##TITLE=1H_SAM-22.114
 CDCl3,8 sc, 
 11.4.2019
##JCAMPDX= 6.0         $$ Bruker NMR JCAMP-DX V2.0
##DATA TYPE= NMR FID
##DATA CLASS= NTUPLES
##ORIGIN= UXNMR, Bruker Analytische Messtechnik GmbH
##OWNER= root
$$ XWIN-NMR		Version 3.5
$$ Thu Apr 11 14:07:26 2019 Russian Standard Time (UT+4h)  she@DPX200
##.OBSERVE FREQUENCY= 200.1315
##.OBSERVE NUCLEUS= ^1H
##.DELAY= (6, 6)
##.ACQUISITION MODE= SIMULTANEOUS
##.ACQUISITION SCHEME= undefined
##.AVERAGES= 8
##.DIGITISER RES= 18
##SPECTROMETER/DATA SYSTEM= spect
##.PULSE SEQUENCE= zg30
##.SOLVENT NAME= CDCl3
##.SHIFT REFERENCE= (INTERNAL, CDCl3, 0, 15.7039)
##AUDIT TRAIL= $$ (NUMBER, WHEN, WHO, WHERE, WHAT)
$$ ##TITLE= Audit trail, XWIN-NMR		Version 3.5
$$ ##JCAMPDX= 5.01
$$ ##ORIGIN= Bruker BioSpin GmbH
$$ ##OWNER= she
$$ F:/spectra/data/she/nmr/H-F/1/audita.txt
$$ ##AUDIT TRAIL=  $$ (NUMBER, WHEN, WHO, WHERE, WHAT)
(   1,<2019-04-11 14:06:19.07 +0400>,<she>,<DPX200>,
      <created by zg, POWCHK disabled, PULCHK disabled
       configuration hash MD5:
       00 E9 B6 7A A2 85 ED C7 34 08 36 98 17 FE 4E 26
       data hash MD5: 16K
       F7 5E 20 62 1A 59 FB 15 42 87 52 25 BF 65 AA 06>)
$$ ##END=
$$ 
$$ hash MD5
$$ 17 29 0E 4D 30 CF FE 53 19 B0 DB 5A B4 45 C5 B1
##$RELAX= 
##$RELAX= 
##$RELAX= 
##$RELAX= 
##$RELAX= 
##$RELAX= 
$$ Bruker specific parameters
$$ --------------------------
##$DU= <F:/spectra>
##$EXPNO= 1
##$NAME= <H-F>
##$PROCNO= 1
##$TYPE= <nmr>
##$USER= <she>
##$AMP= (0..31)
100 100 100 100 100 100 100 100 100 100 100 100 100 100 100 100 100 100 
100 100 100 100 100 100 100 100 100 100 100 100 100 100 
##$AQSEQ= 0
##$AQ_mod= 1
##$AUNM= <au_zg>
##$AUTOPOS= <>
##$BF1= 200.13
##$BF2= 200.13
##$BF3= 200.13
##$BF4= 200.13
##$BF5= 200.13
##$BF6= 200.13
##$BF7= 200.13
##$BF8= 200.13
##$BYTORDA= 1
##$CFDGTYP= 0
##$CFRGTYP= 5
##$CHEMSTR= <none>
##$CNST= (0..31)
1 1 145 1 1 1 1 1 1 1 1 1 1 1 1 1 1 1 1 1 1 1 1 1 1 1 1 1 1 1 1 1 
##$CPDPRG= <>
##$CPDPRG1= <>
##$CPDPRG2= <>
##$CPDPRG3= <>
##$CPDPRG4= <mlev>
##$CPDPRG5= <mlev>
##$CPDPRG6= <mlev>
##$CPDPRG7= <mlev>
##$CPDPRG8= <mlev>
##$CPDPRGB= <>
##$CPDPRGT= <>
##$D= (0..31)
0 1.2 0 0 0 0 0 0 0 0 0 0.03 0 0 0 0 0 0 0 0 0 0 0 0 0 0 0 0 0 0 0 0 
##$DATE= 1554977178
##$DBL= (0..7)
120 120 120 120 120 120 120 120 
##$DBP= (0..7)
150 150 150 150 150 150 150 150 
##$DBP07= 0
##$DBPNAM0= <>
##$DBPNAM1= <>
##$DBPNAM2= <>
##$DBPNAM3= <>
##$DBPNAM4= <>
##$DBPNAM5= <>
##$DBPNAM6= <>
##$DBPNAM7= <>
##$DBPOAL= (0..7)
0.5 0.5 0.5 0.5 0.5 0.5 0.5 0.5 
##$DBPOFFS= (0..7)
0 0 0 0 0 0 0 0 
##$DE= 6
##$DECBNUC= <off>
##$DECIM= 24
##$DECNUC= <off>
##$DECSTAT= 4
##$DIGMOD= 1
##$DIGTYP= 9
##$DL= (0..7)
0 120 120 120 120 120 120 120 
##$DP= (0..7)
150 150 150 150 150 150 150 150 
##$DP07= 0
##$DPNAME0= <>
##$DPNAME1= <>
##$DPNAME2= <>
##$DPNAME3= <>
##$DPNAME4= <>
##$DPNAME5= <>
##$DPNAME6= <>
##$DPNAME7= <>
##$DPOAL= (0..7)
0.5 0.5 0.5 0.5 0.5 0.5 0.5 0.5 
##$DPOFFS= (0..7)
0 0 0 0 0 0 0 0 
##$DQDMODE= 0
##$DR= 18
##$DS= 0
##$DSLIST= <SSSSSSSSSSSSSSS>
##$DSPFIRM= 0
$$ [...]
##$SUBNAM2= <"">
##$SUBNAM3= <"">
##$SUBNAM4= <"">
##$SUBNAM5= <"">
##$SUBNAM6= <"">
##$SUBNAM7= <"">
##$SUBNAM8= <"">
##$SUBNAM9= <"">
##$SW= 24.9337058887773
##$SWIBOX= (0..15)
0 0 2 0 0 0 0 0 0 0 0 0 0 0 0 0 
##$SW_h= 4990.01996007984
##$TD= 16384
##$TD0= 1
##$TE= 0
##$TE2= 300
##$TE3= 300
##$TEG= 300
##$TL= (0..7)
0 120 120 120 120 120 120 120 
##$TP= (0..7)
150 150 150 150 150 150 150 150 
##$TP07= 0
##$TPNAME0= <>
##$TPNAME1= <>
##$TPNAME2= <>
##$TPNAME3= <>
##$TPNAME4= <>
##$TPNAME5= <>
##$TPNAME6= <>
##$TPNAME7= <>
##$TPOAL= (0..7)
0.5 0.5 0.5 0.5 0.5 0.5 0.5 0.5 
##$TPOFFS= (0..7)
0 0 0 0 0 0 0 0 
##$TUNHIN= 0
##$TUNHOUT= 0
##$TUNXOUT= 0
##$USERA1= <user>
##$USERA2= <user>
##$USERA3= <user>
##$USERA4= <user>
##$USERA5= <user>
##$V9= 5
##$VALIST= <valist>
##$VCLIST= <CCCCCCCCCCCCCCC>
##$VD= 0
##$VDLIST= <DDDDDDDDDDDDDDD>
##$VPLIST= <PPPPPPPPPPPPPPP>
##$VTLIST= <TTTTTTTTTTTTTTT>
##$WBST= 1024
##$WBSW= 4
##$XGAIN= (0..3)
0 0 0 0 
##$XL= 0
##$YL= 0
##$YMAX_a= 318176
##$YMIN_a= -503084
##$ZGOPTNS= <>
##$ZL1= 120
##$ZL2= 120
##$ZL3= 120
##$ZL4= 120
##$ABSF1= 10
##$ABSF2= 0
##$ABSG= 5
##$ABSL= 3
##$ALPHA= 0
##$AQORDER= 0
##$ASSFAC= 0
##$ASSFACI= 0
##$ASSFACX= 0
##$ASSWID= 0
##$AUNMP= <proc_1d>
##$AZFE= 0.1
##$AZFW= 0.1
##$BCFW= 1
##$BC_mod= 2
##$BYTORDP= 1
##$COROFFS= 0
##$CY= 11.3945322036743
##$DATMOD= 1
##$DC= 2
##$DFILT= <>
##$DTYPP= 0
##$F1P= 18.9103706918063
##$F2P= -1.10871071338519
##$FCOR= 0.5
##$FTSIZE= 0
##$FT_mod= 4
##$GAMMA= 1
##$GB= 0.15
##$INTBC= 1
##$INTSCL= 1
##$ISEN= 128
##$LB= 0.24
##$LEV0= 0
##$LPBIN= 0
##$MAXI= 10000
##$MC2= 0
##$MEAN= 0
##$ME_mod= 0
##$MI= 1.114404
##$NCOEF= 0
##$NC_proc= 0
##$NLEV= 6
##$NOISF1= 3.799351
##$NOISF2= 2.8
##$NSP= 1
##$NTH_PI= 0
##$NZP= 0
##$OFFSET= 15.70392
##$PC= 1
##$PHC0= -8846.14
##$PHC1= 4.400257
##$PH_mod= 1
##$PKNL= yes
##$PPARMOD= 0
##$PSCAL= 0
##$PSIGN= 0
##$REVERSE= no
##$SF= 200.130013532006
##$SI= 16384
##$SIGF1= 3
##$SIGF2= 2
##$SINO= 400
##$SIOLD= 16384
##$SREGLST= <1H.CDCl3>
##$SSB= 0
##$STSI= 0
##$STSR= 0
##$SW_p= 3612.71676300578
##$SYMM= 0
##$S_DEV= 0
##$TDeff= 0
##$TDoff= 0
##$TI= <>
##$TILT= no
##$TM1= 0
##$TM2= 0
##$TOPLEV= 0
##$USERP1= <user>
##$USERP2= <user>
##$USERP3= <user>
##$USERP4= <user>
##$USERP5= <user>
##$WDW= 1
##$XDIM= 8192
##$YMAX_p= 0
##$YMIN_p= 0
$$ End of Bruker specific parameters
$$ ---------------------------------
##NTUPLES= NMR FID
##VAR_NAME=  TIME,          FID/REAL,        FID/IMAG
##SYMBOL=    X,             R,               I
##VAR_TYPE=  INDEPENDENT,   DEPENDENT,       DEPENDENT
##VAR_FORM=  AFFN,          ASDF,            ASDF
##VAR_DIM=   8192,          8192,            8192
##UNITS=     SECONDS,       ARBITRARY UNITS, ARBITRARY UNITS
##FACTOR=    0.0002004,     1,               1
##FIRST=     0,             0,               0
##LAST=      1.6414764,     0,               0
##MIN=       0,             -503084,         0
##MAX=       1.6414764,     318176,          0
$$ Real data points
##PAGE= N=1
##DATA TABLE= (X++(R..R)), XYDATA
$$ [...]
$$ plain form
2709 -4033 -4283 4602 4428 -4344 -3291 2845 868 -3158 960 3532 -1789 -3972 1019 1675 -1418 189
2725 189 2205 -2044 -4384 1079 3399 -1448 -1702 2436 377 -4937 -449 5600 985 -3831 1239
2740 1239 2722 -3137 -2545 5476 4105 -4529 -3218 3723 1007 -4305 1279 5936 -1498 -6368 746
2755 746 4479 -1141 -2555 2353 1728 -4121 -1971 3103 1349 -1825 72 243 -2361 -722 3435 338
2771 338 -2905 705 2385 -2457 -2806 4482 3844 -4199 -3304 4686 2500 -4043 -146 5789 -14 -5827
2787 -5827 988 5484 -603 -3643 2403 2381 -3796 -2197 3949 2001 -3417 -811 1759 -1268 -2632
2802 -2632 2232 2366 -2587 -2135 2073 259 -2303 1533 3125 -1926 -2724 2551 2019 -2477 2 4215
2818 4215 -328 -4681 1736 5268 -1338 -3722 3412 3855 -3765 -2948 5136 3290 -4961 -2393 4411
$$ packed form
2709d033k50Q885j74q772J053O136j977m026M118K572n321k183M991O56l093J607
2725A89K016m249k340N463K320m847k54M138k059n314M488O049m615m816N070
2740A239J483n859N92Q021j371q634J311O941k716n312N584M657p434m870P114
2755G46L733n620j414M908o25n849K150N074j754l174J897J71k604J639M157l097
2771C38l243L610J680m842l49P288o38q043Q95P990k186o543L897N935n803n813
2787e827O815M496o087l040O046k2o177J599O146j948n418K606K570l027j364
2802b632M864J34m953M52M208j814k562L836J592n051p98N275n32m496K479M213
2818D215m543m353O417L532o606k384P134M43p620Q17Q084j846q251K568O804
$$ plain form
2833 4411 919 -4381 66 3494 -1340 -4109 699 2342 -1549 -1390 1280 -1224 -2699 1104 1509
2848 1509 -1773 -801 2496 -515 -4164 758 4921 -782 -4278 2038 3533 -3092 -3155 4400 3345 -4314
2864 -4314 -2604 3694 1008 -4001 262 4257 -1494 -4682 1027 2608 -2588 -2709 2445 607 -4295
2879 -4295 -1492 2518 -415 -3158 366 1458 -2360 -1750 2278 772 -2551 510 2531 -1409 -2007
2894 -2007 3039 2426 -3237 -1011 4934 991 -4403 470 5420 -880 -4747 2106 5296 -2061 -3822
2909 -3822 2952 3470 -2962 -2086 3320 1422 -3299 -727 2730 -197 -2057 1065 1436 -1877 19 2677
2925 2677 -348 -1977 2242 2838 -1788 -1379 3810 2062 -2956 -283 4702 833 -2908 1778 4521
2940 4521 -1365 -2910 3380 3814 -2361 -1984 3751 1203 -4132 -498 4426 -205 -4020 602 2856
$$ packed form
2833D411l492n300M447L428m834k769M808J643l891J59K670k504j475L803M05
2848A509l282R72L297l011l649M922M163n703l496O316J495o625o3P555j055p659
2864d314J710O298k686n009M263L995n751l188N709J581n196j21N154j838m902
2879d295K803M010k933k743L524J092l818O10M028j506l323L061K021l940n98
2894b007N046o13n663K226N945l943n394M873M950o300l867O853L190p357j761
2909c822O774N18o432Q76N406j898m721K572L457k927j860L122L71l313J896K658
2925B677l025j629M219N96m626M09N189j748n018K673M985l869l741M686K743
2940D521n886j545O290M34o175L77N735k548n335L634M924m631l815M622K254
$$ plain form
2955 2856 -2113 -2929 2116 1949 -2853 -1918 1830 -600 -2235 894 1658 -2000 -1276 1981 -144 -2611
2971 -2611 1336 3247 -1842 -3655 2319 2895 -3869 -2654 3927 1774 -4953 -1604 4352 185 -5187
2986 -5187 -575 3612 -1492 -4536 988 2498 -3138 -3055 1805 692 -2913 -1032 1038 -1617 -2347 1236
3002 1236 1549 -2270 -1227 2062 -479 -3144 1195 2906 -1361 -2938 2285 2077 -2536 -537 4283
3017 4283 948 -3954 -17 4092 -262 -3090 2519 3016 -3048 -3022 3722 2568 -3190 -1275 3627 729
3033 729 -3420 823 3836 -203 -2547 873 1587 -725 173 2049 346 -1406 1128 1929 -530 235
3049 235 3556 337 -3538 273 4573 556 -2607 2125 3650 -3087 -3540 3715 3937 -2517 -2751 2968
3065 2968 1014 -3802 -321 4303 214 -3583 -284 1442 -1406 -1604 2427 869 -3183 -1504 1868
$$ packed form
2955B856m969q16N045j67m802R35L748k430j635L129P64l658P24L257k125k467
2971b611L947J911n089j813N974N76o764J215O581k153o727L349N956m167n372
2986e187M612M187n104l044N524J510n636Q3M860j113l605J881K070k655p30L583
3002A236L13l819J043L289k541k665M339J711m267j577N223k08m613J999M820
3017D283l335m902L937M109m354k828N609M97o064K6O744j154n758J915M902k898
3033G29m149M243L013m039k344L420P14k312Q98J876j703j752K534Q01k459P65
3049B35L321l219l875L811M300m017l163M732J525o737m53P255K22o454k34N719
3065B968j954m816L481M624m089l797L299J726k848j98M031j558m052J679L372
$$ plain form
3080 1868 -378 -1521 1616 1331 -2470 -2160 2157 586 -2598 544 1825 -2241 -3052 1940 2276 -2732
3096 -2732 -2260 2440 103 -4172 -190 4054 -789 -5234 -44 3431 -1583 -3580 1893 2342 -4006
3111 -4006 -3428 2375 1939 -2009 -1064 1184 -1023 -2093 687 1542 -1393 -781 1067 -1118 -1973 1996
3127 1996 2529 -1956 -2243 2447 1304 -3162 -550 4310 609 -4288 166 4148 -288 -3149 2242
3142 2242 2962 -2569 -2431 3448 2512 -2109 -790 2771 68 -2508 1312 3686 -865 -2418 1336 1897
3158 1897 -1296 280 2996 152 -2526 295 2299 -535 275 2884 340 -3011 174 3350 196
3173 196 -1949 2152 2291 -3025 -2411 3940 2926 -2707 -1705 3163 601 -3551 556 4366 -458 -3609
3189 -3609 412 2502 -993 -1321 2150 987 -2307 -995 1453 152 -966 904 717 -2602 -1276
$$ packed form
3080A868k246j143L137k85l801L10M317j571l184L142J281m066q11M992L36n008
3096b732M72M700k337m275L982M244m843m445N190L475n014j997N473M49o348
3111d006N78N803m36l948R45K248k207j070K780Q55k935O12J848k185q55L969
3127A996N33m485k87M690j143m466K612M860l701m897M454L982m436k861N391
3142B242P20n531J38N879r36m621J319L561k703k576L820K374m551j553L754N61
3158A897l193J576K716k844k678K821K004k834Q10K609k544l351L185L176l154
3173A96k145M101J39n316O14O351j014n633J002M868k562m152M107L810m824l151
3189c609M021K090l495l28L471j163l294J312K448j301j118J870j87l319J326
$$ plain form
3204 -1276 2270 280 -2787 239 1831 -2006 -2688 2270 2181 -2813 -2491 2132 831 -3183 51 3427
3220 3427 -1186 -4001 467 2747 -1308 -2011 1912 1145 -2992 -1810 2972 1015 -2674 -504 1901
3235 1901 -1287 -2084 1404 1980 -1291 -1169 804 -125 -1737 979 1756 -1744 -1791 1692 743 -2283 295
3252 295 3059 -894 -3602 1143 3879 -1148 -3120 2145 2841 -2834 -2018 3517 2031 -2690 -901 2664
3268 2664 429 -1667 1250 2650 -1120 -1842 1100 1466 -965 499 1810 -1045 -2166 935 2073
3283 2073 -996 -477 2279 -93 -3012 -112 3222 65 -2166 1041 1689 -2139 -1403 3122 2016 -2880
3299 -2880 -1273 3033 488 -2628 1316 3701 -1376 -3262 1361 2838 -1230 -1311 1578 628 -2960 -472
3315 -472 2357 629 -1674 -31 415 -2072 -53 2211 -149 -2390 131 1292 -2039 -1281 3252 1519
$$ packed form
3204a276L546j990l067L026J592l837o82M958q9m994L22M623j301m014L234L376
3220C427m613k815M468K280m055p03L923p67m137J182M782j957l689K170K405
3235A901l188p97L488N76l271J22J973r29j612K716P77l500m7L483r49l026K578
3252B95K764l953k708M745K736n027j972N265O96n675Q16N535j486m721J789L565
3268B664k235k096K917J400l770p22K942L66k431J464J311k855j121L101J138
3283B073l069N19K756k372k919K900L334l157k231L207O48l828P36M525j106m896
3299b880J607M306k545l116L944K385n077j886M623J477m068q1K889r50l588K488
3315d72K829j728k303J643M46k487K019K264k360k241K521J161l331P58M533j733
$$ plain form
3331 1519 -3755 -1831 3143 899 -2505 343 3414 -1096 -3763 839 3542 -955 -2242 1428 1028
3346 1028 -2230 -921 2810 734 -2264 -253 1203 -1501 -1008 1979 971 -2480 -1015 1205 -352
3361 -352 -1384 1272 1390 -2044 -2213 1449 1120 -1786 -23 2314 -1232 -3008 1167 3261 -1071 -2420
3377 -2420 1936 1464 -2954 -928 3757 1375 -3143 -1028 2823 -256 -2097 1099 2340 -1739 -2358
3392 -2358 933 1418 -1190 61 1165 -1310 -1765 939 1331 -971 -477 1507 -787 -2724 772 3202
3408 3202 -787 -2652 1225 1748 -1722 -1339 3451 1781 -3254 -1066 2662 956 -1944 1002 2581
3423 2581 -1570 -2361 1603 2626 -960 -630 1725 -299 -2512 130 2745 -416 -1754 583 228 -1662
3439 -1662 -218 2259 317 -2026 -6 1212 -985 -633 2455 1345 -2852 -788 3164 764 -2416
$$ packed form
3331A519n274J924M974k244l404K848L071m510k667M602K703m497j287L670m00
3346A028l258J309L731k076k998K011J456k704M93K987j008l451J465K220j557
3361c52j032K656J18l434j69L662l29k906J763K337l546j776M175K094m332j349
3377b420M356m72m418K026M685k382m518K115L851l079j841L196J241m079o19
3392b358L291M85k608J251J104k475m55K704L92k302M94J984k294j937L496K430
3408C202l989j865L877N23l470L83M790j670n035K188L728j706k900K946J579
3423B581m151p91L964J023l586L30K355k024k213K642K615l161j338K337l55j890
3439a662J444K477j942k343K020J218k197L52L088j110m197K064L952k400l180
$$ plain form
3454 -2416 1102 2563 -1353 -2854 1810 3467 -1258 -2330 2025 1327 -2532 -782 2875 901 -2381
3469 -2381 -613 1017 -483 -673 1112 126 -2099 -1009 1003 -430 -969 1173 916 -2294 -1620 2152
3485 2152 1110 -1740 -309 2152 -920 -2799 1170 2761 -1066 -2014 1393 1161 -2316 -632 2658
3500 2658 472 -3214 -673 2112 -515 -1986 1207 1471 -1966 -2122 1508 1367 -1322 -522 1064 -983
3516 -983 -1787 807 976 -964 -829 840 -877 -1998 1174 2115 -1049 -1860 1492 1177 -1955 -685 3171
3533 3171 853 -3107 -532 3352 554 -2355 980 2352 -1343 -2168 1686 2237 -1194 -1023 1549 264
3549 264 -1379 1063 2224 -556 -1427 768 688 -1199 708 2108 -512 -2072 340 2011 -806 -520
3565 -520 2388 1191 -2295 -677 2751 878 -1875 298 2093 -1065 -1600 2371 2507 -1883 -1789 1749
$$ packed form
3454b416L518J461l916j501M664J657m725j072M355o98l859J750L657j974l282
3469b381J768J630j500j90J785r86k225J090K012j433n39K142k57l210O74L772
3485B152j042k850J431K461l072j879L969J591l827r48L407k32l477J684L290
3500B658k186l686K541K785k627j471L193K64l437j56L630j41k689Q00J586k047
3516i83q04K594J69j940J35J669j717j121L172R41l164q11L352l15l132J270L856
3533C171k318l960K575L884k798k909L335J372l695q25L854N51l431J71K572j285
3549B64j643K442J161k780q71K195q0j887J907J400k620j560K412J671k817K86
3565e20K908j197l486J618L428j873k753K173J795l158n35L971J36m390R4L538
$$ plain form
3581 1749 861 -2092 343 2925 -38 -2888 -312 1666 -504 -876 1066 487 -1977 -886 1297 22
3597 22 -1353 372 11 -2033 -700 2265 738 -2207 -417 1425 -1273 -2355 1628 2631 -1903 -2671
3613 -2671 1418 1400 -2183 -995 2495 -186 -3306 -726 2087 88 -1452 548 553 -2159 -1281 1447
3629 1447 852 -1405 -186 814 -916 -1229 1449 1368 -1856 -1162 795 -558 -1339 1150 2229 -1287
3645 -1287 -2136 955 1470 -1169 -162 2427 -248 -2913 8 2787 100 -1860 903 1842 -1926 -1683
3661 -1683 2191 2254 -1152 -1141 1511 417 -1316 773 1914 -387 -1398 842 873 -313 776 1762 -705
3678 -705 -1855 801 1904 -585 -640 1872 200 -2393 44 3227 780 -2067 305 1799 -1723 -1631
3694 -1631 2553 2421 -2000 -2059 1325 814 -1230 616 2398 -757 -2484 195 1561 -372 -297 1421
$$ packed form
3581A749q88k953K435K582k963k850K576J978k170l72J942n79k464J091K183j275
3597B2j375J725l61k044J333K965j527k945J790J842k698j082L983J003m534p68
3613b671M089j8l583J188L490k681l120K580K813j999j540K000Nk712Q78K728
3629A447n95k257J219J000j730l13K678q1l224O94J957j353p81K489J079l516
3645a287q49L091N15k639J007K589k675k665K921K779k687j960K763R39l768K43
3661a683L874O3l406J1K652j094j733K089J141k301j011K240L1j186J089R86k467
3678g05j150K656J103k489n5K512j672k593K437L183k447k847K372J494l522R2
3694a631M184j32m421n9L384n11k044J846J782l155j727K679J366j933P5J718
$$ plain form
3710 1421 -34 -2276 -719 1883 321 -821 127 -183 -1562 -649 2144 513 -1346 -708 647 -1444
3726 -1444 -1560 1776 1762 -2268 -2114 1538 456 -2143 17 2356 -917 -3645 -125 2346 -369 -2058
3742 -2058 686 855 -1724 -1183 1760 1392 -1320 -455 -96 -1110 -1021 1709 1127 -1481 -1011 785 -688
3759 -688 -1253 1641 1992 -1508 -2235 1124 947 -1548 -178 2108 -349 -2904 -175 2652 99 -1476
3775 -1476 1104 1285 -1463 -908 2440 1667 -1589 -548 1741 201 -1063 1078 2118 -640 -1694 860
3791 860 1209 -323 352 1229 -697 -1583 626 1566 -368 -515 1229 -144 -1816 298 2651 307 -1936
3808 -1936 306 1647 -1667 -1238 2526 2002 -1911 -1633 1530 786 -1486 632 2283 -308 -1902 433
3824 433 1411 -358 -558 931 -67 -1683 49 1538 -231 -974 590 290 -1568 -548 1746 183
$$ packed form
3710A421j455k242J557K602j562j142R48l10j379R13K793j631j859O38J355k091
3726a444j16L336j4m030J54L652j082k599K160K339l273k728L520K471k715j689
3742b058K744J69k579N41K943l68k712Q65L59j014Q9K730n82k608M70J796j473
3759f88n65K894L51l500p27L359j77k495J370K286k457k555K729K827k553j575
3775a476K580J81k748N55L348p73l256J041K289j540j264K141J040k758j054K554
3791H60L49j532O75Q77j926q86K209R40j934j47J744j373j672K114K353k344k243
3808a936K242J341l314M29L764n24l913K78L163p44k272K118J651k591j594K335
3824D33R78j769k00J489r98j616J732J489j769p43J564l00j858J020K294j563
$$ plain form
3840 183 -1930 -218 1073 -1007 -1599 1230 1188 -1888 -1745 1311 689 -1581 -68 1690 -957 -2554
3856 -2554 342 2102 -634 -1597 834 448 -1868 -594 2083 578 -1626 -673 824 -744 -843 1108
3872 1108 849 -1298 -709 671 -303 -799 845 1075 -1746 -1108 1372 782 -1248 -300 1661 -552 -2264
3889 -2264 262 2428 -127 -1882 737 1192 -1202 -845 1904 870 -1369 -404 1498 578 -632 767
3905 767 1391 -1055 -1026 1545 806 -875 332 1140 -828 -1372 896 1867 -472 -400 727 -12 -1698 500
3923 500 2540 -273 -1532 406 766 -1225 -862 2315 1153 -1865 -1427 1768 544 -824 885 1658
3939 1658 -815 -1782 976 2014 -213 -753 924 170 -1227 390 1566 86 -842 261 -244 -1299
3955 -1299 199 1592 -218 -1943 -157 1312 -1005 -1186 1442 1266 -2141 -1724 1567 886 -1361 -147
$$ packed form
3840A83k113J712J291k080n92K829m2l076J43L056o22k270J513J758k647j597
3856b554K896J760k736r63K431l86k316J274K677j505k204R53J497j568r9J951
3872A108k59k147N89J380r74m96J644K30k821O38K480n90k030R48J961k213j712
3889b264K526K166k555j755K619M55k394L57K749j034k239R65J902r20j210J399
3905G67O24k446K9K571p39j681J207Q08j968n44K268R71k339P2J127p39j686K198
3923E00K040k813j259J938L60j991L63L177j162l018M38L195j224j368J709P73
3939A658k473r67K758J038k227n40J677p54j397J617J176j480r28J103n05j055
3955a299J498J393j810j725J786J469k317j81K628j76l407M17L291o81k247J214
$$ plain form
3971 -147 1319 -662 -2108 782 2242 -304 -1484 637 463 -1263 -41 1558 311 -1386 -245
3986 -245 772 -514 -364 853 529 -1496 -932 838 -200 -937 774 793 -1509 -1429 1265 499 -1079
4003 -1079 -306 1316 -865 -2187 928 1910 -584 -1710 602 738 -1505 -553 2018 683 -1702 -968
4019 -968 1298 195 -976 672 908 -676 -1012 861 674 -363 231 618 -1147 -1261 1077 1151 -916
4036 -916 -550 707 -554 -1589 374 2420 -487 -1711 40 919 -874 -811 1874 963 -1920 -951 1391
4053 1391 633 -715 847 1423 -982 -1546 1249 1756 -231 -574 695 102 -1236 458 1533 473
4069 473 -931 501 376 -303 355 1432 -145 -1413 -159 749 -799 -96 1406 456 -1970 -1088 1886
4086 1886 872 -1104 143 1928 -616 -1992 866 2127 -498 -1256 462 217 -970 -202 1781 106
$$ packed form
3971a47J466j981j446K890J460k546j180K121j74j726J222J599j247j697J141
3986b45J017j286J50J217l24k025N64J770j038p37J711J9k302Q0K694p66j578
4003a079P73J622k181j322L115R82k494j126K312J36k243R52K571j335k385P34
4019i68K266j103j171J648K36j584l36J873j87j037N94L87j765j14K338P4k067
4036i16L66J257j261j035J963K046k907j224J751Q79j793O3K685r11k883R69K342
4053A391p58j348J562N76k405n64K795N07j987l43J269n93j338J694J075j060
4069D73j404J432j25o79O58J077j577j268J254R08j548P03J502r50k426Q82K974
4086A886j014j976J247J785k544j376K858J261k625p58J718k45j187P68J983j675
$$ plain form
4102 106 -1091 112 215 -862 -49 1122 419 -1217 -871 1011 -415 -815 778 603 -1692 -1778 1367
4119 1367 614 -1278 -440 1254 -525 -1869 712 1587 -440 -1436 534 719 -1251 -332 1684 535
4135 535 -1957 -529 1116 -352 -868 596 772 -1167 -1215 223 617 -609 137 238 -734 -1281 1009
4152 1009 842 -950 -326 730 -572 -1305 416 1685 -857 -1721 726 799 -1229 -920 1760 504 -1679
4169 -1679 -720 1560 526 -1168 444 1316 -336 -949 1002 1105 -619 -365 1079 -143 -951 726
4185 726 1257 -44 -597 612 713 -790 144 1438 -144 -1216 404 918 -296 -306 1553 784 -1388
4202 -1388 -316 1592 793 -788 607 1442 -674 -1368 1129 1504 -879 -1094 1575 589 -1380 -316
4218 -316 1640 172 -1192 -144 755 -662 -476 983 430 -645 -232 654 -265 -750 756 446 -1251
$$ packed form
4102A06j197J203J03j077Q13J171p03j636L46J882j426m00J593j75k295q6L145
4119A367p53j892Q38J694j779j344K581Q75k027r96J970J85j970R19K016j149
4135E35k492J428J645j468n16J464J76j939m8J438L94j226P46J01r72n47K290
4152A009j67j792O24J056j302p33J721J269k542q64K447P3k028L09K680j256k183
4169a679R59K280j034j694J612Q72j652o13J951J03j724K54J444j222q08J677
4185G26N31j301n53J209J01j503R34J294j582j072J620N14j214j0J859p69k172
4202a388J072J908p99j581J395Q35k116o94K497L75k383k15K669r86j969J064
4218c16J956j468j364J048Q99j417J86J459n53j075M13Q86r19m85J506l10j697
$$ plain form
4235 -1251 -414 1209 372 -1364 -294 1330 -790 -1986 686 1258 -1033 -1442 451 637 -1047 -367
4251 -367 1321 41 -1613 -175 1201 -376 -1173 786 332 -1137 -538 843 -29 -737 -378 555 -627
4268 -627 -957 670 784 -971 -461 853 -345 -1109 514 1285 -776 -1272 1165 759 -1166 -398 1299
4285 1299 130 -1815 -323 1558 -182 -1262 302 1193 -647 -1138 790 1267 -817 -704 726 266
4301 266 -569 930 1142 -432 -555 643 355 -629 420 897 -338 -1133 736 1263 -601 -450 1560
4318 1560 615 -1681 -145 1443 434 -900 312 891 -578 -970 1069 1361 -1314 -632 1087 513
4334 513 -1069 261 1404 -114 -1179 161 1167 -628 -147 755 312 -962 -45 1029 40 -513 431
4351 431 172 -731 -476 1160 157 -1304 -125 921 -584 -1401 793 1128 -1374 -1174 735 634 -1361
$$ packed form
4235a251Q37J623q37j736J070J624k120j196K672N72k291m09J893J86j684O80
4251c67J688j280j654J438J376j577p97J959m54j469N99J381q72p08L59R33j182
4268f27l30J627J14j755N10J314j198p64J623P71k061m96K437m06j925P68J697
4285A299j169j945J492J881j740j080J564Q91j840m91J928M77k084J13J430m60
4301B66q35J499K12j574j23J198k88r84J049M77j235p95J869N27j864J51K010
4318A560r45k296J536J588j009j334J212N79j469l92K039K92k675O82J719n74
4334E13j582J330J143j518j065J340J006j795M81R02m43j274R17J074r89n53R44
4351D31k59r03K55J636j003j461J179J046j505q17K194L35k502K00J909j01j995
$$ plain form
4368 -1361 -350 1036 -294 -1662 -315 1294 -342 -922 418 536 -897 -534 730 507 -806 -25
4384 -25 346 -910 -552 595 456 -1179 -757 598 -342 -884 514 1045 -841 -1100 283 504 -1033 -375
4402 -375 789 167 -1434 -67 1111 -330 -984 633 925 -966 -750 1213 831 -833 -325 983 89
4419 89 -748 511 1101 -533 -468 514 542 -476 653 1329 -210 -696 871 853 -449 -173 1233 -35
4437 -35 -1257 234 1532 -43 -1285 369 1318 -569 -1096 1155 990 -1050 -1091 1355 718 -982 347
4454 347 1382 69 -633 760 956 -498 -87 802 42 -1098 158 939 -2 -691 605 623 -749 -275
4472 -275 1100 256 -1194 17 599 -614 -1259 501 863 -1009 -743 780 -38 -1250 -380 1210 -73
4489 -73 -1598 398 786 -780 -1324 572 554 -932 -532 747 143 -1021 -383 527 -399 -673 658 384
$$ packed form
4368a361J011J386j330j368J347J609j636n80J340J18j433L63J264k23j313P81
4384b5L71j256L58J147j39j635M22J355r40n42J398N31j886k59J383K21j537O58
4402c75J164o22j601J367J178j441o54J617K92j891K16J963l82j664N08J308q94
4419H9q37J259N90j634O5R82K8j018J129O76j539m86J567j8j302K76J406j268
4437c5j222J491J298j575j242J654R49j887n27K251j65k040m1K446o37j700J329
4454C47J035j313p02J393J96j454M11Q89p60j140J256P81r41o89J296J8j372M74
4472b75J375q44j450J211N82j213o45J760L62j872K66J523q18j212Q70J590j283
4489g3j525J996L88j566n44J896j8j486M00J279o04j164O38R10r26k74J331k74
$$ plain form
4507 384 -617 -230 698 -22 -859 301 590 -763 -1031 710 486 -1200 -500 1357 597 -1319 172
4524 172 1333 -354 -1050 787 617 -871 -625 972 661 -562 -26 868 -26 -585 371 664 -906 -344
4542 -344 433 46 -432 135 876 -245 -1078 155 746 -590 -322 942 164 -870 67 1033 -389 -1145
4560 -1145 502 727 -949 -552 1070 936 -896 -525 1189 251 -1047 187 1228 -366 -888 494
4576 494 1031 -232 -65 609 -95 -666 235 839 -309 -534 597 341 -707 -465 781 51 -768 206
4594 206 589 -899 -849 775 894 -1280 -623 1203 574 -782 -211 1015 -218 -1096 421 861 -591
4611 -591 -571 719 472 -804 -265 985 222 -694 688 350 -560 -305 614 628 -1018 -247 680 -271 -475
4630 -475 451 626 -673 -750 520 568 -937 29 1173 -180 -1454 -98 876 -256 -1196 395 842 -854
$$ packed form
4507C84j001L87R28p20q37J160K89j353k68J741k24j686P00J857p60j916J491
4524A72J161j687o96J837j70j488K46J597l11j223N36Q94q94n59R56K93j570N62
4542c44P77l87m78N67P41j121q33J233N91j336K68J264p78j034R37R66j422p56
4560a145J647K25j676L97J622j34j832L71J714r38j298J234J041j594n22J382
4576D94N37j263J67O74p04n71R01O04j148k25J131k56j048K42J246p30q19R74
4594B06L83j488N0J624J19k174O57J826o29j356N71J226j233q78J517M40j452
4611e91K0J290k47j276N39J250p63r16J382l38r10K55R19J4j646P71R27r51k04
4630d75R26J75j299p7J270M8j505R66J144j353j274J356R74j132r40J591M47j696
$$ plain form
4648 -854 -688 889 284 -732 -207 320 -191 -460 175 740 -651 -128 732 -113 -615 53 838 -119 -716
4667 -716 782 597 -786 -427 1205 -71 -1115 111 794 -117 -1096 253 753 -1010 -642 955 620
4684 620 -933 -538 1101 163 -960 283 1131 40 -741 553 1087 -328 -211 939 319 -388 178
4701 178 749 -3 -311 201 498 -515 30 800 198 -806 255 1154 -498 -777 893 678 -1018 -241
4719 -241 897 573 -910 100 666 -29 -976 522 1138 -267 -910 603 575 -614 161 1015 300 -795
4737 -795 67 538 -314 -338 886 262 -611 -316 516 -327 -655 296 580 -658 -802 546 25 -1014 -254
4756 -254 618 -236 -1196 376 667 -645 -439 231 697 -849 -615 646 405 -1186 -232 538 -256 -650
4774 -650 172 292 -860 -509 533 -27 -696 45 328 -304 -756 539 351 -511 -198 344 -59 -1117 -72
$$ packed form
4648h54J66J577o05j016N25N27n11k69O35N65j391N23Q60q45n02O68P85r57n97
4667g16J498j85j383L59J632j276j044J226O83r11r79J349N00j763L68J597l35
4684F20j553L95J639r38j123J243Q48j091p81J294N34j415J17J150o20p07N66
4701A78N71p52l08N12K97j013N45P70o02j004J061Q99j652k79J670k15j696P77
4719b41J138l24j483J010N66o95r47J498O16j405o43J513k8j189P75Q54p15j095
4737g95Q62M71q52k4J224o24q73K95Q32q43l28R51K84j238j44J348n21j039P60
4756b54Q72q54r60J572K91j312K06O70M66j546K34J261k41j591R54P70p94l94
4774f50Q22J20j152L51J042n60o69P41K83o32m52J295j88q62L13N42m03j058J045
$$ plain form
4793 -72 747 -201 -1085 761 847 -697 -547 819 491 -573 -228 621 436 -600 304 734 -337 -652 309
4812 309 454 -523 -58 613 -183 -670 455 715 -126 -661 714 429 -870 -79 934 211 -699 376
4830 376 759 -420 -629 1179 699 -690 -153 1228 150 -790 340 855 -330 -855 498 1117 -405
4847 -405 -266 447 472 -420 -38 744 75 -812 240 380 -326 -185 648 125 -592 28 533 -259 -709 682
4867 682 406 -617 -507 784 330 -680 -155 787 40 -886 190 777 -796 -1056 343 435 -831 -400
4885 -400 545 -29 -1169 -406 725 -502 -810 453 204 -684 -528 453 132 -688 -246 290 -46 -785 245
4904 245 31 -351 -517 483 -310 -1162 -22 511 -683 -861 371 472 -729 -578 1026 435 -988 -400
4922 -400 587 50 -1083 437 547 -389 -853 448 658 -388 -443 307 -135 -643 140 402 -271 -287 372
$$ packed form
4793g2Q19r48q84J846Q6j544J50J366l28j064L45Q49j85j036R04M30j071l15R61
4812C09J45r77M65O71p96m87J125K60q41n35J375k85j299P91J013p23r10J075
4830C76L83j179k09J808m80j389N37J381j078r40J130N15j185n25J353O19j522
4847d05J39P13K5q92L82P82o69q87J052J40p06J41Q33n23p17O20N05p92m50J391
4867F82k76j023J10J291m54j010N25R42p47r26J076N87j573k60J399R2j266M31
4885d00R45n74j140P63J131j227l08J263k49q88J56R81l21q20M42N36l36p39J030
4904B45k14l82j66J000p93q52J140N33j194j78J232J01j201J51J604n91j423N88
4922d00R87n37j133J520J10r36m64J301K10j046n5P50m42n08P83K62o73j6O59
$$ plain form
4941 372 -10 -267 317 771 276 -400 349 585 -155 -572 669 601 -706 -439 881 218 -478 -55 651
4960 651 -4 -518 748 687 -387 -471 563 86 -534 4 906 508 -497 500 652 -112 49 645 82
4979 82 -660 -208 421 94 -244 847 422 -609 -355 781 576 -788 -9 503 -423 -694 22 552 -571
4998 -571 -763 377 418 -715 -433 929 79 -638 -263 408 -181 -275 296 175 -684 -331 569 102 -564 114
5018 114 400 -1045 -681 630 429 -858 -475 137 -240 -1066 66 735 -564 -726 183 452 -820 -359
5036 -359 644 141 -1056 -230 754 -191 -839 -150 510 -805 -754 700 405 -315 58 532 -440 -526 360
5055 360 764 3 -183 385 335 -299 -1 748 -121 -769 402 286 -560 -349 758 519 -516 -231 582
5074 582 364 -983 261 877 -89 -634 395 918 -295 -542 477 88 -802 83 553 112 -403 418
$$ packed form
4941C72l82k57N84M54m95o76P49K36p40m17J241o8j307K67J320o63o96M23P06
4960F51o55n14J266o1j074q4J034m77o20N38R02l98j005R97J52p64J61N96n63
4979H2p42M52O29l27l38J091m25j031K54J136k05j364P79N12r26k71P16N30j123
4998e71j92J140M1j133K82J362q50p17L75O71n89r4N71j21q59L53R00m67o66O78
5018A14K86j445L64J311k01j287L83O12l77q26J132O69j299j62R09K69j272M61
5036c59J003n03j197Q26R84r45o48O89O60j315N1J454k95p20L73M74r72q6Q86
5055C60M04p61j86N68n0o34K98P49q69o48J171j16q46K11J107k39j035K85Q13
5074E82k18j347J244O16r66n45J029N23j213k47J019l89q90Q85M70m41n15Q21
$$ plain form
5092 418 363 -120 -76 907 496 -561 23 735 38 -123 661 397 -288 -366 678 548 -416 180 652 -326
5112 -326 -606 615 867 -403 -352 635 283 -815 -134 872 322 -630 108 665 -520 -282 396 254 -315
5131 -315 -301 485 274 -241 64 564 -603 -506 369 15 -492 -217 50 -186 -717 19 543 -432 -803 479
5151 479 410 -951 -439 592 251 -705 -466 359 -240 -302 25 611 -509 -538 171 -99 -251 -316 678 -428
5171 -428 -566 219 462 -257 -410 417 132 -216 10 396 -100 -588 130 464 -540 -2 838 102 -924
5190 -924 -276 482 -110 -604 98 563 -672 -468 292 950 -505 -320 572 62 -600 147 880 156 -234
5209 -234 492 156 74 68 259 -151 -439 60 433 -227 -385 701 219 -717 -282 528 359 -613 297 518 -208
5230 -208 -568 542 889 -426 -476 351 401 -552 -84 1031 143 -699 47 334 -291 -190 224 286 -360 -276
$$ packed form
5092D18n5m83M4R83m11j057N84P12o97j61P84k64o85p8J044j30r64N96M72r78
5112c26k80J221K52j270N1R87l52j098O81J006n50r52P38N57j185K38O78j42n69
5131c15J4P86k11n15L05N00j167R7Q75l54n07K75K67k36n31P36N24r75l71J282
5151D79o9j361N12J031l41r56K39Q25n99o2L27N86j120k9P09k70j52o5R94j106
5171d28j38P85K43p19j53Q27k85l48K26L86m96m88P18L34j004N38Q40p36j026
5190i24O48P58n92m94P02M65j235K04P60O58j455J85Q92n10o62P47P33p24l90
5209b34P26l36q2oJ91m10k88M99L73o60j58J086m82r36M35Q10j69r72R10K21p26
5230b08l60J110L47j315n0Q27N0r53M68J115q88q42P46K87o25J01M14O2o46Q4
$$ plain form
5250 -276 306 434 -386 148 266 -476 -512 217 184 -300 45 546 -108 -550 332 547 -330 -412 447 -106 -811
5271 -811 -353 850 -164 -837 -64 814 -444 -703 319 243 -787 -429 375 110 -645 -106 398 -301 -698
5290 -698 -205 432 -279 -552 612 76 -377 43 513 -396 -559 206 372 -287 -141 637 3 -929 -242 744
5310 744 -240 -878 -27 161 -447 -451 554 340 -475 -527 502 115 -653 -249 542 83 -390 184 339 127
5330 127 -104 605 3 -188 58 81 -242 -436 369 275 -347 -19 1054 -63 -407 400 605 -248 -472 568
5350 568 604 -528 -467 825 547 -324 34 866 52 -453 20 676 -253 -15 271 230 -225 18 825 74
5370 74 -232 322 550 -246 -318 631 376 -432 110 441 213 -372 243 571 -234 -725 430 -76 -300 27
5390 27 785 236 -760 220 675 -111 -523 216 349 -513 -109 268 185 -240 -298 328 -228 -527 147 321 -391
$$ packed form
5250b76N82J28q20N34J18p42l6P29l3m84L45N01o54m42Q82K15q77q2Q59n53p05
5271h11M58J203j014o73P73Q78j258k59J022p6j030L58Q04k65p55N39N04o99l97
5290f98M93O37p11k73J164n36m53M20M70r09j63P65J66o59J46P78o34r32O87R86
5310G44r84o38Q51J88o08mJ005k14q15n2J029l87p68M04P91m59m73N74J55k12
5330A27k31P09o02j91K46K3l23j94Q05r4o22L28J073j117l44Q07K05q53k24J040
5350E68L6j132O1J292k78q71L58Q32q14n05M73O56r29K38K86m1m55K43Q07p51
5370G4l06N54K28p96p2R49k55q08N42L31k28n85O15L28q05m91J155n06k24L27
5390B7P58n49r96R80M55p86m12P39J33q62M04L77q3m25n8O26n56k99O74J74p12
$$ plain form
5411 -391 -404 208 161 -522 -86 609 -682 -657 366 248 -588 -142 575 25 -849 -252 435 -176 -814 107
5431 107 447 -314 -330 565 679 -522 -503 183 -267 -698 49 276 -114 -261 120 66 64 6 210 -328 -557 36
5453 36 235 -116 -556 244 -25 -395 -464 472 -35 -240 240 643 10 -167 425 502 -405 -522 441 317 -381
5474 -381 129 414 82 -656 357 601 -204 -634 382 500 -300 -125 445 261 -178 566 352 -123 -152 377
5494 377 -152 -689 20 690 -9 -249 431 528 -193 -455 362 294 -368 -228 714 -86 -639 134 720 -97 -361
5515 -361 79 216 -648 -15 683 -23 -361 -265 417 -313 -204 -130 187 -225 -513 58 404 -519 -179 333 -292
5536 -292 -378 183 260 -620 76 333 -267 -609 -56 668 313 -828 240 346 -327 -571 480 461 -578 -572
5556 -572 529 -25 -566 132 586 -332 -627 196 335 -420 -319 390 -127 -554 102 315 -191 -162 146 -216
$$ packed form
5411c91j3O12m7o83M36O95j291K5J023j18q36M46P17n50q74N97O87o11o38R21
5431A07L40p61j6Q95J14j201J9O86m50m31P47K27l90j47L81n4kn8K04n38k29N93
5453C6J99l51m40Q00k69l70o9R36n07k05M80M03o33j77N92P7r07j17R63j24o98
5474c81N10K85l32p38J013K44q05m30J016J18q00J75N70j84m39P44k14m75k9N29
5494C77n29n37P09O70o99k40O80R7p21k62Q17o8o62J40R42q00n53P73N86q17k64
5515c61M40J37q64O33O98p06l38R6O82p30J09P4L17m12k88N71L46r23L40N12o25
5536b92q6N61P7q80O96K57o00l42N53P24l55j141J068J06o73k44J051j9j039O
5556e72J101n54n41O98M54r18k95Q23J39p55J01P09n17m27O56K13n06K9L08l62
$$ plain form
5576 -216 -516 82 548 -67 -632 6 182 -90 -141 104 563 -623 -459 613 204 -278 121 376 -186 -509
5596 -509 -26 762 -136 -95 357 192 -434 -240 523 335 -294 170 329 -42 -49 266 360 -228 132 645 -274
5617 -274 -191 184 557 -482 -452 201 209 -277 58 597 -106 -521 136 214 -504 -190 -11 397 -340 -301 567 381
5639 381 -505 -435 388 52 -202 299 219 -346 -216 293 231 -290 -9 201 -390 -443 103 429 -476 52 334
5660 334 -98 -493 -52 473 -183 -409 479 149 -600 -402 459 239 -389 99 312 -293 -534 184 228 -543
5680 -543 -589 140 131 -429 -396 42 82 -355 -260 500 98 -383 311 -69 -333 -107 353 175 -514 172 578 -403
5702 -403 -242 290 280 -421 -575 509 -6 -325 42 9 -535 -240 131 482 -202 -236 193 -28 -343 137 405
5723 405 -52 -190 116 450 102 -157 361 111 -333 32 774 202 -111 555 561 -133 -145 520 334 -623 -16
$$ packed form
5576b16l00N98M66o15n65O38J76k72n1K45M59j186J64J072m09m82L99K55n62l23
5596e09M83P88q98M1M52j65o26J94P63j88o29M64J59l71pL15R4n88L60N13r19
5617b74Q3L75L73j039L0O53Qm86L35N39p03m15O57P8p18L14J79M08p37L9Q68j86
5639C81q86P0Q23l36k54N01q0n65J30N09o2n21K81K10n91n3N46L26r05N28K82
5660C34m32l95M41N25o56k26Q88l30p49J98Q61k20o28M88K13o05k41P18M4p71
5680e43m6P29rn60L3M38M0m37R5P60m02m81O94l80k64K26M60j78o89O86M06r81
5702d03J61N32j0p01j54J084n15l19L67l3n44K95L71L51o84l4M29k21l15M80K68
5723D05m57j38L06L34l48k59N18k50m44L65P42n72l13O66Oo94j2O65j86r57O07
$$ plain form
5744 -16 440 -126 -283 272 520 111 -241 241 284 -126 -43 180 412 -283 -209 263 34 -220 343 -144 -422
5765 -422 -282 145 165 -333 193 288 -333 -517 488 99 -390 -196 458 -180 -477 181 331 -364 -376 -44 254
5786 254 -107 -170 211 202 -218 -191 465 -270 -436 133 247 -336 -221 472 138 -180 -112 61 -83 -547 -46 306
5808 306 -408 -450 -257 125 -256 -44 355 -108 -477 -2 137 -115 -324 456 73 -584 -179 515 381 -360
5828 -360 -217 349 200 -720 131 505 62 -609 113 194 -164 -363 239 -256 -345 49 230 -278 13 382 68
5849 68 -204 -284 270 -14 -277 171 252 -338 -86 731 205 -452 218 311 -361 -303 542 365 -320 -121 110 345
5871 345 -536 -214 691 9 -538 104 395 -24 -55 387 200 -525 154 358 67 -296 63 240 -35 219
5891 219 411 112 16 -18 494 -110 -168 334 255 -320 -442 145 177 -173 -105 469 158 -482 197 309 186 -381
$$ packed form
5744a6M56n66j57N55K48m09l52M82M3m10Q3K23K32o95P4M72k29k54N63m87k78
5765d22J40M27K0m98N26R5o21j84J005l89m89J94O54o38k97O58J50o95j2L32K98
5786B54l61o3L81rm20K7O56p35j66N69J14n83J15O93l34l18O8J73j44m64N01L52
5808C06p14m2J93L82l81K12L99m63l69M75J39k52k09P80l83o57M05O94j34p41
5828c60J43N66j49r20Q51L74m43o71P22Q1l58j99O02m95q9L94J81n08K91L69l14
5849F8k72q0N54k84k63M48Q1n90K52Q17n26o57O70R3o72N8Q45j77o85J99K31K35
5871C45q81L22R05o82n47O42K91m19l1M42j87p25O79K04k91l63L59J77k75K54
5891B19J92k99r6l4N12o04n8N02p9n75j22N87L2l50O8N74l11o40O79J12j23n67
$$ plain form
5913 -381 3 362 -397 24 210 222 -474 -371 175 -119 -229 103 -135 -411 -228 302 -19 -646 -73 230
5933 230 -117 -444 111 244 -185 -402 343 254 -519 -127 475 -183 -434 -32 458 -150 -226 180 -184 -437 -325
5954 -325 420 194 -474 324 204 -306 -575 137 28 -67 -209 171 10 -422 63 565 -98 -253 261 150
5974 150 -469 -10 472 30 -454 65 407 79 -333 429 452 -36 -158 755 363 -86 165 542 342 -224
5994 -224 -196 511 -126 -137 179 469 -193 45 429 231 -32 33 318 -290 -12 485 250 -288 126 367 -63
6015 -63 -164 445 574 -364 -58 315 47 -395 53 603 149 -257 -182 603 -106 -212 201 204 -613 -394 273
6036 273 -189 -202 -172 226 145 -179 52 55 -169 -82 286 -121 -161 0 272 -231 -363 -11 392 -179 -167 90 26
6059 26 -415 -132 105 -199 -320 -269 276 -121 -254 179 76 -364 -259 203 -136 -448 -290 237 -77 -357 -29
$$ packed form
5913c81L84L59p59M21J86J2o96J03N46k94j10L32k38k76J83N30l21o27N73L03
5933B30l47l27N55J33m29k17P45q9p73L92O02o58k51M02M90o08p6M06l64k53J12
5954c25P45k26o68P98j20n10k69P12j09r5j42L80j61m32M85N02o63j55N14j11
5974A50o19M59M82m42m84N19L42l28m12P62K3m88j22R13l92m49K51L77k00n66
5994b24K8P07o37j1L16K90o62K38L84j98k63O5K85o08K78M97k35n38M14K41m30
6015f3j01O09J29r38L06L73k68m42M48N50m54m06P5P85p09j06M13Lq17K19O67
6036B73m62j3L0L98q1l24K31Lk24Q7L68m07m0J61K72n03j32L52M03n71J2K57o4
6059B6m41K83K37l04j21N1N45l97j33M33j03m40J05M62l39l12J58N27l14k80L28
$$ plain form
6080 -29 257 -355 -235 -13 -290 -440 377 311 -770 -344 -123 -110 60 57 587 -42 -639 -155 401 -172 -394
6101 -394 247 292 -690 -171 280 227 -247 -134 144 -202 -371 -103 728 -216 -216 533 178 -224 -78 475 -62
6122 -62 -276 175 264 -253 -169 450 68 -69 410 241 115 319 443 556 -203 -40 30 349 -113 193 91
6143 91 111 -32 196 448 46 -296 233 148 -48 -99 398 -131 -405 127 550 -119 122 237 338 -266 -128
6164 -128 418 128 -362 202 -90 -278 125 268 505 -326 -213 232 481 -437 -80 314 -140 -280 153 146 8
6185 8 -174 -64 -56 -377 -263 207 -182 -306 -158 -92 -175 -416 97 196 -397 -181 319 -28 -503 101 415 -221
6207 -221 -319 38 -19 -419 -450 178 -82 -246 96 25 35 -377 311 -28 -452 -112 247 226 -233 -120 196 -108
6229 -108 -157 364 170 -149 -272 -150 404 -54 39 28 5 -293 10 379 101 2 251 119 -313 -150 445 108
$$ packed form
6080b9K86o12J20K22k77j50Q17o6j081M26K21J3J70lN30o29n97M84N56n73k22
6101c94O41M5r82N19M51n3m74J13K78l46j69K68Q31r44%P49l55m02J46N53n37
6122f2k14M51Q9n17Q4O19l82j37M79j69j26K04J24J13p59J63P0L19m62L06j02
6143I1K0j43K28K52m02l42N29q5j96n1M97n29k74N32M23o69K41J15J01o04J38
6164a28N46k90m90N64k92j88M03J43K37q31J13M45K49r18L57L94m54j40M33pj38
6185Hj82J10Ql21J14M70l89j24J48O6q3k41N13R9n93K16N00l47m75O04L14o36
6207b21r8L57n7m00l1O28k60j64L42p1J0m12O88l39m24L40L59k1m59J13L16l04
6229a08m9N21j94l19j23J22N54m58R3j1k3k98L03L69k78r9K49j32m32J63N95l37
$$ plain form
6251 108 -78 364 335 135 295 564 397 -188 -41 368 65 -62 28 106 -507 -186 131 307 -130 83 205
6272 205 16 -70 -107 252 -144 -4 164 -24 -37 -164 221 205 -84 189 353 -114 8 280 -47 -344 -303 331
6294 331 -46 115 272 410 159 -397 354 372 60 -547 136 -43 -179 -219 113 219 -271 -89 -44 -82 -356
6315 -356 19 230 -320 -113 10 -275 -327 68 184 -291 -456 225 328 -360 -42 258 -192 -413 212 224 -106
6336 -106 62 -146 -140 -317 -289 499 -87 -268 -217 80 -172 -123 -87 6 -61 -229 214 58 -90 70 -41 -103 -365
6359 -365 -20 174 147 -57 143 45 -288 -69 256 41 -94 352 541 -376 -319 261 152 -222 -222 354 355 -61
6381 -61 -189 535 -368 -219 537 97 -80 -20 130 66 -158 -78 79 44 -226 178 -26 -385 -116 377 -341 -390
6403 -390 88 515 -86 -302 100 -70 -384 81 292 42 -502 -43 377 -207 -318 402 150 -45 -134 262
$$ packed form
6251A08j86M42k9k00J60K69j67n85J47M09l03j27R0P8o13L21L17J76m37K13J22
6272B05j89q6l7L59l96J40J68j88j3j27L85j6k89K73J64m67J22K72l27k97M1O34
6294C31l77J61J57J38k51n56P51J8l12o07O83j79j36m0L32J06m90J82M5l8k74
6315c56L75K11n50K07J23k85n2L95J16m75j65O81J03o88L18L00m50k21O25J2l30
6336a06J68k08Oj77K8P88n86j81N1K97k52M9L6R3o7j68M43j56j48J60j11o2k62
6359c65L45J94k7k04K00r8l33K19L25k15j35M46J89r17N7N80j09l74%N76Jm16
6381f1j28P24r03J49P56m40j77O0J50o4k24Q0J57l5k70M04k04l59K69M93p18m9
6403c90M78M27o01k16M02j70l14M65K11k50n44M59M20n84j11P20k52j95q9L96
$$ plain form
6423 262 -62 -69 24 312 80 -443 154 367 -33 -114 354 101 -425 -160 359 166 -261 -91 313 -301 -212 536
6445 536 -19 -104 86 77 -153 -414 -217 206 -357 -409 97 -199 -443 52 424 -203 -223 -274 16 -287 -203 192
6467 192 302 -56 -277 367 -252 -22 -561 201 -104 -143 209 393 -95 -140 81 -84 54 -41 117 -123 -357
6488 -357 7 313 -66 192 202 49 -364 44 152 263 -13 273 -24 -229 -188 141 197 -190 -116 229 302 -177
6510 -177 210 454 105 -340 238 405 -371 -26 226 85 -147 -27 289 94 -169 415 103 -232 -47 338
6530 338 276 -91 10 307 -142 -144 87 164 24 -288 101 350 -199 -46 217 -4 -267 146 375 -213 -98
6551 -98 233 162 -161 -272 41 -67 -156 284 110 -356 307 45 -43 -212 -111 -2 -15 -221 313 341 -144 -198
6573 -198 2 293 -526 -218 251 200 -509 -208 76 -11 -262 354 216 -343 -88 134 109 -274 -312 52 -311
$$ packed form
6423B62l24pR3K88k32n23N97K13m00q1M68k53n26K65N19j93m27J70M04o14Q9P48
6445E36n55q5J90rk30k61J97M23n63n2N06k96k44M95L72o27k0n1K90l03Q4L95
6467A92J10l58k21O44o19K30n39P62l05l9L52J84m88m5K21j65J38r5J58k40k34
6488c57L64L06l79K58J0j53m13M08J08J11k76K86k97k05M1L29N6l87P4L45P3m79
6510a77L87K44l49m45N78J67p76L45K52j41k32J20L16j95k63N84l12l35J85L85
6530C38o2l67J01K97m49kK31P7j40l12L89K49n49J53K63k21k63M13K29n88J15
6551i8L31p1l23j11L13j08q9M40j74m66O63k62q8j69J01J09j3k06N34K8m85n4
6573a98K00K91q19L08M69n1p09L01K84q7k51O16j38n59K55K22k5l83l8L64l63
$$ plain form
6594 -311 -272 122 -31 -371 -307 -226 117 -68 -141 147 -125 -128 2 -144 -212 -215 300 -7 -200 -102 364 227 -10
6617 -10 -72 54 -139 -369 513 -51 -280 -235 85 -199 -170 493 167 228 -124 -83 248 -48 45 314 -11 -200
6639 -200 -65 286 -51 -28 10 11 145 229 228 135 -231 -106 -15 66 -71 402 386 -599 -30 242 138 -141 224 -86
6663 -86 0 -108 16 369 -26 -31 378 222 -207 -458 331 -15 74 251 79 -132 -348 559 59 -242 -119 -186
6685 -186 232 -196 57 172 10 -17 249 22 -216 -54 4 -223 -222 -144 156 -4 -241 166 73 -43 -84 243
6707 243 131 -78 49 -320 -243 -61 106 151 49 -566 -19 -29 -159 2 123 -440 -526 241 -163 -24 -177
6728 -177 54 -156 -134 -133 438 59 -323 -274 253 64 -202 215 227 -315 -188 301 56 -22 267 63 -219 -199
6750 -199 -57 -1 -66 -80 188 43 -398 -242 365 -101 58 331 56 110 -120 546 270 -24 246 451 -319
$$ packed form
6594c11L9L94j53l40O4Q1L43j85p3K88k72lJ30j46o8lN15l07j93R8M66j37k37
6617a0o2J26j93k30Q82n64k29M5L20k84K9O63l26O1l52M1L31k96R3K69l25j89
6639b00J35L51l37K3L8JJ34Q4jr3l66J25R1Q1j37M73j6r85N69K72j04k79L65l10
6663h6Q6j08J24L53l95nM09j56m29k51P89l46Q9J77j72k11k16R07n00l01J23o7
6685a86M18m28K53J15j62k7K66k27k38J62N8k27JP8L00j60k37M07r3j16m1L27
6707B43j12k09J27l69P7J82J67M5j02o15N47j0j30J61J21n63q6P67m04J39j53
6728a77K31k10K2JN71l79l82M9N27j89k66M17J2n42J27M89k45p8K89k04k82K0
6750a99J42N6o5j4K68j45m41J56O07m66J59K73k75N4k30O66k76k94K70K05p70
$$ plain form
6771 -319 -101 333 184 -37 -8 417 183 -94 160 340 3 -230 -5 175 104 -30 17 189 7 17 104 278
6793 278 -271 137 136 11 -78 -115 79 -3 -195 121 -99 -140 -164 295 -87 -180 289 -14 -206 -29 -165 35 -405
6816 -405 373 -68 109 -351 -22 159 -130 41 320 -29 -159 -107 -28 2 28 86 -465 -392 -219 198 -159 -136
6838 -136 -35 174 -228 -87 -184 309 -83 -138 117 7 43 50 269 -238 -275 -83 203 -431 -56 -120 260 -365
6860 -365 -71 160 126 -142 -161 110 74 -183 -399 247 66 13 529 34 -377 158 220 -43 187 -180 68 -62
6882 -62 -82 279 -206 -156 271 -56 -82 -68 221 233 1 -78 99 155 -175 -56 251 -36 -397 258 218 -287 44
6905 44 -246 264 -181 104 157 243 67 189 15 -425 146 248 -129 -367 -14 50 -48 22 -155 -128 -341 3
6927 3 105 -66 -48 17 13 -53 -237 -28 191 -37 -296 60 92 -231 181 118 -3 -15 -195 49 -250 -194 199 -165
$$ packed form
6771c19K18M34j49k21K9M25k34k77K54J80l37k33K25J80p1j34M7J72j82J0Q7J74
6793B78n49M08jj25q9l7J94q2j92L16k20m1k4M59l82r3M69l03j92J77j36K00m40
6816d05P78m41J77m60L29J81k89J71K79l49j30N2P9L0K6N8n51P3J73M17l57K3
6838a36J01K09m02J41r7M93l92n5K55j10L6PK19n07l7J92K86o34L75o4L80o25
6860c65K94K31l4k68j9K71l6k57k16O46j81n3N16m95m11N35O2k63K30l67K48j30
6882f2k0L61m85N0M27l27k6J4K89J2k32p9J77N6l30J19L07k87l61O55m0n05L31
6905D4k90N10m45K85N3Q6j76J22j74m40N71J02l77k38L53O4r8P0j77K7k13L44
6927CJ02j71J8O5mo6j84K09K19k28k59L56L2l23M12o3j21j2j80K44k99N6L93l64
$$ plain form
6951 -165 -372 98 343 217 -427 -115 240 -186 -289 267 -43 -156 -321 227 -198 -672 -4 -36 101 212
6971 212 91 212 -36 -478 24 -193 -204 -201 1 -70 -358 112 -11 -106 90 267 241 -162 -41 -177 -206 -88
6993 -88 -44 -7 -511 142 -46 97 -144 174 163 -258 -103 137 193 -387 -29 95 -123 -289 220 -223 -166 -7
7015 -7 512 365 -166 -30 446 -109 -94 190 46 365 38 141 140 -169 -156 -57 102 -409 307 447 251 -167
7037 -167 125 122 32 266 -90 145 -184 257 207 236 -64 103 307 -198 14 200 314 -188 -73 203 -44 -37
7059 -37 280 120 -6 -145 230 117 -90 -22 19 313 -138 68 215 -81 -19 70 36 -96 -142 -119 263 -49 129
7082 129 282 18 -36 32 142 -14 -422 7 362 65 -33 230 433 -541 -121 182 -152 -181 -173 43 -418 -215
7104 -215 234 42 -81 -151 452 63 69 67 281 -4 -199 77 -316 -246 40 -22 -47 -36 135 239 -187 -131 512
$$ packed form
6951a65k07M70K45j26o44L12L55m26j03N56l10j13j65N48m25m74O68l2J37J11
6971B12j21J21k48m42N02k17j1LK02p1k88M70j23r5J96J77k6m03J21j36k9J18
6993h8M4L7n04O53j88J43k41L18j1m21J55K40N6n80L58J24k18j66N09m43N7J59
7015gN19j47n31J36M76n55J5K84j44L19l27J03jl09J3R9J59n11P16J40j96m18
7037a67K92lr0K34l56K35l29M41n0K9l00J67K04n05K12J86J14n02J15K76k47P
7059c7L17j60j26j39L75j13k07O8M1K94m51K06J47k96O2Q9l4j32m6K3L82l12J78
7082A29J53k64n4O8J10j56m08M29L55k97r8K63K03r74M20L03l34k9QK16m61K03
7104b15M49j92j23p0O03l89OkK14k85j95K76l93P0K86o2k5J1J71J04m26N6O43
$$ plain form
7127 512 17 -102 104 104 226 -27 -43 192 48 57 201 -195 -78 -464 258 295 -339 156 186 70 -199 46
7149 46 -116 -18 301 12 34 8 395 133 -49 59 412 79 -352 67 341 236 -118 -94 91 284 -242 248
7171 248 129 -29 -388 261 -4 87 85 365 27 109 20 251 111 -345 258 141 -22 157 94 -117 -224 119
7193 119 -106 -67 -363 -156 249 -334 168 -284 -139 -202 -3 143 -52 -69 160 107 -35 -154 217 145 -448 173
7215 173 107 -119 -140 104 200 -106 -72 -23 -28 -134 -38 361 -102 -396 236 142 -239 -25 -53 184 97 129 -44 -21
7239 -21 -492 212 -245 28 -27 304 25 -261 24 164 360 44 -375 180 -259 -357 -132 -88 39 -709 281
7260 281 282 79 -119 413 54 -95 60 -76 113 54 -18 517 -126 171 411 51 -69 198 -152 -42 -54 459
7282 459 -45 -205 124 97 -372 -192 -14 79 -154 -229 215 52 111 -93 6 86 -155 161 28 -216 -207 57 -82
$$ packed form
7127E12m95j19K06%J22k53j6K35j44RJ44l96J17l86P22L7o34M95L0j16k69K45
7149D6j62R8L19k89K2k6L87k62j82J08L53l33m31M19K74j05l54K4J85J93n26M90
7171B48j19j58l59O49k65R1kK80l38Q2q9K31j40m56O03j17j63J79o3k11j07L43
7193A19k25L9k96K07M05n83N02m52J45o3J99J46j95j7K29n3j42j19L71p2n93O21
7215A73o6k26k1K44R6l06L4M9nj06R6L99m63k94O32r4l81K14k8K37q7L2j73K3
7239b1m71P04m57K73n5L31k79k86K85J40J96l16m19N55m39r8K25M4J27p48R90
7260B81Jk03j98N32l59j49J55j36J89n9p2N35o43K97K40l60j20K67l50J10j2N13
7282D59n04j60L29k7m69J80J78R3k33p5M44j63N9k04R9Q0k41L16j33k44RK64j39
$$ plain form
7305 -82 -33 136 187 196 -132 -97 104 140 -191 -131 119 -174 238 167 189 9 65 -16 22 -5 127 268 -307 151 103
7330 103 -225 -82 -28 108 -161 26 -35 2 -146 -212 265 -47 -165 -360 7 -80 97 -45 -279 -371 -179 -107
7352 -107 -67 -198 183 -104 -134 -104 174 -15 -276 -65 -235 90 -391 -64 267 28 -233 154 -134 48 -56
7373 -56 228 380 -158 -47 -73 69 133 49 181 -364 70 272 329 -73 -57 -69 -287 -212 -329 138 -228 -278 27
7396 27 106 -192 -52 208 -472 -247 -19 -155 248 -85 190 56 -167 -27 24 205 -48 -23 -38 214 198 82
7418 82 33 -13 -197 24 -135 159 334 299 -8 -67 -47 153 290 265 229 128 115 123 265 -240 -163 29 176 -186
7442 -186 -28 25 283 51 -127 37 -37 42 82 -36 1 -82 -72 107 19 176 381 -59 88 -245 260 45 -186
7465 -186 120 134 -56 -105 -49 -24 -3 149 -47 -105 -81 19 -54 -211 -40 -240 -244 -102 -237 382 -434 -387 -112 105
$$ packed form
7305h2M9J69N1Rl28L5K01L6l31O0K50k93M12p1K2j80N6q1L8k7J32J41n75M58m8
7330A03l28J43N4J36k69J87o1L7j48o6M77l12j18j95L67q7J77j42k34r2J92P2
7352a07M0j31L81k87l0L0K78j89k61K11j70L25m81L27L31k39k61L87k88J82j04
7373e6K84J52n38J11k6J42O4q4J32n45M34K02N7m02J6j2k18P5j17M67l66n0L05
7396B7P9k98J40K60o80K25K28j36M03l33K75j34k23J40N1J81k53K5j5K52j6j16
7418H2m9m6j84K21j59K94J75l5l07n9K0K00J37k5l6j01j3QJ42n05P7J92J47l62
7442a86J58N3K58k32j78J64p4P9M0j18L7q3J0J79q8J57K05m40J47l33N05k15k31
7465a86L06J4j90m9N6K5K1J52j96n8K4J00p3j57J71k00mJ42j35O19q16M7K75K17
$$ plain form
7489 105 -50 12 -39 -200 -182 -256 -92 -151 -55 9 -206 -483 -165 -115 331 13 -3 -339 -142 -90 262 112 -120
7512 -120 -246 188 -353 -268 64 87 -203 -298 31 268 -262 -127 276 -14 -287 117 604 57 -227 284 160
7533 160 -327 -80 109 290 -117 151 220 135 301 125 60 28 -63 233 221 -20 -44 -131 -205 -142 84 248 -57
7556 -57 6 244 17 78 284 79 160 -92 -261 14 -36 -7 285 342 -102 -106 296 259 -328 71 -104 -56 -176 197
7580 197 261 -73 159 85 86 -512 -145 243 1 -263 -146 -176 -86 -77 192 -90 -214 -191 307 -4 -187 67 215
7603 215 165 369 -20 -188 24 21 132 -185 -374 188 -16 -50 -155 -70 -335 -81 -252 258 -238 109 87 298
7625 298 79 179 62 214 10 -177 532 411 -10 -308 485 -228 -188 4 309 111 -170 223 98 103 -153
7646 -153 466 40 192 118 -257 -162 -62 154 138 -113 182 22 69 113 176 309 105 -113 39 276 -252 162
$$ packed form
7489A05j55O2n1j61J8p4J64n9R6O4k15k77L18N0M46l18j6l36J97N2L52j50k32
7512a20j26M34n41Q5L32K3k90r5L29K37n30J35M03k90k73M04M87n47k84N11j24
7533A60m87K47J89J81m07K68O9q5J66j76o5l2r1K96j2k41k4q7p4O3K26J64l05
7556e7O3K38k27O1K06k05Q1k52j69K75n0K9K92N7m44mM02l7n87L99j75M8j20L73
7580A97O4l34K32p4Jn98L67L88k42k64J17l0R0RK69k82j24K3M98l11j83K54J48
7603B15n0K04l89j68K12lJ11l17j89N62k04l4j05Q5k65K54j71N10m96L47k2K11
7625B98k19J00j17J52k04j87P09j21m21k98P93p13M0J92L05j98k81L93j25Nk56
7646a53O19m26J52p4l75R5J00K16j6k51K95j60M7M4O3J33k04k18J52K37n28M14
$$ plain form
7668 162 241 -151 114 159 119 153 187 -65 365 140 -110 160 116 56 -18 13 238 13 349 126 21 -13 68 -275
7692 -275 -296 103 285 -154 -295 61 152 137 -100 -84 -159 -170 -8 -62 -115 104 253 -22 82 -24 76 141 -164
7715 -164 -24 -19 23 -301 146 117 6 17 -80 -3 87 4 88 109 -134 -96 30 -11 -139 -2 30 -124 252 284 139
7740 139 -70 131 345 66 18 184 113 -204 -63 347 58 -68 -4 249 -147 -54 4 -101 -76 -43 -132 -147 -42
7763 -42 -58 280 241 -137 74 313 147 -247 -67 421 -173 -78 319 -170 231 235 167 61 -336 90 88 -123 503
7786 503 11 17 51 -287 419 8 -380 125 169 -285 70 258 157 -76 -227 277 131 65 20 233 141 165 -68
7809 -68 -216 -65 -161 -261 157 -15 164 341 -51 73 95 -129 -36 218 163 15 -49 -102 -60 -127 47 300 222
7832 222 69 3 -62 58 226 -253 -242 71 -171 190 -209 -177 -201 -184 -235 7 166 -73 -41 -57 -118 263 66
$$ packed form
7668A62P9l92K65M5m0L4L4k52M30k25k50K70m4o0p4L1K25k25L36k23j05l4Q1l43
7692b75k1L99J82m39j41L56R1j5k37J6p5j1J62n4n3K19J49k75J04j06J00O5l05
7715a64J40NM2l24M47k9j11J1r7P7R0q3Q4K1k43L8J26m1j28J37L2j54L76L2j45
7740A39k09K01K14k79m8J66p1l17J41M10k89j26O4K53l96R3N8j05K5L3q9j5J05
7763d2j6L38l9l78K11K39j66l94J80M88n94R5L97m89M01Mo8j06l97M26kk11O26
7786E03m92OL4l38P06m11l88N05M4m54L55J88j01k33j51N04j46o6m5K13r2K4k33
7809f8j48J51r6j00M18j72J79J77l92J24K2k24R3K54n5j48o4n3M2o7J74K53p8
7832B22j53o6o5J20J68m79J1L13k42L61l99L2k4J7n1K42J59k39L2j6o1L81j97
$$ plain form
7855 66 -95 -84 -273 -35 -36 229 -187 -186 -84 264 165 -35 214 27 64 2 74 213 227 -28 -17 -6 -123 -22
7879 -22 -167 -305 36 -93 181 -92 -56 18 -29 133 -12 -222 62 9 12 -222 -111 212 -263 -140 -108 -3 -120
7902 -120 -184 322 -1 12 64 356 119 -118 -24 -70 -29 -71 379 226 -208 24 50 -95 65 48 -258 -23 -106
7925 -106 75 -11 -30 113 6 79 204 142 180 296 2 128 15 105 34 108 -205 -277 -75 -235 299 -75 -64
7948 -64 298 -61 -23 -64 0 -102 -9 60 -117 -36 -131 213 -163 -163 235 103 328 -123 242 -6 111 101 30 -66
7972 -66 -110 -3 -87 -74 83 -125 475 35 29 -320 31 22 4 59 -117 47 50 253 -70 72 -191 96 -104 -93
7996 -93 -9 -35 -33 -117 12 137 -107 228 133 111 35 -90 52 200 -280 -188 105 -202 -388 -123 89 -134 -289
8019 -289 183 99 68 300 -8 -278 94 10 -55 -83 -431 -287 119 -244 -84 -35 -167 -59 -71 181 8 -232
$$ packed form
7855F6j61J1j89K38jK65m16JJ02L48r9k00K49j87L7o2P2J39J4k55J1J1j17J01
7879b2j45j38L41j29K74k73L6P4m7J62j45k10K84n3Lk34J11L23m75J23L2J05j17
7902a20o4N06l23J3N2K92k37k37R4m6M1m2M50j53m34K32K6j45J60j7l06K35q3
7925a06J81q6j9J43j07P3J25o2L8J16k94J26j13R0p1P4l13p2K02j60N34l74J1
7948f4L62l59L8m1O4j02R3O9j77Q1r5L44l76%L98j32K25m51L65k48J17j0p1r6
7972f6m4J07q4J3J57k08O00m40ol49L51rj8N5j76J64LK03l23J42k63K87k00J1
7996i3Q4k6Kq4J29J25k44L35r5k2p6j25J42J48m80R2K93l07j86K65K12k23j55
8019b89M72q4l1K32l08k70L72q4o5k8l48J44M06l63J60M9j32J08j2K52j73k40
$$ plain form
8041 -232 -11 -122 -52 149 -368 -180 -56 -83 -99 -29 -16 -233 102 58 14 291 -14 24 180 219 -128 52 184
8064 184 -167 134 223 -214 59 -85 320 -172 -144 -58 130 111 -94 64 -19 -180 26 332 95 255 133 84
8086 84 187 -69 23 37 -103 167 1 -80 -265 -91 105 34 -10 -177 171 42 86 -74 182 -157 -242 70 192
8109 192 -220 86 256 -319 -79 131 3 -189 -114 157 84 14 -65 -465 -54 -142 247 -45 -53 85 -145 112
8131 112 138 -147 201 228 229 16 90 -238 -25 -149 -205 -237 -159 -52 32 20 95 300 -134 -162 124 -192 2 -161
8155 -161 -56 -40 96 50 -90 -106 -423 -247 190 90 75 80 -226 -201 228 61 -124 -80 192 -149 122 129 334
8178 334 39 11 -392 -122 138 30 282 227 307 -82 -152 -163 -293
$$ packed form
8041b32K21j11P0K01n17J88J24k7j6P0J3k17L35m4m4K77l05L8J56L9l47J80J32
8064A84l51L01Q9m37K73j44M05m92K8Q6J88j9k05J58q3j61K06L06k37J60j22m9
8086H4J03k56R2J4j40K70j66q1j85J74J96p1m4j67L48j29M4j60K56l39q5L12J22
8109A92m12L06J70n75K40K10j28j92P5K71p3p0p9m00M11q8L89k92qJ38k30K57
8131A12K6k85L48K7Jk13P4l28K13j24n6l2P8J07Q4j2P5K05m34k8K86l16J94j63
8155a61J05J6J36m6j40j6l17J76M37j00j5Nl06K5M29j67j85M4K72l41K71PK05
8178C34k95k8m03K70K60j08K52n5Q0l89p0j1j30
8191b93
$$ Imaginary data points
##PAGE= N=2
##DATA TABLE= (X++(I..I)), XYDATA
$$ plain form
0 0 0 0 0 0 0 0 -8 8 -8 8 -8 16 -16 16 -24 32 -32 40 -48 53 -64 74 -85 100 -112 125 -148 165 -186 213
30 213 -237 265 -297 332 -371 413 -456 509 -567 623 -692 766 -847 941 -1041 1154 -1286 1437
48 1437 -1607 1812 -2053 2344 -2711 3181 -3810 4699 -6041 8314 -12888 25658 -133830 -503084
62 -503084 -218038 132870 195576 141328 106020 -137571 -393436 -252459 162656 308072 119246
73 119246 -100835 -218586 -250852 -94676 171547 262551 87894 -136088 -253333 -202882 37753
84 37753 286237 231989 -67409 -240651 -174260 -47526 101585 254007 174287 -164627 -332854
95 -332854 -114771 135000 151631 105684 51181 -155767 -322715 -120272 224390 240626 3368
106 3368 -124545 -151797 -194373 -78020 214068 291094 4771 -257156 -217188 -36267 110725
$$ packed form
0@%%%%%%qJ6j6J6j6K4l2L2m0N6o4P2q8J01j17J38j59J85k12K37k73L13l51L99
30B13m50N02n62O29p03P84q69R65j076J190j315J458j613J788j982K195k440K723
48A437l044L419l865M397n055N892o991Q509j0740J4355k1202L8546j59488l69254
62e03084K85046L50908O2706n4248l5308k43591k55865J40977M15115J45416j88826
73A19246k20081j17751l2266J56176K66223R1004j74657k23982j17245N0451K40635
84C7753K48484n4248k99398j73242O6391J26734J49111J52422p9720l38914j68227
95c32854K18083K49771J6631m5947n4503k06948j66948K02443L44662J6236k37258
106C368j27913k7252m2576J16353K92088P7026k86323k61927L9968J80921J46992
$$ plain form
117 110725 209512 172689 -42503 -222163 -165521 32840 195563 235825 95460 -148479 -221453
128 -221453 -29800 155226 158012 115332 60904 -117188 -241837 -38874 260988 227050 -31950
139 -31950 -128905 -83920 -85165 -11754 194993 219047 -54763 -246081 -125321 62462 122729
150 122729 134164 86450 -89294 -209856 -83955 126767 184004 111363 222 -133629 -175300
161 -175300 -8990 194988 194681 48149 -71637 -145184 -136379 43538 240161 179866 -55489
172 -55489 -162171 -115223 -55685 55284 206607 152123 -125782 -254633 -87881 75601 79586
183 79586 81490 72678 -95153 -247364 -112920 138664 168102 21706 -72101 -109382 -131903
194 -131903 -40301 129012 156941 10715 -120036 -139836 -73502 64936 173523 94955 -91446
$$ packed form
117A10725R8787l6823k15192j79660N6642J98361J62723M0262j40365k43939p2974
128b21453J91653J85026K786m2680n4428j78092j24649K02963K99862l3938k59000
139c1950r6955M4985j245P3411K06747K4054k73810j91318J20760J87783O0267
150A22729J1435m7714j75744j20562J25901K10722N7237p2641j11141j33851m1671
161a75300J66310K03978l07j46532j19786p3547Q805J79917J96623o0295k35355
172e5489j06682M6948N9538J10969J51323n4484k77905j28851J66752J63482L985
183G9586J904q812j67831j52211J34444K51584K9438j46396r3807l7281k2521
194a31903R1602J69313K7929j46226j30751j9800O6334J38438J08587p8568j86401
$$ plain form
205 -91446 -144635 -59226 2535 55949 141332 90989 -131260 -218351 -34491 128578 87554
216 87554 21716 7918 -89905 -186515 -58341 157232 148339 -25374 -106075 -94503 -85923 -4570
228 -4570 137971 131988 -43565 -144817 -85018 -1190 59136 118658 84247 -64188 -137858 -45707
240 -45707 62086 90857 88034 35288 -85709 -122718 7224 118393 80889 18189 -3169
251 -3169 -70247 -111707 21072 171506 92529 -83976 -92652 -12084 -13485 7283 117281 105718
263 105718 -85633 -170278 -28540 100426 80850 38955 14798 -65572 -117880 -24250 108333
274 108333 121093 40449 -47547 -109035 -80730 54665 142069 75649 -24020 -53739 -74193 -69992
286 -69992 54413 174233 79436 -108149 -121296 -11464 22790 32963 100666 71162 -102235
$$ packed form
205i1446n3189Q5409O1761N3414Q5383n0343k22249q7091J83860J63069m1024
216H7554o5838j3798r7823r6610J28174K15573q893j73713q0701J1572Q580Q1353
228d570J42541n983j75553j01252N9799Q3828O0326N9522l4411j48435p3670R2151
240d5707J07793K8771k823n2746j20997l7009J29942J11169l7504o2700k1358
251c169o7078m1460J32779J50434p8977j76505q676Q0568j401K0768J09998j1563
263A05718j91351q4645J41738J28966j9576m1895k4157q0370n2308R3630J32583
274A08333J2760q0644q7996o1488K8305J35395Q7404o6420r9669k9719k0454M201
286f9992J24405J19820r4797j87585j3147J09832L4254J0173O7703k9504j73397
$$ plain form
297 -102235 -164007 -11501 106988 65232 14262 201 -75794 -127249 -9506 133757 95756
308 95756 -32935 -77783 -66073 -50672 26097 118572 81289 -53220 -112642 -66169 6102 78170
320 78170 109644 26091 -98337 -104201 -15538 37842 65934 94541 19315 -136363 -140062 36996
332 36996 127745 46355 -10893 -4117 -71598 -128753 2104 165148 100965 -76175 -107454 -36541
344 -36541 -13344 16446 95945 82634 -55307 -129436 -56474 40439 78748 72243 7552 -85672
356 -85672 -94529 -6029 60552 64303 49708 -8477 -105062 -98065 42616 119788 43504 -31344
368 -31344 -33409 -58058 -70690 38318 141645 54780 -94073 -88939 -7567 5977 28402 99154
380 99154 57046 -100047 -133328 4689 91272 52292 21424 6120 -68121 -107475 -5723
$$ packed form
297a02235o1772J52506J18489m1756n0970j4061p5995n1455J17743J43263l8001
308I5756j28691m4848J1710J5401P6769R2475l7283j34509n9422M6473P2271P2068
320G8170L1474q3553j24428n864Q8663N3380K8092K8607p5226j55678l699J77058
332C6996R0749q1390n7248O776o7481n7155J30857J63044o4183j77140l1279P0913
344c6541K3197K9790P9499j3311j37941p4129P2962R6913L8309o505o4691r3224
356h5672q857Q8500O6581L751j4595n8185r6585O997J40681P7172p6284p4848
368c1344k065k4649j2632J09008J03327q6865j48853N134Q1372J3544K2425P0752
380I9154m2108j57093l3281J38017Q6583l8980l0868j5304p4241l9354J01752
$$ plain form
391 -5723 110178 88173 -8790 -65847 -76891 -42885 42948 95679 47536 -29139 -61991 -68852
403 -68852 -32484 73584 127795 18771 -105551 -72626 15946 21467 29905 89262 45211 -106581
415 -106581 -124075 35360 119277 44979 -10354 -5051 -49871 -84623 13951 124509 77003 -42332
427 -42332 -75741 -46012 -15016 44375 95167 43541 -60216 -84703 -33355 18243 64922 83068
439 83068 9418 -91366 -81079 10792 54969 53773 52839 -3445 -98895 -81567 50964 103556
451 103556 32832 -11897 -12184 -59186 -72957 44787 136554 43498 -83082 -64981 -2901 -5258
463 -5258 18368 86375 51403 -80359 -111447 -9523 62028 49586 24203 -11640 -70477 -74788
475 -74788 673 59402 51379 14671 -40095 -92433 -55775 55104 88451 10146 -41144 -29497
$$ packed form
391e723J15901k2005r6963n7057j1044L4006Q5833N2731m8143p6675l2852o861
403f8852L6368J06068N4211j09024j24322L2925Q8572N521Q438N9357m4051j51792
415a06581j7494J59435Q3917p4298n5333N303m4820l4752R8574J10558m7506j19335
427d2332l3409K9729L0996N9391N0792n1626j03757k4487N1348N1598M6679J8146
439H3068p3650j00784J0287R1871M4177j196r34n6284r5450J7328J32531N2592
451A03556p0724m4729k87m7002j3771J17744R1767r3056j26580J8101O2080k357
463e258K3626O8007l4972j31762l1088J01924P1551j2442k5383l5843n8837m311
475g4788P5461N8729q023l6708n4766n2338L6658J10879L3347p8305n1290J1647
$$ plain form
487 -29497 -43714 -48347 43367 114442 24146 -96631 -71679 12415 21805 21938 60972 25256 -84736
500 -84736 -94566 15104 73842 35180 3518 -17009 -67894 -70784 21126 83899 35432 -32654
512 -32654 -50129 -52765 -33832 37503 80514 20914 -55525 -58684 -28299 348 53585 77941
524 77941 2309 -81049 -50621 22137 32580 34408 59628 12168 -87578 -68908 57022 93324
536 93324 17874 -14204 1410 -35414 -57707 29935 106573 42227 -56485 -56193 -12354 6165
548 6165 33626 60998 19929 -50829 -56882 -11738 25094 53700 54146 -13264 -77658 -38584 39847
561 39847 46187 22393 30584 2816 -68962 -52235 60950 94856 12190 -33905 -10350 -18268
573 -18268 -30201 38063 93109 22099 -67285 -47807 7814 13015 24339 52390 10330 -71514
$$ packed form
487b9497j4217m633R1714P1075r0296j20777K4952Q4094R390J33L9034l5716j09992
500h4736r830J09670N8738l8662l1662k0527n0885k890R1910O2773m8467o8086
512c2654j7475k636J8933P1335M3011n9600p6439l159L0385K8647N3237K4356
524G7941p5632q3358L0428P2758J0443J828K5220m7460r9746J8670J25930L6302
536I3324p5450l2078J5614l6824k2293Q7642P6638o4346r8712K92M3839J8519
548F165K7461K7372m1069p0758o053M5144L6832K8606M46o7410o4394L9074P8431
561C9847O340k3794Q191k7768p1778J6727J13185L3906q2666m6095K3555p918
573a8268j1933O8264N5046p1010q9384J9478N5621N201J1324K8051m2060q1844
$$ plain form
585 -71514 -64836 14138 44322 21646 7892 -17036 -61494 -50449 20650 51507 18438 -12792
597 -12792 -34870 -57226 -26235 48589 58196 -10373 -40176 -17847 -24163 -26803 42403 80436 -8535
610 -8535 -89367 -34907 36687 14634 -2921 37175 16538 -73898 -71841 31170 67237 5910
622 5910 -29480 -20778 -35726 -39279 14196 51588 14694 -34323 -44861 -37454 -8622 41508 45921
635 45921 -14563 -49326 -22446 -4736 -3008 35412 58405 -9097 -72717 -25301 44220 31387
647 31387 7312 29117 9402 -56390 -39266 54419 68704 -1764 -22595 2793 -17256 -31251
659 -31251 32097 74411 9336 -55576 -28509 12234 8472 15931 38899 9540 -44126 -37634 11023
672 11023 33651 31519 18633 -17967 -42441 -6902 36855 27893 11755 21067 -3106 -50777 -16309
$$ packed form
585g1514O678P8974L0184k2676j3754k4928m4458J1045P1099L0857l3069l1230
597a2792k2078k2356L0991P4824R607o8569k9803K2329o316k640O9206L8033q8971
610h535q0832N4460P1594k2053j7555M0096k0637r0436K057J03011L6067o1327
622E910l5390Q702j4948l553N3475L7392l6894m9017j0538P407K8832N0130M413
635D5921o0484l4763K6880J7710J728L8420K2993o7502o3620M7416O9521j2833
647C1387k4075K1805j9715o5792J7124R3685J4285p0468k0831K5388k0049j3995
659c1251O3348M2314o5075o4912K7067M0743l762P459K2968k9359n3666O492M8657
672A1023K2628k132j2886l6600k4474L5539M3757q962j6138R312k4173m7671L4468
$$ plain form
685 -16309 69148 60154 -21654 -30106 15544 144 -26796 29916 74077 1069 -70273 -25569
697 -25569 35659 18210 -930 22090 5279 -49384 -41550 21509 38252 7339 -9540 -20637
709 -20637 -38702 -20035 27720 31753 -4200 -18372 -19384 -30890 -11104 39906 38149 -20144 -38016
722 -38016 -7195 -3220 -9320 28085 43703 -20502 -62523 -10506 33966 4699 -7702 22836
734 22836 -121 -61106 -36481 43461 40614 -23806 -30149 -2090 -18638 -31402 14906 42218
746 42218 -3737 -45504 -28794 -2874 6293 19074 17081 -15395 -31872 -11073 3420 5875 26349
759 26349 28629 -23530 -50980 2385 45591 13079 -10464 16970 7408 -42267 -21848 51493
771 51493 47140 -20913 -28907 8228 -459 -16409 21785 44642 -6900 -43281 -9720 19189 6655
$$ packed form
685a6309Q5457q994q1808q452M5650j5400k6940N6712M4161p3008p1342M4704
697b5569O1228j7449j9140K3020j6811n4663P834O3059J6743l0913j6879j1097
709b0637j8065J8667M7755M033l5953j4172j012j1506J9786N1010j757n8293j7872
722c8016L0821L975o100L7405J5618o4205m2021N2017M4472k9267j2401L0538
734B2836k2957o0985K4625P9942k847o4420o343K8059j6548j2764M6308K7312
746D2218m5955m1767J6710K5920R167J2781j993l2476j6477K0799J4493K455K0474
759B6349K280n2159k7450N3365M3206l2512k3543K7434r562m9675K0419P3341
771E1493m353o8053p994L7135q687j5950L8194K2857n1542l6381L3561K8909j2534
$$ plain form
784 6655 8925 21906 -5272 -36095 -10104 27952 20190 3703 6320 -6525 -24833 295 36728
797 36728 23347 -5660 -1695 -1489 -18023 3187 47107 29028 -25866 -22286 15405 5646 -9626
810 -9626 27469 41232 -20896 -53480 2170 41241 7593 -11273 13316 1247 -39221 -21471
822 -21471 32815 31870 -9164 -19828 -11751 -14879 -3032 23246 18460 -9944 -15444 -9810 -15259 412
836 412 34146 20476 -29821 -29590 10857 10235 -10997 10925 28749 -17063 -47273 -618 37135
849 37135 4870 -18742 3878 454 -32425 -14744 32781 20776 -25020 -22850 1070 -8845 -12025
862 -12025 18876 22133 -19860 -33868 -3917 8899 1570 9549 11556 -16504 -27752 -310 14580
875 14580 4547 7971 10383 -18502 -30743 9670 33062 70 -16038 11185 6156 -30214 -10669
$$ packed form
784F655K270J2981k7178l0823K5991L8056p762j6487K617j2845j8308K5128L6433
797C6728j3381k9007L965K06j6534K1210M3920j8079n4894L580L7691r759j5272
810i626L7095J3763o2128l2584N5650L9071l3648j8866K4589j2069m0468J7750
822b1471N4286r45m1034j0664Q077l128J1847K6278m786k8404n500N634n449J5671
836D12L3734j3670n0297K31M0447o22k1232K1922J7824m5812l0210M6655L7753
849C7135l2265k3612K2620l424l2879J7681M7525j2005m5796K170K3920r915l180
862a2025L0901L257m1993j4008K9951J2816p329P979K007k8060j1248K7442J4890
875A4580j0033L424K412k8885j2241M0413K3392l2992j6108K7223n029l6370J9545
$$ plain form
888 -10669 41093 23762 -32657 -21985 21526 8252 -20013 6690 29132 -8057 -33743 700
900 700 26504 5578 -8301 1479 -3237 -12444 4667 19012 5090 -4777 -99 -8474 -13272 15157
914 15157 32296 -253 -25027 -1947 12236 -7907 -267 33555 15231 -34334 -23471 22754
926 22754 17687 -8139 9252 20759 -19311 -35560 12542 37399 1403 -16049 6453 1264
938 1264 -24451 -3516 34044 16798 -20720 -15711 4119 -448 135 15925 10457 -13548 -13829 -33
952 -33 1737 7577 18899 443 -28081 -11480 21258 9601 -12311 7632 17187 -22830 -33665
965 -33665 20135 41535 -7439 -30199 5026 10390 -20864 -7349 35593 18578 -30200 -25245
977 -25245 10165 9439 -2660 10917 12081 -16003 -23280 1179 11607 5111 8097 2960 -19542
$$ packed form
888a0669N1762j7331n6419J0672M3511j3274k8265K6703K2442l7189k5686L4443
900G00K5804k0926j3879R780m716r207J7111J4345j3922r867M678q375m798K8429
914A5157J7139l2549k4774K3080J4183k0143P640L3822j8324m9565J0863M6225
926B2754n067k5826J7391J1507m0070j6249M8102K4857l5996j7452K2502n189
938A264k5715K0935L7560j7246l7518N009J9830m567N83J5790n468k4005k81J3796
952c3J770N840J1322j8456k8524J6601L2738j1657k1912J9943R555m0017j0835
965c3665N3800K1400m8974k2760L5225N364l1254J3515M2942j7015m8778M955
977b5245L5410p26j2099J3577J164k8084p277K4459J0428o496K986n137k2502
$$ plain form
990 -19542 -18824 9222 13830 -4039 -887 7608 -13053 -23212 8869 24731 -6389 -19696 7040
1003 7040 6957 -19624 -5695 27427 6460 -31890 -9480 25863 3915 -20826 6225 19531 -16851
1016 -16851 -26023 15745 27802 -8233 -19858 2139 2913 -11121 2280 17817 2146 -15181
1028 -15181 -9972 -4713 -1408 13787 14807 -12114 -21747 2185 8034 -10418 1325 26036 651
1041 651 -37328 -12291 30052 12548 -17956 2391 18423 -14170 -25766 17053 32910 -5553
1053 -5553 -20851 5372 8423 -9765 3406 24228 3782 -21104 -5850 12215 4087 2148 12401
1066 12401 -217 -20102 -6583 15377 9363 19 5496 -2377 -20593 -5181 23699 13869 -9520
1079 -9520 -1476 5703 -16156 -13233 27293 30768 -14051 -22794 10804 10088 -14417 5240 35719
$$ packed form
990a9542P18K8046M608j7869L152Q495k0661j0159L2081J5862l1120j3307K6736
1003G040q3k6581J3929L3122k0967l8350K2410L5343k1948k4741K7051J3306l6382
1016a6851r172M1768J2057l6035j1625K1997P74j4034J3401J5537j5671j7327
1028a5181N209N259L305J5195J020k6921r633K3932N849j8452J1743K4711k5385
1041F51l7979K5037M2343j7504l0504K0347J6032l2593j1596M2819J5857l8463
1053e553j5298K6223L051j8188J3171K0822k0446k4886J5254J8065q128j939J0253
1066A2401j2618j9885J3519K1960o014r344N477p873j8216J5412K8880r830k3389
1079i520Q044P179k1859K923M0526L475m4819q743L3598p16k4505J9657L0479
$$ plain form
1092 35719 7457 -33092 -12024 23445 10796 -7449 8511 12796 -13689 -18128 7783 15840
1104 15840 888 -2391 -2440 -11764 -6602 11486 6262 -11534 -4057 6580 -10110 -15450 12976 18548
1118 18548 -17326 -24707 9780 15210 -12446 -7745 17289 291 -28293 -5655 26298 7892
1130 7892 -17031 -2263 7312 -14020 -12215 18235 17133 -15095 -17619 2376 -693 -9054 6617
1143 6617 13346 -10728 -22100 -4313 4595 -2731 2078 4959 -13216 -20613 1553 10340 -5270
1156 -5270 -3759 8837 -7655 -25716 2216 29136 3269 -22977 -683 14890 -10209 -12732
1168 -12732 23810 24553 -18801 -25285 11656 19020 -2264 1572 14912 -3653 -21600 -1699 19525
1181 19525 11523 1070 -621 -10612 -15087 6374 20818 5659 -5309 1552 -5956 -18146 3893
$$ packed form
1092C5719k8262m0549K1068L5469j2649j8245J5960M285k6485m439K5911Q057
1104A5840j4952l279m9r324N162J8088n224j7796P477J0637j6690n340K8426N572
1118A8548l5874p381L4487N430k7656M701K5034j6998k8584K2638L1953j8406
1130G892k4923J4768R575k1332J805L0450j102l2228k524J9995l069q361J5671
1143F617O729k4074j1372J7787Q908p326M809K881j8175p397K2166Q787j5610
1156e270J511J2596j6492j8061K7932K6920k5867k6246K2294J5573k5099k523
1168a2732L6542P43m3354o484L6941P364k1284L836J3340j8565j7947J9901K1224
1181A9525q002j0453j691r991m475K1461J4444j5159j0968O861p508j2190K2039
$$ plain form
1194 3893 32239 12922 -19417 -8985 9676 -2555 -4522 24350 24197 -14825 -22710 10807 18465
1207 18465 -490 6196 20130 -2764 -23991 1731 27598 9691 -8373 2389 3811 -12738
1219 -12738 -5275 19400 14065 -10236 -11939 -2052 -2850 1263 12704 3722 -15262 -10836 2382 -2812
1233 -2812 -1829 15945 7847 -24847 -21627 15272 17417 -9844 -4653 14655 -6680 -30258 231
1246 231 32991 8049 -22964 -7917 7922 -8324 -10124 15648 15036 -15176 -21418 -1887 3241
1259 3241 -1012 5471 2224 -16050 -16807 828 3973 -2846 2638 1479 -18794 -19444 8772 15990
1273 15990 -6313 -9939 3789 -5943 -18783 5509 26975 1496 -22896 -3932 11157 -5487
1285 -5487 -4220 22429 14032 -23347 -20175 15632 17050 -4646 1012 12365 -7837 -22025 2802
$$ packed form
1194C893K8346j9317l2339J0432J8661j2231j967K8872j53l9022p885L3517P658
1207A8465j8955O686J3934k2894k1227K5722K5867j7907j8064J0762J422j6549
1219a2738P463K4675n335k4301j703R887p98M113J1441q982j8984M426J3218n194
1233b812R83J7774q098l2694L220L6899K145k7261N191J9308k1335k3578L0489
1246B31L2760k4942l1013J5047J5839j6246j800K5772o12l0212o242J9531N128
1259C241m253O483l247j8274p57J7635L145o819N484j159k0273o50K8216P218
1273A5990k2303l626J3728r732j2840K4292K1466k5479k4392J8964J5089j6644
1285e487J267K6649q397l7379L172L5807J418k1696N658J1353k0202j4188K4827
$$ plain form
1298 2802 23747 8454 -7174 -4667 -5064 -7520 5764 15263 4058 -5071 -2361 -6767 -8988 12453
1312 12453 25136 -172 -20561 -731 14196 -2807 -3483 22743 16141 -21388 -18247 20522 22350
1325 22350 -5687 -2729 14753 -2062 -18772 5817 27035 5990 -13621 -2553 3131 -5799
1337 -5799 1743 17188 5455 -14577 -8980 2951 -122 2080 11449 1234 -17533 -9550 8066
1350 8066 4276 -1457 8014 2443 -18830 -12105 15847 13293 -9471 -4515 8957 -8416 -19448
1363 -19448 10107 26514 -4787 -24435 -315 11386 -8858 -7665 16800 8657 -21852 -18039
1375 -18039 9514 10234 -4720 -2305 571 -11054 -11963 3660 7888 -941 -2145 -4109 -14764 -8119
1389 -8119 13659 11741 -10748 -9969 5100 -3353 -13879 7696 22226 -4174 -24145 -1854 14626
$$ packed form
1298B802K0945j5293j5628K507l97k456J3284R499j1205r129K710m406k221K1441
1312A2453J2683k5308k0389J9830J4927j7003o76K6226o602l7529L141L8769J828
1325B2350k8037K958J7482j6815j6710K4589K1218k1045j9611J1068N684q930
1337e799P542J5445j1733k0032N597J1931l073K202R369j0215j8767P983J7616
1350H066l790n733R471n571k1273O725K7952k554k2764M956J3472j7373j1032
1363a9448K9555J6407l1301j9648K4120J1701k0244J193K4465q143l0509L813
1375a8039K7553P20j4954K415K876j1625r09J5623M228q829j204j964j0655O645
1389h119K1778j918k2489P79J5069q453j0526K1575J4530k6400j9971K2291J6480
$$ plain form
1402 14626 -2091 -6059 13598 6921 -20008 -12086 16238 12647 -7108 -2175 6055 -8475 -12406
1415 -12406 10721 17631 -3742 -11845 195 47 -5104 7032 14213 -2116 -13199 -2201 4331
1428 4331 137 7381 12336 -5427 -16912 1335 14488 764 -2147 12066 2819 -20754 -7491
1441 -7491 23729 15091 -13300 -6428 11048 -2947 -13880 10576 23545 -3024 -19696 -1634
1453 -1634 9815 450 1624 10340 61 -13405 -4696 7620 5213 3587 5397 -5956 -15985
1466 -15985 532 16002 4353 -7106 1947 1713 -14606 -6208 20026 14739 -13565 -13134 5022
1479 5022 -307 -8643 10318 18564 -8712 -22824 -644 12577 -345 -385 11610 -1034 -21531
1492 -21531 -7659 17050 11141 -4407 -1831 -89 -11353 -6916 12091 12906 -3220 -7236 -4538
$$ packed form
1402A4626j6717l968J9657o677k6929P922K8324l591j9755M933Q230j4530l931
1415a2406K3127O910k1373q103J2040j48n151J2136P181j6329j1083J0998O532
1428D331m194P244M955j7763j1485J8247J3153j3724k911J4213r247k3573J3263
1441g491L1220q638k8391O872J7476j3995j0933K4456J2969k6569j6672J8062
1453a634J1449r365J174Q716j0279j3466Q709J2316k407j626J810j1353j0029
1466a5985J6517J5470j1649j1459R053k34j6319Q398K6234n287k8304M31J8156
1479E022n329q336J8961Q246k7276j4112K2180J3221j2922m0J1995j2644k0497
1492b1531J3872K4709n909j5548K576J742j1264M437J9007Q15j6126m016K698
$$ plain form
1505 -4538 -7679 -1140 14526 8856 -11152 -10502 2910 -2470 -7067 11278 16077 -12202 -24483 2975
1519 2975 17401 -2089 -7536 9929 3173 -21438 -10403 19934 15214 -9769 -9403 2683 -3896
1532 -3896 -6377 10788 14226 -4219 -12281 -3457 195 1412 11335 9248 -9491 -14162 979 5195
1546 5195 -1052 5827 9643 -9384 -20497 147 15373 1572 -6467 4127 -1055 -18261 -5532
1559 -5532 19946 10195 -13972 -8086 6612 -4082 -9097 12120 17752 -9607 -19265 2960 12431
1572 12431 -38 498 9300 -1731 -13978 -2790 13007 9209 426 -799 -7389 -9810 4382
1585 4382 14279 2912 -5761 295 -3823 -13919 1262 22802 8546 -19471 -11618 8518 431
1598 431 -7818 11726 17548 -11217 -24041 2723 18239 3191 -1949 8247 -314 -15501 -2588
$$ packed form
1505d538l141O539J5666n670k0008O50J3412n380m597J8345M799k8279j2281K7458
1519B975J4426j9490n447J7465o756k4611J1035L0337m720k4983L66J2086o579
1532c896k481J7165L438j8445q062Q824L652J217R923k087j8739m671J5141M216
1546E195o247O879L816j9027j1113K0644J5226j3801q039J0594n182j7206J2729
1559e532K5478r751k4167N886J4698j0694n015K1217N632k7359r658K2225R471
1572A2431j2469N36Q802j1031j2247J1188J5797l798q783j225o590k421J4192
1585D382R897j1367q673O056m118j0096J5181K1540j4256k8017P853K0136q087
1598D31q249J9544N822k8765j2824K6764J5516j5048n140J0196q561j5187J2913
$$ plain form
1611 -2588 18055 11955 -2782 -1930 -1401 -7437 571 16225 10120 -6523 -6339 -671 -3555 925 14038
1626 14038 7515 -12592 -11812 3114 2504 -2858 8062 8692 -14487 -19196 5884 15094 -3000 -5523
1640 -5523 7038 -2919 -20016 -2119 23161 9587 -15123 -7984 5569 -3182 -5355 12200 14469
1653 14469 -7331 -15566 -1655 5259 2914 6307 3413 -9417 -11397 531 3169 -725 4616 3894
1667 3894 -14233 -18005 4611 13890 -4628 -11104 2574 -1585 -16823 -4171 18104 6205 -17634
1680 -17634 -9609 6811 -343 -5649 9199 10503 -10526 -15015 5374 11492 244 1080 5712 -5666
1694 -5666 -12052 3681 15168 4050 -4596 -1275 -4530 -7787 4315 14398 2375 -8772 -3939
1707 -3939 -2152 -6582 4058 16746 2224 -17513 -7215 8668 704 -3671 12172 11563 -14374
$$ packed form
1611b588K0643o100j4737Q52N29o036Q008J5654o105j6643J84N668k884M480J3113
1626A4038o523k0107P80J4926o10n362J0920O30k3179m709K5080R210j8094k523
1640e523J2561r957j7097J7897K5280j3574k4710P139J3553q751k173J7555K269
1653A4469k1800q235J3911O914k345L393k894j2830j980J1928K638l894N341p22
1667C894j8127l772K2616R279j8518o476J3678m159j5238J2652K2275j1899k3839
1680a7634Q025J6420p154n306J4848J304k1029m489K0389O118j1248Q36M632j1378
1694e666o386J5733J1487j1118q646L321l255l257J2102J0083j2023j1147M833
1707c939J787m430J0640J2688j4522j9737J0298J5883p964m375J5843o09k5937
$$ plain form
1720 -14374 -17058 10941 19095 -724 -3741 8140 801 -11836 1756 20280 10037 -6694 -4174
1733 -4174 2192 -321 4605 13232 5236 -7188 -4689 1339 -627 3712 12673 2313 -16016 -8980
1747 -8980 8946 5121 -4149 4429 5986 -13058 -15937 7851 16248 -2265 -8588 2313 -1565 -11922
1761 -11922 2239 18418 4330 -13889 -5499 5289 -1879 -1663 11807 7662 -12354 -11998 4293
1774 4293 6435 -483 1708 2137 -9312 -11291 2002 6107 -1140 -1392 -1750 -11315 -10990 6351 9544
1789 9544 -7107 -10545 1676 -2175 -12925 78 16315 142 -19842 -6348 10893 1128 -6864
1802 -6864 6427 8371 -11045 -13155 7526 13245 -274 -3558 1310 -4175 -6215 5579 10864 565
1816 565 -4585 -1453 -4227 -5029 7610 12454 -3155 -11737 -1217 2900 -4047 2498 12808 639
$$ packed form
1720a4374k684K7999Q154j9819l017J1881p339j2637J3592J8524j0243j6731K520
1733d174O366k513M926Q627p996j2424K499O028j966M339Q961j0360j8329P036
1747h980J7926l825r270Q578J557j9044k879K3788Q397j8513o323J0901l878j0357
1761a1922J4161J6179j4088j8219Q390J0788p168K16J3470m145k0016L56J6291
1774D293K142o918K191M29j1449j979J3293M105p247k52l58r565L25J7341L193
1789I544j6651l438J2221l851j0750J3003J6237j6173j9984J3494J7241r765p992
1802f864J3291J944j9416k110K0681N719j3519l284M868n485k040J1794N285j0299
1816E65n150L132k774q02J2639M844j5609q582J0520M117o947O545J0310j2169
$$ plain form
1830 639 -15963 -5174 10972 4692 -2830 6352 6459 -11438 -9926 12775 15155 -2730 -4170 6782
1844 6782 272 -7946 6174 17861 3549 -10439 -1739 6480 1599 2296 9232 3154 -7987 -4585
1858 -4585 3839 3126 4169 6213 -2745 -12318 -2160 10365 2646 -5190 3561 3737 -12397 -10087 13172
1873 13172 14296 -8270 -11433 4936 2666 -8657 1899 15703 1290 -15709 -5215 8364
1885 8364 2594 -1915 5478 2026 -10531 -7043 6321 5354 -1976 -224 -1340 -9381 -5791 7394
1899 7394 5523 -5828 -4693 -714 -6741 -6327 7020 7870 -9083 -11571 1819 1228 -6975 2247 10856
1914 10856 -5221 -17819 -1207 12596 500 -6816 4503 3823 -12735 -8519 12614 12347 -5999
1927 -5999 -8306 1500 -1055 -4186 5869 10671 -1266 -9091 -3875 -465 1894 8252 6439 -6958
$$ packed form
1830F39j6602J0789J6146o280p522R182J07j7897J512K2701K380j7885j440J0952
1844F782o510q218J4120J1687j4312j3988Q700Q219m881O97O936o078j1141L402
1858d585Q424p13J043K044q958r573J0158J2525p719p836Q751J76j6134K310K3259
1873A3172J124k2566l163J6369k270j1323J0556J3804j4413j6999J0494J3579
1885H364n770m509P393l452j2557L488J3364r67p330J752j116q041L590J3185
1899G394j871j1351J135L979o027M14J3347Q50j6953k488J3390n91q203R222Q609
1914A0856j6077j2598J6612J3803j2096p316J1319o80j6558M216K1133k67j8346
1927e999k307R806k555l131J0055M802j1937p825N216L410K359O358j813j3397
$$ plain form
1941 -6958 -10419 1528 4238 -1241 4397 10194 -4517 -16799 -635 15416 4747 -6009 2805
1954 2805 4399 -10201 -6819 13849 13804 -5790 -8487 3110 1578 -3524 6994 12902 -2322 -11825
1968 -11825 -760 7021 2173 3131 6952 -1926 -11094 -1928 8854 5142 801 1722 -3780 -9773 -176
1983 -176 11424 4995 -4087 -656 -777 -9223 -2411 14706 9560 -10969 -9803 4341 1152 -6714
1997 -6714 5395 13603 -4626 -18133 -1677 11619 2511 -3332 3842 940 -10771 -6283 8721
2010 8721 8175 -1881 -3754 -3198 -5931 -870 8860 4629 -5515 -4080 -140 -4897 -2149 10603 7546
2025 7546 -10462 -11635 3518 5178 -3324 2069 8539 -5770 -15766 -250 12937 2692 -5132
2038 -5132 1183 -925 -11835 -3556 13510 8767 -7570 -7353 548 -2893 -2815 9340 10311 -5217 -11344
$$ packed form
1941f958l461J1947K710n479N638N797j4711j2282J6164J6051j0669j0756Q814
1954B805J594j4600L382K0668m5j9594k697J1597j532n102J0518N908j5224r503
1968a1825J1065P781m848R58L821q878r168R166J0782l712m341R21n502n993R597
1983a76J1600o429r082L431j21q446O812J7117n146k0529J166J4144l189p866
1997f714J2109Q208j8229j3507J6456J3296r108n843P174k902j1711M488J5004
2010H721n46j0056j873N56k733N061R730m231j0144J435L940m757K748J2752l057
2025G546j8008j173J5153J660q502N393O470j4309r996J5516J3187j0245p824
2038e132O315k108j0910Q279J7066m743j6337K17P901l441P8J2155R71j5528o127
$$ plain form
2053 -11344 -1747 3474 2308 5546 5963 -5557 -10087 369 5675 2418 4133 5943 -6997 -13641
2067 -13641 2182 13534 2021 -6214 2108 1362 -11353 -5250 14510 10973 -10030 -10377 2915
2080 2915 1800 -4285 5223 9934 -3673 -12690 -2497 6636 3844 2917 3806 -4407 -9481 328 8308
2095 8308 4087 641 2739 -4067 -10477 576 12980 5132 -5991 -2158 590 -6755 -2881 11787
2109 11787 8995 -8951 -10022 2211 1654 -4055 5004 9583 -5830 -14261 167 9442 527 -2631
2123 -2631 4782 388 -10500 -3816 10315 7150 -3298 -2751 196 -2970 -6 8137 5049 -3371
2137 -3371 -2747 890 -2576 823 10088 5257 -9872 -7476 6330 3975 -4942 2821 8663 -5799
2151 -5799 -14748 1528 13188 1079 -7868 981 2073 -8613 -4559 10583 7495 -6910 -6890 1176
$$ packed form
2053a1344R597N221j166L238M17j1520m530J0456N306l257J715J810j2940o644
2067a3641J5823J1352j1513q235Q322p46j2715O103J9760l537k1003l47J3292
2080B915j115o085R508M711j3607r017J0193R133k792r27Q89q213n074R809P980
2095H308m221l446K098o806o410J1053J2404p848j1123L833K748p345L874J4668
2109A1787k792j7946j071J2233n57n709R059M579j5413q431J4428R275q915l158
2123b631P413m394j0888O684J4131l165j0448N47K947l166K964Q143l088q420
2137c371O24L637l466L399R265m831j5129K396J3806k355q917P763N842j4462
2151e799q949J6276J1660j2109q947Q849J092j0686M054J5142l088j4405K0Q066
$$ plain form
2165 1176 -549 -877 6879 6292 -4820 -6451 1320 2505 810 5295 4815 -5991 -8008 2772 6486
2180 6486 -227 82 3731 -4689 -10097 2344 10256 -643 -7226 208 560 -8977 -2974 11313 4395
2195 4395 -12390 -7904 5073 653 -5633 3746 7916 -6025 -12474 918 8426 1344 -1431 1778
2209 1778 -1967 -6459 452 6981 3456 -350 -201 -4216 -6003 3547 10020 179 -6627 72 1921
2224 1921 -6552 -2369 11009 5492 -11336 -8090 6158 3004 -5435 1687 7170 -4902 -11005 1974
2238 1974 9637 -79 -3636 2566 384 -6193 899 9957 3878 -4058 -823 2469 -1285 1699 8730
2253 8730 3979 -5002 -2721 3453 1262 937 6707 3062 -7360 -4624 6142 3798 -2876 2541 5045
2268 5045 -6425 -9916 5041 10841 -2752 -7302 2947 2228 -7919 -1995 11078 4584 -8940
$$ packed form
2165A176j725l28P756n87j1112j631P771J185j695M485m80j0806k017J0780L714
2180F486o713L09L649q420n408J2441P912j0899o583P434L52r537O003J4287o918
2195D395j6785M486J2977m420o286R379M170j3941o449J3392P508p082k775L209
2209A778l745m492O911O529l525l806J49m015j787R550O473r841o806O699J849
2224A921q473M183J3378n517j6828L246J4248l154q439P122N483j2072o103J2979
2238A974P663r716l557O202k182o577P092R058o079p936L235L292l754K984P031
2253H730m751q981K281O174k191l25N770l645j0422K736J0766k344o674N417K504
2268E045j1470l491J4957N800j3593m550J0249p19j0147N924J3073o494j3524
$$ plain form
2281 -8940 -5220 4825 1699 -1791 4038 4314 -4339 -5123 2355 3633 996 2942 1270 -6383 -4672
2296 -4672 5588 4552 -3201 -1536 2680 -5009 -8809 3680 9417 -3051 -9971 -580 1806 -6038
2310 -6038 -2362 7858 1264 -11394 -6501 4436 877 -3616 2857 3445 -7544 -8199 4074 6794
2324 6794 -1536 -1932 1750 -2612 -5624 2897 7602 794 -4147 -940 -1006 -2636 3069 6650 -1258 -6819
2340 -6819 -308 1952 -3489 -92 8220 381 -11651 -4209 8061 2517 -5505 1527 5747 -5824
2354 -5824 -9281 5600 10725 -1012 -5746 1777 1690 -3555 1789 8958 3203 -4140 -1369 2378 705
2369 705 3758 7386 1398 -5967 -487 5006 1215 549 6079 2439 -7856 -3956 7444 5022 -3563
2384 -3563 32 3693 -4659 -7136 5308 9036 -2776 -6510 1862 1562 -5208 987 9154 1302 -9153
$$ packed form
2281h940L720J0045l126l490N829K76q653p84P478J278k637J946j672p653J711
2296d672J0260j036p753J665M216p689l800J2489N737j2468o920R391K386p844
2310f038L676J0220o594j2658M893J0937l559m493O473N88j0989o55J2273K720
2324F794q330l96L682m362l012Q521M705o808m941L207o6j630N705L581p908n561
2340f819O511K260n441L397Q312p839j2032P442J2270n544q022P032M220j1571
2354e824l457J4881N125j1737m734P523q7n245N344P169n755p343K771L747j673
2369G05L053L628n988p365N480N493l791o66N530l640j0295L900J1400k422q585
2384c563L595L661q352k477J2444L728j1812l734Q372l00o770O195Q167p852j0455
$$ plain form
2399 -9153 -2693 5904 1501 -1712 4124 3197 -5821 -5247 4154 5176 231 205 32 -4970 -3166 4189
2415 4189 3788 -2913 -1186 1038 -5503 -6152 4734 7338 -5435 -8810 1111 1992 -6081 -2262 7635
2430 7635 736 -11573 -5387 6081 1964 -4586 246 2999 -5259 -6112 3704 5464 -1429 -3006 646
2445 646 -2158 -3198 3795 5251 -2423 -4335 635 -224 -2704 2617 5811 -2341 -7241 -103 3676
2460 3676 -1394 -599 4955 -485 -9104 -2556 7520 2377 -4334 1768 3823 -5813 -6010 6772 8642
2475 8642 -3081 -5073 2963 2202 -3639 1665 8816 2016 -5525 -1059 3948 1682 1668 4042 669
2490 669 -3873 284 3862 938 947 4407 -26 -7114 -843 8265 3158 -4821 421 4372 -3799 -5865
2506 -5865 5807 8296 -3759 -7167 2641 3579 -3192 215 7258 631 -7590 -1745 5214 1439 -1325
$$ packed form
2399i153O460Q597m403l213N836r27r018N74R401J022m945k6j73n002J804P355
2415D189m01o701J727K224o541o49J0886K604j2773l375R921Q81q073L819R897
2430G635o899j2309O186J1468m117o550M832K753q258q53R816J760o893j577L652
2445F46k804j040O993J456p674j912M970q59k480N321L194q152m900P138L779
2460C676n070P95N554n440q619O548J0076n143o711O102K055r636j97J2782J870
2475H642j1723j992Q036p61n841N304P151o800p541M466N007k266j4K374l373
2490F69m542M157L578k924RL460m433p088O271R108n107p979N242L951q171k066
2506e865J1672K489j2055l408R808R38o771L407P043o627q221N845O959l775k764
$$ plain form
2521 -1325 3119 1146 -5533 -3189 4543 3150 -1987 280 906 -4104 -3169 3928 3008 -3125 -1901 862
2537 862 -3028 -4103 3357 4398 -4805 -5715 2181 1548 -5346 -999 6177 -739 -9493 -1473 7076 -466
2553 -466 -5957 995 3934 -4590 -5348 4002 5019 -3632 -4177 1296 32 -2346 1524 3124 -2161 -3073
2569 -3073 817 -117 -1932 2676 3294 -3904 -5577 2404 3861 -3122 -1581 4842 362 -7679 -1276
2584 -1276 7459 1484 -5443 747 3890 -3186 -4118 5459 5425 -4113 -3748 3947 1703 -3111 1672 5513
2600 5513 -1284 -5237 1706 4978 -200 -598 2846 433 -3630 727 4907 1058 -1020 1735 136
2615 136 -3909 814 6340 1017 -4483 898 3355 -3287 -2995 6610 5395 -5934 -5668 4742 3627
2630 3627 -4268 -304 6655 -564 -7373 -625 5873 834 -2802 983 1315 -3760 -1886 3812 1586
$$ packed form
2521a325M444j973o679K344P732j393n137K267O26n010R35P097r20o133J224K763
2537H62l890j075P460J041r203r10P896o33o894M347P176o916q754Q020Q549p542
2553d66n491O952K939q524p58R350J017q651n45N473j264k378L870J600n285r12
2569c073L890r34j815M608O18p198j673P981J457o983J541O423m480q041O403
2584a276Q735n975o927O190L143p076r32R577l4r538L65P695k244m814M783L841
2600E513o797l953O943L272n178l98L444k413m063M357M180l849k078K755j599
2615A36m045M723N526n323n500N381K457o642K92R605j215j1329K66J0410j115
2630C627p895L964O959p219o809O748O498n039l636L785L32n075J874N698k226
$$ plain form
2645 1586 -2015 -34 561 -3051 -1297 4273 1679 -4498 -1500 2900 -1570 -3639 2847 4021 -4153
2660 -4153 -5010 3175 2797 -3862 -1290 4342 -1024 -6601 323 5812 -1117 -5053 1314 2763 -4717
2675 -4717 -3128 4833 2733 -4954 -2767 2885 158 -3226 1596 3157 -2465 -3292 805 1410 -887
2690 -887 1564 2229 -2663 -3299 2807 3042 -2873 -685 4324 -536 -6299 977 6982 -731 -6136 1098
2706 1098 4553 -3196 -3906 4663 4195 -4861 -4248 3687 2374 -3066 151 3229 -1622 -3807 1411 2944
2722 2944 -707 -816 2045 -973 -3324 2073 4277 -850 -2223 2243 641 -3517 552 5681 1252
2737 1252 -4660 140 3492 -1954 -2493 4526 3430 -5186 -3951 4134 2076 -3879 392 5040 -1639
2752 -1639 -6444 826 5667 -1107 -3741 1898 1981 -3812 -1829 3680 1986 -2169 -700 1337 -1119
$$ packed form
2645A586l601J981N95l612J754N570k594o177K998M400m470k069O486J174q174
2660d153q57Q185l78o659K572N632n366n577O924N489o929l936O367J449p480
2675d717J589P961k100p687K187N652k727l384M822J561n622q27M097O05k297
2690h87K451O65m892o36O106K35n915K188N009m860n763P276O005p713n405P234
2706A098L455p749p10Q569m68r056O13P935j313n440L217L078m851k185N218J533
2722B944l651j09K861l018k351N397K204n127j373M466j602m158M069N129m429
2737A252n912M800L352n446n39P019j096q616J235Q085k058n955M271M648o679
2752a639m805P270M841o774k634N639Q3n793J983N509j694m155J469K037k456
$$ plain form
2767 -1119 -245 3213 1006 -2811 454 3071 -1552 -1904 3945 3620 -4629 -3483 4832 3378 -4408 -1065
2783 -1065 5261 -118 -6137 417 5850 -347 -4724 1147 3123 -2983 -2355 3313 2050 -3856 -1822
2798 -1822 2458 -498 -2116 2281 2521 -2800 -2146 2317 1395 -1916 1036 3021 -1277 -2755 2600 2768
2814 2768 -2369 -794 3792 -422 -4458 1137 4715 -1919 -5049 1835 3137 -4300 -3962 3902 2518
2829 2518 -5748 -3296 4084 1335 -4806 -909 3546 -1306 -4441 1073 2956 -855 -1796 1482 -268
2844 -268 -2038 872 2525 -1337 -1549 2217 404 -3605 1081 5032 -820 -4716 1223 3743 -2431
2859 -2431 -3115 3816 3298 -4771 -3280 3981 1676 -3975 -589 3785 -1387 -4685 919 3646 -1942
2874 -1942 -2817 2212 1581 -3190 -788 3881 833 -2421 650 2739 -1230 -1098 2726 1493 -1876 850
$$ packed form
2767a119Q74L458k207l817L265K617m623l52N849l25q249J146Q315j454p786L343
2783a065O326n379o019O554N433o197m377N871J976o106O28N668j263n906K034
2798a822M280k956j618M397K40n321O54M463r22l311K952J985m298j478N355J68
2814B768n137J575M586m214m036N595L578o634l130O884J302p437L38P864j384
2829B518q266K452P380k749o141L897M455m852l135N514J883l811r41L278j750
2844b68j770K910J653l862k12L766j813m009M686L951n852l896N939K520o174
2859b431o84O931n18q069J491P261k305n651L386M374n172l298N604K727n588
2874a942q75N029o31m771K402M669l048l254L071K089l969J32L824j233l369K726
$$ plain form
2890 850 2851 -577 -1730 2747 2311 -2737 -1197 4382 1384 -4225 -147 5190 -478 -5206 1732
2905 1732 4836 -2186 -4606 2372 3717 -3297 -2880 3269 2123 -3442 -1039 2918 308 -2103 982
2920 982 2189 -1334 -383 2315 268 -2003 1594 2463 -1887 -1997 2931 1802 -3417 -1349 3763 456
2936 456 -4096 453 3320 -2373 -4373 1877 3044 -3453 -3208 2497 585 -4853 -1551 3679 -546
2951 -546 -4978 -338 2668 -2243 -3301 1616 2207 -2909 -2155 1900 632 -1974 382 1701 -1554 -1677
2967 -1677 1907 636 -2602 822 2519 -1515 -3356 2087 3122 -3178 -2741 3610 1983 -4580 -2023
2982 -2023 4353 401 -5170 -549 4470 -577 -4098 1056 3223 -1793 -2402 2528 2100 -1529 -802 2516
2998 2516 165 -1394 2060 2414 -1487 -716 2721 954 -1760 1536 3990 -1023 -2534 2452 2771 -2043
$$ packed form
2890H50K001l428j153M477m36n048J540N579k998n609M078N337n668m728O938
2905A732L104p022k420O978J345p014M17O149j146n565K403L957k610k411L085
2920I82J207l523R51K698k047k271L597Q69m350j10M928j129n219K068N112l307
2936D56m552M549K867n693k000O250J167o497K45N705j912n438L302N230m225
2951e46m432M640L006m911j058M917N91n116P54M055j268k606K356J319l255j23
2967a677L584j271l238L424J697m034j841N443J035o300M37O351j627o563K557
2982b023O376l952n571M621N019n047l521N154K167n016o09M930m28l629P27L318
2998B516k351j559L454L54l901P71L437j767k714L296K454n013j511M986L19m814
$$ plain form
3014 -2043 -651 3646 967 -3488 -30 4304 -124 -3270 1798 3292 -2652 -3069 3463 3614 -3417
3029 -3417 -2220 3493 1131 -3310 99 4002 -62 -2675 781 2629 -564 -536 1736 173 -2207
3044 -2207 586 2274 -660 -741 2249 146 -3870 -122 3952 -25 -4241 592 2920 -2793 -4046
3059 -4046 2743 3541 -3853 -4183 1869 1222 -3996 -1036 3709 -209 -4449 -648 2210 -1131 -1908 1537
3075 1537 667 -3350 -1634 2271 250 -1784 778 1014 -2463 -2098 2199 1189 -2251 -541 1796 -1453
3091 -1453 -2637 1981 2309 -2577 -2253 2438 1113 -3347 -211 4118 -544 -4777 520 4503 -388
3106 -388 -3427 2088 2860 -2756 -2276 3308 2892 -2140 -1169 2039 -29 -1225 1070 2271 -738 -846
3122 -846 1320 -14 -1017 2222 2798 -1472 -2220 2238 2492 -2217 -68 4302 637 -3938 633 4601
$$ packed form
3014b043J392M297k679m455L458M334m428l146N068J494n944m17O532J51p031
3029c417J197N713k362m441L409L903m064k613L456J848l193K8K272j563k380
3044b207K793J688k934q1K990k103m016L748M074l977m216M833K328n713j253
3059d046O789P98p394l30O052o47n218K960M745l918m240L801K858l341p77L445
3075A537q70m017J716L905k021k034K562K36l477L65M297j010l440J710K337l249
3091a453j184M618L28m886L24M691j325m460L136M329m662m233N297L983m891
3106c88l039N515P72n616M80N584m16n032R71L208k068j196K295J201l009j08
3122h46K166j334j003L239N76m270p48M458K54m709K149M370l665m575M571L968
$$ plain form
3138 4601 49 -2824 1347 3158 -1853 -2029 3443 2906 -2686 -1672 2397 507 -2536 966 3149
3153 3149 -1181 -3139 1364 1967 -874 -626 1968 -71 -3034 410 2057 -320 -810 1544 -402 -3079
3169 -3079 -245 3127 -526 -2926 511 1822 -3216 -2394 3298 2458 -3888 -2974 2579 668 -3744 -282
3185 -282 3902 -674 -4868 -479 2775 -845 -2119 1005 911 -2590 -1407 1931 407 -1709 524 241
3201 241 -2193 -1114 2650 515 -2530 -558 1971 -1353 -2381 2248 2586 -2549 -2481 2499 1573 -2445
3217 -2445 -379 3427 -311 -3485 869 3621 -812 -2656 1853 2087 -2873 -1264 3321 1750 -2407
3232 -2407 -579 2020 -369 -1948 1510 2459 -868 -1638 1671 681 -992 1175 2053 -951 -1744 2231
3248 2231 1804 -1913 154 2805 -511 -3390 1137 4252 -286 -2891 1892 2852 -2269 -2239 3520 2292
$$ packed form
3138D601m552k873M171J811n011j76N472n37n592J014M069j890l043L502K183
3153C149m330j958M503O03k841K48K594k039k963L444J647k377m90K354j946k677
3169c079K834L372l653k400L437J311n038Q22N692q40o346R14N553j911m412L462
3185b82M184m576m194M389L254l620j274L124r4l501J183L338j524k116K233k83
3201B41k434J079L764k135l045J972K529l324j028M629L38n135O8M980r26m018
3217b445K066L806l738l174M354K752m433j844M509K34m960J609M585j571m157
3232b407J828K599k389j579L458R49l327p70L309r90j673K167Q78l004p93L975
3248B231m27l717K067K651l316k879M527L115m538k605M783R60n121L0N759j228
$$ plain form
3264 2292 -3403 -1545 2789 882 -2002 537 2351 -1305 -2393 1077 1590 -808 -333 1653 -970
3279 -970 -2313 1196 2427 -979 -1375 1735 185 -2836 -66 3234 91 -2711 189 2073 -1603
3294 -1603 -1776 3067 1674 -3305 -2192 2687 711 -2567 422 2632 -1520 -3502 1082 2943 -1694
3309 -1694 -2323 1529 662 -2872 -953 2361 26 -2308 -339 662 -1356 -271 2212 -67 -2375
3324 -2375 -278 1928 -981 -1170 2556 1794 -3237 -1805 3177 1447 -2643 -254 3019 -616 -3610
3339 -3610 1162 3643 -684 -2691 687 1392 -1947 -888 2420 744 -2601 -843 1815 -438 -1518
3354 -1518 1629 1204 -2516 -1269 1819 383 -1356 1035 1346 -1372 -1872 2133 2080 -1398 -561 2038
3370 2038 -455 -2520 1372 3745 -1121 -2771 1679 1840 -2306 -1080 3554 1262 -3688 -1298 2703
$$ packed form
3264B292n695J858M334j907k884K539J814l656j088L470N13k398M75J986k623
3279i70j343L509J231l406l96L110j550l021K770L300l143k802K900J884l676
3294a603j73M843j393m979J113M879j976l278K989K210m152j982M584J861m637
3309a694o29L852q67l534J919L314k335k334J969J001k018J085K483k279k308
3324b375K097K206k909j89L726p62n031J432M982j730m090K389L273l635k994
3339c610M772K481m327k007L378P05l339J059L308j676l345J758K658k253j080
3354a518L147m25l720J247L088j436j739K391L11k718n00M005n3l478Q37K599
3370B038k493k065L892K373m866j650M450J61m146J226M634k292m950K390M001
$$ plain form
3385 2703 650 -2345 492 2458 -1595 -2374 964 1882 -871 -762 731 -578 -1474 1360 1629 -736
3401 -736 -642 1323 25 -1920 1076 3215 -520 -2747 1254 2583 -1450 -1407 3064 1849 -2937 -1535
3417 -1535 2761 1282 -2276 -46 1960 -1103 -2796 1375 2770 -1496 -1873 1055 229 -2175 241
3432 241 2410 -267 -2354 74 1249 -805 -295 2058 121 -2086 -249 1653 -458 -669 1657 979
3448 979 -2725 -1204 2692 768 -2543 142 2341 -1511 -3046 1636 3207 -1738 -3076 1167 1356
3463 1356 -2107 -1060 2350 391 -2946 -1150 1701 -198 -1166 797 381 -2178 -1002 1673 222
3478 222 -990 709 791 -1951 -1323 2320 1371 -2082 -759 2106 -387 -2564 1256 2874 -1242 -2534
3494 -2534 1199 1550 -1711 -878 2633 735 -3092 -818 2580 45 -1994 1082 1792 -1538 -1528 1894
$$ packed form
3385B703k053k995K837J966m053p79L338R18k753J09J493j309q96K834K69k365
3401g36R4J965j298j945K996K139l735k227M001J329m033M3M471j215m786J402
3417a535M296j479l558K230K006l063j693M171J395m266l77K928q26k404K416
3432B41K169k677k087K428J175k054N10K353j937k207J837J902k111k11K326o78
3448I79l704J521L896j924l311K685K199l852j535M682J571m945j338M243J89
3463A356l463J047L410j959l337J796K851j899r68J963m16k559J176K675j451
3478B22j212J699Q2k742O28L643r49l453J323K865k493k177L820J618m116j292
3494b534L733L51l261Q33L511j898l827K274L398k535k039L076P10l330J0L422
$$ plain form
3510 1894 1827 -1551 -744 1397 -170 -1567 1168 1865 -471 -750 938 256 -860 1260 2554 -965
3526 -965 -2145 1369 2042 -1370 -443 2792 1055 -2741 -566 3480 792 -2349 371 2288 -1207 -2277
3542 -2277 2017 2766 -1442 -1769 1400 720 -1563 307 1984 -907 -2107 597 881 -691 -216 1758
3558 1758 -204 -1989 821 2105 -543 -1281 1567 578 -1973 -668 2674 602 -2392 -96 1398
3573 1398 -832 -2169 1549 2015 -2710 -2270 1168 1216 -2418 -501 2318 -576 -3510 -166 2297 -249
3589 -249 -1611 484 78 -2083 -730 1820 290 -1344 136 65 -1618 -624 2015 520 -2153 -729
3605 -729 1777 -792 -1851 1312 2453 -2089 -2502 1919 1917 -1558 -687 1928 401 -2912 -36 2760
3621 2760 711 -1903 586 577 -1581 -730 2021 1258 -1413 -426 1304 -114 -300 1910 1606 -1579 -1413
$$ packed form
3510A894o7l378Q07K141j567j397K735O97k336k79J688o82j116K120J294l519
3526i65j180L514O73l412R27L235j737l796K175M046k688l141K720J917l495j070
3542b277M294P49m208l27L169o80k283J870J677k891j200K704K84j572M75J974
3558A758j962j785K810J284k648p38K848r89k551J305L342k072k994K296J494
3573A398k230j337L718M66m725M40L438M8l634J917K819k894k934L344K463k546
3589b49j362K095m06k161J353K550j530j634J480p1j683R94K639j495k673J424
3605g29K506k569j059L163J141m542m13M421kl475Q71K615j527l313K876K796
3621B760k049k614K489rk158Q51K751p63k671R87J730j418j86K210l04l185J66
$$ plain form
3638 -1413 1419 559 -495 1139 1965 -1277 -1767 1379 2117 -755 -517 1967 262 -2589 327 3233
3654 3233 519 -2264 956 1942 -1166 -1620 2425 2294 -2089 -1582 1632 1380 -927 465 1580 -905
3670 -905 -1722 346 1651 -346 310 798 -1205 -1807 731 1734 -468 -1253 1305 -46 -2253 -32
3686 -32 2990 424 -2806 -368 1650 -751 -1816 1439 2111 -2072 -2369 1394 1497 -1326 -295 1670
3702 1670 -894 -2711 272 1970 -390 -1334 468 -17 -2039 -419 2032 490 -1723 -203 114 -1344
3718 -1344 -453 1475 447 -1718 -766 976 -638 -1302 1588 1424 -2328 -2016 1787 1341 -1579 -318
3734 -318 2210 -174 -2900 23 3405 217 -2105 248 1647 -1435 -779 2165 1504 -1212 -1004 894
3750 894 22 -379 1556 1027 -1137 -591 1300 290 -475 1063 1750 -1458 -1915 1490 2334 -880 -606
$$ packed form
3638a413K832q60j054J634Q26l242m90L146P38k872K38K484j705k851K916K906
3654C233k714k783L220R86l108m54M045j31m383N07L214k52k307J392J115k485
3670i05q17K068J305j997O56M88k003o02K538J003k202p85K558j351k207K221
3686c2L022k566l230K438K018k401j065L255O72m183k97L763J03k823J031J965
3702A670k564j817K983J698k360r44J802m85k022J620K451j542k213J520L17j458
3718a344Q91J928j028k165R52J742j614o64K890j64l752L12L803m46k920J261
3734c18K528k384k726K923L382l188k322K353J399l082O56K944o61k716K08J898
3750H94q72m01J935n29k164N46J891j010p65J538O87l208m57L405Q44l214K74
$$ plain form
3767 -606 1856 410 -2250 76 2982 361 -1891 492 1663 -1034 -973 2611 1532 -1781 -1141 1612
3783 1612 787 -1143 434 1750 -1136 -1974 503 1042 -518 -599 781 -492 -1574 359 1550 -820
3799 -820 -980 526 -209 -1854 376 2454 -56 -2383 126 1609 -993 -1537 1652 1570 -2122 -1947 1623
3816 1623 1222 -1614 -202 1776 -940 -2237 230 1612 -702 -966 549 61 -1548 -180 1478 -99
3832 -99 -1258 -73 160 -1567 -625 1738 233 -2027 -372 1397 -420 -753 924 1031 -2066 -1513 1719
3849 1719 1187 -1505 -555 1545 -432 -1913 950 2683 -426 -1874 844 1092 -1204 -695 2072 886
3865 886 -1733 -747 1407 136 -728 941 768 -1472 -773 1030 142 -415 768 946 -1399 -1321 1580
3882 1580 1356 -1167 -368 1727 280 -1850 824 2783 23 -1563 642 1549 -831 -1044 1987 1455
$$ packed form
3767f06K462j446k660K326K906k621k252K383J171k697O1L584j079l313O40K753
3783A612q25j930J577J316k886q38K477N39j560q1J380j273j082J933J191k370
3799h20j60J506p35j645K230K078k510k327K509J483k602n44L189q2l692J75L570
3816A623m01k836J412J978k716j297K467J382k314k64J515m88j609J368J658j577
3832i9j159J185K33j727R42K363j505k260J655J769j817l33J677J07l097N53L232
3849A719n32k692R50K100j977j481K863J733l109j448K718K48k296N09K767j186
3865H86k619R86K154j271q64J669j73k240O99J803q88n57J183J78k345P8K901
3882A580k24k523P99K095j447k130K674J959k760j586K205R07k380k13L031n32
$$ plain form
3898 1455 -1414 -992 1346 489 -878 288 944 -1073 -1190 1132 1299 -1007 -536 1069 -721 -1103 850
3915 850 1544 -795 -1415 916 143 -1692 270 2057 -567 -1884 118 1260 -795 -632 1428 982
3931 982 -2469 -1290 1963 950 -1268 -132 1169 -723 -1668 1012 1754 -616 -1452 385 -67 -1206
3947 -1206 158 1318 -564 -1813 -352 178 -970 -86 1250 -157 -2149 172 1465 -242 -860 863
3963 863 818 -2082 -1165 2006 1112 -1526 -95 1012 -118 -1631 622 2167 -526 -1961 268 281 -1093
3980 -1093 -259 1812 222 -1968 -717 1029 19 -648 886 573 -1927 -677 1057 381 -696 400
3996 400 698 -1361 -858 1336 1023 -752 -432 1007 -534 -1668 1058 2348 -437 -1941 812 1582
4012 1582 -1139 -778 2074 670 -2018 -1072 1656 571 -869 -56 842 -1109 -1081 1007 1125 -476 -502
$$ packed form
3898A455k869M22K338q57j367J166O56k017j17K322J67k306M71J605j790l82J953
3915H50O94k339o20K331p73j835J962J787k624j317K002J142k055J63K060m46
3931I82l451J179L253j013k218J136J301j892r45K680P42k370q36J837m52j139
3947a206J364J160j882j249J461N30j148Q84J336j407j992K321J293j707o18J723
3963H63m5k900R17L171q94k638J431J107j130j513K253J545k693j435K229J3j374
3980a093Q34K071j590k190J251J746j010o67J534l13k500J250J734o76j077J096
3996D00K98k059N03K194l13j775L20J439j541j134K726J290k785j504K753P70
4012A582k721L61K852j404k688R46K728j085j440Q13Q98j951K8K088J18j601k6
$$ plain form
4029 -502 397 -354 -922 1283 1226 -758 -1100 738 67 -1312 860 2168 -534 -2010 225 1604 -567
4046 -567 -520 1652 1093 -1771 -916 1937 977 -1108 235 1118 -739 -1552 1461 1509 -901 -1164 616 228
4064 228 -1440 234 1653 -270 -1481 -140 605 -568 -105 1312 -453 -1418 -25 1165 -508 -832
4080 -832 1101 473 -2068 -892 1831 939 -1460 91 1299 -824 -2112 645 2158 -824 -1877 90
4096 90 812 -945 -381 1251 225 -1669 -379 601 -706 -352 836 355 -1607 -680 1024 139 -837
4113 -837 323 645 -1426 -915 1543 1003 -1258 -731 1084 -258 -1218 760 1812 -780 -1502 559 766
4130 766 -969 -416 1819 519 -1766 -402 1743 194 -1215 507 1168 -1061 -1357 1086 971 -880
4146 -880 -536 683 -426 -592 982 1194 -622 -693 703 196 -782 982 1534 -533 -1681 644 1534
$$ packed form
4029e02Q99p51n68K205n7j984l42J838o71j379K172J308k702j476K235J379k171
4046e67M7K172n59k864Q55K853r60k085J343Q83j857q13L013M8k410k63J780l88
4064B28j668J674J419j923j211J341P45j173M63J417j765r65J393J190j673l24
4080h32J933o28k541J176K723q92k399J551J208k123j288K757J513k982j053J967
4096I0P22j757N64J632j026j894J290R80j307L54J188m81j962R27J704q85r76
4113h37J160L22k071N11K458n40k261N27J815j342r60J978J052k592p22K061K07
4130G66j735N53K235j300k285J364K145j549j409J722O61k229k96K443j15j851
4146h80L44J219j109j66J574K12j816p1J396n07r78J764N52k067j148K325Q90
$$ plain form
4163 1534 -775 -726 1562 634 -1616 -479 2252 559 -1185 380 1209 -258 -1218 1321 1517 -631
4179 -631 -689 1026 233 -678 341 1350 -715 -1391 748 596 -640 62 1192 5 -1350 315 1278
$$ packed form
4163A534k309M9K288r28k250J137K731j693j744J565Q29j467r60K539J96k148
4179f31n8J715p93r11J019J009k065o76K139j52j236P02J130j187j355J665R63
$$ [...]
8191I6
##END NTUPLES=NMR FID
##END=
