##TITLE=1H_SAM-22.113
 CDCl3,8 sc, 
 11.4.2019
##JCAMPDX= 6.0         $$ Bruker NMR JCAMP-DX V2.0
##DATA TYPE= NMR FID
##DATA CLASS= NTUPLES
##ORIGIN= UXNMR, Bruker Analytische Messtechnik GmbH
##OWNER= root
$$ XWIN-NMR		Version 3.5
$$ Thu Apr 11 14:15:30 2019 Russian Standard Time (UT+4h)  she@DPX200
##.OBSERVE FREQUENCY= 200.1315
##.OBSERVE NUCLEUS= ^1H
##.DELAY= (6, 6)
##.ACQUISITION MODE= SIMULTANEOUS
##.ACQUISITION SCHEME= undefined
##.AVERAGES= 8
##.DIGITISER RES= 18
##SPECTROMETER/DATA SYSTEM= spect
##.PULSE SEQUENCE= zg30
##.SOLVENT NAME= CDCl3
##.SHIFT REFERENCE= (INTERNAL, CDCl3, 0, 15.7039)
##AUDIT TRAIL= $$ (NUMBER, WHEN, WHO, WHERE, WHAT)
$$ ##TITLE= Audit trail, XWIN-NMR		Version 3.5
$$ ##JCAMPDX= 5.01
$$ ##ORIGIN= Bruker BioSpin GmbH
$$ ##OWNER= she
$$ F:/spectra/data/she/nmr/H-F/1/audita.txt
$$ ##AUDIT TRAIL=  $$ (NUMBER, WHEN, WHO, WHERE, WHAT)
(   1,<2019-04-11 14:14:24.95 +0400>,<she>,<DPX200>,
      <created by zg, POWCHK disabled, PULCHK disabled
       configuration hash MD5:
       00 E9 B6 7A A2 85 ED C7 34 08 36 98 17 FE 4E 26
       data hash MD5: 16K
       89 C2 5B 33 36 CC 0D 26 A5 1D 3A 68 8B 33 FE D5>)
$$ ##END=
$$ 
$$ hash MD5
$$ 2D 04 B6 3F 3C C0 30 C7 14 F9 CD 55 06 91 B5 04
##$RELAX= 
##$RELAX= 
##$RELAX= 
##$RELAX= 
##$RELAX= 
##$RELAX= 
$$ Bruker specific parameters
$$ --------------------------
##$DU= <F:/spectra>
##$EXPNO= 1
##$NAME= <H-F>
##$PROCNO= 1
##$TYPE= <nmr>
##$USER= <she>
##$AMP= (0..31)
100 100 100 100 100 100 100 100 100 100 100 100 100 100 100 100 100 100 
100 100 100 100 100 100 100 100 100 100 100 100 100 100 
##$AQSEQ= 0
##$AQ_mod= 1
##$AUNM= <au_zg>
##$AUTOPOS= <>
##$BF1= 200.13
##$BF2= 200.13
##$BF3= 200.13
##$BF4= 200.13
##$BF5= 200.13
##$BF6= 200.13
##$BF7= 200.13
##$BF8= 200.13
##$BYTORDA= 1
##$CFDGTYP= 0
##$CFRGTYP= 5
##$CHEMSTR= <none>
##$CNST= (0..31)
1 1 145 1 1 1 1 1 1 1 1 1 1 1 1 1 1 1 1 1 1 1 1 1 1 1 1 1 1 1 1 1 
##$CPDPRG= <>
##$CPDPRG1= <>
##$CPDPRG2= <>
##$CPDPRG3= <>
##$CPDPRG4= <mlev>
##$CPDPRG5= <mlev>
##$CPDPRG6= <mlev>
##$CPDPRG7= <mlev>
##$CPDPRG8= <mlev>
##$CPDPRGB= <>
##$CPDPRGT= <>
##$D= (0..31)
0 1.2 0 0 0 0 0 0 0 0 0 0.03 0 0 0 0 0 0 0 0 0 0 0 0 0 0 0 0 0 0 0 0 
##$DATE= 1554977664
##$DBL= (0..7)
120 120 120 120 120 120 120 120 
##$DBP= (0..7)
150 150 150 150 150 150 150 150 
##$DBP07= 0
##$DBPNAM0= <>
##$DBPNAM1= <>
##$DBPNAM2= <>
##$DBPNAM3= <>
##$DBPNAM4= <>
##$DBPNAM5= <>
##$DBPNAM6= <>
##$DBPNAM7= <>
##$DBPOAL= (0..7)
0.5 0.5 0.5 0.5 0.5 0.5 0.5 0.5 
##$DBPOFFS= (0..7)
0 0 0 0 0 0 0 0 
##$DE= 6
##$DECBNUC= <off>
##$DECIM= 24
##$DECNUC= <off>
##$DECSTAT= 4
##$DIGMOD= 1
##$DIGTYP= 9
##$DL= (0..7)
0 120 120 120 120 120 120 120 
##$DP= (0..7)
150 150 150 150 150 150 150 150 
##$DP07= 0
##$DPNAME0= <>
##$DPNAME1= <>
##$DPNAME2= <>
##$DPNAME3= <>
##$DPNAME4= <>
##$DPNAME5= <>
##$DPNAME6= <>
##$DPNAME7= <>
##$DPOAL= (0..7)
0.5 0.5 0.5 0.5 0.5 0.5 0.5 0.5 
##$DPOFFS= (0..7)
0 0 0 0 0 0 0 0 
##$DQDMODE= 0
##$DR= 18
##$DS= 0
##$DSLIST= <SSSSSSSSSSSSSSS>
##$DSPFIRM= 0
$$ [...]
##$SUBNAM2= <"">
##$SUBNAM3= <"">
##$SUBNAM4= <"">
##$SUBNAM5= <"">
##$SUBNAM6= <"">
##$SUBNAM7= <"">
##$SUBNAM8= <"">
##$SUBNAM9= <"">
##$SW= 24.9337058887773
##$SWIBOX= (0..15)
0 0 2 0 0 0 0 0 0 0 0 0 0 0 0 0 
##$SW_h= 4990.01996007984
##$TD= 16384
##$TD0= 1
##$TE= 0
##$TE2= 300
##$TE3= 300
##$TEG= 300
##$TL= (0..7)
0 120 120 120 120 120 120 120 
##$TP= (0..7)
150 150 150 150 150 150 150 150 
##$TP07= 0
##$TPNAME0= <>
##$TPNAME1= <>
##$TPNAME2= <>
##$TPNAME3= <>
##$TPNAME4= <>
##$TPNAME5= <>
##$TPNAME6= <>
##$TPNAME7= <>
##$TPOAL= (0..7)
0.5 0.5 0.5 0.5 0.5 0.5 0.5 0.5 
##$TPOFFS= (0..7)
0 0 0 0 0 0 0 0 
##$TUNHIN= 0
##$TUNHOUT= 0
##$TUNXOUT= 0
##$USERA1= <user>
##$USERA2= <user>
##$USERA3= <user>
##$USERA4= <user>
##$USERA5= <user>
##$V9= 5
##$VALIST= <valist>
##$VCLIST= <CCCCCCCCCCCCCCC>
##$VD= 0
##$VDLIST= <DDDDDDDDDDDDDDD>
##$VPLIST= <PPPPPPPPPPPPPPP>
##$VTLIST= <TTTTTTTTTTTTTTT>
##$WBST= 1024
##$WBSW= 4
##$XGAIN= (0..3)
0 0 0 0 
##$XL= 0
##$YL= 0
##$YMAX_a= 90735
##$YMIN_a= -172749
##$ZGOPTNS= <>
##$ZL1= 120
##$ZL2= 120
##$ZL3= 120
##$ZL4= 120
##$ABSF1= 10
##$ABSF2= 0
##$ABSG= 5
##$ABSL= 3
##$ALPHA= 0
##$AQORDER= 0
##$ASSFAC= 0
##$ASSFACI= 0
##$ASSFACX= 0
##$ASSWID= 0
##$AUNMP= <proc_1d>
##$AZFE= 0.1
##$AZFW= 0.1
##$BCFW= 1
##$BC_mod= 2
##$BYTORDP= 1
##$COROFFS= 0
##$CY= 11.3945322036743
##$DATMOD= 1
##$DC= 2
##$DFILT= <>
##$DTYPP= 0
##$F1P= 18.9103706918063
##$F2P= -1.10871071338519
##$FCOR= 0.5
##$FTSIZE= 0
##$FT_mod= 4
##$GAMMA= 1
##$GB= 0.15
##$INTBC= 1
##$INTSCL= 1
##$ISEN= 128
##$LB= 0.24
##$LEV0= 0
##$LPBIN= 0
##$MAXI= 10000
##$MC2= 0
##$MEAN= 0
##$ME_mod= 0
##$MI= 1.114404
##$NCOEF= 0
##$NC_proc= 0
##$NLEV= 6
##$NOISF1= 3.799351
##$NOISF2= 2.8
##$NSP= 1
##$NTH_PI= 0
##$NZP= 0
##$OFFSET= 15.70392
##$PC= 1
##$PHC0= -8848.15
##$PHC1= 6.400256
##$PH_mod= 1
##$PKNL= yes
##$PPARMOD= 0
##$PSCAL= 0
##$PSIGN= 0
##$REVERSE= no
##$SF= 200.130013532006
##$SI= 16384
##$SIGF1= 3
##$SIGF2= 2
##$SINO= 400
##$SIOLD= 16384
##$SREGLST= <1H.CDCl3>
##$SSB= 0
##$STSI= 0
##$STSR= 0
##$SW_p= 3612.71676300578
##$SYMM= 0
##$S_DEV= 0
##$TDeff= 0
##$TDoff= 0
##$TI= <>
##$TILT= no
##$TM1= 0
##$TM2= 0
##$TOPLEV= 0
##$USERP1= <user>
##$USERP2= <user>
##$USERP3= <user>
##$USERP4= <user>
##$USERP5= <user>
##$WDW= 1
##$XDIM= 8192
##$YMAX_p= 0
##$YMIN_p= 0
$$ End of Bruker specific parameters
$$ ---------------------------------
##NTUPLES= NMR FID
##VAR_NAME=  TIME,          FID/REAL,        FID/IMAG
##SYMBOL=    X,             R,               I
##VAR_TYPE=  INDEPENDENT,   DEPENDENT,       DEPENDENT
##VAR_FORM=  AFFN,          ASDF,            ASDF
##VAR_DIM=   8192,          8192,            8192
##UNITS=     SECONDS,       ARBITRARY UNITS, ARBITRARY UNITS
##FACTOR=    0.0002004,     1,               1
##FIRST=     0,             0,               0
##LAST=      1.6414764,     0,               0
##MIN=       0,             -172749,         0
##MAX=       1.6414764,     90735,           0
$$ Real data points
##PAGE= N=1
##DATA TABLE= (X++(R..R)), XYDATA
0 0 0 0 0 0 0 0 0 -8 8 -8 8 -8 16 -16 24 -24 32 -37 42 -49 59 -72 80 -93 107 -123 139 -159 180 -203 230
31 230 -260 290 -325 362 -402 449 -498 554 -615 680 -755 835 -923 1024 -1134 1261 -1404
48 -1404 1568 -1757 1983 -2250 2578 -2994 3529 -4260 5318 -6995 10074 -17615 77371 37183
62 37183 -125975 -43280 29068 23832 22753 89489 46730 -74916 -103541 5327 72156 55809
74 55809 19594 -9388 -60374 -67754 -1499 68465 60965 2994 -55278 -68143 -21960 44761 55439
87 55439 15687 -16459 -32872 -50455 -22066 57259 80101 -736 -66042 -40552 -379 7594
99 7594 36560 61730 -1444 -89428 -63588 32025 52609 10731 382 -7629 -60922 -74156 10114
112 10114 76922 32703 -44973 -60797 -40940 -21182 12658 45091 25333 -34993 -69815 -48058
124 -48058 7186 49561 38379 -15425 -46635 -32011 -13248 2715 39727 53465 -10909 -76212
136 -76212 -38615 40353 43585 4261 4148 1920 -41903 -44158 31280 69843 12425 -40472 -28345
149 -28345 -10674 -8742 22378 51433 12052 -49442 -45891 606 25390 31391 29032 -4704 -47480
162 -47480 -36881 14278 42686 35860 18069 -14964 -45281 -22555 36102 54806 25886 1965
174 1965 -13554 -34544 -16796 47585 69131 13049 -30603 -15753 -2358 -5393 26589 60361
186 60361 20205 -47125 -40720 13626 29572 17018 20171 6892 -33900 -38652 9602 39411 21554
199 21554 -752 -14739 -30465 -19679 23353 40322 8436 -17341 -15488 -16968 -12574 25321 47359
212 47359 5685 -39860 -25874 6503 9811 14271 28599 5936 -39658 -35450 9734 26429 12721
225 12721 5819 -6967 -35611 -32558 11936 30859 4885 -14128 -14936 -25738 -26245 9873 32383
238 32383 1722 -30133 -21534 -9033 -10336 6150 25310 883 -34600 -23155 7155 7186 1563
251 1563 13417 2686 -32069 -25441 19921 28794 -4147 -12514 34 -11717 -21194 11295 36216
264 36216 6259 -29900 -22132 -683 4241 10695 18343 544 -25421 -22319 -2581 10695 20744
277 20744 17951 -12872 -36212 -12455 20641 16174 3930 12576 1951 -32451 -24070 30591 43368
290 43368 -11 -18681 739 -1457 -14866 13551 43368 13762 -29608 -19471 11346 11587 9181
303 9181 21227 10281 -23139 -24048 9612 25692 14848 4586 -5125 -18824 -13627 12882 25198
316 25198 12969 -1530 -13141 -21783 -5509 27035 27634 -2493 -13824 -4964 -10766 -10406 24564
329 24564 41819 -2810 -40819 -13616 19278 6393 -453 23855 14940 -34084 -37056 16284 37784
342 37784 5649 -12139 -2540 -9004 -21459 -352 29362 18703 -12452 -24058 -14447 158 14701
355 14701 16455 -223 -13925 -13040 -10853 -4189 17800 23989 -8306 -33878 -12667 13469 4887
368 4887 -521 13655 1789 -33823 -25362 21209 28058 -6420 -14487 406 -12217 -23786 9102
381 9102 37584 6168 -31630 -19213 5012 1445 1325 18605 11840 -21915 -29725 -1374 19207
394 19207 15587 4142 -8385 -18032 -12591 2670 10721 12912 9445 -11644 -31597 -12528 24695
407 24695 21667 -8201 -10547 1785 -12553 -21402 13858 39078 2216 -34941 -14534 13338 4051
420 4051 -581 19678 13628 -23633 -27489 10239 26603 9761 141 -400 -12101 -15450 7951 25881
434 25881 13562 -4844 -11043 -12385 -5102 15003 23104 4985 -11760 -11036 -8523 -2861 17284 24726
448 24726 -1890 -24293 -9933 7827 3085 6031 21431 5888 -29237 -20791 20157 24887 -1006
461 -1006 -2717 7751 -9352 -21642 8321 34107 12209 -17100 -11896 1357 395 5696 19029
474 19029 9876 -13067 -16399 -3373 5936 13017 14832 -2654 -21779 -12134 7970 8017 2773 7760
488 7760 297 -22866 -19589 12744 22096 -706 -10483 -2733 -8675 -14564 7265 24400 4224 -19018
502 -19018 -12127 317 -1860 5081 18081 5132 -20685 -17045 5829 9604 3651 6324 1447 -17830
516 -17830 -18070 5797 16226 3489 -4097 -5814 -14819 -13879 7589 17042 -369 -12615 -7784 -8738
530 -8738 -11476 5914 20669 903 -22801 -13066 5604 1580 -675 11907 7400 -17312 -18829
543 -18829 6207 16202 5291 371 -343 -9807 -10083 6844 15557 5342 -1971 -2732 -10363 -8439 12707
558 12707 20496 -1415 -15184 -2658 2234 -6869 2044 20252 6604 -21790 -15123 10916 10336
571 10336 -1752 5139 7779 -10813 -16305 7146 19865 5574 -3233 575 -3035 -7103 7348
584 7348 19737 8639 -6558 -3534 9 -201 8879 16962 5045 -9625 -5205 3419 2356 6137
598 6137 14229 1826 -16817 -8568 11270 6582 -4338 5318 7759 -14655 -19332 10441 22138
611 22138 -3423 -15224 2185 4119 -12289 -4067 20006 11712 -15587 -14457 5031 7417 504
624 504 4487 5860 -5145 -10210 -2269 6046 7801 5734 -4149 -13819 -6488 7531 4571 -4583 720
639 720 1884 -14294 -17106 7074 15612 -6292 -16854 -1282 371 -13341 -4921 15642 4486
652 4486 -20745 -13001 7879 2818 -7961 3342 9663 -9433 -17647 2818 14724 1768 -6202
665 -6202 469 -154 -7267 -1316 9194 6519 -2852 -6303 -6024 -2021 6763 6879 -3879 -6357 1273
680 1273 -1843 -9252 2839 16355 -255 -20043 -5677 14841 2670 -10608 5415 14133 -8770
693 -8770 -18115 8201 21315 -152 -10957 4953 8139 -6131 -2253 15834 11616 -5816 -5963
706 -5963 5006 5338 3392 7517 5932 -2805 -3512 2165 3706 4399 7982 1845 -8268 -3447 7463
721 7463 4660 -1850 4258 5423 -8499 -9842 9318 13104 -5207 -7581 7165 3446 -11102 -911
735 -911 17640 5831 -14871 -5227 11575 3246 -7000 4151 10809 -4940 -12297 1904 10370
748 10370 1235 -3730 -387 -2165 -4924 -54 2918 -320 -688 -1605 -8049 -8247 4459 7490 -6743
763 -6743 -10473 1094 698 -10940 -4477 10368 1669 -15453 -8061 7447 701 -9398 1272 6972
777 6972 -7499 -12085 3709 8487 -4583 -6072 3978 -39 -9391 -1069 8791 660 -8357 -1046
791 -1046 3245 -3357 -2741 4709 1274 -7396 -3569 3021 -779 -2180 3722 858 -8666 -3691 7386
806 7386 2762 -5700 1006 6441 -5163 -8550 6843 12220 -2907 -7485 4975 5583 -4952 -923
820 -923 11927 6516 -6711 -2740 7064 3672 284 5577 4668 -2571 -1534 4652 3119 104 5427
835 5427 4846 -5227 -4595 7627 6679 -4160 -1243 7697 923 -7879 1636 10858 795 -6911 2152
850 2152 6596 -2349 -2613 7283 4811 -5424 -1771 6286 1914 -2838 3496 4835 -4138 -4268 4906
865 4906 4629 -3188 -811 3966 -2198 -5736 2396 5013 -3456 -4333 2597 -1262 -8016 -296 6738 -2801
881 -2801 -9272 1132 4822 -7622 -8269 6175 5244 -9908 -7683 6541 2566 -10321 -4237 7229
895 7229 736 -9315 -2145 5240 -2162 -6354 -25 2303 -2300 -2140 -467 -3195 -3425 1842 789
910 789 -4361 -1201 3635 -3868 -8991 2163 8076 -3251 -8581 3078 4859 -7487 -6360 8880
924 8880 6561 -8982 -5495 7583 2111 -7858 1050 9887 -964 -9535 1711 7891 -1303 -4128
938 -4128 5203 4859 -4694 -3009 5751 4341 -1848 90 2541 678 308 3186 1716 -107 2824 2151
954 2151 -2667 678 8806 2857 -7159 -83 9599 923 -7188 4378 11975 -2604 -11002 4380
968 4380 12698 -1919 -7447 5957 8118 -6716 -6918 7788 7978 -4270 -4194 4220 1726 -4026 395
983 395 4536 494 -2096 26 -548 -1448 2394 2447 -2294 -1462 3430 -134 -5183 730 5479 -2183 -6732
1000 -6732 2857 5421 -6039 -6865 5245 4254 -8139 -4496 7953 1366 -11511 -3733 8555 552
1014 552 -9637 -711 6728 -4100 -10296 820 6963 -2287 -6450 -251 1014 -4070 -2643 2321
1028 2321 1393 -930 -1645 -3232 -3488 2329 4463 -3059 -4199 3330 2000 -6807 -2838 8940 3116
1043 3116 -9307 -4082 7739 1453 -8202 997 8577 -2634 -9704 2277 7997 -2413 -5876 3226
1057 3226 3553 -5487 -2564 6777 2749 -4856 -1088 3530 -309 -1491 4272 4145 -2346 -2392 2587 1244
1073 1244 237 4367 3705 -3009 -2604 4118 2379 -1682 3972 7032 -3137 -7433 3606 8192 -2233
1088 -2233 -4183 6157 4332 -7984 -4300 8365 5585 -5705 -2449 5795 238 -5889 894 6296
1102 6296 -198 -4097 1211 2248 -1933 149 3013 -970 -2365 2936 2527 -3687 -1637 4842 872
1117 872 -5052 1382 6835 -1752 -6746 1669 5364 -2992 -3806 4378 2784 -6734 -4381 4228 1367
1132 1367 -4713 -145 3145 -3930 -6292 2186 4153 -3275 -3795 1672 -738 -5469 254 5006 -572
1147 -572 -5071 -22 1529 -2733 -668 4574 84 -5664 -326 4091 -1762 -2614 4442 2793 -7237
1162 -7237 -4845 6216 3724 -5640 -2027 4715 -2348 -7915 1230 7978 -697 -7268 -1615 1614 -2523
1177 -2523 -1212 4470 1658 -4607 -2854 312 -394 1772 5107 316 -5741 -1617 4259 708 -1486
1192 -1486 5380 5127 -5833 -6101 5934 7219 -2799 -2012 5319 485 -7107 423 9030 1638 -6181
1207 -6181 -156 3812 -2515 -2911 5120 3715 -5235 -4069 3026 2255 -1853 852 2761 -1961 -3732
1222 -3732 1824 3626 541 592 1107 -2668 -1525 4785 4802 -1627 -924 3928 -821 -5208 3747 9445
1238 9445 -483 -8141 742 6591 -2172 -4372 6316 5893 -7460 -7956 4925 6368 -3445 -3526 2865
1253 2865 -406 -6057 -1246 5212 1286 -3119 -2119 -1184 -1426 1515 3271 -868 -2992 -110 -412 -2789
1269 -2789 2316 5792 -1117 -7151 -599 4607 -818 -2390 4906 2632 -7845 -6113 6139 5127
1283 5127 -4977 -2771 3745 -2731 -8575 1151 8354 -862 -8787 -2099 2691 -3038 -3186 4383 3675
1298 3675 -5134 -6027 320 2436 339 723 -31 -3044 -1787 959 714 753 3890 720 -6536 -3458
1314 -3458 6460 4280 -4244 -1326 4990 -1126 -7544 1809 9488 11 -8505 -87 5638 -1863 -4086
1329 -4086 5104 4675 -5721 -5528 3837 4484 -1563 -179 2953 -1428 -4225 1892 5516 949 -1127
1344 -1127 913 -199 -1302 2923 5059 415 -1489 1602 671 -1508 3271 6649 109 -5000 1307
1359 1307 4597 -1536 -1963 5843 3563 -7146 -4055 6674 5150 -4818 -1760 5335 -512 -6363 1374
1374 1374 7529 519 -5580 -833 2736 -708 -694 3149 1305 -3332 -1702 974 -236 1240 3498
1389 3498 -399 -5109 -1510 3620 643 -2359 2085 1995 -5337 -5054 4280 4206 -3803 -3851 1950 -1306 -5489
1406 -5489 1145 5406 -1435 -6922 -1207 1895 -3087 -1994 3436 220 -6824 -3704 3060 1253 -3076
1421 -3076 -99 833 -4324 -4036 2360 2658 -1985 -2048 77 -2992 -2925 3173 3939 -2961 -4135 1513 -62
1438 -62 -3796 1451 6173 -1030 -7215 -685 5023 -435 -2896 3206 3040 -5252 -4125 4238 4627 -1617
1454 -1617 -1501 1606 -1353 -1955 3112 4434 -453 -1626 1013 -157 -1653 4139 5772 -1308 -4205
1469 -4205 1854 3632 -879 673 6389 1707 -5982 -1688 6601 3524 -1429 2164 3692 -3235 -3447
1484 -3447 4916 6355 -669 -1696 1972 -286 -2575 2745 6802 903 -3968 -290 1426 -591 1107
1499 1107 4329 794 -3966 -1904 1861 687 633 3229 -506 -5502 -2061 4091 1281 -2982 1521
1514 1521 2711 -4902 -5667 4134 5769 -3408 -5541 1736 1098 -5161 -1177 5809 1182 -7017 -4191
1529 -4191 2524 814 -2011 892 673 -3837 -4217 -127 985 -43 210 -1721 -5511 -2874 2099 1272
1545 1272 -2822 -1406 76 -4342 -5296 2462 4517 -3163 -5504 888 822 -4098 -508 5916 511 -7174
1561 -7174 -2211 4696 628 -3025 2200 3567 -4018 -5031 3652 5194 -1177 -2912 1067 -9 -2246
1576 -2246 916 4358 1224 -2198 -1378 -608 100 3460 3324 -1595 -2741 1451 1679 -1611 2234 6415
1592 6415 299 -6694 -472 7070 2767 -2341 3031 5273 -3057 -5012 5394 8496 -217 -3022 2675
1607 2675 2372 -2291 768 6900 3265 -3227 -1560 2054 673 907 3232 1466 -2843 -1788 1760
1622 1760 1281 484 2219 229 -4105 -1677 3527 1877 -1776 787 1475 -3680 -3569 4114 4811 -2977
1638 -2977 -3833 2574 989 -4636 252 6846 767 -7267 -2341 4603 55 -3592 1037 2554 -4069
1653 -4069 -5905 669 2782 -1307 -2443 -1047 -3067 -3147 36 585 -2168 -1889 -847 -3801 -3908 1745
1669 1745 2598 -3130 -5035 804 1064 -3775 -1103 4177 -28 -6420 -2332 4225 1017 -3282 245
1684 245 1862 -3418 -3600 3452 3897 -2241 -2973 980 -330 -3056 1345 4514 -811 -3976 -782 1225
1700 1225 -171 759 2784 -419 -3970 -1057 2155 571 813 3203 25 -4198 -605 5088 2602
1715 2602 -1239 2070 3515 -2224 -2614 5051 6846 -1090 -2855 2964 2936 -1431 1568 6059 1904 -3599
1731 -3599 -507 3182 1573 618 2794 838 -2942 -624 2834 1683 -252 1761 610 -3730 -1826
1746 -1826 4268 3453 -2065 -1238 2174 -800 -2633 2400 5235 -926 -4136 554 2383 -761 305
1761 305 4180 601 -4779 -1636 3350 720 -1885 1266 1262 -3682 -3250 1937 2252 -1899 -2172 -152 -2437
1778 -2437 -3356 757 1847 -2366 -3356 -645 -1704 -2750 732 2480 -2599 -5521 -136 1991 -2112
1793 -2112 -1946 3018 596 -5921 -3286 4287 2256 -3979 -1664 2031 -1593 -3655 1341 3887 -1147
1808 -1147 -3412 -995 -565 -1092 1074 2042 -1214 -2939 -892 -360 -1052 969 2471 -1569 -4968 -94
1824 -94 3210 -249 -1246 2342 881 -4553 -1825 4647 3068 -2449 -440 2702 -450 -2445 3173 5526
1840 5526 -708 -3666 1699 3028 -653 534 4291 1929 -3222 -1084 3241 2164 297 1118 530
1855 530 -1777 -653 2413 1476 113 922 -198 -2644 -30 4688 2122 -2760 -643 3155 -537 -2550
1871 -2550 3615 5536 -1659 -4896 1839 4800 -959 -1574 4008 2123 -3994 -2223 4057 3462 -1612
1886 -1612 -795 1283 -1206 -2053 1703 2564 -949 -1506 -476 -1284 -723 1663 1585 -2223 -2741 -43 -147
1903 -147 -1591 1104 2348 -2237 -4842 181 2677 -1374 -1870 2042 -468 -5575 -1948 4863 1593
1918 1593 -4550 -1834 1939 -1687 -4080 2165 4584 -2238 -5748 -743 1825 -766 -1050 1898 -425
1933 -425 -3793 -2241 425 590 314 -6 -2489 -3704 -222 2114 -422 -1103 1236 -778 -4791 -1829
1949 -1829 4788 2642 -3263 -2167 2053 -920 -3184 2080 4498 -1173 -4979 177 2601 -655 -345
1964 -345 3017 241 -4080 -1313 3405 2069 -1030 565 964 -2155 -1490 2882 3015 -465 -1002 103
1980 103 -819 -531 3212 2874 -1101 -1590 857 -469 -666 3346 4360 -1617 -3935 1548 3487 -338
1996 -338 -353 3922 1569 -4077 -1469 5154 3250 -2086 -710 1936 -533 -1932 2416 3931 -321 -1742
2012 -1742 473 266 52 1775 2570 -796 -2325 366 1627 -494 1112 2851 -1359 -4358 -184 3699
2028 3699 824 -1627 1292 438 -3764 -1827 3702 2629 -2043 -1906 396 -1522 -2470 2445 3644 -1842
2044 -1842 -4387 -427 862 -1198 152 2882 -701 -4597 -2125 1749 379 -224 874 -937 -3983
2059 -3983 -2030 1993 956 -1275 -628 -367 -3890 -2664 2766 2421 -3137 -2844 652 -1406 -3416 1060
2075 1060 3914 -1094 -5371 -1226 2238 -729 -1447 1255 69 -3637 -2507 1980 1818 -529 213 -629
2091 -629 -2507 -1318 2457 2175 -1007 -441 514 -1640 -1469 3004 3857 -1254 -2631 1059 1041 -1373 1142
2108 1142 4241 35 -3767 -408 2859 659 -507 2924 2077 -2797 -1745 3211 3072 -690 1 1776
2124 1776 -358 -1484 2205 3637 658 -1027 911 1202 197 2136 2959 -145 -1387 1049 1312 347
2140 347 1929 3264 -348 -3159 511 3962 210 -1415 2037 2204 -3169 -2623 3850 3469 -1934 -2752
2156 -2752 1391 400 -2330 467 3761 329 -3193 -1083 779 340 156 1411 -43 -2631 -1270 852
2172 852 154 -34 1106 -896 -3602 -1370 2086 634 -1852 -142 29 -2985 -2694 1850 2012 -3082
2188 -3082 -3111 544 -1082 -3332 -155 2957 -1510 -5366 -1396 2281 -1002 -2689 1038 971 -3620 -3408
2204 -3408 1264 1976 -1089 -1444 -182 -1300 -1880 612 1495 -301 -696 -537 -1734 -1089 2328 2159 -1940
2221 -1940 -2078 840 -2 -2304 534 3457 -52 -4305 -627 3331 360 -1929 1706 2201 -2320 -2277
2237 -2277 2818 3235 -657 -917 1539 419 -1211 1514 3696 738 -1562 916 1534 607 1202 2863
2253 2863 1222 -1030 392 1825 958 1305 2840 489 -2245 203 3237 933 -568 1607 1545 -1925
2269 -1925 -1553 3269 3145 -2044 -1369 2345 511 -2538 696 3860 494 -3439 100 2505 535 -572
2285 -572 1316 1211 -1894 -1178 1434 1207 16 311 123 -2204 -527 1811 992 -1650 -680 561 -2155
2302 -2155 -2419 1494 2004 -2468 -3169 157 88 -2451 -767 1993 -1246 -4175 -1444 891 -732 -2029
2318 -2029 623 -302 -3791 -2618 1490 845 -1652 -1428 473 -1470 -1990 742 1792 -1300 -2181 -264
2334 -264 -671 -1487 682 1449 -1178 -2416 -178 390 -1530 -191 1889 -658 -3750 -896 2448 289
2350 289 -1728 628 1430 -2376 -2483 2301 2887 -1006 -1735 1259 817 -756 1081 3092 615 -1330
2366 -1330 276 1225 624 1451 2693 341 -1550 1068 2339 611 530 2546 1186 -2026 -403 3255
2382 3255 1834 -895 242 2083 -600 -1277 2233 2896 -522 -1532 1475 1061 -1077 997 3239 852
2398 852 -1962 -110 2273 775 48 1725 1113 -1628 -855 2149 1761 122 680 209 -1557 -547 1681
2415 1681 1254 -1281 -2 713 -1641 -1883 1473 2404 -1574 -2894 377 993 -2314 -876 2320 109
2431 109 -3982 -1973 1633 174 -1998 -289 709 -2087 -2411 396 946 -1041 -1190 -364 -1011 -1636 582
2448 582 1156 -1374 -1580 -20 -1062 -1644 505 1911 -1398 -2898 -208 604 -1152 -1010 1300 -65
2464 -65 -3378 -1536 2136 664 -1994 -153 1147 -1902 -2595 1678 2498 -945 -2016 706 531 -1530
2480 -1530 198 2283 717 -1663 -533 656 506 490 1610 653 -830 -101 1260 194 778 2181
2496 2181 660 -2312 -434 2815 1261 -1125 489 2277 -769 -2105 1595 3686 -6 -1858 1162
2511 1162 1781 -818 122 3085 1488 -1570 -750 2142 1113 -138 1293 1806 -731 -914 1359 1407 99
2528 99 552 788 -899 -1113 1114 1340 -234 -105 881 -562 -1652 678 2101 -655 -1325 971 715
2545 715 -1528 -755 2533 472 -2958 -903 2291 160 -2179 223 2035 -1266 -2597 623 1826
2560 1826 -776 -1347 312 -177 -1521 -344 691 -296 -1195 -460 -538 -1300 175 912 -942 -2210 -290
2577 -290 740 -1446 -1364 1288 155 -2650 -1695 1056 86 -2105 11 1357 -1419 -2398 434 1662
2593 1662 -1007 -1666 844 397 -2005 -527 1741 27 -2047 -192 1011 -712 -1103 1061 1044 -1337
2609 -1337 -840 675 288 -341 465 889 -977 -782 1648 846 -902 403 1483 -817 -1629 1078 2577
2626 2577 -258 -1211 1385 1313 -1323 -692 2830 1603 -1454 -548 1857 619 -371 1068 1655 -228 -743
2643 -743 1125 1132 106 684 1251 -446 -1034 1183 1735 -105 -111 1618 494 -1651 449 2229 329 -1374
2661 -1374 809 1175 -938 -819 1729 1243 -1340 -775 1331 619 -1175 445 1447 -670 -1414 928
2677 928 1261 -997 -884 997 150 -1538 -338 1325 -92 -1326 125 12 -1225 -318 923 -167
2693 -167 -1744 -29 645 -1489 -1483 1017 555 -1834 -1284 1530 204 -1936 -644 1447 -566 -2228 -328
2710 -328 1506 -944 -1887 25 234 -1127 -1052 765 18 -1230 -620 338 -912 -657 715 69 -1879
2727 -1879 -714 689 -143 -1135 523 1145 -1220 -1505 1068 1130 -1126 -860 1542 -235 -1436 201 2319
2744 2319 -101 -1694 625 1469 -878 -1100 1791 1352 -1402 -1194 1183 505 -1047 334 1530 -34
2760 -34 -1059 654 1571 206 366 1031 -20 -467 646 1174 -50 131 1186 290 -945 452 2589
2777 2589 354 -1572 695 2187 -398 -864 2121 2058 -1319 -1425 1519 1533 -722 224 1701 293 -1014
2794 -1014 369 1277 365 -175 791 133 -989 -95 1010 92 -657 -3 43 -466 -199 1105 499 -933
2812 -933 25 547 -779 -797 1163 1183 -1482 -1301 1019 475 -1510 -117 1509 -606 -2100 -173 2023
2829 2023 -499 -1791 372 774 -1287 -1506 627 887 -1681 -1313 96 -233 -852 -7 365 -1099 -1194
2846 -1194 97 -370 -794 325 532 -1527 -1612 642 649 -1199 -554 1268 118 -1939 -425 1953 -152
2863 -152 -1621 -155 973 -1378 -1223 1317 1477 -1602 -1274 814 -3 -982 556 1914 -301 -1474
2879 -1474 203 1146 -296 -221 865 257 -1253 242 1067 240 -342 1118 389 -907 55 1588 558
2896 558 -568 481 1355 -589 -596 1775 1781 -899 -783 1454 1163 -773 237 1990 297 -1633 -158
2913 -158 1729 447 -535 887 571 -775 -176 1148 666 -331 338 650 -880 -516 1244 968 -761
2930 -761 -289 1116 -200 -834 714 2000 -809 -1508 359 1243 -690 -491 1218 47 -1613 -291
2946 -291 1147 -240 -1272 498 791 -1025 -1207 711 500 -1139 -1013 215 -878 -1487 242 673 -945
2963 -945 -1476 -156 -10 -727 -361 770 -627 -1433 142 281 -912 -1001 823 132 -2053 -669 1331
2980 1331 -9 -1671 -275 740 -1113 -1493 617 962 -1214 -1307 166 -145 -885 -8 862 -436 -1098
2997 -1098 -38 605 -516 -61 857 -122 -1218 142 1167 -10 -475 915 880 -658 -253 1276 1064
3014 1064 -821 -89 955 -135 -937 1365 1762 -114 -919 1004 785 -551 50 1797 478 -969
3030 -969 -268 1579 512 -259 831 613 -354 -218 1159 1216 313 616 637 -354 -102 1021 965 -59 170
3049 170 1064 -253 -910 1060 1927 -205 -1057 698 1424 -733 -794 1554 1088 -1365 -673 1244 696 -997
3067 -997 140 678 -26 -1043 589 486 -762 -399 219 -128 -842 -261 566 -565 -1082 116 140 -1055
3085 -1055 -617 603 -603 -1498 -141 717 -748 -847 422 -170 -2087 -975 1138 -47 -1982 -379
3101 -379 891 -1118 -1816 395 958 -1241 -1571 169 272 -771 -722 1157 304 -1345 -362 298 -212 -711
3119 -711 -65 -120 -636 -66 151 -152 -462 682 158 -1174 -177 1556 467 -740 -60 1418 118 -886
3137 -886 554 2154 -374 -1135 665 1453 -336 -85 1206 841 -1040 -496 1528 833 -278 513 1121
3154 1121 -225 -356 1322 1136 71 86 884 142 79 1223 1003 143 -330 906 268 -258 768 1358
3172 1358 55 -437 743 1249 -331 -224 1465 751 -1521 -170 1644 834 -930 25 1079 -316
3188 -316 -1251 606 1249 -454 -923 449 432 -545 -192 705 -49 -901 -496 397 -460 -113 605 -300 -1598
3207 -1598 -241 791 -199 -798 86 -124 -1613 -680 814 318 -1259 -874 333 -743 -1208 275 1167
3224 1167 -809 -1327 240 144 -1123 -745 741 -7 -1694 -372 500 -392 -667 291 -179 -1129 -616 616
3242 616 255 -410 -457 176 -911 -451 656 522 -1121 -418 577 29 -1094 429 1437 -257 -1284 156
3260 156 1081 -335 -538 802 849 -912 -538 1184 938 -278 329 704 -171 -517 900 910 -188 58
3278 58 935 -102 -319 723 1138 116 -550 523 727 -121 303 1367 74 -910 293 1257 303 -47
3296 -47 918 1042 -581 -382 1279 1299 -494 -100 965 -272 -526 729 1315 0 -655 314 249 -304 91
3315 91 643 207 -799 -87 346 -136 -156 900 -229 -1069 -211 627 11 -714 435 290 -1291 -1099 1047
3334 1047 718 -947 -546 563 49 -1744 93 1361 -305 -1516 -505 306 -525 -386 376 46 -869
3351 -869 -599 235 -162 -314 482 -381 -983 -737 682 261 -870 -190 -55 -951 -1140 478 747 -946 -937
3370 -937 641 -216 -940 -198 1194 -192 -1518 27 774 -392 -608 860 503 -1048 -941 680 869
3387 869 -795 -403 792 -290 -514 455 952 -117 -110 256 -201 -235 698 868 -127 -406 531 355 -504 434
3407 434 1046 350 -1221 354 1247 410 -401 661 1329 -763 -757 1429 1269 -146 -519 666 198 -1013
3425 -1013 194 1455 472 -565 434 600 -278 168 923 431 -641 110 669 106 246 559 233 -678
3443 -678 -223 638 352 -524 312 375 -995 -777 791 718 -773 -761 783 -95 -1186 457 1269 -24 -1421
3462 -1421 -81 943 -441 -373 347 469 -1041 -1060 226 185 -313 -138 -308 -652 -672 313 347 -388 -425 -104
3482 -104 -875 -786 97 473 -856 -919 251 -233 -870 97 669 -251 -1356 -214 488 -346 -694 435 400
3501 400 -1028 -721 656 394 -705 -299 357 -763 -916 589 702 -101 -458 82 -40 -376 284 1146
3519 1146 72 -552 -1 272 -237 484 1323 329 -898 -131 1012 457 -160 752 337 -657 -723 1119 986
3538 986 -475 34 673 256 -450 284 1158 172 -608 129 697 247 63 1102 280 -784 1 873 -17
3557 -17 -70 585 277 -632 67 778 614 -278 385 601 -346 -541 591 1094 -97 -287 369 -65 -583 411
3577 411 849 127 -853 -387 639 -228 -84 687 352 -985 -1043 432 264 -238 22 -179 -632 -738 124
3596 124 510 -320 -253 33 -690 -747 418 396 -735 -852 -212 314 -796 -56 596 -129 -1202 -844 384
3615 384 -75 -479 161 366 -962 -1455 332 601 -563 -410 -90 -499 -833 -136 320 -191 -694 26 -247
3634 -247 -604 160 285 -247 -976 -83 227 -649 -379 909 423 -1159 -626 489 314 -333 213 625 -719
3653 -719 -538 592 793 -33 -668 630 168 -647 82 992 423 -315 133 693 -10 142 930 417 -48
3672 -48 -29 540 450 390 947 450 -377 16 1156 517 -30 266 656 -344 -648 535 1378 -75 -504 253
3692 253 443 -431 -173 1232 587 -639 -294 314 188 -181 854 717 -514 -584 479 618 -84 -82 274
3711 274 -136 -521 240 415 -377 -435 163 -692 -700 210 652 -83 -612 -146 66 -833 -631 955 -59 -1011
3731 -1011 -728 425 122 -986 158 559 -642 -1107 91 482 -593 -573 2 -192 -1008 -608 481 -132
3749 -132 -584 -311 -393 -561 -114 506 -129 -775 -498 15 -706 -540 330 337 -1086 -501 265 109 -457 46 837
3770 837 -575 -935 356 1026 -327 -442 617 211 -590 -137 1021 488 -593 -142 593 88 -129 814
3788 814 796 -409 -336 535 405 301 277 389 -139 -69 580 267 242 336 578 46 -269 611 906 -1 -235 707
3810 707 394 -541 -27 1353 692 -439 -349 493 233 -258 224 645 -156 -344 502 739 175 -243 692 -259
3830 -259 -127 164 454 347 -281 193 81 -680 -67 913 -212 -659 102 440 -683 -450 475 82 -477
3849 -477 -272 329 -39 -420 -9 381 -411 -724 -284 272 -575 -695 202 -75 -1003 -636 480 -67 -737 -198
3869 -198 -89 -231 -210 -7 220 -838 -460 68 -431 -428 141 128 -1077 -471 411 -32 -643 -292 502 -408 -866
3890 -866 -126 628 -237 -619 287 261 -396 -179 395 238 -658 -349 472 -10 -44 18 271 -330 -169 523 308
3911 308 -476 279 554 -375 -431 429 558 140 10 408 240 -354 403 715 310 -411 259 546 -274 -201 569
3932 569 677 -337 -587 970 306 113 632 1006 -122 -434 330 902 56 373 481 132 -124 327 411
3951 411 -26 328 741 442 -200 458 1025 184 -699 251 499 -190 -444 462 394 -589 -471 761 489 -612
3971 -612 -454 472 -161 -593 36 534 -202 -480 54 115 -660 -268 537 -90 -618 -357 -106 -120 -237 242 7
3992 7 -678 -272 -49 -161 -144 -117 100 -711 -681 54 -46 -561 -154 346 -377 -989 -104 446 -534 -811 62 110
4014 110 -676 -522 120 373 -551 -384 81 -22 -417 94 207 -214 -553 403 365 -336 -78 315 -275 -405
4034 -405 158 331 -257 91 474 -100 -565 -21 568 369 -121 189 320 270 -192 813 582 -215 -82 756
4054 756 176 -555 -64 543 246 -432 631 582 352 -53 513 227 60 43 577 493 -93 477 275 -229 223
4075 223 621 247 -148 377 786 128 -205 278 960 -631 -193 405 490 -486 -285 554 224 -567 139 683
4095 683 -262 -420 400 431 -240 -100 374 291 -295 -166 30 -422 -116 69 -155 -212 -436 402 54 -785 -51
4116 -51 452 -419 -627 136 341 -449 -194 333 -112 -939 -231 -14 -165 -646 -280 16 -415 -391 361 148 -460
4137 -460 -504 287 149 -688 166 344 -241 -573 199 -124 -661 -320 182 -263 -305 -40 524 -145 -245 194 157
4158 157 -698 1 488 -36 -649 -84 274 -219 -377 416 463 -272 -217 313 500 -143 -84 371 -55 -240 -9
4179 -9 189 95 38 345 527 52 45 469 81 -50 306 406 -77 -36 532 516 -298 -53 384 53 -142 56 847
4202 847 -28 -240 302 341 -255 -51 472 259 -504 0 593 -28 -267 240 239 -133 -272 526 -278 21 67
4223 67 104 55 -266 390 18 -402 -232 413 195 -343 197 274 -705 -685 341 231 -692 -433 240 374 -604
4244 -604 -257 339 -117 -464 150 121 -401 -441 118 -295 -570 -417 -232 166 -665 -350 -53 34 -349 -120 441
4265 441 -332 -474 -7 -545 -527 -48 53 -289 -589 42 -63 -274 -467 161 -83 -591 56 177 -100 -761
4285 -761 231 72 -452 -634 246 58 30 -273 325 12 -433 -220 366 13 -156 70 -89 -394 -318 210 -49
4306 -49 -23 26 225 -223 67 631 283 7 135 888 127 -310 362 411 -43 -142 525 618 -319 -139 665 280
4328 280 -262 259 509 324 -115 201 736 -96 -14 554 649 23 148 262 251 -260 -4 323 95 -53 408
4349 408 153 -85 -11 286 232 -580 321 444 -174 -86 162 -33 -447 36 458 -136 -537 -69 547 -184 -609
4370 -609 224 126 -225 -481 134 143 -285 -723 56 -291 -256 -5 151 -367 -344 -231 -430 -481 -308 62 -116 -511
4392 -511 -170 -168 -600 -201 187 116 -292 196 151 -238 -552 -69 -20 -274 -752 214 212 -283 -585 140 -269 -179 116
4415 116 196 -171 -663 -7 310 -334 -388 71 -144 -289 -106 14 -155 -48 -291 183 122 -237 410 243 -210
4436 -210 104 479 127 33 408 369 -68 -173 456 350 -83 -69 618 246 -270 467 288 -8 103 348 575
4457 575 -13 176 554 139 -98 21 403 3 102 380 504 -116 279 452 75 -231 341 691 -86 -408
4477 -408 353 276 30 -187 458 60 -77 262 385 70 -435 334 251 -28 -382 192 371 -269 -181 405 -27
4498 -27 -547 161 -41 -169 -153 -149 96 -674 -59 134 -345 -587 170 80 -285 -494 449 138 -696 -334 105 -83
4520 -83 -476 -61 5 -397 -319 78 -231 -348 -366 32 259 -473 -390 -256 -38 -459 -231 -266 -494 -407 101 282
4542 282 -302 -62 314 -244 -274 182 231 -191 -18 398 173 -182 -142 355 124 -197 -242 302 -38 -303 164
4563 164 199 -348 -129 616 102 -655 207 328 279 -27 270 461 -33 -141 374 419 211 223 20 129 -49
4584 -49 561 380 -19 99 384 272 24 263 609 -148 -69 406 56 -77 44 323 137 -30 65 547 99
4605 99 -360 301 551 -278 -28 109 322 -261 -116 216 -166 -462 -2 148 256 -473 21 21 -361 141 258
4626 258 74 -78 -67 -34 -198 -288 26 403 -511 -199 338 -91 -619 -482 151 -111 -280 -262 34 -390 -445 -33
4648 -33 -41 -541 -49 -31 -247 -375 -235 -161 -209 -409 -14 -60 -360 261 23 8 -416 32 105 -242 -398 243 159
4671 159 -300 -134 28 6 -425 -77 88 -98 -417 190 237 -93 -86 250 58 -281 -117 401 -10 -436 154
4692 154 137 -207 263 32 592 177 97 470 -506 181 416 244 20 30 236 299 -254 167 371 101 265
4713 265 25 151 -169 -85 404 108 -102 -153 265 216 -206 146 381 -16 -189 207 323 -59 313 388 306 -203
4735 -203 146 205 53 -166 85 240 -255 -139 323 405 -198 -147 227 -257 -367 214 48 -390 -55 134 71
4756 71 -514 40 137 -11 -270 207 153 -137 -39 86 74 -546 -279 110 -95 -259 -313 133 -264 -312 -279 190 -375
4779 -375 -553 -141 -326 -294 121 155 -47 -47 -19 -38 -453 -446 -333 -40 -321 -148 116 41 -161 37 346 -345 -55
4802 -55 -3 428 -108 -228 16 -5 -104 156 -92 -259 -120 328 -19 -341 152 207 251 52 72 305 14 -129
4824 -129 234 589 -233 -4 100 175 -74 254 106 -236 -54 490 434 -204 65 521 333 -365 -66 101 162
4845 162 -382 460 580 84 -9 228 260 146 10 611 130 90 244 352 299 186 344 238 -236 104 158 -7
4867 -7 -546 31 603 -495 -196 324 204 -180 -151 479 446 -548 33 40 8 -454 -35 112 -11 -475 112 197
4889 197 -338 72 141 81 -291 -113 55 -120 -444 11 -159 -284 -164 111 -514 -315 280 -13 -405 -273 60
4910 60 390 -63 96 452 -232 -246 -442 23 -357 -274 -49 -61 -460 -176 28 -141 -163 -191 43 -234 -336 111
4932 111 129 -346 -83 168 8 39 240 81 -165 -223 163 48 -10 153 239 208 -74 -145 354 -37 -24 122 488
4955 488 -161 -109 356 -78 85 -360 231 178 38 99 417 78 -202 94 64 -87 -17 28 313 49 128 28
4977 28 259 166 215 247 -32 143 -149 150 -49 43 204 38 49 125 107 -128 -289 400 152 56 -255 466 243
5000 243 141 -82 446 -89 -218 411 87 -212 -127 -63 -85 -106 -36 219 126 -202 82 131 -125 -25 -23 -188 -358
5023 -358 0 195 3 -326 -121 72 -297 -204 219 -192 -401 67 256 106 -94 347 481 -167 -485 191
5043 191 -117 -224 3 74 -15 -500 51 226 -299 -207 51 87 -385 -286 -47 22 -346 53 425 -2 -187 250
5065 250 58 -508 -401 315 230 -306 -174 270 -276 -15 117 12 75 -65 440 200 -268 -58 408 241 9
5086 9 127 372 -125 -24 166 -39 -53 22 27 -13 -71 155 238 126 270 288 104 9 199 487 237 127 52 199
5110 199 266 -112 574 363 -118 422 0 401 -82 62 654 238 -205 340 460 34 254 124 201 -91 -85
5131 -85 120 129 157 80 207 -70 -165 335 262 -243 46 141 -289 -356 139 28 -27 -159 71 442 -50 -60 32 -290
5155 -290 -148 -154 197 103 -132 -350 -131 -368 5 -44 -89 -374 -85 249 -89 -451 -169 96 -143 -321 -141 126
5177 126 -361 118 176 68 -591 -251 391 1 -431 10 67 -324 56 297 -15 -231 -110 95 -229 -235 148
5198 148 81 -124 -289 194 81 -18 -85 59 140 -38 -77 246 25 120 224 375 323 317 188 -243 -25 -159 300
5221 300 -102 97 329 -93 -290 20 526 -227 -377 506 299 52 163 361 265 -107 -64 387 74 -120 60
5242 60 462 85 -147 -63 67 121 159 273 89 -173 158 43 114 -163 369 371 -97 0 175 -125 212 -253 -119
5265 -119 -276 105 192 -160 -228 128 -27 186 -73 -129 242 221 22 -23 12 -168 -149 -56 -93 -432 84 138 205 -16
5289 -16 -120 -208 -454 29 -102 -135 114 -309 -7 -275 -279 -66 20 -299 -415 33 -273 -112 -183 -91 11 -147 -60
5312 -60 -148 -245 -309 -295 187 -370 -233 131 130 -523 -81 26 -16 -112 191 15 -358 -210 389 -272 -455 124 286
5335 286 -257 -184 178 135 203 -129 161 164 111 56 323 -82 -138 105 303 -208 138 336 366 -173 -21 245 190
5358 190 -237 342 271 -201 -23 421 88 84 143 164 7 -506 74 100 190 150 205 124 -362 121 115 301 -316 122
5382 122 193 189 45 49 128 0 -43 269 303 -214 -319 294 -89 -374 -353 378 -292 133 123 53 4 -116 412 -226
5406 -226 -129 166 29 -563 -73 -51 170 -341 -46 -187 -283 -100 -318 -106 -86 9 66 401 3 -287 96 -117
5428 -117 -230 -17 -10 -76 -251 -51 55 -177 -360 290 291 -36 -143 -175 -153 -116 -33 42 -137 -412 13 21 -140 -61
5452 -61 79 -99 -398 -115 137 230 -180 138 135 18 -236 123 -182 112 62 202 233 6 331 337 86 -63 75
5475 75 134 -84 293 316 -27 146 88 243 32 187 104 -26 156 -331 193 294 67 293 145 41 -90 30
5497 30 165 -150 -27 681 204 -248 338 482 -24 -24 472 159 82 -74 230 298 -334 -8 112 111 -226 -89
5519 -89 178 -59 252 471 352 -200 -118 161 -33 13 -35 -21 -84 -107 264 67 -83 -39 49 -319 -239 258 -54
5542 -54 -165 -168 38 -201 -44 -16 -99 154 -436 70 65 -21 -204 -103 64 -203 -25 66 45 -433 -56 -181 -288
5565 -288 -267 212 -245 -194 -256 107 -143 -267 97 -93 -158 -73 30 -304 -354 -63 248 71 -149 47 -191 -63
5587 -63 -95 -40 35 -38 -110 -88 -83 -20 -39 122 -128 73 -7 379 -148 -60 -109 -9 -46 -218 316 -48 7 24 -125 270
5613 270 37 404 376 -50 37 -7 256 -308 445 490 -128 18 165 154 70 151 454 122 -131 462 115 4
5635 4 47 263 307 -105 -132 415 77 137 274 716 175 -291 -108 280 -139 -212 -63 130 23 251 -110 -345
5657 -345 -75 -154 432 -19 178 35 -32 -118 49 -29 -131 134 -174 243 113 -128 8 -256 -299 -114 -115 -25 -263
5680 -263 81 -170 -153 -53 -33 63 -108 -209 -138 -73 -187 -65 12 -124 -211 -61 -170 -254 -94 -7 119 -138 17
5703 17 349 -160 -150 147 116 -236 -238 142 385 -310 -180 -113 -133 -415 122 47 -100 -215 142 56 -176 81 -68
5726 -68 15 -272 -43 39 -225 -525 -8 55 -245 -106 794 101 153 26 287 -89 -204 237 407 44 -207 323
5748 323 54 -118 13 340 406 -73 -180 68 239 47 17 393 -217 229 470 239 140 14 321 -213 4
5769 4 293 299 246 48 149 -203 -296 165 14 -214 -13 39 126 16 -188 591 45 -40 -70 5 106 -58 35 -93
5793 -93 -219 -173 321 67 139 -135 -82 -210 -92 -2 156 -261 81 -98 -12 -75 -77 125 -253 -318 -99 -190 -308 -238
5817 -238 -26 -8 -314 -485 -166 -173 -193 35 355 -41 -214 138 -193 -142 -100 123 46 -203 -433 -187 -37 15 -113
5840 -113 -299 -11 94 128 80 -322 -1 -10 -238 -7 148 58 -7 -137 194 91 -146 -59 -8 -153 6 116 271
5863 271 -111 -289 12 -84 -53 -112 154 -3 -287 67 509 -71 -72 423 69 166 -42 210 389 -26 -147 13
5885 13 41 155 470 7 -63 93 -141 105 20 427 220 -121 138 -224 172 -66 -34 272 -12 144 6 77
5907 77 -32 -4 75 -168 -78 3 389 -106 -7 262 -126 -5 148 65 16 188 -3 -200 -154 41 -15 27 -205 -124
5931 -124 -155 81 -59 -329 46 -214 4 -394 -13 22 -285 -88 -182 99 -214 141 315 -76 -284 -354 148
5952 148 -39 80 -214 -74 -178 -237 -318 -88 -272 -111 311 -375 -347 239 -28 -318 -64 -185 -156 -375 0
5973 0 294 29 -83 -267 -241 29 41 204 213 -297 -26 63 65 202 295 176 -377 -82 69 46 -190 91 -167 37
5997 37 194 98 -183 213 101 84 283 -243 355 22 393 -192 336 138 -6 -10 25 337 158 174 -31 178
6019 178 -87 102 22 -162 -23 126 47 212 287 -62 -217 249 185 233 421 -150 17 -8 26 158 -62 102
6041 102 -123 186 45 56 -129 166 102 -19 81 200 62 123 92 400 117 -269 40 68 -181 -53 -107 -194
6063 -194 -95 -57 260 251 -249 -238 -72 79 -98 32 122 -158 -120 39 -106 -410 -80 0 -485 -222 72 -54 -130
6086 -130 -22 53 -344 -415 -81 -118 292 -304 258 103 -268 -263 -212 85 -231 -7 103 96 293 -121 93 65 -137
6109 -137 6 160 -281 283 395 3 -196 309 228 -200 -245 -50 -112 -94 -7 272 -304 174 184 52 -230 153
6131 153 412 301 -147 -158 9 39 -38 -11 56 -153 359 187 161 -210 -37 350 157 -237 342 113 -72 15
6153 15 151 263 -176 -52 230 -20 -8 -276 95 306 -104 45 86 30 -239 67 109 -15 162 122 -132 -403
6175 -403 -190 326 42 -31 297 -116 51 -148 -100 -24 19 -158 -27 -209 -234 3 192 -54 26 -162 -127 -74 118
6198 118 18 -482 -85 -94 -73 127 88 123 -179 -34 -162 71 -36 -277 -152 -80 -290 -226 -185 16 -30 24 171
6221 171 -96 -191 57 127 -117 -106 -139 111 -433 -282 282 -346 -240 -5 -61 105 -199 -101 127 -174 260 163
6243 163 109 -299 154 78 -59 -65 306 447 142 33 -200 -53 113 238 197 -139 -85 365 45 -157 45 191
6265 191 230 32 75 146 -102 276 116 143 -44 -93 100 206 -79 133 -74 129 94 -117 251 61 247 56
6287 56 251 116 54 239 -294 -62 -103 93 313 141 -226 -75 -214 61 88 319 0 -235 178 -154 33
6308 33 380 -20 -27 -47 128 122 139 -102 222 36 -180 -121 41 63 -198 -173 46 -220 -64 -159 -361 -195 122 -123
6332 -123 -55 -155 264 -149 -424 -1 60 -188 -234 195 254 -327 -35 -151 137 -24 -63 -44 15 -227 285 467
6354 467 -202 109 116 -120 -107 -48 74 -93 -160 180 -136 -14 -126 -94 -137 -126 27 40 243 -286 -5 129 -221
6377 -221 -370 56 52 -279 -96 448 -59 152 192 96 84 -180 158 435 -78 -137 75 -124 -180 228 149 -4 -98
6400 -98 -120 159 211 -113 99 119 -189 50 145 74 -97 213 135 -132 -21 97 -154 114 64 270 251 10 -111
6423 -111 91 -165 -189 -23 51 -10 -68 11 -60 110 -267 -11 -155 -63 -67 161 -105 193 -95 120 -221 120 133
6446 133 -165 -127 -79 -353 -388 101 57 92 -6 -247 -26 -415 -291 -24 -90 -238 -103 -5 23 97 -167 -109 -241 -286
6470 -286 -132 14 -20 74 180 -262 -42 296 -185 151 487 37 -96 -205 -21 21 183 -20 -131 183 36
6491 36 -67 -172 99 32 -129 -40 42 -150 -434 211 20 66 -94 -238 -306 -272 64 16 94 38 238 181 -48 76
6515 76 27 225 61 -250 164 -85 134 50 128 -265 7 -52 236 -10 -104 107 -171 181 -215 -194 -100 200 282
6538 282 -43 315 -148 187 160 -172 -217 53 59 -144 -73 34 -15 -5 325 -19 106 -48 177 -37 26 52 10
6561 10 -315 76 -122 -179 147 79 114 -290 -107 135 23 -250 -70 -56 -269 -115 -20 141 -111 -192 216 133 154
6584 154 101 62 -5 -263 -218 -406 -191 -183 -3 -38 -56 -77 -62 146 -27 -370 220 -397 -195 193 -1 -83 -379 -35
6608 -35 -67 -194 -124 -95 -291 -120 -171 -66 39 -10 89 -216 -171 88 -91 270 -438 -144 182 46 -189 105 -1
6631 -1 -89 -265 -143 -223 107 -257 390 497 -42 259 -17 -214 -111 19 -335 -126 37 139 -10 44 -157 145
6653 145 -41 296 1 -121 -49 -69 103 128 71 -5 -144 99 -153 153 304 460 146 -44 129 156 76 -269
6675 -269 -4 -95 120 343 36 291 364 125 -104 -311 560 172 -9 -239 41 -217 -247 84 136 -166 -112 -157
6697 -157 14 13 118 -8 -98 -4 143 -96 -173 -72 -93 67 -145 -18 -68 225 -25 -134 -207 -349 -98 158 81
6720 81 -109 -237 -47 200 -134 131 120 -80 -58 -293 -90 -204 30 -111 -221 -35 -165 -298 -60 -49 143
6741 143 160 -11 128 -175 -115 -215 -158 -17 -195 -14 213 -135 -48 305 206 14 223 94 152 -401 -97 23
6763 23 25 -7 326 -31 -163 182 225 95 -26 46 362 382 176 94 394 27 102 -339 237 317 -17 194 48
6786 48 71 -237 206 91 117 -7 137 241 -246 190 8 -213 339 93 8 235 204 -71 281 217 25 -262
6808 -262 160 38 142 67 -491 125 35 98 -63 177 303 244 56 156 43 104 -63 -208 80 -46 -7 98
6830 98 -212 140 -97 257 -61 12 -4 41 -117 -60 552 46 -132 -79 231 -67 207 -240 69 -34 211 247
6852 247 -300 -190 13 -145 -296 -110 -63 -16 -27 -102 14 -69 -128 354 181 111 -27 -145 -112 -123 -83 -329 64
6875 64 -170 -107 173 -242 -344 -112 106 -117 -228 85 260 -162 -141 52 -12 26 154 -99 -110 -189 -25 281
6897 281 72 254 196 216 -276 316 65 -29 -57 -77 17 20 -320 319 351 29 -94 287 51 471 114 18 -95
6920 -95 -254 186 249 -110 230 140 -157 -118 2 293 -97 6 317 -185 201 58 -49 -29 139 -197 218 -138
6942 -138 -92 -91 154 16 1 185 -20 226 170 -221 -50 -17 252 154 -284 132 120 -81 312 -178 -142 -20 -264
6965 -264 222 342 -148 49 266 -87 -308 -68 302 47 -240 42 -248 -321 -109 -72 -219 -293 -25 -301 -46
6986 -46 -286 -60 290 142 182 162 -100 58 -44 169 -180 -131 -9 98 -16 -150 18 -117 23 -253 128
7007 128 -347 -425 113 282 -270 83 -81 -24 4 -134 -425 -40 -43 -166 -154 29 -308 -93 168 -193 33 62
7029 62 153 -72 174 6 49 -43 290 235 -11 295 257 47 -58 6 244 -330 -71 -90 -95 98 151 299 317 -125
7053 -125 180 253 63 0 80 316 221 -10 -20 4 65 389 24 136 52 123 -237 105 -26 143 -25 -109 -255
7076 -255 -38 6 57 76 41 99 12 250 231 95 95 214 155 -277 81 -50 94 6 -144 -180 -146 -324 -114 -35 -132
7101 -132 -105 -60 -25 -110 152 -66 -178 -73 -399 -145 -84 21 159 -64 -247 -23 24 -267 141 -250 -39 -184
7123 -184 -216 96 49 136 -36 -122 3 -195 361 393 48 -163 207 -333 -123 73 -54 122 -123 111 -60 -308
7145 -308 -28 -99 128 -87 -217 -10 139 -65 183 169 10 8 210 -71 121 -209 -138 198 -144 114 184 90
7167 90 -82 59 -160 185 -188 -42 68 -210 -309 44 -48 217 123 661 -91 45 100 580 189 53 -64 -215
7189 -215 5 -192 -17 18 96 119 228 106 110 67 46 -130 127 171 383 -129 47 66 17 -57 67 115 -227 330
7213 330 20 148 -82 47 122 -123 -292 -217 147 -59 -204 95 -6 -40 57 127 -60 -67 1 -132 -230 352 -120
7236 -120 229 81 260 270 -358 -90 112 18 -308 -101 -180 -216 -227 34 1 -68 -129 22 -73 -12 90 -245 -176 -162
7260 -162 109 -85 40 227 -207 -38 -95 -351 266 -122 -84 -97 -665 206 80 -220 -5 -142 99 319 -4
7281 -4 1 -63 151 -56 -296 154 -42 -184 29 -85 178 -204 -212 106 -280 139 -124 98 179 88 53 323 4
7304 4 124 11 16 275 99 39 107 114 49 221 -277 31 329 188 93 -61 -23 -82 56 183 58 -241 176 -105
7328 -105 20 -89 -64 341 165 -67 214 177 284 -211 9 -131 0 -187 401 -52 -111 55 48 48 66 -17 51
7351 51 42 -175 270 161 14 -15 78 -254 -46 44 181 90 -205 8 205 68 9 190 -396 -27 50 -167 174
7374 174 -70 114 -54 18 215 419 53 -62 100 -157 -193 87 -183 -102 33 -360 -12 29 -244 -61 -138 -365
7396 -365 -320 18 -49 -392 246 323 1 58 92 -62 -49 -66 -103 -110 187 62 73 -185 128 95 74 372 -105 241
7420 241 72 39 153 146 131 -69 -176 -4 -92 -203 -107 209 40 6 266 -17 21 73 -441 125 -107 -7 -46
7443 -46 24 -7 54 -211 151 -23 -195 -134 136 -127 282 -75 -244 13 415 -159 43 -21 100 -71 -12 246
7465 246 -129 169 -3 252 -152 -44 -76 29 275 -80 217 98 83 -122 28 -167 196 -176 -168 -368 -267
7486 -267 225 66 114 15 -223 125 -108 9 -151 -448 181 -336 18 126 63 -129 -137 -341 -71 63 59 70 -63
7509 -63 -136 -20 44 386 -81 -130 -168 34 -22 235 74 -180 -60 -267 217 63 -203 142 -30 -498 18 1
7531 1 -204 -225 -277 51 -431 -104 203 35 -290 -342 -172 -104 151 244 169 193 -76 -70 -235 87 -130 -43 -222 147
7555 147 -11 -33 41 111 -70 -81 172 -35 120 366 33 213 -102 202 72 359 160 -116 320 -184 -142 36
7577 36 -99 222 280 -307 -57 69 271 474 152 -260 17 280 293 506 33 226 388 46 -2 47 -56 31
7599 31 -151 -132 -94 33 -162 76 73 -136 -45 162 -98 -135 34 -4 88 -165 58 -333 -33 424 -47 -87 -141 174
7623 174 42 264 -54 102 -211 -266 159 -128 17 -27 -221 -230 -351 -395 -44 64 -5 -17 -479 -312 -389 70 121
7646 121 -194 -64 89 -118 -353 -226 -207 211 -117 150 -60 26 0 52 54 -127 -152 88 -123 317 341 79 -130
7669 -130 45 349 -88 -55 191 307 243 -14 43 -151 -58 -205 -38 227 30 -181 94 -254 115 89 117 240
7691 240 -270 249 221 29 37 215 234 56 -265 352 210 -54 434 -33 170 155 30 -66 159 264 218 -93
7713 -93 168 240 40 -47 -36 57 61 37 258 -53 160 17 123 -84 15 188 34 8 154 45 -10 -47 212 13
7737 13 -25 79 30 95 -132 -80 -53 -261 -139 81 290 238 133 -335 25 47 -194 -249 88 -179 -21 -167 -403
7760 -403 -79 -103 39 155 -378 159 -87 -160 -102 -37 -19 -160 301 10 -106 -108 8 -146 89 66 -361 207 -142
7783 -142 239 209 -33 82 290 191 -10 -160 -107 -15 -54 -20 -191 44 -392 -22 -276 162 22 -186 -119 38
7805 38 -96 80 -27 -52 440 -21 -57 -159 -66 39 -36 100 -73 90 -138 254 33 -18 132 43 93 354 -2
7828 -2 123 316 125 -17 -33 -15 147 -4 166 -112 429 126 29 111 158 -24 104 296 11 -157 -166 162 -19
7851 -19 -225 53 -201 -70 -145 -335 -126 209 101 222 74 -88 -110 -190 -260 193 151 -141 -232 -252 182 63 -27
7874 -27 49 33 -10 108 86 108 -80 187 -362 40 -234 -145 -363 -82 -155 -242 -66 116 5 -191 -79 117 350
7897 350 223 -149 60 -19 -52 38 144 39 -24 253 359 123 -29 278 52 -212 19 -89 -230 -20 -98 71
7919 71 92 33 -50 -184 -416 35 -290 122 84 9 155 -191 -115 84 -60 -36 278 286 -198 -348 -246 10 155
7942 155 -107 137 -87 -76 150 128 -25 -99 -73 -80 46 32 -78 -14 4 127 -1 -110 -119 266 -163 117 288 28
7966 28 208 112 -69 131 64 109 148 179 -6 61 -194 -102 97 -154 102 447 10 -92 103 -382 66 104 205
7989 205 -220 -366 47 240 -170 62 244 -20 -140 -30 -199 -105 -138 78 -218 96 -117 -354 296 71 -30
8010 -30 91 154 -178 -55 141 38 -165 -60 -184 -381 -126 -109 60 -128 -7 -133 83 18 113 154 -138 -413
8032 -413 106 -97 -78 123 -370 -116 -346 -97 -146 -91 -330 -62 184 -180 -16 20 42 -81 -158 -111 117 -59
8054 -59 -176 79 -72 105 37 45 -129 18 40 183 126 117 45 -38 -145 96 179 267 145 -146 -17 111 225 370
8078 370 -178 296 160 -170 -169 -85 -140 -67 -12 154 -323 -228 -27 -129 19 -16 -78 139 40 117 95 -15 4 -7 -139
8103 -139 242 294 50 214 259 -33 88 -3 183 144 358 -123 325 -31 -144 84 -210 44 -497 -106 62
8124 62 -99 105 -21 276 130 -46 84 -329 -47 -108 -196 115 49 -280 -3 -54 -39 19 -101 -230 -88 -221
8146 -221 -266 -46 -3 302 -148 -123 -137 -117 -2 -343 124 -169 107 -37 369 37 -17 -211 -218 77 98 -166 -184
8169 -184 -52 103 -65 1 28 -118 -34 108 -198 169 60 155 -180 -122 -7 11 -211 -136 142 -96 -2 -63
8191f3
$$ Imaginary data points
##PAGE= N=2
##DATA TABLE= (X++(I..I)), XYDATA
0 0 0 0 0 0 0 0 0 0 0 0 0 8 -8 8 -8 8 -12 16 -16 18 -24 25 -32 36 -40 48 -55 60 -68 79 -87 98 -110 121
34 121 -137 153 -169 188 -209 229 -254 283 -311 348 -383 424 -475 530 -593 668 -758 866 -1002
53 -1002 1173 -1404 1733 -2226 3058 -4730 9374 -47309 -172749 -51093 65352 40763 -42
66 -42 29440 -7928 -105454 -94060 35715 90735 27165 -36048 -51507 -61172 -40192 29828 74545
79 74545 31162 -43082 -74919 -47843 14148 63009 44433 -17270 -48255 -37549 -23556 8276
91 8276 60157 52505 -37434 -87854 -32709 29055 27413 20815 21139 -33606 -92885 -41561 60231
104 60231 61783 -11680 -36470 -25039 -44631 -38037 40145 81779 10404 -70648 -58604 -3924
116 -3924 23910 37996 43123 7643 -45927 -52538 -3312 50763 64581 26084 -30525 -44840 -7392
129 -7392 25890 32314 40327 32165 -25761 -66774 -10515 69186 54228 -9727 -18663 -4291 -23574
142 -23574 -17679 46439 66218 -6556 -58215 -23674 16788 18356 27784 37341 -4677 -53157 -29023
155 -29023 32335 48390 26978 7524 -18551 -39870 -12143 42636 54467 20948 -9686 -27877
167 -27877 -32989 2099 52771 50462 -474 -29183 -25306 -20730 3002 49610 48816 -18990 -57844
180 -57844 -23184 10214 7348 18185 32663 -10410 -65174 -39394 27839 36398 2029 -9041
192 -9041 -14352 -37039 -29045 21617 40916 4949 -26180 -27061 -21602 -4477 29310 32009 -10048
205 -10048 -36150 -19586 -4089 1927 23532 29723 -15425 -53082 -23426 20319 18906 3929 5680
218 5680 -12776 -44467 -28001 22587 31503 -152 -16575 -19373 -29885 -17111 23472 32624 -5256
231 -5256 -28400 -17478 -10858 -6176 20964 31806 -4948 -34804 -15201 10562 9202 12800 21488
244 21488 -2161 -31202 -11990 24793 21285 2319 5370 569 -23058 -11965 31614 32587 -9309
257 -9309 -20428 892 862 -6950 16810 32649 -1730 -35083 -15323 17084 18200 11454 10122 -5748
271 -5748 -23145 -10636 16131 23632 17516 6002 -17139 -27351 3249 35542 22743 -2474 -171
284 -171 -1107 -21694 -8812 39154 40831 -12108 -31563 -814 9575 -3786 13029 33206 -49
297 -49 -39804 -19350 21290 18998 2238 5311 -2722 -26314 -19218 17981 27636 3501 -12887 -14051
311 -14051 -15382 -4958 18667 21898 -133 -17165 -17898 -12321 5073 27189 18113 -17207 -26040
324 -26040 -5664 140 -980 20030 26039 -17833 -47217 -9781 29542 11894 -8804 6428 1669
337 1669 -35517 -29959 25678 39324 -5995 -29308 -9996 -3372 -11523 5855 26395 7707 -25804
350 -25804 -26619 -3817 11959 16120 8754 -10365 -19798 -10368 222 5757 15891 13698 -16450 -33672
364 -33672 -4409 24635 11297 -5680 2246 -2597 -26757 -13746 30072 30044 -13289 -23619 517
377 517 415 -10287 14339 33915 -1466 -37281 -14884 19329 14032 2277 11097 4251 -23030
390 -23030 -21565 12758 28839 12109 -7174 -14142 -13308 -1766 13794 16163 7459 -1405 -14475
403 -14475 -22048 1305 32462 21520 -14790 -17728 3808 -147 -7846 18375 33869 -4713 -37994
416 -37994 -8729 26966 14227 -2278 10412 6859 -22360 -19848 20343 31758 3146 -13025
428 -13025 -6664 -7523 -6716 13579 24511 3943 -17387 -15300 -5042 4152 16633 16250 -5493 -20440
442 -20440 -11189 1133 6615 15586 14858 -11338 -27563 -5801 17378 9894 2219 9711 -2052 -27953
456 -27953 -13863 27135 26273 -9215 -15197 1546 -5592 -14447 10819 29791 1057 -28944 -16147
469 -16147 7208 5859 3482 9166 -912 -20624 -17374 2872 11223 7991 2424 -12285 -23197
482 -23197 -7728 13892 10476 -2831 -2607 -5471 -19016 -11574 18993 22007 -6857 -19161 -4168
495 -4168 -978 -5032 9952 21087 -2124 -24791 -10635 9193 6817 4103 10120 -1970 -22706
508 -22706 -13046 13584 14827 -379 -2630 -4204 -15692 -11716 12522 18639 -870 -12395 -7777
521 -7777 -7297 -3895 13101 17475 -3622 -16214 -5337 2002 169 10922 18819 -2075 -22574 -6657
535 -6657 16740 11469 1007 7930 4600 -14602 -11466 15323 22601 3001 -6470 -2614 -5041 -3182
549 -3182 11585 16353 707 -8791 -5247 -4279 -1408 14171 16553 -6693 -18752 -1549 9185 34
563 34 2549 15375 2364 -22154 -10645 18429 16235 -3111 -1495 4795 -7836 -10504 12106 21831
577 21831 2060 -11186 -2917 565 -2028 8172 15918 1142 -14049 -7549 2417 2309 5275 8706
591 8706 -3687 -16233 -8049 4742 3330 625 3925 -5422 -19753 -8042 12731 6991 -8969
604 -8969 -3455 2419 -12902 -14938 12265 20729 -7747 -20708 449 7932 -7833 -3434 16934
617 16934 6624 -19670 -15336 9528 11407 -2105 -2419 508 -7723 -10895 96 7870 4039 -2340
631 -2340 -9442 -13728 -3953 9275 4839 -7764 -4655 102 -10268 -10831 10486 16557 -7580 -17950
645 -17950 879 7943 -5165 -888 16356 5399 -18301 -8392 15775 10816 -4940 2225 9587
658 9587 -5439 -12170 8688 19464 1801 -9013 -148 3284 -2504 1611 10903 5442 -5875 -6615
672 -6615 -1047 3622 8405 6065 -4584 -6772 3017 3526 -3112 4819 14574 -152 -17262 -1309
686 -1309 20253 7576 -9745 3433 14171 -5205 -13991 11657 23034 -1773 -14348 4134
698 4134 11112 -3376 -2917 12881 8085 -10561 -8838 5898 6604 343 1390 243 -6506 -5919 2037
713 2037 3451 757 720 -3397 -10492 -4587 7342 3660 -5749 -2017 1280 -8107 -8781 8327 11230
728 11230 -8243 -12140 4006 4152 -9978 -2590 13923 1998 -18254 -7679 11780 3641 -10202
741 -10202 -659 6722 -6958 -14007 1554 9795 -1950 -9779 -3828 -2081 -4610 -956 2500 -2444
755 -2444 -4709 -3319 -5806 -4748 4973 6772 -6707 -10738 2624 4729 -5980 -2425 10752 2807
769 2807 -13670 -5126 12260 5300 -7214 1401 8897 -4344 -8992 6787 12550 -2481 -6364 4800
783 4800 3625 -5231 835 10498 1971 -8090 -331 6392 -139 -1443 5438 3164 -5466 -1721 6501
798 6501 3336 -891 3625 2962 -4652 -370 9880 5570 -4540 927 7807 -1171 -5466 8805 13142
813 13142 -2814 -8264 5669 8456 -2671 -1390 10025 4753 -8499 -3737 7733 4606 -2135
826 -2135 1502 2384 -4369 -3566 3869 2561 -2320 719 1936 -6233 -5409 6054 5304 -6452 -5093 4610
842 4610 371 -8505 268 8995 -1129 -10031 -513 5952 -2945 -4988 3730 2300 -7396 -4770 4747
857 4747 918 -5467 -818 2246 -5544 -6277 2964 2698 -5803 -4916 1232 -2924 -6776 699 3800 -4448
873 -4448 -6778 936 -261 -6708 -957 5930 -2726 -9248 602 5711 -5043 -7255 6182 6158 -8466
888 -8466 -7025 8205 5268 -8538 -3396 9014 2651 -8233 -1313 7181 231 -5291 1582 5232
902 5232 -448 -2522 1197 159 -1083 3385 2985 -2144 -117 4959 -701 -4994 4409 10344 -1509
917 -1509 -7313 4131 7797 -4180 -3881 10089 7735 -7728 -5044 9642 5705 -5992 1400 10226
931 10226 102 -8666 2773 10061 -234 -4679 4431 5349 -4039 -2586 6487 4789 -2870 -1491
945 -1491 3070 645 -573 2424 1368 -1249 1116 1597 -2899 -268 6228 845 -7988 -1742 8064
960 8064 1028 -8465 787 9048 -4353 -12406 3281 11386 -3698 -10862 3179 6321 -7660 -8079
974 -8079 6549 6715 -7089 -7188 2656 1631 -5002 -1194 3551 -921 -4816 -1742 -623 -1651 768
989 768 1133 -3263 -3463 1445 -517 -5447 -692 4735 -2648 -7241 1196 4945 -5483 -7458 4696
1004 4696 4999 -7570 -5696 7158 1990 -10747 -3187 9642 1991 -9639 -812 8239 -2241 -8833
1018 -8833 2692 9608 -1463 -6565 1340 3964 -1638 -1275 4001 2765 -1288 -1028 -762 -349 3725
1033 3725 5054 -1944 -3576 3649 3646 -4489 -1369 8749 3738 -8587 -3204 9395 3176 -7029 645
1048 645 9430 -774 -8467 3238 9987 -1285 -5983 3972 5455 -3602 -1713 7538 3842 -4931
1062 -4931 -1392 4981 1302 -1461 3636 3422 -3105 -3062 2920 2788 87 2272 2242 -3800 -3299 3760 2767
1079 2767 -2983 640 4462 -4034 -7580 2917 7673 -2883 -6495 3293 3108 -7722 -4800 8242
1093 8242 4867 -8062 -4894 5330 860 -6042 273 5585 -1184 -5504 480 2574 -1964 -1257 2204
1108 2204 -970 -3047 1177 2236 -3770 -2692 3834 333 -5934 -386 5258 -2405 -8001 793 5026
1123 5026 -2711 -5418 2754 2213 -7129 -4519 4971 2057 -4973 -1430 3360 -2770 -5411 3010 5322
1138 5322 -2653 -3967 2329 1308 -3574 697 5919 -185 -4657 467 3141 -852 -332 3975 394
1153 394 -5035 -651 4920 -13 -3284 3035 2616 -5990 -3573 6931 4350 -5993 -3234 4747 -160
1168 -160 -5967 2699 8374 -529 -7221 -125 4951 229 -183 4600 2086 -4398 -2043 3501 2527 1902
1184 1902 4343 -63 -4960 -343 6042 2907 -1789 3067 3629 -5674 -5485 6755 7497 -3640 -4444
1199 -4444 3962 763 -6204 310 8171 984 -7961 -1473 4794 -1129 -3190 3836 3340 -5396 -4052
1214 -4052 4369 3680 -2160 -473 2412 -1523 -2706 2489 4615 -158 -1552 221 -1533 -1266 4250
1229 4250 3440 -3265 -3219 2233 131 -4723 2118 6800 -3297 -10054 -559 6711 -1626 -5959 3575
1244 3575 4209 -8500 -8121 5750 6741 -4558 -5470 2048 184 -5038 -451 5718 1271 -4668 -2414
1259 -2414 783 355 1965 2671 -1526 -3496 232 1336 -1292 1350 4423 -2039 -7576 -393 5773
1274 5773 -304 -3641 2076 1657 -7337 -5429 7002 5485 -6037 -4728 3325 -304 -6569 2333 8615
1289 8615 -875 -8859 -1079 5745 175 -2004 4377 3682 -4591 -4478 3541 5372 1045 37 -345 -1673
1305 -1673 -217 2896 2356 924 2301 207 -4850 -1348 7429 4873 -4656 -2956 4566 428 -5286
1320 -5286 2311 9249 -730 -9370 38 7903 -425 -3875 4055 4707 -5626 -4957 5944 6012 -1896
1335 -1896 -1601 2522 -615 -3156 2601 5644 75 -3207 279 549 -582 2525 3726 -1577 -3592
1350 -3592 111 1062 -1349 1263 4003 -2350 -6790 63 4761 -1539 -3793 3018 1486 -7590 -4920
1365 -4920 6324 4084 -6596 -4515 3730 -284 -6381 720 6696 -1242 -7424 -1676 3548 -377
1379 -377 -1668 1831 307 -4105 -2500 1542 626 -109 1141 -1701 -5395 -1173 3988 109 -3938 -93
1395 -93 1384 -4652 -4345 4639 3916 -5136 -4846 1869 513 -4291 429 5283 -1831 -6406 82 4094
1411 4094 -483 -1955 3041 953 -5273 -2102 5399 3079 -2524 49 2006 -1908 -2171 4318 4383 -1610
1427 -1610 -2070 1501 -396 -655 4358 4418 -2316 -3507 2630 2824 -1521 2030 5872 -831 -6405 869
1443 869 7203 1262 -2833 2507 3174 -3371 -2671 6081 5720 -1696 -2288 1822 632 -526 3374 4257
1459 4257 -1092 -2907 1173 982 -353 3228 4198 -2471 -5170 1834 4728 -599 -748 3810 130 -6391
1475 -6391 -1577 6538 2907 -3720 -968 1791 -3096 -3732 4218 4730 -3228 -4841 232 17 -2796 1200
1491 1200 4272 -2261 -6654 -1721 1957 -527 -867 1657 -1317 -5571 -2860 1930 138 -931 655
1506 655 -1726 -5591 -1938 4380 1040 -4250 -1007 1374 -4380 -4564 4113 5450 -4471 -6793 1576
1521 1576 2739 -3915 -1796 4976 576 -7631 -4020 4265 2282 -2509 -562 312 -3099 -2881 1979
1536 1979 2958 -275 -721 -1312 -3484 -579 4092 2782 -2143 -772 1677 -1252 -1814 4329 6099 -2275
1552 -2275 -4336 2564 4076 -1062 577 6179 1485 -5925 -297 7004 2551 -2488 1500 4095 -2281
1567 -2281 -3418 5252 6517 -1308 -3371 1747 2179 -464 1671 4354 803 -3109 -880 1683 1777 3144
1583 3144 3023 -1989 -2689 2278 3199 150 1526 4778 -779 -6653 18 7941 2703 -4312 919 3879
1599 3879 -3049 -4881 4854 7413 -2600 -6166 520 2270 -2585 -787 3867 101 -6056 -3246 2037
1614 2037 381 -925 175 -755 -4431 -2487 1712 714 -1290 -599 -1279 -4568 -1883 3045 1007 -3090
1630 -3090 -1472 461 -3229 -3286 3593 4205 -4424 -5614 1624 1523 -4578 -1294 4596 -1134 -8399 -2763
1646 -2763 5004 862 -4761 -775 1553 -3634 -4877 1840 3696 -1786 -3514 -1184 -1128 -1385 1489 1977
1662 1977 -1136 -1467 57 -933 -1250 3368 3956 -2066 -3282 2326 3887 -1158 -120 4602 1354 -4624
1678 -4624 69 6312 2550 -2922 169 3102 -1288 -1879 4727 5025 -2063 -3048 2119 2059 -821 2225
1694 2225 4531 -804 -3745 993 4042 1380 928 2486 26 -2811 543 4263 2165 507 2308
1709 2308 440 -2897 612 6105 2826 -2225 475 2672 -1545 -2204 4882 5465 -3014 -5032 1651
1724 1651 2702 -1932 -416 3594 -410 -5405 -2194 3276 889 -1609 -108 -762 -3719 -1570 2505
1739 2505 681 -2132 -686 -461 -3585 -1799 4067 2299 -4196 -3237 1641 -416 -2960 1495 3679
1754 3679 -2435 -5849 134 2674 -1030 -1586 1772 -969 -5590 -2341 3258 551 -3291 -905 35
1769 35 -3608 -3238 2498 2088 -3215 -3221 -38 -996 -2100 1106 2083 -2263 -3272 197 693 -1090 1335
1786 1335 2859 -2110 -4025 1560 4225 -664 -1607 2880 1173 -4487 -1195 5690 3039 -3844 -1910
1801 -1910 2974 -44 -2014 2640 4170 -1201 -3880 262 2153 767 1420 2072 -1406 -2702 1154
1816 1154 2445 636 1715 2586 -966 -3112 1504 5177 1358 -976 1882 2116 -2349 -669 5819
1831 5819 3883 -2504 -1660 3246 847 -1629 2801 4811 -1428 -4322 1780 3689 -438 -756 2718
1846 2718 365 -4073 -1183 3569 1939 -1683 -608 379 -1432 -366 2518 1339 -1201 -518 -443 -2323
1862 -2323 25 3832 892 -3776 -1795 2397 -208 -3121 2192 4057 -2945 -6255 1316 4561 -1239
1877 -1239 -3269 1741 956 -5143 -3238 3616 2073 -3844 -3010 331 -1091 -2622 1287 1629 -2365 -3267
1893 -3267 -767 -478 -556 787 604 -2801 -2919 420 1084 -1266 316 1553 -2275 -3894 1001 3397
1909 3397 -1205 -2470 1095 371 -4119 -1015 5137 1997 -4809 -2385 2861 -168 -2846 2031 4085
1924 4085 -2694 -5524 514 3767 -15 -958 1201 -258 -3158 -919 2808 2055 337 -83 -1471 -2389
1940 -2389 1629 3771 739 -1129 637 483 -2448 7 5476 3133 -3589 -1799 3107 1277 -1380
1955 -1380 2750 4787 -1213 -4203 1538 4491 282 -763 2424 614 -3368 -112 4653 2518 -1620
1970 -1620 -511 899 -904 -478 3607 2644 -1097 -1765 277 612 539 2936 2084 -2023 -1907 1398 922
1987 922 -487 2334 2698 -2594 -4078 1530 4133 -707 -1904 1927 511 -4545 -1614 4707 2508
2002 2508 -3520 -2338 1114 -844 -2496 1553 2753 -1770 -3564 -373 599 -370 828 954 -2365 -3377
2018 -3377 -36 1466 -803 -290 794 -2073 -4381 -26 3495 -73 -3077 -812 4 -3102 -1508
2033 -1508 3531 1665 -3774 -3209 564 -280 -1954 1743 2451 -3107 -4594 -90 2187 -730 -614 1735
2049 1735 -1010 -4192 -1281 3285 1119 -856 -405 -815 -2782 -610 3192 1340 -1626 -1004 211 -2125
2065 -2125 -756 3958 2808 -2950 -2657 1641 934 -1379 1454 3926 -1246 -4502 -102 4389 1330
2080 1330 -949 1387 1166 -1905 -703 3451 2925 -298 -464 414 -697 529 3762 2714 -920 -624
2096 -624 1164 -198 -348 3332 3469 -1960 -2954 1470 2568 -438 918 3782 -79 -3613 -193 4226
2112 4226 1506 -1173 1210 1340 -2395 -1265 3695 3090 -1429 -1497 1576 189 -1462 1544 2705 -629
2128 -629 -2771 -81 753 -97 564 1289 -1337 -2467 58 848 -937 -171 1086 -1832 -4058 -522 3259
2145 3259 -540 -3478 63 972 -3348 -2955 2977 2874 -3832 -4566 574 730 -2469 -524 2444 -943
2161 -943 -4469 -1793 1710 229 -1064 120 -727 -3106 -1376 1740 19 -1088 -118 -1272 -2840 -813
2177 -813 2144 499 -2438 -1130 588 -2232 -1680 2204 2140 -3041 -3016 1499 1066 -1867 717 3311 -838
2194 -838 -4725 184 4478 669 -1753 1472 1834 -2281 -1668 3426 3454 -644 -1186 862 415 25 1930
2211 1930 2417 223 -906 176 133 631 2651 2196 -1430 -1973 1976 1922 -984 1375 3895 142 -3717
2228 -3717 524 4649 1205 -1661 1334 2509 -1076 -1405 3538 3983 -817 -1401 1887 1220 -575 1285
2244 1285 2914 -66 -2039 471 1736 317 313 1527 -599 -2103 -151 1626 96 -641 340 -1068
2260 -1068 -2684 -57 1852 -32 -2206 -577 104 -2686 -1860 2644 1485 -3153 -3122 1214 729 -2856
2276 -2856 -420 3060 -1037 -4337 -928 2459 -192 -2032 80 63 -2653 -1874 1037 714 -1600 -1412
2292 -1412 -1078 -2137 -1299 1288 -103 -2702 -1577 64 -1573 -1779 984 1241 -2609 -3748 421 1048
2308 1048 -1788 -933 1641 -605 -3680 -418 3007 563 -1536 795 892 -1794 -994 2850 2046 -1396
2324 -1396 -854 1149 237 -824 1490 2752 -594 -1936 729 1113 -170 857 1839 -486 -1826 939
2340 939 2028 459 298 2144 217 -2600 591 3910 1512 -1544 627 2556 -250 -998 2910 3614
2356 3614 -736 -1638 1903 2075 79 1246 2783 594 -1390 478 1668 797 749 1905 -136 -2030
2372 -2030 623 2373 275 -418 962 478 -2399 -1092 2680 1269 -1918 -998 1259 -1074 -1823 1443
2388 1443 2067 -1446 -2563 478 1225 -1158 -88 1786 -548 -3527 -817 1929 89 -1410 -212
2403 -212 -310 -2394 -1584 1329 546 -1740 -1409 -901 -1730 -1464 1210 419 -2306 -1816 89 -1474 -2215 918
2421 918 1552 -2720 -3750 320 1272 -1810 -1454 1741 24 -3532 -1586 2487 914 -2058 -265 942
2437 942 -1375 -1673 1207 1699 -834 -1340 -75 -100 -390 1024 1285 -1135 -1646 539 804 -500 663
2454 663 1930 -724 -2427 380 2220 21 -629 1897 830 -2098 182 3112 1542 -1082 464
2469 464 1981 -557 -1283 2533 3288 -563 -1541 1362 1715 -426 577 2332 796 -1365 -305 1943
2485 1943 1130 566 1085 356 -617 265 1442 662 675 1093 15 -1617 1 2926 1216 -1778 -369
2502 -369 2051 -623 -2312 1716 2899 -895 -2583 859 1911 -1076 -810 2075 541 -2485 -1123
2517 -1123 1633 1037 -1023 -84 578 -1788 -1875 850 1206 -765 -1040 -176 -1186 -1419 785 866 -928 -1278
2535 -1278 7 -823 -1898 340 1396 -1400 -2412 42 169 -1939 -999 1652 -64 -3067 -1382 1872
2551 1872 19 -2445 -565 1599 -1343 -2897 676 1857 -992 -1996 272 314 -1180 -534 907 -149
2567 -149 -1298 -377 -235 -765 110 1178 -628 -1583 391 1142 -438 -812 1771 839 -2084 -1090 2272
2584 2272 1231 -1280 -2 1532 -458 -1700 1235 2359 -603 -1508 947 1339 -936 -99 2386 717
2600 717 -1584 203 2093 116 -419 1281 1432 -705 -153 1550 1158 -224 512 736 -500 -40 1834
2617 1834 1149 -491 44 1554 -146 -1631 1340 2323 -499 -1753 1247 1728 -1005 -845 2160 1046
2633 1046 -1926 -858 1571 846 -1030 316 1327 -1208 -1589 590 1012 -492 -458 508 -543 -1440 269
2650 269 1366 -878 -1030 568 0 -1637 -302 1673 -392 -1892 -299 654 -1054 -1571 643 492
2666 492 -2169 -1312 882 143 -1690 -382 999 -1268 -2069 318 1337 -1129 -1456 319 179 -1737
2682 -1737 -381 1152 -476 -1446 -361 725 -923 -414 793 -15 -1589 -463 1045 -433 -937 1059
2698 1059 901 -1751 -1572 1265 699 -1912 -586 1516 -45 -1616 10 1951 -86 -1411 258 1421
2714 1421 -520 -496 969 478 -693 -342 912 263 -144 1053 831 -730 -106 1743 632 -216 488
2731 488 1343 -355 -826 1899 1991 -460 -790 1437 816 -1223 677 2419 197 -1617 580 1863 -609
2748 -609 -815 1557 1361 -1484 -878 1713 1222 -312 -82 1563 -74 -1023 556 1318 473 -485 276 -213
2766 -213 -470 784 1392 -118 -413 901 75 -1443 297 2129 -520 -2098 228 1495 -753 -1585
2782 -1585 940 1490 -1872 -1735 1230 1242 -1425 -1128 969 -335 -2144 -146 1248 -610 -1381 -72
2798 -72 2 -1182 -704 940 -89 -1182 -202 451 -807 -698 866 -133 -1613 -828 504 -393 -892 539
2816 539 587 -1721 -1746 924 646 -1827 -815 1250 -333 -2520 -79 1913 -303 -2036 -75 1175
2832 1175 -997 -1322 956 725 -1651 -1439 778 603 -373 79 784 -505 -544 505 445 -173 594 748
2850 748 -570 -927 1310 1398 -772 -583 1544 534 -1455 298 2317 295 -1847 159 1844 -450
2866 -450 -591 1238 1469 -1069 -1157 1318 825 -7 315 1755 -88 -1344 691 1752 470 -75 1034
2883 1034 616 -796 265 1747 600 23 570 640 -312 212 1555 451 -1225 -266 1004 -579 -684
2900 -684 1526 1652 -1798 -1484 957 1227 -1085 -534 1503 61 -2067 -228 1450 125 -1378 -88
2916 -88 232 -1147 -699 666 250 -840 -329 360 -921 -1103 1085 227 -1092 -689 455 -377 -773 160
2934 160 948 -1360 -1949 -135 685 -888 -1142 675 -185 -1915 -356 828 -709 -1676 -378 347 -1433
2951 -1433 -1338 929 794 -1421 -1239 396 -24 -1130 101 913 -722 -1240 70 470 -409 429 1017 -441
2969 -441 -1150 405 919 -541 -288 1313 234 -1347 -250 1590 518 -1373 207 1337 -199 -1004
2985 -1004 1225 1786 -756 -912 938 944 -174 122 1239 204 -706 264 1359 449 85 984 401 -578
3003 -578 515 1739 727 -261 1038 1053 -307 -399 1690 1114 -872 -87 1364 255 -681 938 1642
3020 1642 -394 -987 773 1390 -775 -363 1429 512 -1272 -119 1404 465 -706 -28 549 -758 -231
3037 -231 769 979 -116 -297 110 -581 -648 639 341 -969 -542 454 -539 -1302 268 751 -784 -2065
3055 -2065 354 635 -1228 -1452 797 383 -1915 -1075 997 302 -1628 -995 700 -602 -1461 -98 630
3072 630 -869 -1290 29 103 -717 -249 459 -585 -947 217 355 -1071 -110 213 -354 -1204 179 815
3090 815 -352 -712 670 343 -1223 -593 1653 471 -1458 -303 1182 -347 -1145 1091 1651 -304
3106 -304 -1444 472 1315 -402 -424 1312 411 -545 -30 1210 855 -107 491 384 -237 332 930 487 39
3125 39 759 619 -356 377 1609 774 -865 72 1496 441 -576 798 1691 -496 -1387 741 1639 -232
3143 -232 -563 1308 862 -955 -364 1546 696 -928 239 676 -378 -866 667 903 -466 -709 371
3160 371 325 -585 615 656 -448 -881 135 268 -274 204 706 -607 -1277 110 929 -872 -1157 717
3178 717 36 -1695 -861 1097 266 -1704 -754 1017 -640 -1756 27 963 -816 -1575 -249 230 -804
3195 -804 -693 140 -367 -1132 -416 444 -583 -319 330 -329 -1277 -222 846 -35 -966 170 284 -1029
3213 -1029 -718 970 638 -1130 -523 604 125 -998 421 950 -413 -1249 362 973 -438 -178 901
3230 901 266 -1154 -131 1286 364 -458 88 711 -284 -104 1182 582 -213 184 564 -215 -426 1249
3248 1249 1142 -286 -498 1111 625 -311 695 1191 83 -811 522 1278 108 -331 1236 945 -887
3265 -887 -58 1317 743 -98 -28 926 -148 -212 847 783 -198 -385 268 39 -457 731 1080 -271 -648
3284 -648 213 527 -305 -459 1016 -133 -1209 -176 849 -66 -667 419 331 -1226 -823 1021 509 -1299
3302 -1299 -556 181 -367 -1218 181 887 -829 -1336 -141 -25 -460 -574 150 -418 -1258 -371 -6 -365 -328
3321 -328 90 -199 -1099 -358 755 -136 -926 80 403 -1150 -995 853 1069 -1113 -1152 509 225 -850
3339 -850 44 1214 -551 -1535 -175 1023 197 -854 307 198 -1065 -461 684 217 -155 157 625
3356 625 -603 -378 871 281 -421 -161 750 -169 -435 992 994 -796 -778 725 913 -312 272 1228 135
3375 135 -1086 552 1518 192 -431 934 948 -614 -323 1527 946 -234 -295 534 321 -355 568 694
3393 694 -78 -417 60 495 246 737 604 -47 -541 664 587 -287 352 945 -8 -1293 26 1165 182
3412 182 -775 559 649 -750 -534 1478 824 -633 -866 677 192 -920 -70 855 -366 -1358 -259 406
3430 406 -120 -407 347 46 -1301 -356 525 -88 -672 150 -225 -742 -120 427 15 -1176 -292 135 -824
3449 -824 -873 621 695 -907 -879 136 -15 -1025 -121 990 -456 -1579 -432 871 -271 -734 281
3466 281 472 -900 -867 488 544 -200 -623 -148 -497 -313 789 757 -344 -302 99 -502 -514 624 752 -695
3486 -695 -1023 448 336 -402 90 1154 106 -1084 -171 1297 167 -540 400 499 -501 -359 1112 998
3504 998 -526 -174 852 339 -454 194 1487 -118 -365 307 577 204 339 1053 212 -705 213 834 350
3523 350 594 1122 165 -768 229 1136 642 -75 231 544 -277 -563 1010 1099 -456 -486 717 273 -643 395
3543 395 827 -205 -854 -36 458 -20 -222 503 -195 -871 -189 461 -221 -154 57 -94 -1008 -466 852 213
3563 213 -626 -580 135 -646 -550 427 828 -602 -1031 -99 48 -767 -141 340 -502 -1359 -287 819 -34 -732
3583 -732 325 297 -1074 -1177 75 389 -809 -113 -85 -369 -903 161 247 -514 -295 -212 -140 -447 244 708
3603 708 -742 -1032 -126 352 -416 -42 780 23 -1039 -618 941 397 -573 20 591 -260 -454 506 985
3622 985 59 -566 46 -203 -596 384 922 -83 -354 80 520 10 412 719 145 -606 152 1238 111
3641 111 47 1017 591 -697 -80 1266 925 -166 497 931 -608 -410 1007 1291 -84 -662 779 534
3659 534 -335 135 935 289 -778 74 1064 365 -53 640 392 -388 -106 426 499 -228 251 -140 -782 -220
3679 -220 757 418 -740 -136 452 -454 -616 350 1120 -163 -857 2 222 -729 -195 666 -103 -1247 -569
3698 -569 300 29 -915 261 201 -941 -1006 216 190 -526 -325 -100 -509 -970 -261 122 -542 -489 -248 -246 -924
3719 -924 123 644 -290 -806 -38 -2 -376 -225 651 21 -1206 -163 265 193 -713 -245 704 -622 -950
3738 -950 198 818 -474 -753 132 -26 -415 -98 1016 65 -127 -522 244 -363 209 701 -80 -486 19
3757 19 230 -239 73 710 558 -607 -353 1035 710 -212 462 925 -159 -453 863 1116 -2 -245 681
3776 681 479 -245 524 1338 384 -335 -383 573 157 103 690 530 -307 19 733 798 -84 392 78 -143 -319
3797 -319 572 515 -103 38 397 -378 -324 240 924 -260 -1120 180 319 -384 -133 748 249 -1163 -497 701
3817 701 55 -590 -56 306 -664 -671 108 388 -164 -520 78 -268 -614 -359 507 -256 -608 14 -250 -527 -49
3838 -49 521 -50 -975 -265 -20 -807 -314 109 -145 -655 -787 -42 153 -582 -27 122 -269 -846 -90 496
3858 496 -340 -676 96 178 -451 -72 775 39 -454 85 73 176 -411 78 121 -418 -105 285 170 -132 390
3879 390 246 -561 -292 617 442 -329 -37 857 256 -429 100 934 -226 -500 135 729 -62 216 616 317
3899 317 -238 -45 711 563 -62 530 684 -248 -159 883 691 43 429 622 -76 -386 658 716 -50 -486
3919 -486 885 375 -569 178 725 239 -234 196 619 -373 88 516 321 -272 -134 690 337 -443 -234 510
3939 510 -581 -714 77 608 -409 -33 38 71 -361 -284 395 -214 -788 79 -64 -325 -290 -73 -52 -612 -286
3960 -286 326 -250 -721 169 200 -836 -897 297 131 -517 -510 38 -522 -903 254 781 -235 -773 72 216
3980 216 -476 -163 430 -126 -410 -287 110 -208 -126 211 -53 -556 -501 316 -38 -438 67 412 -304 -191 448
4001 448 93 -390 -62 444 -3 -727 270 1032 -2 -873 33 883 -227 -94 698 635 -200 -661 575
4020 575 786 -268 351 770 270 -178 433 726 127 166 303 -41 44 564 725 68 183 412 686 -75
4040 -75 177 764 248 -499 -148 908 -157 -153 820 456 -138 -228 581 213 -74 64 712 220 -664 439
4060 439 533 291 52 231 162 -389 -307 510 26 -343 43 -92 -490 -168 241 58 -603 -252 456 -463 -616
4081 -616 321 187 -859 -569 284 319 -355 -206 145 -21 -1032 -297 330 -451 -669 0 365 -447 -536 176
4101 176 226 -310 -617 33 -358 -437 72 -57 -558 -640 -11 -268 -269 -159 19 -441 -880 -149 134 -501 -51 252
4123 252 -161 -483 -65 510 -189 -582 -35 551 -218 -335 425 445 -493 -73 383 207 -524 72 563 -36
4143 -36 -86 261 747 1 -288 349 -38 -389 290 353 301 321 263 686 -253 217 746 13 -236 57 652 -24
4165 -24 -65 478 689 -69 -207 607 755 -88 -93 589 70 -96 -27 694 17 52 324 118 -134 -142 451 216 -195
4188 -195 199 241 -282 -307 218 394 -522 -84 184 -154 -460 35 435 -221 -205 -18 428 -348 -655 218 155
4209 155 -766 -467 511 -422 -471 -234 216 -299 -695 56 227 -381 -234 247 1 -456 -335 644 -571 -175
4229 -175 102 236 -489 -234 12 -290 -680 -108 116 -80 -645 246 -163 -872 -399 544 -66 -810 -1 129
4249 129 -139 -417 27 431 -144 -516 360 118 -350 32 51 -151 -266 198 361 -347 94 478 97 -432
4269 -432 -72 300 23 -185 335 352 -550 -3 687 318 -436 281 684 151 -295 251 632 -29 -308 806
4289 806 802 -434 54 490 159 -313 245 492 368 -231 349 575 112 64 410 184 -159 255 398 135 -186
4310 -186 423 -44 -3 253 564 226 -197 267 744 -215 -366 489 180 -186 -575 480 420 -343 -371 520 149
4331 149 -446 -194 80 -316 -579 261 273 -364 -362 270 363 -215 -105 5 -207 -272 -150 -83 -296 109 -75 -68 -495
4354 -495 -47 164 -350 -622 403 118 -523 -306 509 -136 -670 -85 239 -291 -512 -71 159 -169 -582 126
4374 126 3 -702 -465 257 -300 -352 -63 -36 -236 -85 320 -84 -301 123 593 -81 -235 55 162 -127 -299
4395 -299 -20 301 -326 -49 483 139 -443 263 617 -47 -77 558 281 24 -209 406 104 -336 -63 666
4415 666 266 -196 253 763 -27 -65 387 450 -340 242 375 123 -364 326 327 -158 380 545 177 -48 55
4436 55 462 52 -151 572 777 -475 -215 297 138 -519 -343 397 395 -366 218 100 90 46 194 416 -322
4457 -322 -350 380 16 -68 -54 83 -90 -626 145 -38 -333 -64 227 113 -236 160 364 35 -379 190 -111
4478 -111 -278 -33 28 108 -368 -77 340 -45 -542 -90 -253 -353 -723 -13 110 -635 -163 -50 -149 -360 -640
4499 -640 -33 -293 -616 0 198 -266 -23 -15 -52 -354 -8 342 -450 -141 147 316 -407 -134 350 -210 -305
4520 -305 -76 340 -17 -313 142 216 -41 -224 333 326 -165 -196 248 393 -269 189 522 -106 300 276 313 122
4542 122 -267 354 574 -200 29 323 80 76 383 164 171 21 648 121 -205 394 672 210 64 522 443 266
4564 266 -108 421 176 -409 231 540 261 -278 -5 297 29 -483 247 398 97 38 128 83 -233 241 289
4585 289 -37 9 266 -202 -357 -115 238 160 -438 125 131 -294 -55 117 435 -227 -403 436 -63 -483 -146
4606 -146 213 -10 -298 -74 -108 9 -341 299 256 -343 -280 84 66 -454 -409 -486 -32 -240 34 138 -592 -226
4628 -226 62 -98 -440 151 180 -607 -477 448 -19 -548 -218 277 -46 -337 71 194 -294 -418 -12 215
4648 215 -273 -115 278 -157 -384 -410 320 -283 -91 93 128 -116 9 286 192 -11 308 390 58 -2 249 185
4670 185 -245 -86 195 611 -96 143 355 188 -73 187 306 -56 -84 323 490 45 267 584 441 -338
4690 -338 113 486 260 -274 433 511 44 185 261 525 -5 88 286 243 -190 253 -59 -28 288 352 133 -350
4712 -350 -28 448 -334 -284 86 307 -352 -508 111 116 -525 -83 -112 68 -500 192 228 -300 -302 9 -32 -520 -102
4735 -102 -70 -105 -162 -108 -207 -239 -130 88 131 -551 10 173 -175 -395 19 -38 -571 -240 -259 34 -363 -67 55
4758 55 69 -229 140 110 -348 -579 -64 477 -494 -235 454 87 -361 -133 109 -61 -238 -123 75 -158 -196
4779 -196 461 415 7 -188 111 23 -294 163 376 80 6 314 262 -225 41 205 295 -122 160 476 94 -114
4801 -114 240 457 151 12 424 345 -132 269 333 235 -90 119 196 383 -65 386 300 30 123 595 -108 -380
4823 -380 356 690 121 134 345 286 -467 86 482 -54 -66 107 377 -148 -355 340 196 -80 -115 265 513
4844 513 -219 101 108 120 -132 8 139 -131 -39 179 0 40 -208 325 -52 -20 160 -273 -635 -202 453 -175
4866 -175 -594 191 125 -120 -426 -169 72 -507 -606 229 -129 -466 -232 239 -199 -828 91 288 -48 -179 27
4887 27 254 -80 14 -170 -107 -83 -91 32 -387 -408 137 583 -63 186 -33 -73 -105 -27 282 -5 -174 -51 44 -98
4911 -98 147 172 247 -382 312 726 225 -168 85 257 -91 -102 188 185 -86 -6 136 493 46 -48 382 132 158
4934 158 209 237 24 183 385 213 -143 254 170 -238 -418 290 302 -174 71 812 100 -138 102 553 -87
4955 -87 -84 58 375 -106 28 374 192 132 -76 428 81 -124 -82 347 -33 149 -13 227 16 -12 342 204
4977 204 -46 280 220 1 -245 265 -167 -318 -146 72 40 -154 -98 186 -13 -243 328 -138 153 -86 198
4998 198 13 -234 -157 619 -167 -440 -200 45 -222 -354 -300 210 -210 163 95 24 -235 -282 -53 128 -426 -106
5020 -106 -288 -523 -36 415 -159 -366 178 -124 -8 -101 210 -50 -141 -465 87 -174 -291 339 474 0 -65
5041 -65 284 75 -154 -362 116 351 -271 -180 411 -206 -204 266 320 124 -67 335 33 -130 24 154 51 10
5063 10 -85 102 108 83 190 481 -64 239 339 72 -241 488 488 41 140 818 289 -291 97 203 268 -18 169
5086 169 325 201 16 109 415 -43 3 198 238 -218 231 315 -164 -6 354 494 67 -281 263 39 -385
5107 -385 -41 146 -108 -219 115 153 -191 -186 -27 70 -209 84 339 -174 -188 55 283 -330 -500 84 153 -239
5129 -239 -318 -2 -86 -307 -228 -282 -289 -174 82 -161 -193 -232 -159 -664 -437 -29 120 -206 -380 -53 52 -493 -282
5152 -282 327 -349 -376 123 386 -622 -308 -132 242 -56 45 253 -192 -131 -248 -167 172 -58 44 134 -401
5173 -401 -112 246 -288 -131 24 216 -269 -274 305 180 -31 -186 -51 -103 -118 -89 556 403 -309 258 265 -180
5195 -180 129 253 350 -228 -254 250 341 37 128 452 -15 -79 209 -1 75 99 397 202 -51 -228 18 101 -351
5218 -351 406 287 -260 -93 173 45 -134 223 250 209 -79 -2 265 24 110 322 304 -190 -101 86 262 -42
5240 -42 -134 110 79 -272 92 123 -451 -393 16 113 -276 -65 101 -186 -42 221 198 -134 137 74 -144 -405 140
5263 140 149 -386 -229 84 241 -276 -231 359 119 -175 -385 113 -68 -400 -110 -8 -230 -483 244 55 -218
5284 -218 -109 199 15 -263 -210 -301 -351 -252 62 -142 -72 -395 174 -5 -280 189 284 -109 -129 154 -170 -41
5306 -41 -23 158 99 -19 140 360 135 106 -58 153 -173 -58 513 448 -299 -61 291 259 81 -44 440 -37
5328 -37 184 207 224 146 -123 262 154 192 -279 238 401 111 131 126 -60 78 -13 190 -199 162 85 166 290 226
5352 226 334 131 127 424 323 -433 64 263 -1 -220 -28 322 -218 -113 199 -5 -252 6 100 189 -8
5373 -8 -186 -104 -130 46 -36 143 -92 -111 359 -53 -399 -55 141 -464 -208 143 175 -257 -197 -43 -206 -215 -162 -17
5397 -17 -105 -412 -26 -56 -267 -339 -34 211 -133 -5 82 -53 -246 66 152 -307 6 15 -420 -128 -202 108 -87
5420 -87 -134 168 20 -115 -356 352 -88 -101 -57 -27 -129 -481 98 217 213 -241 198 139 -19 -132 152 246 -86
5443 -86 -50 225 -34 -427 165 89 -33 234 457 -164 -115 141 243 114 -58 141 131 -54 110 80 88 -207 407
5466 407 272 53 79 101 17 -84 83 109 217 38 -45 207 92 -309 205 -134 209 157 146 109 -62 -18 -177
5489 -177 282 195 157 172 -103 -87 173 133 -115 5 260 -150 -350 42 170 -97 -80 147 59 -64 25 120 121 129
5513 129 122 260 27 -260 -194 372 -223 -7 -111 127 -364 -289 -298 -109 -83 -156 -25 -316 -76 -34 11 -532 -75
5536 -75 264 -122 -209 222 156 -7 -709 134 -27 -338 -223 202 -80 -208 7 -489 -105 -19 214 225 -153 -187
5558 -187 157 74 -352 -35 284 80 -37 -63 108 -14 241 422 68 29 253 -271 -138 -105 47 101 -280 -241
5580 -241 250 -161 171 12 620 32 214 261 328 -45 -86 107 369 -86 204 188 78 23 270 98 -55 38
5602 38 289 208 -29 -85 214 156 -51 306 186 55 -137 336 326 -36 -322 402 -60 -194 110 337 192 191
5624 191 -7 141 -10 -361 332 -85 18 -80 16 -143 -298 -37 149 -308 -245 -63 75 -382 51 57 -226 -592
5646 -592 -30 -145 -417 -134 112 14 -37 -432 -24 6 -520 -94 -28 -82 -196 -25 150 -172 -304 27 -305 -759
5668 -759 187 -198 -333 -283 44 193 -412 -250 -126 34 -214 -459 87 -93 -186 144 -165 57 -141 171 52
5689 52 -305 -53 -354 -116 57 -132 166 7 3 476 -22 -133 302 362 233 74 118 271 8 231 44 97
5711 97 293 43 364 289 -110 116 582 351 -132 -198 232 -271 115 385 181 135 35 347 45 354 -138
5732 -138 158 142 -151 95 20 14 -179 150 36 -238 100 117 -279 -56 77 249 -45 12 4 107 -320 436 323
5755 323 115 -43 91 293 182 -63 177 81 -424 -216 -158 -322 -211 151 -260 -50 -384 -52 56 27 -49
5776 -49 128 -206 -104 70 123 -93 -274 87 7 -424 -293 291 -4 -168 62 -460 -374 -473 47 339 -88 -352
5798 -352 34 -347 -327 -183 -213 -161 140 -68 -51 -214 -126 157 -121 -190 -78 -29 -116 -86 300 129 118 -229 -92
5821 -92 -109 122 -59 216 -52 -240 -90 338 -421 -338 162 276 -106 -37 -192 -39 -287 -95 299 27 -31 88
5843 88 212 -123 216 363 182 516 127 160 -224 -134 382 239 -20 180 181 59 77 58 426 80 -304 60
5865 60 264 57 163 174 135 -75 -203 55 140 90 -143 255 -59 -89 417 374 10 -7 212 47 -174 316 291
5888 291 -99 -11 243 -262 -40 -34 -106 54 -48 20 177 -42 6 -33 0 -153 -173 28 -135 -148 -223 -168 39 -230
5912 -230 -97 139 -162 -319 -48 -69 -304 -22 78 -237 -226 -375 -157 -31 -278 -96 -150 -292 96 77 -101
5933 -101 -241 -295 198 -160 -148 56 -247 -296 -390 37 15 -82 397 -5 20 -249 -105 258 -96 45 298 -113
5955 -113 -80 174 -145 -214 373 144 99 -18 -122 146 58 -178 115 37 207 110 187 196 241 66 83 -150 -81 205
5979 205 179 0 50 44 63 68 51 438 61 -280 -298 209 175 155 -7 146 356 -172 179 -156 15 -9 -208 321
6003 321 -43 169 313 -7 102 319 -72 224 126 97 -228 -394 -61 212 213 24 187 97 -159 39 156 -189
6025 -189 -125 -302 -267 84 -491 35 156 -120 -156 -75 -123 123 -141 -56 74 -33 -146 -97 21 -101 17 103 -209
6048 -209 -145 -336 -167 17 -194 -70 -511 -328 128 60 -318 -221 19 -348 -148 -239 88 -348 -277 102 80 -161
6070 -161 189 49 -9 -391 35 55 17 -265 -144 43 61 -155 -385 -20 -167 180 40 -171 117 123 25 9 -113
6093 -113 66 85 43 -7 252 42 38 147 -12 238 29 109 398 -239 69 367 176 75 111 77 151 144 -103 -68
6117 -68 246 306 76 61 114 -56 192 253 -44 424 0 125 -48 232 -309 -89 111 581 0 -21 193 47
6139 47 -124 -181 332 271 -86 -314 -19 -100 135 59 226 -147 -59 -277 -4 -112 -215 -21 18 12 -40 286 -328
6162 -328 25 -409 -155 201 -267 427 -80 62 -11 27 1 145 124 122 91 -490 152 93 -208 -98 43 -172 -2
6185 -2 -384 -153 -14 104 -1 30 -427 -36 -47 -96 28 -513 -25 -50 -173 34 -227 -38 -206 238 -351 -86
6207 -86 274 -35 -6 -191 -3 -308 -111 32 6 148 -272 -88 163 116 109 144 153 -282 -98 -119 -59 216 62 50
6231 50 103 -76 -212 388 -162 -157 -9 82 195 -15 220 435 60 99 173 10 463 -50 33 -140 -63 -88 -181 13
6255 13 270 104 -82 -149 -127 208 261 -76 169 46 17 357 100 358 4 -52 -10 -144 80 90 -17 -19 133
6278 133 93 48 295 -176 384 -37 -402 130 -86 113 -122 -180 -220 133 -108 45 -151 -10 -120 -226 -286 -27
6300 -27 152 -91 62 -174 169 -118 -219 -20 -76 -361 -160 219 35 43 -124 -89 138 -222 -282 93 -135 -218
6322 -218 63 45 -53 184 38 -186 -239 17 -71 -313 -285 180 -156 -286 109 273 17 -306 74 325 -169 -57
6344 -57 40 -106 -25 -152 191 255 -41 56 224 -164 -87 -110 60 -16 69 570 164 114 123 -49 15 -67 -52 255 -32
6369 -32 258 300 277 187 -42 -20 192 -135 161 -121 67 -150 364 -189 15 396 235 185 -137 358 32 32 -92
6392 -92 -43 -63 -199 -156 263 -66 -59 -126 62 -310 120 241 -127 86 15 -70 400 -319 53 81 -254 -410 -62
6415 -62 45 181 7 -15 235 -141 -63 -129 -73 -101 -354 156 -230 -326 -217 -60 -13 -417 -75 -277 -350 134 -60
6438 -60 -66 -291 -236 -251 -41 227 91 -27 -138 -237 -7 -181 -58 -13 -148 -271 -172 4 -81 -120 -132 325 -174 43
6462 43 94 160 -78 -92 -267 -106 212 -373 148 36 -25 -57 122 118 229 54 163 -87 106 -73 -110 -57 94
6485 94 13 -97 -124 226 109 -30 -105 376 67 -131 137 214 122 -8 53 246 -117 222 7 184 -170 -7
6507 -7 384 -229 366 360 121 40 -28 -47 251 235 -210 151 -112 427 158 133 -31 11 107 129 -53 89 367 -82
6531 -82 142 328 289 -83 -209 -27 129 -30 -168 218 -159 -16 -11 -172 -67 -75 156 -19 -221 -142 139 203 -351
6554 -351 -296 141 261 -301 295 198 -283 125 1 -216 -256 -316 77 101 62 -116 -113 -6 -169 -93 171 -303 -10
6577 -10 110 103 -195 222 88 -208 -135 34 90 -1 23 96 263 -183 -341 119 -82 39 -6 197 -269 147 -295
6600 -295 -150 -336 -93 226 52 -184 3 224 -252 -163 102 44 167 265 353 25 307 57 253 95 110 121
6622 121 213 98 153 314 -177 -6 -7 122 62 -207 73 7 91 215 142 4 -11 -185 289 192 -270 160 143 123
6646 123 329 49 259 -385 78 189 5 220 -16 -108 130 136 248 72 38 35 354 -156 159 -197 -60 141
6668 141 -56 -64 -224 -273 109 -123 -231 -248 35 -99 -95 52 178 88 -89 -234 241 225 -100 161 -97 -115 -89
6691 -89 -31 -177 -164 -407 -5 54 -257 138 70 20 -21 -100 -89 -285 -171 -91 -258 -330 76 -118 77 -191 -189 -482
6715 -482 -304 -7 -114 -141 -77 -121 171 17 54 4 280 -237 -37 211 -183 -216 -64 -142 -98 309 136 54 -105
6738 -105 -31 322 95 263 136 130 -413 -45 223 -31 24 -150 161 279 -195 73 387 39 62 33 63 115 -87
6761 -87 487 158 64 105 -50 230 156 152 292 203 199 336 146 -21 -127 468 85 -157 3 260 106 217 67
6784 67 76 73 116 136 166 171 -203 137 -24 136 -180 155 -24 8 92 464 163 75 234 197 -49 -62 45 260 -107
6809 -107 -97 28 48 -216 -325 -39 -197 27 -200 -63 -1 218 236 -37 -205 -36 -197 -120 116 -19 -208 -49
6831 -49 -135 -60 49 53 192 -344 231 -109 -48 -176 -87 -172 -402 -153 54 -171 -119 -10 -125 185 -12 42 -61
6854 -61 64 -43 85 139 77 -407 -7 74 116 27 -117 56 -231 -143 111 -4 190 -245 30 -97 -59 35 93
6877 93 -115 90 40 203 -40 26 107 -75 19 -22 -11 274 209 117 240 -132 138 275 243 -40 141 84 -213 189
6901 189 197 18 179 -62 -39 347 154 -69 43 -23 173 -20 69 49 184 -231 221 101 168 343 -68 73
6923 73 -3 -40 -117 113 221 50 -244 -269 -75 298 -66 -52 200 346 145 -139 -17 -90 -32 -367 106 -201 -82
6946 -82 132 -21 -59 -148 163 -106 -227 183 40 190 -304 -295 -30 -467 -62 -191 15 -145 142 -135 230 -212
6968 -212 282 -202 -86 -50 -143 -217 -86 77 20 -189 80 195 -48 -148 -355 -192 81 50 53 81 -162 20 54
6991 54 184 18 -22 42 97 96 -134 -99 288 -101 -197 -136 164 61 219 -80 235 66 307 172 -137 188 104
7014 104 -212 -131 199 128 54 88 323 -11 -95 -106 395 156 -17 -23 201 19 -21 -4 28 11 245 111 27 41 112
7039 112 108 -325 269 42 48 -199 332 -86 -93 -96 180 -112 70 20 188 -124 -392 -167 42 177 -265 161 -381
7062 -381 -312 -275 -143 -32 -57 -25 -135 -128 -261 295 4 17 157 -80 133 -270 179 114 109 -200 -178 37 43 89 186
7087 186 -255 -160 3 -39 106 -168 -242 -98 136 40 -119 -120 211 -178 -118 226 -154 -27 -93 -518 -40 -49 111
7110 111 -60 -34 -47 147 -345 86 21 219 -56 -223 175 64 311 -92 35 -397 -78 161 -140 53 276
7131 276 7 127 -73 277 -59 -112 225 154 -193 -178 136 -82 -99 234 -37 274 37 31 321 192 -105 -51
7153 -51 171 575 114 22 169 182 -87 0 65 9 -29 -142 80 15 -154 161 115 -87 36 -49 4 -202 -160 212
7177 212 145 161 43 49 89 279 167 -35 40 -256 129 93 98 309 81 -104 -98 -118 -19 57 148 206 -370 -13 -53 -293
7203 -293 137 -49 -76 -226 -237 10 14 -227 274 42 -50 -180 -18 -35 -81 -177 -81 148 65 36 116 -166 210 -213
7227 -213 155 131 -204 -9 -36 -100 -56 -103 18 -291 -47 151 -183 -11 25 38 -56 -139 10 -214 -104 171 174 -154
7251 -154 -283 -184 331 362 123 133 41 -331 128 11 100 -36 104 220 1 82 264 260 37 -107 220 147 -199
7274 -199 -56 152 -172 -110 8 17 -53 109 545 165 118 -161 37 219 -218 300 -131 -67 212 -81 350 -84
7296 -84 219 -201 -187 179 -73 117 77 -24 215 152 236 310 11 -213 53 153 202 380 -170 -27 -10 159 -10
7319 -10 96 -28 -259 -250 -278 17 -256 32 36 -430 103 -123 166 -30 127 0 -159 -178 -56 418 -86 88
7341 88 83 -5 -266 -234 -401 -195 122 -92 -94 -193 -133 125 121 176 -143 -118 115 -441 -242 81 -140 267 45 52 -111
7366 -111 95 -200 -303 116 14 74 159 -54 -70 52 -28 58 289 -45 213 32 -175 -67 -170 388 182 150
7388 150 179 25 212 136 241 127 -336 192 465 33 -138 174 58 59 77 214 93 -209 245 191 42 240
7410 240 -60 190 107 -22 -1 -19 -88 -49 1 10 -92 3 -68 -12 70 343 14 -130 -66 141 118 -70 226 -72 -76
7435 -76 134 13 147 100 -32 -202 -397 -177 -53 312 -141 -113 41 47 10 -182 340 -112 144 64 68 -31 -9 -25
7459 -25 138 -124 -89 -123 82 245 47 -112 -309 -59 -161 -11 6 -72 6 -341 23 -4 6 195 98 -66 -218
7482 -218 85 74 -6 51 209 -285 108 -136 -287 -187 54 -354 -27 69 287 197 -193 -77 125 205 182 49
7504 49 292 185 218 53 96 352 58 99 82 -79 86 30 97 279 -164 150 188 -73 219 -58 154 99 260
7527 260 -125 -182 77 66 -75 -15 -421 -490 7 55 -47 3 106 168 -112 -158 237 154 77 -13 113 170 -19 13
7551 13 -35 7 74 64 220 266 99 -248 -90 62 -53 42 352 -42 -81 7 251 201 38 214 18 -175 69
7574 69 -108 -180 -40 5 -185 -181 -246 -165 96 9 -98 -326 92 -74 -283 231 -207 -464 -225 -5 125 -232 28
7597 28 -304 -107 -244 -240 125 -42 -243 -38 -2 -172 -311 -287 39 204 -215 -108 2 198 237 -174 150 173
7619 173 97 -211 -59 -92 324 -159 -292 -144 -2 253 251 -12 88 147 166 -155 164 22 8 111 189 171 -88
7642 -88 51 -7 -3 56 13 -83 -170 155 157 -162 101 -47 -22 144 -271 -47 81 -243 -208 -77 35 126 35 210 63
7667 63 230 183 248 31 112 -54 -153 -34 -263 -228 -127 -126 -36 -242 63 -137 251 -119 -69 -34 161 -54 204 45
7691 45 66 128 159 -280 242 297 49 -84 -90 -129 2 -78 74 394 -148 52 138 -61 -125 -265 -83 40 51 170
7715 170 33 -436 167 -34 -38 103 95 69 -310 -117 -164 26 257 -61 -52 -45 0 -35 -211 -133 -203 63 -8 180 -18
7740 -18 -209 -102 -167 -165 -34 -188 -24 23 -236 -281 -97 230 -32 114 -249 102 -72 -340 135 -169 80 -324
7762 -324 -136 -86 -174 -175 69 242 -170 284 179 195 -398 200 -185 -274 23 116 -360 -61 157 -38 -157 210
7784 210 114 47 -104 108 -7 103 499 267 62 116 248 16 56 -5 184 89 88 96 250 130 1 12 41 -7
7808 -7 -217 -73 55 46 -9 70 -110 -102 -66 147 66 122 88 -7 -38 -194 55 218 86 9 204 272 -55 95 106 92
7834 92 -20 30 -2 28 -8 -137 -267 -65 -160 -293 166 -10 -20 -20 -259 -152 229 -9 -228 -136 -106 -100 -19 303 -23
7859 -23 30 44 194 -217 -18 -191 -104 -52 -83 34 158 62 -191 -210 -13 -231 207 350 67 176 -165 120 -52
7882 -52 -125 9 -77 -62 -309 -223 -110 -297 -56 51 122 -278 59 200 3 36 -242 -69 56 79 -129 -173 161
7905 161 64 374 -136 27 -156 318 5 125 117 -70 48 18 40 191 202 -170 91 128 136 -10 327 396 161
7928 161 -162 43 -1 253 -29 -267 -9 100 221 68 -10 160 73 -100 223 -36 159 -181 116 -6 89
7949 89 242 82 -176 429 129 -63 118 -5 20 405 332 283 -93 23 -277 -189 -209 297 6 -112 127 46
7971 46 -18 278 -55 -133 -256 -2 25 -201 -122 -12 -68 -177 90 -249 265 -156 360 147 -137 204 259 -93
7993 -93 -131 208 -115 23 57 -101 -219 -275 -309 -122 -93 -10 154 167 -117 -97 61 -128 116 304 10 -134 151
8016 151 -156 19 -8 21 -30 108 137 -70 -293 -357 -354 82 34 282 -88 -15 -243 -210 77 -91 196 -93 7
8039 7 25 85 128 90 233 12 -186 272 12 -228 -62 -403 123 -12 27 -18 186 91 -107 205 -72 248 176
8062 176 -71 -117 -65 -32 -96 88 -35 148 11 209 153 142 -138 -273 -271 -9 232 26 -83 131 36 -5 289
8085 289 -188 -70 38 133 41 24 -55 171 -332 -87 134 -29 -48 22 -93 266 14 -317 -91 179 -154 -233
8107 -233 -315 -310 -170 -93 -131 -38 -102 -172 -111 24 -235 141 -123 48 -80 -24 -173 160 149 72 -289 257 87 179
8131 179 119 -54 40 63 68 -268 -9 212 -19 -88 -458 87 22 -206 56 -163 37 -114 -49 -102 130 261 -38
8154 -38 -224 -24 -66 -233 256 -181 216 -201 -104 -453 96 5 44 79 -77 -53 41 166 127 172 -176 -58 -123 129
8178 129 94 31 -146 16 215 53 123 153 -158 96 84 65 227
8191B27
##END NTUPLES=NMR FID
##END=
