##TITLE=1H_SAM_21.109
 CDCl3, 108 sc, 
 11.3.2019
##JCAMPDX= 6.0         $$ Bruker NMR JCAMP-DX V2.0
##DATA TYPE= NMR FID
##DATA CLASS= NTUPLES
##ORIGIN= UXNMR, Bruker Analytische Messtechnik GmbH
##OWNER= root
$$ XWIN-NMR		Version 3.5
$$ Mon Mar 11 17:28:08 2019 Russian Standard Time (UT+4h)  she@DPX200
##.OBSERVE FREQUENCY= 200.115
##.OBSERVE NUCLEUS= ^1H
##.DELAY= (6, 6)
##.ACQUISITION MODE= SIMULTANEOUS
##.ACQUISITION SCHEME= undefined
##.AVERAGES= 108
##.DIGITISER RES= 16
##SPECTROMETER/DATA SYSTEM= spect
##.PULSE SEQUENCE= zg30
##.SOLVENT NAME= CDCl3
##.SHIFT REFERENCE= (INTERNAL, CDCl3, 0, 15.7039)
##AUDIT TRAIL= $$ (NUMBER, WHEN, WHO, WHERE, WHAT)
$$ ##TITLE= Audit trail, XWIN-NMR		Version 3.5
$$ ##JCAMPDX= 5.01
$$ ##ORIGIN= Bruker BioSpin GmbH
$$ ##OWNER= she
$$ F:/spectra/data/she/nmr/H-F/1/audita.txt
$$ ##AUDIT TRAIL=  $$ (NUMBER, WHEN, WHO, WHERE, WHAT)
(   1,<2019-03-11 17:26:19.17 +0400>,<she>,<DPX200>,
      <continue with go, POWCHK disabled, PULCHK disabled
       configuration hash MD5:
       00 E9 B6 7A A2 85 ED C7 34 08 36 98 17 FE 4E 26
       data hash MD5: 16K
       8A 84 C4 B4 AB B7 8A 20 DD FC 2A C5 32 DA C8 B2>)
$$ ##END=
$$ 
$$ hash MD5
$$ 17 DC C3 59 6F BD 7B 94 81 3D EA 2F 81 95 CA 87
##$RELAX= 
##$RELAX= 
##$RELAX= 
##$RELAX= 
##$RELAX= 
##$RELAX= 
$$ Bruker specific parameters
$$ --------------------------
##$DU= <F:/spectra>
##$EXPNO= 1
##$NAME= <H-F>
##$PROCNO= 1
##$TYPE= <nmr>
##$USER= <she>
##$AMP= (0..31)
100 100 100 100 100 100 100 100 100 100 100 100 100 100 100 100 100 100 
100 100 100 100 100 100 100 100 100 100 100 100 100 100 
##$AQSEQ= 0
##$AQ_mod= 1
##$AUNM= <au_zg>
##$AUTOPOS= <>
##$BF1= 200.13
##$BF2= 200.13
##$BF3= 200.13
##$BF4= 200.13
##$BF5= 200.13
##$BF6= 200.13
##$BF7= 200.13
##$BF8= 200.13
##$BYTORDA= 1
##$CFDGTYP= 0
##$CFRGTYP= 5
##$CHEMSTR= <none>
##$CNST= (0..31)
1 1 145 1 1 1 1 1 1 1 1 1 1 1 1 1 1 1 1 1 1 1 1 1 1 1 1 1 1 1 1 1 
##$CPDPRG= <>
##$CPDPRG1= <>
##$CPDPRG2= <>
##$CPDPRG3= <>
##$CPDPRG4= <mlev>
##$CPDPRG5= <mlev>
##$CPDPRG6= <mlev>
##$CPDPRG7= <mlev>
##$CPDPRG8= <mlev>
##$CPDPRGB= <>
##$CPDPRGT= <>
##$D= (0..31)
0 1.2 0 0 0 0 0 0 0 0 0 0.03 0 0 0 0 0 0 0 0 0 0 0 0 0 0 0 0 0 0 0 0 
##$DATE= 1552310552
##$DBL= (0..7)
120 120 120 120 120 120 120 120 
##$DBP= (0..7)
150 150 150 150 150 150 150 150 
##$DBP07= 0
##$DBPNAM0= <>
##$DBPNAM1= <>
##$DBPNAM2= <>
##$DBPNAM3= <>
##$DBPNAM4= <>
##$DBPNAM5= <>
##$DBPNAM6= <>
##$DBPNAM7= <>
##$DBPOAL= (0..7)
0.5 0.5 0.5 0.5 0.5 0.5 0.5 0.5 
##$DBPOFFS= (0..7)
0 0 0 0 0 0 0 0 
##$DE= 6
##$DECBNUC= <off>
##$DECIM= 2
##$DECNUC= <off>
##$DECSTAT= 4
##$DIGMOD= 1
##$DIGTYP= 9
##$DL= (0..7)
0 120 120 120 120 120 120 120 
##$DP= (0..7)
150 150 150 150 150 150 150 150 
##$DP07= 0
##$DPNAME0= <>
##$DPNAME1= <>
##$DPNAME2= <>
##$DPNAME3= <>
##$DPNAME4= <>
##$DPNAME5= <>
##$DPNAME6= <>
##$DPNAME7= <>
##$DPOAL= (0..7)
0.5 0.5 0.5 0.5 0.5 0.5 0.5 0.5 
##$DPOFFS= (0..7)
0 0 0 0 0 0 0 0 
##$DQDMODE= 0
##$DR= 16
##$DS= 0
##$DSLIST= <SSSSSSSSSSSSSSS>
$$ [...]
##$SUBNAM2= <"">
##$SUBNAM3= <"">
##$SUBNAM4= <"">
##$SUBNAM5= <"">
##$SUBNAM6= <"">
##$SUBNAM7= <"">
##$SUBNAM8= <"">
##$SUBNAM9= <"">
##$SW= 260.267013134115
##$SWIBOX= (0..15)
0 0 2 0 0 0 0 0 0 0 0 0 0 0 0 0 
##$SW_h= 52083.3333333333
##$TD= 16384
##$TD0= 1
##$TE= 0
##$TE2= 300
##$TE3= 300
##$TEG= 300
##$TL= (0..7)
0 120 120 120 120 120 120 120 
##$TP= (0..7)
150 150 150 150 150 150 150 150 
##$TP07= 0
##$TPNAME0= <>
##$TPNAME1= <>
##$TPNAME2= <>
##$TPNAME3= <>
##$TPNAME4= <>
##$TPNAME5= <>
##$TPNAME6= <>
##$TPNAME7= <>
##$TPOAL= (0..7)
0.5 0.5 0.5 0.5 0.5 0.5 0.5 0.5 
##$TPOFFS= (0..7)
0 0 0 0 0 0 0 0 
##$TUNHIN= 0
##$TUNHOUT= 0
##$TUNXOUT= 0
##$USERA1= <user>
##$USERA2= <user>
##$USERA3= <user>
##$USERA4= <user>
##$USERA5= <user>
##$V9= 5
##$VALIST= <valist>
##$VCLIST= <CCCCCCCCCCCCCCC>
##$VD= 0
##$VDLIST= <DDDDDDDDDDDDDDD>
##$VPLIST= <PPPPPPPPPPPPPPP>
##$VTLIST= <TTTTTTTTTTTTTTT>
##$WBST= 1024
##$WBSW= 4
##$XGAIN= (0..3)
0 0 0 0 
##$XL= 0
##$YL= 0
##$YMAX_a= 462671
##$YMIN_a= -257844
##$ZGOPTNS= <>
##$ZL1= 120
##$ZL2= 120
##$ZL3= 120
##$ZL4= 120
##$ABSF1= 10
##$ABSF2= 0
##$ABSG= 5
##$ABSL= 3
##$ALPHA= 0
##$AQORDER= 0
##$ASSFAC= 0
##$ASSFACI= 0
##$ASSFACX= 0
##$ASSWID= 0
##$AUNMP= <proc_1d>
##$AZFE= 0.1
##$AZFW= 0.1
##$BCFW= 1
##$BC_mod= 2
##$BYTORDP= 1
##$COROFFS= 0
##$CY= 11.3945322036743
##$DATMOD= 1
##$DC= 2
##$DFILT= <>
##$DTYPP= 0
##$F1P= 18.9103706918063
##$F2P= -1.10871071338519
##$FCOR= 0.5
##$FTSIZE= 0
##$FT_mod= 4
##$GAMMA= 1
##$GB= 0.15
##$INTBC= 1
##$INTSCL= 1
##$ISEN= 128
##$LB= 0.24
##$LEV0= 0
##$LPBIN= 0
##$MAXI= 10000
##$MC2= 0
##$MEAN= 0
##$ME_mod= 0
##$MI= 1.114404
##$NCOEF= 0
##$NC_proc= 0
##$NLEV= 6
##$NOISF1= 3.799351
##$NOISF2= 2.8
##$NSP= 1
##$NTH_PI= 0
##$NZP= 0
##$OFFSET= 15.70392
##$PC= 1
##$PHC0= -8854.046
##$PHC1= 130.4001
##$PH_mod= 1
##$PKNL= yes
##$PPARMOD= 0
##$PSCAL= 0
##$PSIGN= 0
##$REVERSE= no
##$SF= 200.130013532006
##$SI= 16384
##$SIGF1= 3
##$SIGF2= 2
##$SINO= 400
##$SIOLD= 16384
##$SREGLST= <1H.CDCl3>
##$SSB= 0
##$STSI= 0
##$STSR= 0
##$SW_p= 3612.71676300578
##$SYMM= 0
##$S_DEV= 0
##$TDeff= 0
##$TDoff= 0
##$TI= <>
##$TILT= no
##$TM1= 0
##$TM2= 0
##$TOPLEV= 0
##$USERP1= <user>
##$USERP2= <user>
##$USERP3= <user>
##$USERP4= <user>
##$USERP5= <user>
##$WDW= 1
##$XDIM= 8192
##$YMAX_p= 0
##$YMIN_p= 0
$$ End of Bruker specific parameters
$$ ---------------------------------
##NTUPLES= NMR FID
##VAR_NAME=  TIME,          FID/REAL,        FID/IMAG
##SYMBOL=    X,             R,               I
##VAR_TYPE=  INDEPENDENT,   DEPENDENT,       DEPENDENT
##VAR_FORM=  AFFN,          ASDF,            ASDF
##VAR_DIM=   8192,          8192,            8192
##UNITS=     SECONDS,       ARBITRARY UNITS, ARBITRARY UNITS
##FACTOR=    1.92e-05,      1,               1
##FIRST=     0,             0,               0
##LAST=      0.1572672,     0,               0
##MIN=       0,             -257844,         0
##MAX=       0.1572672,     462671,          0
$$ Real data points
##PAGE= N=1
##DATA TABLE= (X++(R..R)), XYDATA
0@%MpOqNlJ6k4K1j9L8o5N5n0P5r2J08j22J41j73J89k10K47k71L11l75M07m37N03
30B70n76O30o89P84q75R53j066J186j276J376j459J397r59r07J4078J95111m65822
47b57844N643K50248O2453L9155l9223j21672K5404J23371j04752j47046J33765
58c0498J99750p6569j69733J1527R4783k7843o8326M2929J00348K4974p5037j33285
70a06980m6273J70496J69831j33107k02991R0259J78684n5632j53236k6260J04728
81a0481J51205K339k24293j17529J92213J56562j07059j24258L4804Q8971L5196
92G7670o8205j15392J7656J50089M9752r4012n6739K3561j7726m7018O1790J49798
104A31224J1022j81633j33705O5689J61300J05469o5943k03248l9003K11353P3642
$$ plain form
0 0 0 4 -3 3 -5 0 -3 13 -11 10 -9 29 -36 19 -31 44 -48 60 -62 79 -94 95 -115 132 -139 172 -203 204 -233 270
30 270 -306 324 -365 419 -456 497 -569 617 -659 717 -742 655 -304 -1211 12867 207978 -257844
47 -257844 -252201 -1953 60500 99655 60432 -61240 -35836 87535 -17217 -164263 -30498
58 -30498 169252 92683 -77050 -65523 29260 1417 -66909 -23980 76368 101342 26305 -106980
70 -106980 -153253 17243 187074 53967 -149024 -58765 119919 64287 -88949 -115209 -10481
81 -10481 140724 143063 -81230 -198759 -6546 150016 42957 -81301 -46497 42474 77670
92 77670 9465 -105927 -88271 61818 111570 17558 -39181 -15620 -33346 -80364 -18574 131224
104 131224 142246 -39387 -173092 -107403 53897 159366 93423 -109825 -148828 62525 136167
115A36167j96127o6974J66749P3776q1811p5039m9486L0551J44552L4598j49920
126c2964n5407J08623K0966q8870Q727J00880J361r8625l3323O6588M6816j8541
138B6231l7815l2744K5847Q5537j4840j42869M507J80756J6793j78087n0872J19775
150B219R2322j3583j08319j10959P4697J85670k098j65523n8510Q0120O6150m401
162C7785l6664j3052J9752q940l6879K2826O5830o338p7837l5644O8471Q1915
174H1225l8472j17475p914J16832O4601o8358j10039j1264J29658Q5646j18970
185E470j29014Q1685J27606k3873q1394l2423J2060O4850L7866p4650m6302Q5319
197B7200L6409j00782m3319Q8866O2763m0908n6473j678K4820m34j0394J1350
$$ plain form
115 136167 -59960 -126934 39815 113591 31780 -43259 -92745 -62194 82358 116956 -32964
126 -32964 -88371 20252 41218 -47652 -38925 61955 63316 -35309 -68632 -2044 44772 26231
138 26231 -11584 -44328 -18481 67056 52216 -90653 -86146 94610 111403 -66684 -117556 2219
150 2219 94541 80958 -27361 -138320 -63623 122047 119949 -45574 -104084 -23964 42186 37785
162 37785 1121 -11931 7821 -1119 -37998 -15172 50658 44320 -33517 -69161 -690 81225
174 81225 42753 -74722 -82636 34196 98797 30439 -79600 -90864 38794 124440 5470
185 5470 -123544 -41859 85747 61874 -19520 -51943 -39883 24967 62833 -11817 -58119 27200
197 27200 63609 -37173 -80492 8374 71137 30229 -26244 -27922 -3102 -3536 -13930 -2580
209b580L4263K7245l8763j15760k3325J70439J18912j37775j53853M7954J06360
220C3117K4254l2347o1618j6252R2535M4551j12766p3764R0681Q3650l2537n5359
232a5855m121J5805l443j5306J5359M8517Q367n7045n4312J8960P8506L0310p6281
245a0539n8756P1537P2846n4526r1160N397Q6565O7216m4466j09133n086R7182
257B7077K2733o6258j9735M3990M1277j0800p8451n2589Q0477R8797l5879p4533
269b3894q73J2457j5308R988M1542L0762j7465o6381m6571M2071Q5515J6455p3236
282d938n6876N3023P3638n2904r4849M0438J07845J1902o9493o5972j8287P3181
294c292Q3745m1009q5752K5328N2328l5579l7706L8306M2489j0295l8109k2408
$$ plain form
209 -2580 31683 58928 20165 -95595 -118920 51519 170431 32656 -121197 -73243 33117
220 33117 57371 25024 -36594 -52846 39689 84240 -28526 -102290 -11609 72041 39504 -15855
232 -15855 -19976 -4171 -7614 -22920 -7561 40956 49323 -7722 -62034 -43074 35432 65742 -10539
245 -10539 -69295 2242 75088 20562 -70598 -65201 21364 88580 44114 -65019 -70105 27077
257 27077 49810 -16448 -36183 7807 49084 38284 -40167 -92756 -12279 86518 50639 -23894
269 -23894 -24767 -12310 -27618 -17630 23912 54674 37209 -29172 -75743 -33672 51843 68298 -4938
282 -4938 -61814 -8791 64847 11943 -82906 -42468 65377 77279 7786 -58186 -76473 -3292
294 -3292 80453 39444 -46308 -20980 31348 -4231 -41937 -3631 38858 28563 -9546 -31954
306c1954K0145L0252p543l0047L524M1288J8854n3749o0661M4551Q7530j9079
318D3111p8431j343N4661J6905l3526m7983M603Q3999M2610q4472q3208L5970
330d7104P9445K1669l7505m6191R557L7550j5042l5185K9790M3439j9812m0488
342a9877m776K1265K1522r357l1790J3222N2165q033p4884k9843O8911P8086k5790
355E0821r4991k2856P0750M2379k7531l8073o852K9863L6068l4015n9884L8059
367a6262P2842l1649o6979J8651M3746j969j9351j4879N05K9603J0697l8121j6717
380b9883M0712K3635l9374l9457L4522O1256j7916p4978j0003O4312L6768k7393
392B2201n0424j9066N0857N5018m2396p2904K5783P0573k943m8616k0387J9433
$$ plain form
306 -31954 -11809 18443 10900 -19147 -15623 25665 44519 -9230 -69891 -25340 62190 43111
318 43111 -35320 -36663 17998 34903 1377 -46606 -42003 41996 84606 134 -83074 -47104
330 -47104 32341 54010 16505 -29686 -20129 17421 2379 -32806 -3016 40423 20611 -19877
342 -19877 -24653 -3388 18134 8777 -23013 -9791 42374 34341 -40543 -70386 -1475 76611 50821
355 50821 -44170 -67026 3724 46103 18572 -19501 -26353 3510 39578 5563 -54321 -16262
367 -16262 56580 24931 -42048 -23397 20349 18380 -971 -15850 -15345 14258 24955 -13166 -29883
380 -29883 10829 34464 -4910 -44367 -9845 51411 33495 -41483 -51486 12826 49594 22201
392 22201 -28223 -47289 3568 58586 16190 -56714 -30931 39642 36699 -11917 -32304 -12871
404a2871L4156N53l7561l265L5811N08l7050j161L2676J6104k1296m0067K151
417c1312N9944K2634o1692m7628M2663O0063p789n5023k4109M0735L5583k5723
429H346l6983J0612L9403J8040l9906n6407K5904P9715j710p2114n988M0946k632
442G226j4460M149J654J4475J2818l9535l4870M7184M8638l4413m8307K4114M4013
455C2686j3526n0756r116N1569M0289k3815n5888k5762M2080O3052j5780o9803
467c4770J952O0947l081m8991j743L1461J7191o071k7789j8162L3005K3024l5025
480h052k2639L7211L2712k4570m6766r795M7267L9830l0584m3924J6391L5463
492B2544r080l6960o636L9524M0672k6790o4272p198N6799L2220k3753l8365Q63
$$ plain form
404 -12871 21285 21838 -15723 -18988 16823 17331 -19719 -20880 11796 27900 6604 -33463 -31312
417 -31312 28632 51266 -10426 -58054 -15391 44672 36883 -18140 -42249 -1514 34069 8346
429 8346 -28637 -18025 21378 39418 -488 -56895 -30991 48724 47014 -25100 -31088 9858 7226
442 7226 -7234 -3085 -1431 13044 25862 -13673 -48543 -1359 47279 12866 -35441 -11327 32686
455 32686 19160 -31596 -40712 10857 51146 27331 -28557 -54319 -12239 50813 35033 -34770
467 -34770 -32818 28129 25048 -23943 -25686 5775 22966 16895 -10894 -29056 3949 26973 -8052
480 -8052 -30691 6520 39232 14662 -32104 -41899 5368 45198 14614 -29310 -12919 22544
492 22544 13464 -23496 -30132 9392 50064 23274 -40998 -48196 8603 40823 17070 -21295 -20432
505b0432L9547K532n1083n781N4956K2946l6236k7948j777J5797K6703o894l0883
518a8553K0050L6827l8312n4979K8876O7201N609n1129l4786J8764L8943N959
530B4470k8501k1423K2418L7587j4289n8942k097O8438J4731n4664j4886L2898
542E740Q000j4380q733q847K1938L7194k7313n7403J7436N7087o447m0047k020
555a7795K8587J2623k6325l0591J5431M5905Q664m0152l1958J8334M1962j621
567B3064m3622p135M7930J5535m2307l1343J7312M1387J6777l4450l7672K4849
579i675L2304k0531k1606J8348K0144l007k2775k6003J7563N1862o624n6854n954
592c2808M8891J2205l3310j8289J4486K8444K876l1328j9067K1387L3553n504
$$ plain form
505 -20432 19115 21647 -29436 -35217 19739 42685 6449 -21499 -23276 -7479 19224 12330 -18553
518 -18553 1497 38324 12 -54967 -26091 41110 46719 -4410 -39196 -20432 18511 24470
530 24470 -4031 -25454 -3036 34551 20262 -38680 -40777 27661 42392 -12272 -27158 5740
542 5740 13740 -640 -9373 -18220 3718 40912 13599 -43804 -26368 30719 24272 -15775 -17795
555 -17795 10792 23415 -2910 -33501 -18070 27835 36499 -3653 -35611 -17277 24685 23064
567 23064 -20558 -27693 20237 35772 -6535 -37878 -20566 20821 37598 3148 -34524 -9675
579 -9675 22629 2098 -19508 -1160 18984 15977 -6798 -32801 -15238 36624 30000 -26854 -32808
592 -32808 16083 28288 -5022 -23311 -8825 19619 22495 -8833 -27900 -6513 27040 21536
604B1536m3509p642M7801J7100m7945k5234M3342K1664k1905j5128m870P180L1063
617B3453k135n1008q49N9746M029n4543p320L8595J1054k0138j6313L548K1445
630I564J2945k2154l0060J5570M3334K53n0985j5116M6903K4343l5399k3496J6710
643g588J7383N737j3941k5698J4215L8305j2223m6538J0418M4204k52l1326j7300
656b4604J1179L0944R492l5676k1062L3408K4578k7905k6085J6213K8215K378
668B1075k8173k0437J8114L0808l947l1026p431L0975J8217l6123l0040L5658
680b330L8238j8996l3565m464J4576K0781P782l3642j4480M2920J5454n1581j8109
693c7416M7678K2220k6031k2642J139J4835J7590r389k6764L188L7943N131m3456
$$ plain form
604 21536 -21973 -29615 18186 35286 -12659 -37893 5449 27113 5208 -9920 -14790 -7610 23453
617 23453 21318 -29690 -30539 29207 33236 -21307 -28627 9968 21022 884 -15429 -11881 9564
630 9564 22509 355 -29705 -14135 29199 29452 -21533 -36649 10254 34597 -802 -24298 -7588
643 -7588 9795 15532 1591 -24107 -9892 28413 16190 -30348 -19930 24274 24022 -7304 -24604
656 -24604 -13425 17519 27011 -8665 -29727 3681 28259 354 -25731 -9518 18697 21075
668 21075 -7098 -27535 -9421 21387 17440 -13586 -21017 9958 28175 -7948 -37988 -2330
680 -2330 35908 16912 -16653 -21117 -6541 14240 22022 -11620 -26100 16820 32274 -19307 -37416
693 -37416 10262 32482 6451 -16191 -15052 -217 17373 7984 -18780 -15592 22351 27482 -15974
706a5974k1071M0723L0450k9641k6539J8612J7503q032j2568q290O316L5019M423
719C0931n6164j5193N3712K0794l7749j7563K0065J5821l732j9550j8564K1503
731e689L8289j3093m0607q28K8975R677k0970j2619K1482J9409j7046l2455J3
744b5462L4316K3288k0274l8032O761L7645j660l3497M46K7618J1265j4943k7845
757b0374j0281L8870L0706l5226l7530K9123K9358k0268k2669O784J8196J3858
769B0547p417l2108o242L5263J6093l1186j7417K7150K1762k7152k8190J9099
781i798L1728l103k3384j2222L675K5679J2125l6743k2914M4629L1904m2477l6744
794c7645K5578K9177q93j2057j7628l95K5903M590l2567l491L5158J1586l1948
$$ plain form
706 -15974 -37045 3678 34128 4487 -22052 -3440 14063 6031 -6537 -14827 -8511 26508 30931
719 30931 -25233 -40426 13286 34080 -3669 -21232 -1167 14654 10922 -8628 -27192 -5689
731 -5689 32600 19507 -21100 -21928 7047 16724 -4246 -16865 4617 24026 6980 -25475 -25462
744 -25462 8854 32142 11868 -26164 -19403 18242 16582 -16915 -16469 11149 22414 7471 -20374
757 -20374 -30655 8215 38921 3695 -33835 -4712 24646 4378 -18291 -11507 6689 20547
769 20547 13130 -18978 -25220 10043 26136 -5050 -22467 4683 26445 -707 -28897 -9798
781 -9798 21930 18827 -4557 -16779 -13104 12575 24700 -12043 -34957 9672 41576 -901 -37645
794 -37645 -12067 17110 16217 4160 -13468 -13863 12040 16630 -15937 -19428 15730 27316 -4632
807d632k4668K0053L0723n772k7327k754J9535J0459j4018k0982N303L2322J0258
820B8500l8895k3941L3430K7032j6369k6030j220K2218K0546j9061l5769J3542
832a6017M1145m814l2447p537J7997J6400k815k3077p261K7256J2773k6628j7833
845b2858K3172K2363j5383k8055O512K9424N265k5448j7400J2964K4224Q657k7898
858d461k9693K8732M1033k3928l9992J4068L2441l705j9672q517K577K1508J1712
871B2103k9163j9483K9222K4097k3534k6230J4020K6597m199k4350m100K0528
883E508J0065j1536j8099m38K3621J7506k6247l2436K3465L8590j5541l5488L667
896a7363K5883J0974j2673k5731l217L4587J5979l0136k3049J7565K0970m171
$$ plain form
807 -4632 -29300 -9247 21476 15704 -11623 -14377 5158 15617 1599 -19383 -14080 18242 28500
820 28500 -10395 -34336 -906 26126 9757 -16273 -17493 4725 25271 6210 -29559 -16017
832 -16017 25128 20314 -12133 -19670 -1673 14727 11912 -11165 -18426 8830 21603 -5025 -22858
845 -22858 314 22677 7294 -20761 -14249 15175 20440 -5008 -22408 -9444 14780 23437 -4461
858 -4461 -34154 -5422 35611 11683 -28309 -14241 18200 14495 -5177 -13694 -11117 10391 22103
871 22103 -7060 -26543 2679 26776 3242 -22988 -8968 17629 13430 -10920 -15020 5508
883 5508 15573 4037 -14062 -14500 9121 26627 380 -32056 -8591 29999 14458 -21030 -17363
896 -17363 8520 19494 6821 -18910 -22127 12460 28439 -1697 -24746 -7181 13789 9618
908I618j7696l462K0170R654k3314j7778J9145K2923p730k2963n331K0614J6413
921B0263j9095k2968J3183K8145qk6345k0215J8186L5545p330m0044j63L4348
934A3502L159k2678q128P136J6526J2413k1412k8185K0387L1143j5922k6105J1804
947f360K2437o458k1061m257J6529J6295q189k0449m018J9626J6453j9564k6850
960b5866J6934L8939j0530m2862k490L1208J4310o544k0104j3377K0668K0826
972B1112k0305k4500J9782K4851r619k3871m502J9889J3557j1761j9314R295J9200
985A3814n792k2697n94K0728J6708j4026k9378J972L1569Q692k5272j6367J6779
998c864K4067n370l3199n816L2044J8597k3002j9590L784J6377J1200j1022k2451
$$ plain form
908 9618 -8078 -11540 8630 18284 -5030 -22808 -3663 19260 11530 -11433 -16764 3850 20263
921 20263 1168 -21800 -8617 19528 19520 -6825 -27040 -8854 26691 19361 -20683 -20846 13502
934 13502 16661 -6017 -14145 -7009 9517 21930 518 -27667 -7280 23863 7941 -18164 -6360
947 -6360 16077 9619 -11442 -15699 830 17125 8936 -11513 -15531 4095 20548 984 -25866
960 -25866 -8932 30007 19477 -23385 -25875 5333 19643 13099 -7005 -20382 286 21112
972 21112 807 -23693 -3911 20940 11321 -12550 -17052 2837 16394 4633 -14681 -5386 13814
985 13814 8022 -14675 -15269 5459 22167 8141 -21237 -19265 12304 20996 -4276 -20643 -3864
998 -3864 20203 14833 -18366 -24182 7862 26459 3457 -16133 -12349 4028 15228 4206 -18245
1011a8245J0924L0555j2624l2483Q668K6692k363j5670l422P981R669k852j8661
1024a1831n061K4373J8552k2079l0493J0177L5819L109l5396q168K5025J1958
1036A5985r841j5424p917J6438K6517j5250l4496Q460L3591n620k3835K330J5257
1049F195L751r015j3689K147K2699N457k3816j2847K0000J6797j1809k2761J806
1062a5085K8728Q384k7258j8902J7734K5745k141k7126j3247K2459K4678j6160
1074G809k5939M795K2081O001j1601j9359L768K6790L51k9910J596K7112L84k0625
1088f747m623R740J2475J048j8519j3175K1122K4178k0542k8291R014L2138M311
1101B2129l0127j4401K0418K1076q928j9341p568J3783K1445n604l1216o44L5759
$$ plain form
1011 -18245 -7321 23234 10610 -21873 -13205 13487 11124 -4546 -7968 13 9682 6830 -11831
1024 -11831 -16892 7481 26033 3954 -26539 -16362 19457 22566 -12830 -20998 4027 15985
1036 15985 6144 -9280 -17197 -759 25758 10508 -23988 -15528 18063 12443 -11392 -9062 6195
1049 6195 9946 931 -12758 -10611 12088 17545 -6271 -19118 882 17679 5870 -16891 -15085
1062 -15085 13643 22027 -5231 -24133 -6399 19346 17205 -9921 -23168 -709 23969 7809
1074 7809 -18130 -13335 8746 14747 3146 -16213 -12445 14345 14696 -15214 -13618 13494 13878 -6747
1088 -6747 -11370 -1630 10845 11893 -6626 -19801 1321 25499 4957 -23334 -14320 17818 22129
1101 22129 -7998 -22399 -1981 19095 10167 -9174 -16742 -2959 18486 12882 -18334 -18978 16781
1114A6781J063l0507j576K0378M072r385q793k714J4318J2940j7181j7364J4361
1127c607K2326j0911k4602J805K5830J1104k3644k0353J2190K4728L599k1325
1139b860j6562J1269K7281m693l0709j256K7041P625j6187j4699L008J8503P595
1152A5356k0380j1084K0740J1812j9276j1873J2102J4414M46j5135j5058J2203
1164e733K5358q999k8237K784K8142O740k4171j6829J3329K3281j071k0266j0348
1177a6020J1049J9250j562k4570o667K9047J2306k9204j3374K1331J1351j0847
1189B090n475j800L243J2586o527k1994Q553K9724m654l0432m712K4827J2426
1202A7855j5138j6052M444J8397N264j6549j5785O850K6305M835k9299j3233K5124
$$ plain form
1114 16781 17844 -12663 -14239 6139 10211 826 -7967 -10681 3637 16577 -604 -17968 -3607
1127 -3607 18719 7808 -16794 -14989 10841 21945 -1699 -22052 -9862 14866 18465 -2860
1139 -2860 -19422 -8153 19128 14435 -16274 -17530 9511 17136 949 -13750 -10742 7761 15356
1152 15356 -5024 -16108 4632 16444 -2832 -14705 -2603 11811 12257 -2878 -17936 -5733
1164 -5733 19625 10626 -17611 -14827 13315 20055 -4116 -20945 -7616 15665 14594 -5672 -16020
1177 -16020 -4971 14279 12717 -11853 -18520 10527 22833 -6371 -19745 1586 12937 2090
1189 2090 -3385 -5185 -1942 10644 4117 -17877 -9324 20400 15746 -14686 -19398 5429 17855
1202 17855 2717 -13335 -8891 9506 14770 -1779 -17564 -10714 15591 20426 -8873 -22106 3018
1215C018J4302j6418j2629R297R463J095q669j2988Q030K2116p603k2191M095
1228i082J8418P15j4138q269R477J7566k783k4071p254K3512J5085j5984j8558
1241a5366N219K0845L834k0038j0581J2817J6847n98j9983j1138J7948J9138j5053
1254C891k0811J4028J6943j1548j1578L395N879O731K806j8327p083K6181O944
1267A7451k7298q831K5081J1473j4890j6508L171J3960R951p915j7791j053K1832
1280H633R211k1372j7354K1732J8971j6245j7896Q799J2212p76l666q968j954
1293h673J6597N271k2167o988K4644Q019k0481r610J1437J1913j840j3482p696
1306a3056J3936J3963q318j9790J25K1534R433j9664j5951J3774J6724l954j4040
$$ plain form
1215 3018 17320 902 -11727 -2430 7033 8128 -541 -13529 -5499 16617 9014 -13177 -9082
1228 -9082 9336 10051 -4087 -12356 -2879 14687 11904 -12167 -19421 4091 19176 3192 -15366
1241 -15366 -10147 10698 14532 -5506 -16087 -3270 13577 12979 -7004 -18142 -194 18944 3891
1254 3891 -16920 -2892 14051 2503 -9075 -5680 199 6930 9736 -8591 -15674 10507 17451
1267 17451 -9847 -18678 6403 17876 2986 -13522 -10351 3609 13560 5645 -12146 -13199 8633
1280 8633 17844 -3528 -20882 850 19821 3576 -14320 -5521 6691 5915 2249 -6719 -8673
1293 -8673 7924 13195 -8972 -15960 8684 16703 -3778 -13388 -1951 9962 8122 -5360 -13056
1306 -13056 880 14843 6525 -13265 -13140 8394 17827 -1837 -17788 -4014 12710 8756 -5284
1319e284o013R442J4027n713j8413J639K2022j239j8359m39J0960M044k143j0465
1333e934n478J4685J3392j8102j8309J8370J8149j2085j5455K481J1832P204n570
1346E180j3748l446J7903R592j6217j6583J3345K0771r694k1161P659J3650j180
1359F071n894l583l017R672R913j6463j2553J9920J3949k0515j3017J2763J2490
1372I736m440r014m532O273J2410k050j8028m243J8615J1317j4042j8105J0866
1385e237J5972k736j5088j270Q625P872k615j2716l554J6225Q054j7127r515J4948
1399A838P054o807q060j205R457J0158j0401j6874R408J9446n172j8444k5J2712
1413C085P127o506j2775q53J5551Q229j3122j5761R422J7563k753j9277j83J7126
$$ plain form
1319 -5284 -11297 -1855 12172 6459 -11954 -10315 11707 10468 -7891 -8330 2630 6674 4531 -5934
1333 -5934 -11412 3273 16665 -1437 -19746 -1376 16773 4688 -10767 -8286 3546 10750 5180
1346 5180 -8568 -12014 5889 15481 -736 -17319 -3974 16797 7103 -14058 -6399 7251 6071
1359 6071 177 -3406 -6423 3249 13162 -3301 -15854 4066 18015 -2500 -15517 -2754 9736
1372 9736 5296 -3718 -8250 -1977 10433 8383 -9645 -13888 4727 16044 2002 -16103 -5237
1385 -5237 10735 7999 -7089 -8359 266 8138 5523 -7193 -10747 5478 13532 -3595 -13110 1838
1399 1838 8892 2085 -5975 -7180 2277 12435 2034 -14840 -5432 14014 8842 -9602 -9627 3085
1413 3085 10212 3706 -9069 -9922 5629 13858 736 -15025 -5603 11960 9207 -10070 -10253 6873
1427F873J548j1228l339J882O888Q506r764j5821J1895J9374j3803j8359J1931
1440c417J6580o675j1879k961N599J0838L012j6197r081J5928J2669j2693j6244
1453a4521Q916J7730k322j6616l561J0496N328m06q489o102J1103J1971j3018
1466E09j5592J2292J5847r264j3021K876Q706N762n469j1666K041J5492J845j7243
1480f885n780J3369J0454n228j5287m7J3575P759j2913j0030P577J2700j146j3687
1494e569o823J4679R198j0652r801N777P893J346o583q240M598J6700m390k2184
1508a4051L016K0253M90j3992l213O423P044K032j1844j0263J3883J5038j0099
1521D717j7812M699J7420L51j5208l927J0760O940m849p582l420O893J3419q123
$$ plain form
1427 6873 8421 -2807 -6146 -4264 2624 11130 1366 -14455 -2560 16814 3011 -15348 -3417
1440 -3417 13163 6488 -5391 -8352 -2753 8085 11097 -5100 -14181 1747 14416 1723 -14521
1453 -14521 -5605 12125 9803 -6813 -10374 122 5450 5044 -3445 -9547 1556 13527 509
1466 509 -15083 -2791 13056 3792 -9229 -6353 2353 8115 2646 -9020 -6979 8513 10358 -6885
1480 -6885 -12665 704 11158 5930 -9357 -9404 4171 11930 -983 -11013 -3436 9264 8118 -5569
1494 -5569 -12392 2287 11485 833 -8968 -3191 4702 6048 -535 -8775 -4177 12523 8133 -14051
1508 -14051 -11035 9218 9708 -4284 -7497 -1074 5970 8002 -3842 -14105 -222 14816 4717
1521 4717 -13095 -8396 9024 9375 -5833 -9760 1000 7940 3091 -4491 -7911 -1018 12401 4278
1535D278j8672O213K0571l657j8458K742J1095K333m714q360j008J1729P575j3548
1549a881j1749J2671J3504p023j3798n99J2589P531j0007j1270N581J1527J479
1562H555j1456o708Q809J2110o165j4887L179J3174N56r797o182N177J2306n66
1576H105j5632l889J6442O365j3411o168N469Q887J308q882r769P949J5967o795
1590E946j7264K828J6379J070j1354o975O897J0640k775j0088l518P475R315k494
1604F082j5825M27J8493J168j7722l055J4443M117p195n529j434P449R617p780
1618C256j6962O869J8505m776j5312n14J2022O181q229r244J772J1599L524r228
1632e37q734O805J1518k463j4823j782J6078L198j0830o802N664Q101J324r341
$$ plain form
1535 4278 -14394 -8181 12390 8733 -9725 -6983 4112 6445 1731 -6629 -7637 4092 11667 -1881
1549 -1881 -13630 -959 12545 5522 -8276 -8875 3714 11245 1238 -10032 -4451 7076 8555
1562 8555 -2901 -9609 -800 11310 5145 -9742 -6563 6611 7167 -2630 -8812 -3635 8671 8105
1576 8105 -7527 -11416 5026 11391 -2020 -8188 -2719 6168 7476 -1406 -11175 -3226 12741 5946
1590 5946 -11318 -8490 7889 8959 -2395 -9370 -2473 8167 5392 -4696 -8214 -739 8576 6082
1604 6082 -9743 -9316 9177 10345 -7377 -10432 4011 8128 933 -4596 -6030 1419 11036 3256
1618 3256 -13706 -6837 11668 6892 -8420 -8934 3088 9269 1040 -8204 -6432 5167 8691 -537
1632 -537 -9271 -2466 9052 6589 -8234 -10016 6062 9260 -1570 -8372 -2708 5393 6717 -2624
1646b624p750J1613J1311j1772j0507N306J0830j66o463p893L432J3997k158j5347
1660h191j703J5950L325j0679p036M806Q911J815q547o972P518R981l071j3530
1674g423j458J4744N430j4717o645J1074O774o191m823j136L116Q524j862j5148
1688i741J436J8109P58j7969k015J1546N126o851n139J60P235M929p609q085L701
1703d409J2279L15j3211n104J4371N592j1161o584O685N978O34p018n548L539
1717c642J3183m684j2855J298J3232L12r860l511M381P996J087j1160n624J1694
1731A847Q289r783q102M276Q882J439q054p360O813Q915k014j1400j587J2013
1745D174N561j1525q328R159Q978m543q163O72K308P800o85j2576j027J3228N397
$$ plain form
1646 -2624 -10374 1239 12550 778 -9729 -4423 6407 6241 -222 -8115 -4683 9314 7156 -8191
1660 -8191 -9894 6056 9381 -1298 -8334 -3528 5383 7198 -1349 -8321 -803 9178 6107 -7423
1674 -7423 -8881 5863 11293 -3424 -10069 1005 7779 1588 -3235 -4371 -1255 7269 5407 -9741
1688 -9741 -8305 9804 10562 -7407 -9422 2124 7250 399 -4740 -4580 2655 7584 -25 -8110 -4409
1703 -4409 7870 8185 -5026 -10130 4241 9833 -1328 -7912 -1227 4751 5385 -1633 -7181 -3642
1717 -3642 9541 4857 -7998 -6700 6532 6844 -3016 -6527 -2146 5850 6937 -4223 -9847 1847
1731 1847 10136 353 -7749 -3473 5409 6848 -1206 -8566 -1753 7162 5148 -6252 -7839 4174
1745 4174 9735 -1790 -10118 -959 8019 3476 -4687 -4015 -1707 6093 5408 -7168 -8195 5033 10430
1760A0430j4624n378J2486M654o288n903o0N342P578m155j1450J409J2588J178
1774G807j3069k776J0355O057p566q664N004O668P95l919p070K621J0480R23j4558
1789f912j877J2595M544j0643m933N145N697J254o127o395O953R127n756r576
1803f904K812Q262J547o779n530L776R346j044j0269j529Q431N894o761r100L171
1818d677J1423q84j0074j604N840N257j681p503l457Q748Q293j1221q291R101
1832g30R065o811o618K365K549M449l24r011r73J1228L522j2029o189R951Q858
1847I302p221q698K600O817J682m314m251n2Q216L580j1787o732J3203Q158j1167
1862f64p363P478M560o33l307n074P50J0153k04j2515q62J2186L676q855p033
$$ plain form
1760 10430 -4194 -9572 2914 7568 1280 -4623 -4683 659 8237 4082 -7368 -5959 6629 7807
1774 7807 -5262 -8038 2317 8374 808 -7856 -2852 3816 4611 692 -6378 -3757 6723 7646 -6912
1789 -6912 -8789 3806 8350 -2293 -7226 -2081 3616 4870 -1257 -7652 -699 8428 2672 -6904
1803 -6904 -4092 4170 5717 -1062 -6592 -2816 6530 5486 -4783 -6312 2119 8013 1252 -7848 -4677
1818 -4677 6746 5862 -4212 -5816 24 5281 3600 -3903 -7360 1388 9681 -1540 -9831 -730
1832 -730 8335 1524 -5094 -2729 -180 4269 3945 -5066 -6039 5189 8711 -3318 -9507 444 9302
1847 9302 2081 -6617 -4017 2800 4482 168 -4083 -4135 4081 7661 -4126 -10858 2345 10503 -664
1862 -664 -8027 -549 4011 3378 71 -5003 -4253 5900 5696 -6819 -7681 4505 8181 -674 -7707
1877g707N014Q359j780o867k994O274O233l318p915j191R926K604r339m469P650
1892D80N973m042o156q23M735O486m880j0072L241J2016k748q911k10O905K264
1907D258j356o174k155P562O915j0189p614P544Q846n917p621J602P631K392n480
1922B44l886N6N633M637p179p534O928J0527p182j0741O154Q365l849l712M8r75
1938b466N232L874q749o739J1319O316r507o709O661P065l223n605l223M847N701
1953D794m81p955k365P712O464p339q844P202Q472m675p386J306L958L080q11
1968C132p673j290J0156K573j0094l846Q529L873l838m943n47M492O114n741p798
1983f901L952R982l162p247k918O860N092n340n015J783N844K330m676p293M081
$$ plain form
1877 -7707 -2693 5666 3886 -2981 -5975 299 6532 3214 -4701 -5892 4034 6638 -2701 -7170 480
1892 480 6453 2411 -3745 -4568 167 6653 1773 -8299 -5058 6958 4210 -4701 -4911 1994 4258
1907 4258 2902 -3272 -5427 2135 9050 -1139 -8753 -1209 7637 1720 -5901 -4299 3332 5724 244
1922 244 -3642 -3586 2047 6684 -495 -8029 -1101 9426 2244 -8497 -2343 6022 2173 -1539 -1491 -2466
1938 -2466 2766 6640 -2109 -8848 2471 8787 -720 -7429 -768 6297 3074 -2531 -5754 -907 4794
1953 4794 4313 -3642 -6007 1705 8169 830 -8014 -812 7660 2985 -4401 -3095 863 3943 3132
1968 3132 -4541 -5831 4325 6898 -3196 -7042 1487 5360 1522 -3421 -3968 524 6638 897 -6901
1983 -6901 -2949 7033 3871 -3376 -6294 566 5658 318 -4697 -2914 2930 5260 584 -6709 -2628
1998b628R189j648j1804J282J0129P96o894r05J316K165M393m962r097Q362Q143
2013G837n690j0641O158Q664k767p205N29K571K910J044n480m299O455O706n281
2028A511r524N447R764l947q268K209N086O3J19m874k971P480N554q699o929O862
2044a117P929n449o125K162L898L033l699n432M85P851J472q034k708O191N291
2059E748m234p061J229P841J696n720m222J531Q556M16r982k842J0173K637p031
2074a265l656N114Q67K031q81q353M151Q707l224r789J905J0775k322o402j474
2089c816L352L732n77l634n532N945O942l685r816L550P467J567j0261r72P004
2104A266K280l314j575k034K001P080l552q900L842R636k873j0428L510N945k25
$$ plain form
1998 -2628 6561 4913 -6891 -5609 4520 5316 -1578 -2483 -1167 998 5391 429 -8668 -306 7837
2013 7837 2147 -8494 -2336 6328 3561 -3644 -3115 -544 2366 3410 -2070 -6369 86 6792 1511
2028 1511 -8013 -2566 7198 3251 -5017 -2808 2278 2341 2460 -2414 -5385 2095 7649 -1050 -7979 -1117
2044 -1117 6812 1363 -4762 -2600 1298 4331 632 -4800 -4315 3536 5008 -3026 -5734 457 5748
2059 5748 1514 -5547 -4318 3523 5219 -501 -4723 -3192 5364 5780 -4202 -7044 3129 5766 -1265
2074 -1265 -4921 193 1060 3091 2210 -6143 -1992 6715 3491 -6298 -4393 6382 4060 -2342 -3816
2089 -3816 -464 3268 2691 -943 -6475 -530 6412 2727 -7089 -3539 3928 5495 -4766 -5738 1266
2104 1266 3546 232 -1343 -3377 -1376 5704 2152 -6748 -2906 6730 3857 -6571 -3061 2884 2659
2119B659k638k541r18N148M563n682o310M712O730k650q685J299P069K128n910
2134a026k331J699M492Pl742m986N532Q115p121o735M911M958k055j262l875R03
2150b516O338Q79q563j568R112K899q492k357L057L374N89l545k920L096N408
2165D791j125q067P45P030K495q937k395N793M529l402l956R4J589M552q43p670
2181d777L26J0052j4j0287R1Q314L96m380k167k91L122L288j917o344K473Q627
2197F512k200p852j058P518J647m892k800K389K121K200l434l157L75P824j585
2212C608q692J700P388M02n820j880L433K227J841m633n065O720L937n466n486
2227e786M563M224J03l922l349L781M165j217o410r61P462J627n534l716L978
$$ plain form
2119 2659 21 -2520 -3438 1710 6273 591 -5719 -1007 5723 3073 -5612 -4313 2756 4884 -1026
2134 -1026 -3357 -1658 2834 2841 -901 -5887 -355 7760 639 -6096 -1185 3773 1718 456 -3419 -2516
2150 -2516 3822 4701 -3862 -5430 3682 6581 -1911 -4268 -1211 2163 2752 -793 -3713 -617 4791
2165 4791 3666 -4401 -3656 3374 5869 -3068 -5463 330 4859 1457 -2499 -2405 -816 3736 2893 -4777
2181 -4777 -4451 5601 5587 -4700 -4609 3705 4101 -279 -2446 -2737 385 3673 1756 -4588 -2115 6512
2197 6512 4312 -3540 -4598 2920 4567 -325 -3125 -736 1385 3585 151 -3006 -2631 5193 3608
2212 3608 -5084 -3384 4004 4406 -1414 -3294 139 2366 4207 -426 -5491 1229 5166 -300 -5786
2227 -5786 -1223 3001 3104 -818 -4167 -386 3779 2562 -3848 -4809 2653 4280 -1254 -4970 -992
2242i92N438k012n003M12K659K285L87o676r74O682L598r064l051Q718J163m540
2258i70j697J640J575K459j029o369L36Q704L30q908j031O593K420l363m208K859
2274f59K392l37m17m799O95O738J003q000j960Q492K687p459l060N144J592nk641
2291e94k895K043O426j921q258J822P478p85m747k147K756L898n14m407k209N254
2307A200K102k575n446K972N086o90n490n83L819K895j658m215j303N673L609
2322E396n801n331N106O087m461k726J50J581J620J885n948j768O925J809o869
2337b345l066O763K494l030m356J890K212J042r91k721m05N157J845o253l512
2352e276O468L957o121l907M814L016j772q84k465l37N534P51o823j125P314J829
$$ plain form
2242 -992 4446 2434 -2569 -2157 502 2787 3174 -3502 -4476 2206 5804 -3260 -6311 2407 3570 -970
2258 -970 -2667 -1027 548 3007 1978 -4391 -4055 4649 4979 -3929 -4960 1633 4053 690 -3518 -659
2274 -659 1733 1396 979 -3820 -3125 3613 4616 -3384 -5344 3148 5835 -1624 -4684 460 2052 2047 -594
2291 -594 -3489 -1446 4980 3059 -5199 -3377 4101 3316 -1431 -3578 -822 3076 2562 -1845 -4054 1200
2307 1200 3302 727 -4719 -1747 3339 2649 -2841 -3424 395 3290 1632 -2583 -3886 1787 5396
2322 5396 -405 -5736 -630 5457 996 -1730 -1580 1 1621 3506 -2442 -4210 2715 4524 -2345
2337 -2345 -5411 1352 3846 816 -3540 -1650 562 1604 613 -2108 -2513 2644 4489 -1764 -5276
2352 -5276 1192 5149 -972 -4879 -65 2951 1179 295 -2170 -2507 3027 3778 -3045 -4170 3144 4973
2368D973o388k057K539L073K18l499k078L390L326j964m885M8O285j35k822l106
2384c082M515K503k274l414n96K556L129k195m679J707O632k492m895L18K898
2399F31J873j058k900j158L248L442m769l705N299L559k809m566J006L199R30
2414B222j493l793O51M590J962n288l285N123M284m591m815K639M189j122j462
2429a89l90j327L488J764n321k593O695K471m401n621O512J277j160j063j469
2444a327J088K411J73l921j717N101J896l939l471L475K916j659l043r3K410J930
2460B230l56m205q21O208J398o598k12L893P53j734j716j717L108L684l088m637
2476c810K585N361k367m405J332K029J504j545l210J63L680K136k968m248L619
$$ plain form
2368 4973 -1415 -3472 -933 2140 2358 -1141 -3219 171 3497 1533 -3352 -3304 2981 2846 24 -3082
2384 -3082 1433 3936 1662 -1752 -2348 208 3337 1142 -3537 -1830 4802 2310 -2585 -2267 631
2399 631 2504 1446 -1454 -2612 636 4078 -691 -4396 903 4462 1653 -2913 -1907 1292 2222
2414 2222 729 -3064 -2413 2177 4139 -1149 -4434 689 4973 382 -4433 -1794 2395 1273 -189
2429 -189 -579 -1906 1582 3346 -1975 -4568 2127 4598 197 -5424 1088 2365 1205 142 -1327
2444 -1327 -239 2172 2345 -1576 -3293 1808 3704 -235 -3706 -231 2685 1026 -2017 -2110 300 2230
2460 2230 1874 -2331 -3152 3056 4454 -2144 -2356 1537 2290 556 -1160 -2877 231 3915 827 -3810
2476 -3810 -1225 4136 1769 -2636 -1304 725 2229 684 -2526 -2363 1317 3453 485 -3763 -144
2491a44N163l646m552K371L216M61l932k207K807j88L597k935m488M728N790n562
2507D79o104N412K702j229k191L87n34L485P06m315k697L723L887m194l848M036
2523b95N171l348m102O41K393P44O46k774k646M405L266m327l883M958K331l285
2539a05k317K066R74J389n38m277p3N264N97n063m19L248J327j989k381P97J909
2556D09J909k282l510J822M395J9m934o90M889J446l986j106J211J644P41j033
2572I44m357J610O249k412n732K510M764j594l264K98J184k62J768j669k881K775
2588f9N094l916o099L121O331l765l427J225K990j059K27l61k331J797M554l004
2604A308o575L879O362l969m922L218J835J11n26q41k987M839K877n568l081N034
$$ plain form
2491 -144 5019 1373 -3179 -808 2408 2869 -1063 -3270 -463 -651 2946 11 -4477 251 6041 479
2507 479 -5625 -213 2489 1260 -931 -544 -1078 2407 3113 -1202 -3899 -176 3711 -483 -4331 -295
2523 -295 4876 1528 -2574 -1933 460 1204 1850 -924 -3570 835 4101 -226 -4109 849 3180 -105
2539 -105 -2422 -356 618 2007 1469 -2808 -2881 2383 2980 -2083 -2502 746 2073 84 -2297 -1500 409
2556 409 2318 36 -3474 -1652 2743 2762 -2172 -2862 2027 3473 -513 -1619 -408 1236 1977 944
2572 944 -3413 -1803 4446 2034 -3698 -1188 3576 1982 -1282 -984 200 -62 1706 37 -2844 -69
2588 -69 5025 1109 -4990 -1869 4462 697 -2730 -1505 1485 426 653 292 -2039 -242 4312 1308
2604 1308 -5267 -1388 4974 1005 -3917 -699 1136 1247 721 -120 -3107 1732 4609 -959 -4040 994
2620I94K300l113l237J555K998J02j393k005N46L605N74n003q26L573L635l883
2636D22k958J646K554m73k245k29N3L914P19o220j173O270J470n645o31L473R40
2653A887l47j415l291J670N194k085n111J800L895k05k721j535J884J532q58q17
2669e23j060J409K946r15n411Q92N408j30p047K325M194j46k676N84r56n7M175
2686C012k241n226K343N330r32n437K111L094m80j641j339J06K970J091k949k931
2702c119L171K510j609m076J414M558p28k831q86R26J751J107k708l304N012L182
2718D370l961l029K987K102k191j323n02J801R23J003m935J071K492K322l798
2733f68j654K144K630p93k807k48J024L076o21l779j290O195K84n489p42M283
$$ plain form
2620 994 3294 181 -3056 -1501 1497 1599 206 -1799 -1253 2352 2926 -2077 -2903 670 4305 422
2636 422 -2536 -890 1664 1191 -1054 -1283 -1230 2684 3403 -2817 -3990 2280 3750 -1895 -2526 947 1887
2653 1887 1540 125 -3166 -1496 3698 1613 -3498 -1698 2197 1992 -729 -2264 -380 1152 294 -523
2669 -523 -1583 -174 2772 1857 -3554 -2662 2746 2616 -4431 -2106 2088 1942 -734 -150 -1106 -1163 3012
2686 3012 771 -4455 -2112 3218 2286 -3151 -1040 2054 1574 -67 -1406 -1300 1670 2761 -188 -3119
2702 -3119 52 2562 953 -3123 -1709 2849 2121 -710 -1596 -670 1081 2188 -520 -3824 1188 4370
2718 4370 409 -2620 367 2469 278 -1045 -1547 254 1177 2180 -2755 -1684 808 3130 -668
2733 -668 -2322 -178 2452 1659 -1148 -1396 -372 2704 2083 -1696 -2986 3209 3493 -1996 -2738 1545
2749A545P77l165m66J700j517L094J058n249j020O739q43m982l04M344k86l001
2765a576J474j242J750J153j467k793J524L675K58m839m70M573J223l819o24J118
2781h2L97J242p29k745kM863r30m010L89M266o94l780N80Q21J261J116k703j614
2799b354L686J578k248l090J230K945l73k317r74K148J663j206j535j243K614
2814E24L324l759k808K986K671j388k326J052J49J012L04l186j619M690J959m435
2830h50k796M680N35k197m21N20J266r3K23k310j83M042M74m906l43M001J355
2847B997m039j609K275J007j11l56j336j57K569K086n263J039K298Q80l575k74
2863a569K734p53o1N84k799N7L373r17l373R27M204m65k905j457K064J427o07
$$ plain form
2749 1545 2322 -843 -1309 391 -1126 1968 3026 -2223 -3243 3496 2653 -2329 -2633 1711 1425 -1576
2765 -1576 -102 -1344 406 1559 92 -2701 -1177 2498 2756 -2083 -2553 2020 3243 -576 -1200 -82
2781 -82 315 1557 828 -1917 -1919 2944 2014 -1996 -1607 2659 1965 -1815 -1235 -414 847 1963 -740 -2354
2799 -2354 1332 2910 662 -2428 -1198 1747 1374 -943 -1917 231 1894 688 -847 -2090 524
2814 524 3848 89 -2719 267 2938 1550 -776 276 425 1437 1741 -1445 -3064 1626 3585 -850
2830 -850 -3646 1034 1569 -628 -1049 -529 737 644 867 -1443 -1626 2416 2890 -2016 -2359 1642 2997
2847 2997 -1042 -2651 -376 631 520 164 -1172 -1329 1240 3326 -1937 -898 1400 2280 -1295 -1569
2863 -1569 1165 412 351 935 -1864 -1807 1566 649 -2724 -1797 2407 1942 -963 -2420 -356 1071 464
2880D64j298k05K81L227k054j948J22K903M43l311R01J618k13nj652p16K201J706
2898B464j945l943L002L515k710k685K059P93r14L73n26k022L258J600j997l335
2914c013L675K439k590k254J700J977j775O02n10j543J962J024l030j994M910
2929A580K199n685p49L776L60k676J438o62l16K380L71l916N3K899M67k951p31
2946b163J753J622j068p19p01P02Q29P27k359p8L099P49l162r79K966J661l263
2963c84j50m21N16L118k620k041Q93K915j230k622K20K351J06n56j205N67L75
2980a68K415j986k136J996K299k278k196N23K076Q50k584P48k44J204R94j088
2996D25k541K057L374l185k920L824Q88j720q95K80j022J198J948k672j677M251
$$ plain form
2880 464 -834 -1039 -758 2469 415 -1533 -1411 1492 1935 -1376 -475 1143 930 925 -727 -1443 758 2464
2898 2464 519 -3424 -422 3093 383 -2302 -243 550 -364 9 -517 -2539 719 2319 322 -3013
2914 -3013 662 3101 511 -1743 -43 1934 159 761 251 -1292 670 1694 -1336 -3330 1580
2929 1580 3779 -1906 -2655 1121 1481 -1195 243 -419 -735 1645 2016 -1900 -1847 1052 1519 -1432 -2163
2946 -2163 -410 1212 144 -575 -1276 -574 255 982 -1377 -1455 1644 2393 -769 -1748 1218 2879 -384
2963 -384 -534 -955 -439 2679 59 -1982 -1089 1826 596 -2026 -1806 545 651 95 -1110 -543 -168
2980 -168 2247 261 -1875 121 2420 142 -2054 -1531 545 1395 -1189 -441 -685 519 1513 425
2996 425 -2116 -59 3315 130 -2790 1034 1922 202 -693 -413 -1435 -237 1711 -961 -2638 1613
3012A613J256k783j425K016P39j546k28p12J055J184j26j689j935L001K116k947
3028d11k198L368J777k138j691R08J383L40j115r91j023L084J145l783q56L733
3044A532r01j875Q9J365J37J430j895j774Q14K871j257k006P32K194p90j271m38
3061a043R67N93Q89r22k874J768L827k230l137J008L464j241k468P03PJ109J630
3078B050j532j852J556K624l636k613L590J467q64j040k34M53J84J180j769j675
3094b111K137K857k766k599K104K639k282k226J034K271q66m17n3j752K089K212
3110B271k650k206J900L883l673j078J241P2J074o06j805m88K951n62j236J21
3126g91R26J638j979r16J078N70K92o33j106J27K233n7m033N94K518J044j911
$$ plain form
3012 1613 2869 86 -1339 677 1416 -130 -358 -1070 -15 1169 1043 -646 -2581 420 2536 -411
3028 -411 -2609 759 2536 398 -1293 -385 998 1338 223 -768 -1791 1293 2438 -1345 -2201 1532
3044 1532 631 -1244 -1155 210 347 1777 -118 -1892 -1078 1793 536 -1470 -738 1456 666 -605 -1043
3061 -1043 -76 517 1406 484 -2390 -622 3205 975 -2162 -1154 2310 1069 -1399 -696 -689 420 2050
3078 2050 518 -1334 222 2846 -790 -3403 187 1654 790 -250 -484 -31 153 1333 -436 -2111
3094 -2111 26 2883 117 -2482 -378 2261 -21 -2247 -1213 1058 192 -225 -278 -2030 59 2271
3110 2271 -379 -2585 -685 3198 -475 -1553 -312 -240 834 228 -1577 -2065 886 324 -912 -791
3126 -791 135 1773 -206 -1122 -44 526 818 185 -921 -794 1439 1382 -2651 -2057 461 1505 -406
3143d06L63J365j552m02J257k115r06M555j132k896N57L120j326k015J014K015
3159A496q33J45j528m14Q20J734n46l760K366K327n58l396R23K143n63j95k62
3176a01j813K072J206j129j965J577L064l487j164J521J517j112l62M07j585K213
3192H59J605k937j927L129K032l694j056J717J141n26p05l32L83P40J512j591
3208C50j751J850J106j645k103J612J077j80N69q93j358K398J56k704l10L244
3224A418N48k565N9J498j03j090n32m94J18K039O63l129P53K115K76l524J074
3241h76K509o11j393J05k25R45J616j196k794N03K781r11k202J630J270k87j186
3258c22J6j211J076J382n65k359Q21L349j506k780J192K047n61j136n56O22Q95
$$ plain form
3143 -406 -43 1322 -230 -632 625 -1490 -2396 2159 1027 -1869 -1312 1808 482 -1533 -519 1496
3159 1496 663 808 -720 -1134 -314 1420 874 -2886 -520 1807 1249 -2147 -1224 919 356 161 -101
3176 -101 -1914 158 1364 235 -1730 -153 2911 -576 -1740 -219 1298 186 -176 231 -1354 859
3192 859 2464 -473 -2400 729 2761 -933 -1989 -272 869 343 -362 -694 -311 429 1941 350
3208 350 -1401 449 1555 -90 -2193 -581 496 316 885 -8 -1366 1032 1188 -1516 -1826 1418
3224 1418 1966 -599 -540 958 855 -235 -767 -1261 -1143 896 1559 -1570 -817 1298 1574 -1950 -876
3241 -876 1633 1022 -371 -266 -491 454 2070 874 -1920 -1417 1364 453 -1749 -119 1151 864 -322
3258 -322 -306 -1517 -441 941 376 -1983 -1162 2187 681 -2099 -907 1140 579 -557 -1113 -491 404
3275D04N10j146j031J567J096p50k304J154K979k702q73M71l89R91P94j392p93
3292a414K092J489l091n29J695J351r93r86j57J154l68J70j339K3J506J72p17
3309E8j322J104J985k679l79J018J39R26N70j780p18K271J157m142j082L199P88
3326A113k060J176J006j809K210j436j634q6K368J021l767J399K060k45q84j166
3342g34P31k2J083o19p27o52L077j085l115J261K110ok104M25Q37l14K2J368k496
3361i60M66K202k283r90J109J883k94j903Q37o71J539j68j328M81K63J408j951
3378c60j884J486K825k673LO78J013q13K47j019o16N97K241r28k778K816Q78j343
3396C70k266J459J049j67k15o17o98K598j57j996j000J762J287k252j59J500M71
$$ plain form
3275 404 914 -232 -1263 304 1400 650 -1654 -500 2479 -223 -1096 -625 -1014 -23 771 -621 -1414
3292 -1414 678 2167 -924 -1453 242 1593 600 -386 -543 611 243 413 -926 -903 603 775 58
3309 58 -1264 -160 1825 -854 -1233 -215 -76 850 1420 -360 -1078 1193 2350 -1792 -2874 325 1113
3326 1113 -947 229 1235 -574 1636 200 -1434 -1520 848 1869 -1898 -499 1561 1316 432 -734
3342 -734 -3 -25 1058 439 -288 -940 2137 1052 -2063 -802 1308 1302 -802 -377 460 146 168 1536 -960
3361 -960 -494 1708 -575 -1565 -456 1427 1133 -770 67 -604 935 767 -561 -80 183 1591 -360
3378 -360 -2244 -758 2067 -606 -603 75 1088 275 522 -497 -1113 -516 1725 797 -1981 835 1713 370
3396 370 -1896 -437 612 445 230 -387 -1085 1513 1356 -640 -1640 122 1409 -843 -1002 498 969
3413I69j87p66o00O5N45P88j239o94K632j76j463j338J593j50k05K51o59j034
3431a668L179o56j772m17J919J420l150N41N94J215r63M38j266M29J324m81k932
3448b246J810K006j131j631M15J702J7j195K52j140R17K132j323j873J78K136
3464A026N06l081J603K425k790O88k04j560J080J116q71j443R42K839k355j626
3480a705J781m45N73q49M89k1M44Q26r50j666J928J448k294k75N88J865k054m9
3498c66M12p30J475P30j997j566K461K174l487L05J035M74j998J144j101M12M77
3515a46J142j423m03J513R79l247K1K610O8j973N96N77m56J010m50q83k019K636
3533A52O76j321j357K783j007n26m54J177P0J205j113j621O8L991j479k427P08
$$ plain form
3413 969 782 16 -584 -519 26 814 -425 -1119 1513 1337 -126 -1464 129 -21 -226 25 -634 -1668
3431 -1668 1511 855 -917 -1334 585 2005 -1145 -604 -10 1205 242 680 -586 -157 1167 686 -2246
3448 -2246 -436 1570 439 -1192 -777 925 942 -253 -1 -1141 -224 1908 585 -1288 -1110 1026
3464 1026 1532 -1549 54 2479 -311 377 173 -1387 -307 809 -62 -1505 -563 2276 -79 -1705
3480 -1705 76 -369 204 -645 -156 -177 267 1093 143 -1523 405 1853 -441 -716 -128 1737 -317 -366
3498 -366 46 -684 791 1521 -476 -2042 419 2593 -894 -589 446 920 -1078 66 -1035 -623 -146
3515 -146 996 -427 -830 683 1662 -1585 -1564 1046 1114 -859 -263 314 -142 868 418 -465 -2484 152
3533 152 828 -493 -1850 933 -74 -600 -1054 123 193 1398 285 -1336 -1268 2723 1244 -1183 -475
3550d75P34q58J04Q66j328J191J392j027j352O25J288j82j960L64J732p67j021
3567f74Q38K03q77N25M32k507J901J963k552j525K465J921k236n53P70p90R96
3584C00L59j177o21J341J605j570n84O48J183j929q22J139L92p0M83j006o60M56
3602e33J174j076p65K917n25j974L09P78M86j456J02q1K72Q85R93j635j293K058
3620F36P68j822m46J16J933J04j085m5j828K635r41j391J299J238j45q52r96R30
3638A08o32J051q29k00J03K708n57l291O53K305j329L4k37l9n07J432p63j408
3656a398K322O5r90j312J079J379j168m05n0M30k51K51O95q81q27K678j083j911
3674a377J756J152j903o86R68L30R1n46O58j520M39J095j25j730J926P13k127
$$ plain form
3550 -475 259 -599 -495 371 -957 234 1626 599 -753 -128 1160 978 -982 -618 1114 347 -674
3567 -674 164 367 -510 15 447 -2060 -159 1804 -748 -2273 192 2113 -123 -676 94 -696 300
3584 300 659 -518 -1139 202 1807 237 -347 301 1484 -445 -1267 -128 264 194 677 -329 -989 -533
3602 -533 641 -435 -1200 1717 1192 -782 -473 305 791 -665 -563 -644 -372 513 1506 -129 -1422 636
3620 636 1404 -418 -864 -748 1185 1289 204 159 -1669 966 25 -1366 -67 1171 1026 174 -822 108
3638 108 -524 527 -302 -502 -399 2309 1752 -1539 -886 1419 90 124 -113 -152 -659 773 10 -1398
3656 -1398 924 989 -1 -1313 -234 1145 -23 -428 -478 -48 -299 -48 647 -234 -1061 1617 534 -1377
3674 -1377 379 1531 -372 -1058 -90 240 331 -215 443 -1077 -638 457 332 -1398 528 1241 -886
3691h86M13M66Q17j191M53J0n7N72P23j575l81K160j78j642r31J679K32K41o34
3710B91l55p58J186L87j856r7J974N26j432o03N88O71j156O63k08m49J469K52
3728A093k090k00K839j136j580J62J394l55k91l23l06M02J146r82j133J145R17
3745G02N06j710N89R16J38j946R51q05O73J616o62k435O76K673j896j789J170
3762f33R59m83R67j216M3J105N3j117J3K5K172j583j412P07J054j053Q93l08n21
3781c35Q11Q91o97j924J073J115j248j562K334K81j276R05r91l43J304J047j650
3798b65j337K615P09k814K39J579o28q85J684j052n7P39m82o00j134K730n41j948
3816a448O57J528j010m4N63j43L42l42Q37k249J051K327j360q79K47R66j218l47
$$ plain form
3691 -886 -473 -7 810 -381 72 82 25 597 1320 -255 -636 1524 1346 -296 -1227 452 684 925 291
3710 291 -64 -822 364 751 -1105 -1202 772 1298 -134 -737 -149 522 -634 29 -179 -628 841 1093
3728 1093 -997 -1197 1642 506 -1074 -912 482 127 -164 -487 -793 -391 755 -227 -1360 -215 702
3745 702 1208 -502 87 1003 1141 -805 146 -659 14 1630 968 -1467 -791 1882 -14 -1803 -633
3762 -633 326 -157 810 -406 -363 742 795 -322 -309 -284 1888 305 -1107 -400 654 -399 494 186 -335
3781 -335 476 1367 670 -1254 -181 934 -314 -1876 458 739 -537 368 -623 -966 338 1385 -265
3798 -265 -1602 1013 1722 -1092 -853 726 98 -787 897 -155 -212 527 45 -555 -1689 1041 500 -1448
3816 -1448 -791 737 -273 -317 246 103 445 103 940 -1309 -258 2069 709 -170 77 1043 -175 -522
3834e22J066o43J65M13J065k050M13J138q08q80M00J322p87n09O71k83k25L40
3852B86K81j023K08J742r12j260P51O34j212M03J154j302L11Q7o89j008K397j72
3870F76j519j57J745N66r88j93m25k53L07l06m9q37J249O69m30r00J246M59j655
3889g95R23L73l82r74J449r35q06K546m40k580m85L698j204r88P56J70q16l4K62
3908b62l84j092K328R69k788J013R79k02j689R24K07L99j228J714r11q72J516
3925F21L59j388q30J899l13J20K90j183Q99n67l30nk50J497q24j215M67J446q54
3944a61r57L50J505k55jn43n28M80J103j675m18J540J498j167j729J637j63o72
3962a56J047j040q83J850L75j729j489K523R87k183pJ254q54M83O7n94j164J685
$$ plain form
3834 -522 544 -99 66 479 1544 -506 -93 1045 237 -643 -243 1079 292 -217 454 171 -54 286
3852 286 567 -456 -248 1494 582 -678 73 707 -505 -102 1052 -250 61 148 -541 -1549 848 676
3870 676 -843 -1000 745 1311 323 130 -295 -548 -241 -547 -596 -1433 -184 485 55 -845 401 860 -795
3889 -795 128 501 119 -855 594 -341 -1147 1399 959 -1621 -2106 1592 388 -600 156 326 -490 -524 -262
3908 -262 -646 -1738 590 1559 -1229 -216 763 561 -1128 -204 3 402 -826 888 -23 -895 621
3925 621 980 -408 -1238 661 348 468 758 -425 474 -93 -423 -428 -678 819 -5 -1220 -753 693 -161
3944 -161 -1118 -768 737 482 481 -62 -590 -110 993 -682 -1100 440 1938 771 -958 679 516 -156
3962 -156 891 -149 -1032 818 1193 -536 -2025 498 1485 -698 -705 549 -305 178 245 -349 -1513 172
3980A72K41p90p58N27J430j447O1R55j104L71O37r57pQ68J58k77j010J013O64
3999G47r74l26J107l33M81l62O7p82M79O87j639k61K335l3j550J27P57N4m57J75
4019B99l72J5K69J83j001N59J135l67j418k36J191M12m46k41N31n02O97m37j422
4038a151J061J973k310n4R81j89m09j18M37j40n01R94o34O5n03J550q66j016P6
4057g54O96j09O41j114J116L58L59j200r99R97J663j691q91J565k40l99r7K87
4075A88k37qJ286k362k13K387m02m93j318J796q9q79J129l18r70M99P65j262m48
4094i49J662l64j367O02J372n44j565O33J568q38P04L96j430p52J349L99j294
4111d18p50J949K77q43J131j018m09Q0N55j452l16K170o82j47j74M41l65j089
$$ plain form
3980 172 413 -377 -1135 -608 822 -625 -564 391 -713 -342 295 -662 -669 199 357 80 -930 83 747
3999 747 -227 -553 554 221 702 340 407 -375 104 791 -848 -1109 1226 1193 -357 -230 527 581 124 299
4019 299 -73 -58 211 394 -607 -48 1087 720 -698 -934 257 669 223 -18 513 11 708 271 -1151
4038 -1151 -90 1883 -427 -481 500 311 -98 -216 221 81 -420 574 -60 5 -498 1052 186 -830 -754
4057 -754 -58 -167 474 -640 476 834 1193 -7 -1006 -9 1654 -37 -928 637 397 -2 -99 188
4075 188 -49 -57 1229 -1133 -1346 1041 639 146 -1172 624 535 -344 785 467 -503 -4 761 -501 -949
4094 -949 713 349 -1018 -416 956 412 -1153 -520 1048 210 914 1310 -120 -872 477 876 -418
4111 -418 -1168 781 1058 215 1346 328 -81 -1 554 -898 -1214 956 274 127 -47 394 29 -1060
4129a060k55J004L41l65K19l12K25R64p92j687J700R69j461j58J001P70n89l47
4147A67K37j839R54J408R5j626N99J504j393j473J038j76P30L75l2m74l92R70
4165F72p28j029Q81J409j804O68R77p23l02J01J41j079J351J059j307n20N83M27
4183G77j320l77K031j211lJ443j228K10l29K73k64j76M38J52j044N64M12j11J96
4202D33o0m04l91N87m14l91l57K317o24p44o01R23r0n61J901j579n11J555p67
4221B22p48J13J082j090qJ71J71O5M21k12o20k94J355n47q36N24J192j538j275
4240a852J756Q92j562P86P58q92p83K153p95m12l76R29j035o78J856O1r03Q62
4258G65n76L24l03N47m35j840K872q43j35r21K48N40p97O91P8o90N80J294k236
$$ plain form
4129 -1060 -1315 -311 30 -335 -116 -428 -203 761 -31 -1718 -18 951 -510 -668 333 1103 514 167
4147 167 404 -1435 -481 927 1022 -604 -5 1499 106 -1367 -329 -505 225 600 568 94 -298 672
4165 672 -56 -1085 -204 1205 -599 69 1046 323 21 122 263 -816 535 1594 287 -233 350 777
4183 777 -543 -920 1111 -100 -103 1340 112 322 -7 266 2 -174 264 416 -628 -64 348 237 433
4202 433 373 -31 -422 165 -249 -640 -997 1320 696 -48 -649 274 184 -377 1524 -55 -566 989 222
4221 222 -526 -413 669 -421 -429 -258 -87 -22 399 187 -433 -727 628 81 -755 -231 961 -577 -1852
4240 -1852 -96 796 -766 20 778 -114 -897 1256 461 49 -327 602 -433 -1111 745 806 -97 765
4258 765 189 513 210 757 322 -1518 1354 511 376 -545 -297 243 -554 137 215 -475 105 1399 -837
4277h37K76J112j2r54n95K286jj108m81k13J47P36J651k312n08Q60R03j443l91
4296h84K433j547q13J069p56J53N74L7j76j265J765m25j631J177J596p43n12J02
4314A54m58J05P78L70j287Q03M51j364j79j9J741j214M79o22L18p79O70R25j329
4333d57j16J485o88j726J674Q14p39o44P25m18M00K26o43j008J911l51j132j1
4351f98O92P43m40k15N38K31j282J545j788l82O36kl50O51J79L00n70N5r2p47
4371i96J85J759p08m09j8J261j919J51J026n81m05M92O75m71k13J043j318j136
4389a582J544k40Q5n9J048K53k083J762j304j79K63N10M93r79J140O73k898Q54
4407f99J780q78k28q77J703o45N46m7j423N23M57P27j934Q46J076m70r12M87k54
$$ plain form
4277 -837 -561 551 539 -415 -1010 1276 1275 167 -314 -527 -380 356 2007 -305 -813 47 950 -493 -884
4296 -884 1549 2 -811 258 -498 -345 229 266 90 -1175 590 165 -1466 -289 1307 564 52 154
4314 154 -304 -199 579 949 -338 465 916 -448 -627 -646 1095 -119 360 -262 56 -723 -53 872 -457
4333 -457 -573 912 224 -1502 172 986 247 -397 328 -90 310 536 -107 -1115 796 445 -687 -698
4351 -698 -6 737 297 82 620 851 -431 1114 -674 -1056 -420 -422 -772 -121 58 358 -212 -157 -249 -996
4371 -996 -811 948 240 -169 -187 1074 -845 -694 332 -249 -654 -162 513 42 -171 872 -446 -1582
4389 -1582 -38 -278 -193 -252 796 1049 -1034 728 -576 -755 -492 18 511 -468 672 1345 -1553 -699
4407 -699 1081 203 -25 -902 801 156 702 655 -768 -245 212 939 -995 -149 927 457 -455 32 -222
4426b22m42K75J072r87M54Q49q94o6Q00l08j686N87J319J55r04Q30r98qK58K76
4446C60o63M2J52Q12m43o46N27m91M83M21l99p03J636j75j403J12j03O93m50r69
4466a207K230j066O48m55L05j499P40O36p98p83J307J062k022J236K95r4j409
4483h74L93O24l79M64O50j260p15J023O61j277J76J463p10m08R58m55q88K57J062
4502G65k319J626J438j386r33R64r2m61Q58l58l0n13K55j18j8O83N52q68o93R54
4522C06j01K92n07O98q62Q2R81o54j187J049%L39j328M43N90j267Q84J06r61J390
4542B93J89q54r21O86M75J18m01R07l64O83K05j042j302J589Q30q75n34J431P6
4561A189j614O20k28J013o07J03o57M55l13R50j481j210J547R48j543j00J694
$$ plain form
4426 -222 -664 -389 683 -304 150 999 105 39 839 531 -1155 -568 751 906 2 832 -166 -174 84 360
4446 360 -303 -261 -109 703 260 -386 141 -350 133 554 155 -548 1088 913 -490 -378 -481 212 -238 -1207
4466 -1207 1023 -43 605 150 455 -1044 -304 332 -466 -1249 58 1120 -902 334 629 535 -874
4483 -874 -481 143 -236 228 878 -382 -1097 -74 587 -690 -514 949 239 -169 789 334 -554 -297 765
4502 765 -1554 72 1510 124 -809 155 63 -398 460 102 72 -441 -186 -304 -322 361 913 45 -648 306
4522 306 205 497 -10 688 -174 -92 889 235 -952 97 97 436 -892 -449 141 -1126 -242 -136 -1097 293
4542 293 482 -372 -1293 -607 -132 -14 -415 492 128 811 1016 -26 -1328 261 1091 216 -318 1113 1189
4561 1189 -425 195 -33 980 373 476 -181 274 -39 911 -570 -1780 -233 715 -828 -928 766
4578G66o18j415J257L73k59j3K2o44O82K55l16m39O0l67N72J16O17j012J22J966
4598A725j633j61r46J964o48r92P02j70J1m93J285L94p86J4L82j354L12Q64J53
4617F23p97Q77l5p47k05M23J46j35K47K72j382M96J210n33j346J044O2K44j2m16
4637C6j021M74J161o13r98P85J672p14j604J315O76j797M64J47M3n7R50P9j537
4656e39Q00Q24j444l19J061Q14p29n06K15j56N11rm20j24J02J04o0l07J226j785
4676g41K99K56J71K87K53K23j371R96N76j461l90Q11L3k59p33J401k23q01P36
4695F3k06j29k60N19R72j541R34L02r54J71q48J503j139J226n9k58q0J8j11r74
4715h51J171L5l83J55M24J31j163k22M53K53N74M07q39J22L94O23r43o7n41j28
$$ plain form
4578 766 148 -1267 -10 363 104 91 113 -531 151 406 90 -349 -289 -656 -84 32 649 -363 -241 1725
4598 1725 92 -69 -1015 949 301 -691 11 -159 -148 -641 644 1038 252 266 648 -706 -394 470 623
4617 623 -174 703 668 -79 -284 139 285 150 397 669 -713 -217 993 460 -886 158 220 464 452 36
4637 36 -985 -511 650 37 -961 -176 1496 782 -822 493 1169 -628 -164 -17 26 -31 919 998 -539
4656 -539 261 1085 -359 -678 383 1197 468 -38 177 21 532 523 103 -21 81 185 125 -182 1044 -741
4676 -741 -442 -186 -15 272 525 748 -623 373 949 -512 -902 -91 -58 -317 -1050 351 128 -673 63
4695 63 -143 -272 -532 -13 959 -582 352 654 -300 -129 -977 526 -613 613 554 296 216 234 123 -851
4715 -851 320 355 -28 127 551 682 -481 -703 -250 3 577 984 145 267 661 1284 341 274 -267 -395
4735c95K67M49l07l89lR77n61j253M46J995oj563L87O97j009M26L49j149L80Q93
4755F31k56l45N23j86j015n5J645P61j667N31M86j704N91l06M14j099J453J137
4773A539j562j043J021o03N04K39l27k55P83L12j938J794m42J83j029P17N44M1
4791D78l0m01k5j195J574n23J144j595P21o62L28M66O29k276Q38J537o47j12R88
4810A237j239j72M1N11J6j713J595p77L22M32K95J04o91N68m10n56J046N56j031
4829A34m27j99K85K55l50J30L32n4J278j388K84J8J57j94j899J885J44j006Q42
4848B27M3M72j966J294n47l19Q54N31k94p60J430o01m92N79j108L46L44j77j50
4867b94p77J261o3p56j15J362Jl36q08M36J21k71N08p82l67J277J13o47J096r19
$$ plain form
4735 -395 -128 321 14 -375 -378 599 38 -1215 -769 1226 1220 -343 44 741 -268 158 507 -642 -262 631
4755 631 375 30 553 367 -648 -703 942 1703 36 567 1053 -651 -60 -366 48 -1051 402 1539
4773 1539 -23 -1066 -45 -648 -144 95 -232 -487 296 608 -1330 464 22 205 -824 -107 437 478
4791 478 448 47 22 -1173 401 -122 1022 -573 148 -514 -186 280 909 -1367 -529 1008 361 249 1237
4810 1237 -2 -174 -133 378 394 -1319 276 -501 -179 253 548 652 -39 529 119 -437 609 1165 134
4829 134 -293 -492 -207 48 -302 -172 160 106 1384 -4 280 298 455 261 -1638 247 391 -615 227
4848 227 270 742 -1224 70 -477 -796 58 589 295 -465 965 364 -128 451 -657 -311 33 -144 -294
4867 -294 -1071 190 127 -629 -744 618 619 283 -525 -89 32 -239 269 -513 -880 397 510 -137 959 40
4887D0l41n05J649o52j067Q24J263k228J408N63l07p53m65J690j537J45Q4O19
4905D30j693Q47R65j340Q52K92L82j173J53N36N07j791Q97J15p22R89r43k27P77
4924a47J360m92j094J33J348j786J017n72O29q33Q49M0j104J098k48O9m84L52
4942A35L02j872J059M30r2N09m90P96j052L22Q91j505j168J327J108k47L91q43
4960AP64j070N66L08q21L48J634j326k161J986O46j366o9R20r64L05Q84j869J014
4979b70Q33M88q79M62L53j630M30J31K57m36Q63p4j22r51Q91N7o71j29J174k04
4999E73j262K24M81K27J166j055j302J157l21J27r03j74K163j233k35P42N26l59
5017E42m08l19R6o7L96j2k0q2J571k315M70N9L16L37n63N40n06P92n48o19K19
$$ plain form
4887 40 -301 -806 843 191 -876 -52 1211 -1017 391 954 647 -106 -571 1119 -418 -273 -189 430
4905 430 -1263 -416 549 -791 61 353 735 -438 -285 251 758 -1033 -136 -21 -743 246 -697 -924 -147
4924 -147 1213 721 -373 -240 1108 -678 339 -233 396 -437 412 452 -652 446 198 267 -217 135
4942 135 437 -1435 -376 54 -38 471 -19 777 -275 47 938 -567 -1735 -408 700 453 844 1
4960 1 765 -305 261 569 -252 96 1730 404 -1757 229 875 -491 -560 360 -604 -299 585 -1284 -270
4979 -270 563 1051 172 634 987 -643 -213 -82 175 -261 602 528 406 -545 346 403 -268 -397 777 573
4999 573 -689 -465 16 243 1409 354 -948 209 -112 15 -888 -1062 1101 -132 -367 375 901 542
5017 542 134 -185 -89 -156 240 228 208 126 1697 -618 -148 -89 227 564 1 541 35 827 279 -340 -121
5038a21l3Q49o42K44N35q67j98K93M39n75j43J413j774M6J334r69K3QP03l40o72
5059d47J381k18q29n26m1r8J089P07j271R2J36M08M79o00k96K82p10J200K00j067
5079a29Q0O08k43n70j38O3J62l85M97N00j70l10p53K05J16J37P0j089J427M1p3
5100D6j68j60J39O29n7K27j071L86O40j149Q41o30J098o12M93p8m10l76M69lK49
5121E03r16R19j175P91K64n79J57R4n26M09n6P63m66n72P7P51j352L48P87K93
5141E14o36J114j014p48R20M85o27L97m39J521j896M93K83R49r97j632K029p94
5159g8Q83j399J133o62J042o46j349P65K14M3o87O04J326j704L08P9L0j212J529
5178B19j58q76Q42J475j251k2p23O68n27J40n74P78m61N07J249j807o2R31n74
$$ plain form
5038 -121 -154 695 53 297 832 -35 -233 60 499 -76 -219 1194 -580 -534 800 -169 -146 -138 565 225 -447
5059 -447 934 716 -113 -639 -680 -778 311 1018 -253 -161 -25 383 862 262 -34 248 -462 738 938 -129
5079 -129 -49 559 316 -254 -392 -329 -167 -552 -55 445 275 -35 -788 -583 -467 -330 -260 -1349 78 119 46
5100 46 -122 -282 -143 486 429 656 -415 -29 611 -538 303 -327 771 159 652 574 164 -212 257 254 503
5121 503 -413 506 -669 122 386 -193 -36 58 -468 -59 -115 648 182 -390 -313 438 -914 -566 221 514
5141 514 -122 992 -22 -770 150 635 8 405 -34 1487 -409 84 367 1316 319 -1313 716 -78
5159 -78 805 -594 539 -123 919 273 -1076 -311 -97 -54 -741 -137 1189 -515 -207 -128 -98 -1310 219
5178 219 61 -815 27 1502 251 229 -494 174 -353 -213 -787 -9 -470 37 1286 -521 -583 348 -226
5197b26p99J671j187M41K49K76p08K59Q5K58o85P99P9l48q63J173k75J03p66N99
5217A35m02j93M94j24k96n36Q85o2k73Q39n46L35m63O22m47lM78j366L72N52j009
5238a008K32P04j90L83jP2J29K58k33O1j319O92M55l63k72j23Q83L01j015O80
5258C26m30j69M92j01q1K51k4J07n31K10P6m10J460r66J65n50j30Q46j371J112
5278B82j42l9l52O61O84p65p4K4j013J34J506r95k17Q37K21p56K13o0q1p93l80
5299a105J400l47n89J055n6r25K02P21J11j014J299q70l11J9Q07k03j277Q78J13
5318i2m02M99J39j93j03L69j72j10m42J528j272l44J172j131J90N22M78m24l51
5337a39J504j024o16K56L1q12M96L46p06N32J267j134n70N40J00j48r63J613p9
$$ plain form
5197 -226 -1025 646 -541 -100 149 425 -283 -24 61 319 -366 433 512 164 -699 474 199 302 -464 135
5217 135 -267 -460 34 -90 -386 -922 -37 -99 -372 467 -79 256 -207 415 -32 -35 443 -923 -551 1 -1008
5238 -1008 -776 -72 -262 121 120 192 321 579 346 407 -912 -220 235 -128 -400 -523 360 661 -354 326
5258 326 -104 -273 219 118 37 288 264 371 -160 50 126 -284 1176 210 375 -175 -305 541 -830 282
5278 282 140 101 -251 410 1094 329 255 279 -734 -600 906 -89 -306 531 752 -4 209 149 68 -725 -1105
5299 -1105 295 -52 -641 414 358 -567 -365 356 467 -547 752 -118 -429 -410 397 194 -1083 -205 -92
5318 -92 -494 5 144 -49 -152 217 45 -65 -507 1021 -251 -595 577 -554 -364 158 636 212 -139
5337 -139 1365 341 -275 -19 12 -800 -304 42 -664 -132 1135 1 -569 -29 71 -77 -1040 573 494
5356D94n99L98j33m69M98R86j196L04p71J164m30p01J161l40j420J098k71J71
5374e6o4J602q14j451N22J3L04L08P2k65N80p91O72N63j463N09L59q40K34K82
5394B76m40l17J095p64l04N72P23j011l26P49o46M17o67Q68k96M16k93j80K23
5413I5J55J93q69j64N69J40o72J342L92q82m01j20k57l10R45l50l42L91J645j467
5433C3n0J38km81P92P46j164P96p08M28n18N64j109J592j147k91P97m61m32P25
5453B48p43L42L10l15L31m73N17l46r1P85j799P11J159p34L80p2J20j078K95J053
5473F00o70L68r11K304j787j29L11j212Q97J74N67r41L2P71o6r23N85L39k46N23
5493E86k76j95m9j8O08j116M6R37q69o88J249O56l84m48J249j666K50P66j511
$$ plain form
5356 494 -105 293 160 -309 189 1175 -21 283 -488 676 246 -455 706 366 -1054 44 -227 -56
5374 -56 -120 1482 668 -783 -261 -248 56 364 436 171 751 -40 632 1195 -268 241 600 -240 -6 276
5394 276 -164 -481 614 -150 -454 118 841 -170 -496 253 -393 24 -643 225 -71 345 52 -128 95
5413 95 250 443 -426 -590 -21 119 -553 789 1181 299 -102 -222 -479 -789 156 -194 -536 -145 1500 33
5433 33 -17 121 119 -362 430 1176 12 808 100 528 10 574 -535 1057 -90 -381 416 -45 -477 248
5453 248 -495 -153 157 -158 173 -300 217 -129 -220 565 -1234 -523 636 -98 282 210 330 -748 -453 600
5473 600 -70 298 -613 1691 -96 -225 86 -1126 -229 -55 512 -429 -397 374 308 -615 -30 309 63 586
5493 586 310 115 66 48 656 -460 -414 523 -346 -1034 215 871 487 39 1288 -378 -128 638 -873
5512h73J603l83K00p14j80J8R88j448R53J812k345p84J231n03P44M10j401L80
5530b92K46l76M71L17k28N03q40j7M32M19r68Q35p06R99j687Q32L97j132J390
5549E95p80Q8Q46j48q10n33P05K5l08O3N17j068P22K98K77l65j05Q52j95m28J57
5570D05p8pm30N67m64k85N79J54j53J45K0q64j16M74M93r01L97n60j48N53O47
5591D28j28j495L23N74N19j173J598j76k53R41p66j260N27J92R49q75M50j10l33
5610f8o94R73R5o72R71J32n63j28o43P78O4l72N43N4r72K333r58r20M2j45J026
5631H76j558P83o33M21l43O40r46Q99O1q85l55J803k87j14p52j73P38l40L71l07
5651a01r0L83O61j060j28M18L54q21L33k96L35J579j183n79K65j172R59r11J610
$$ plain form
5512 -873 730 347 547 -167 -347 -329 659 -789 164 1976 -369 -1153 78 -425 319 729 -672 -292
5530 -292 -46 -422 49 366 138 641 -199 -216 216 635 -333 502 -204 795 -892 -60 337 -795 595
5549 595 -185 -97 749 601 -209 -742 -37 -12 -320 -257 260 -808 -86 212 489 124 19 871 676 248 405
5570 405 327 320 -110 457 -7 -292 287 441 288 433 453 -411 -527 -53 440 -461 -64 -624 -772 -219 428
5591 428 300 -1195 -872 -298 221 -952 646 470 217 1158 392 -868 -341 -149 800 -75 375 265 -68
5610 -68 -762 211 306 -366 605 737 174 46 -597 181 245 -127 416 470 -502 1831 873 -47 -5 -150 876
5631 876 -682 101 -532 -111 -454 186 -760 139 200 -685 -1040 763 476 362 -390 -563 175 -165 206 -101
5651 -101 -191 192 853 -207 -335 83 437 -384 -51 -347 -12 1567 384 -195 70 -1102 -143 -1054 556
5670E56p36M19J71M2r8k63q76N00P82l67K36K76q79Q14j00r9m37Q67l06o22Q7
5691c3N73r80K45P23p33r7K54R63j550P30K51o75n73m02J554q53J022M11n92k22
5711A6K36o6q96P33L3k82N21p52N71j47P9P77o54o05N86R99j254M14R2J0p75j85
5733e49N51l9Q88j42q15j52L47K88p36k44Q25L92k56p1N30k53o42K96j95l21N78
5754B80l22n81K05Q29m90M07o59o98j27J059J063m74k95k19m43J093r15q8N44
5773A69K63n54P92n39n89M63n71j16L2O07N53K58R2j411R81p18l46O10K34N9M81
5794G50j218J669j074k21l00J602q06l49O17o01N3q64J315q85O16l30L17N3k8
5813C16O09j441L46k14O99J58l78m66M13L97l67m40n52P60O1K22k1p25N82J32
$$ plain form
5670 556 -180 239 410 452 354 91 -785 -285 497 130 366 642 -237 577 477 378 -59 808 502 -120 -33
5691 -33 540 -440 -195 528 -205 -302 -48 915 -635 95 346 -329 -902 -1304 250 -603 419 830 238 16
5711 16 252 186 -710 23 56 -226 295 -457 114 -33 46 823 169 -436 150 1149 -105 309 401 411 -364 -549
5733 -549 2 -37 851 709 -106 -258 89 377 -359 -603 222 614 358 287 817 564 -78 218 23 -298 280
5754 280 -42 -623 -418 411 -79 328 -331 -1029 -1156 -97 966 492 197 -22 -465 628 -287 -375 169
5773 169 432 -122 670 131 -458 5 -566 -682 -650 -43 510 768 860 -551 430 -288 -634 -24 210 269 750
5794 750 -468 1201 127 -94 -394 1208 402 53 670 69 122 -742 573 -312 304 -26 291 344 316
5813 316 925 -516 -170 -384 315 473 95 -371 42 439 72 -368 -920 -160 -99 123 102 -623 -41 91
5833I1J18r17K39J265l25L56j056R34l59r46N5O87m09j49M42M3n74O09Q79j246
5853b63k7J119m05r13J151K7m41m13N73j532j77J844o73J60P00k97r68j80J120
5872D05J35j149J000j061M80R96j131J425j160n22J284r61k41J909r62j105P97
5889A39L84r30q09P40Q24K3n4m74L35J17m15j3o63M08J103j211P09j86n82K55
5909c00n7l5O60K61j01j167N79o3P9k22j42P19p7M70J7j238O46j34LL43P3J28
5931D42p01J17N24j31j078K22j45P60q17K012j541L15L80l79l55k81J820O6j627
5950c97J50P48j9m71M76p88l79N39J039p94m3KJ14m72M77K18q52J60N71P7m4j57
5972A55o95K14O58k18m13J44Q07p01Q5J01n55M31k80J169j76qq21J037m35L64
$$ plain form
5833 91 209 -708 -469 796 471 827 -229 705 346 -600 -545 142 -267 -416 26 69 -505 104 983 -263
5853 -263 -290 829 424 -489 662 689 248 -165 408 -1124 -1301 543 -130 30 730 433 -535 -715 405
5872 405 540 -609 391 -670 -190 806 -325 1100 -60 -582 702 -259 -500 1409 447 -658 139
5889 139 523 -407 -1216 -476 348 371 317 -157 178 295 -120 -133 -796 -388 715 -496 213 27 -555 -300
5909 -300 -357 -392 268 529 428 -739 -160 -223 -144 -366 -508 211 134 604 621 -617 29 -105 -102 241 314 442
5931 442 -259 -142 382 251 -827 -605 -750 10 -807 1205 -336 -21 359 -20 -375 -656 1164 1230 -397
5950 -397 -247 501 482 11 487 -301 -680 -141 898 104 61 63 177 -295 182 400 -452 -292 279 356 312 155
5972 155 -540 -326 332 114 -299 -155 652 -49 36 137 -418 13 -267 902 726 718 -103 934 499 863
5992H63K32q18M37m87k46q8j027P96J86o95J052p6M12o2m66o43O14p31P03o68
6012g12O19J88J104j725L18M39r88N10N51n1k24L46J37p51q90J567n44J62m00
6031c44J166K3o86M32p17r69Q17Q66k08l14NK79J18m50M56q88m11L18L54j43M86
6052A90O06j234Q66m34n17O88L93Nr19N04j30p23J45N55q9K50O51o49K47j42M88
6073G51o26j77m92O48J76k66N69n97r23J030k96Q2J56L40K96j141P22r70J007
6092B89k52K7k9K89j129R85n73p14J376l77k25l7j09Q54o19J711j035j794J429
6111F7l61j006O96O61o59Q54K66j99K98j631L05J057k09O81m35j044Q50J192j839
6130d56M87K19O27r05l99M03m15P47N54j254M27j60L36M66q01L23m36m99R2J691
$$ plain form
5992 863 1095 277 714 227 -19 -107 -1134 -338 -152 -847 205 129 541 479 13 -630 -16 -747 -44 -712
6012 -712 -93 95 1199 -526 -208 231 -757 -247 304 253 29 375 512 -239 -1129 438 -106 56 -344
6031 -344 822 845 159 591 -126 -1095 -278 588 380 66 71 350 468 18 474 -414 -825 -507 -153 -296 190
6052 190 796 -438 428 -6 -523 165 558 563 -356 148 18 -705 -560 -5 -94 156 807 158 405 263 751
6073 751 125 -52 -544 104 280 14 583 -14 -937 93 -203 -121 35 375 671 -470 252 -718 289
6092 289 37 64 35 324 -805 180 -393 -1107 269 -108 -333 -370 -479 375 -244 1467 432 -1362 67
6111 67 -294 -1300 -604 57 -602 252 518 319 617 -1014 -709 348 139 820 385 -659 191 1383 -456
6130 -456 31 250 877 -28 -427 -24 -439 308 862 -392 35 -125 211 677 -124 199 -237 -736 -644 1047
6150A047p18m65k96J61M45l52O89o87J47m90P76j585J402J2l81M31j50M76q42
6169c80M03M16j533P09M14r7j185Q99P71m91N52l32q72R04k18M35l00K31n56J239
6189A009j001L84J17j55n4R5k31k84P66k056J999q60J055k17j1k09k1n84j59J65
6209b52Q33o66QR86p49O60o7m18m68Q52m57p65R16j13n30n42J035l26m34J43j83
6230e37N39p79R14q88Q29j73J60o98j61P08O71j244J88N38K85l27p84J365j127
6249e21P40M21J04j303O13L36O9k50k88N28j112J266m98J15J53k47l79n0j89L30
6269a62O79r39J04m66J063o2M91m6J63j623Q79Q03j377J38M44O60m07o54M30m60
6289c42M39r50R84L33q2j001J328k22p04nL30L22J18j27k05L36l29L66p57l46
$$ plain form
6150 1047 329 -136 -432 -271 174 -178 511 -176 -29 -519 257 -1328 74 86 -295 136 -14 462 -380
6169 -380 23 439 -1094 -385 29 -68 -1253 -354 417 -74 478 146 -726 178 -40 395 95 326 -230 1009
6189 1009 8 392 509 354 300 395 164 -120 646 -1410 589 -271 784 567 556 347 326 -258 -417 -252
6209 -252 581 -85 -77 909 160 820 753 335 -133 719 262 -503 413 300 -230 -772 263 -63 -497 -354 -537
6230 -537 2 -777 137 -751 78 -95 65 -633 -794 -86 585 -659 -471 67 352 25 -759 606 -521
6249 -521 219 640 744 -559 54 390 459 209 -79 449 -663 603 105 220 373 126 -253 -303 -492 -162
6269 -162 517 -422 -318 -784 279 217 708 662 825 -798 81 884 -493 -355 89 749 342 -312 118 -342
6289 -342 97 -853 131 464 382 -619 709 487 -217 -222 108 430 548 421 216 552 223 589 -168 -514
6309e14L01l09O87N08j354n95J091O57J68j171Q33l43J92l2L93k99l02Q21r92
6328b60K51L61o03j70J122p98K90j43m94R38p39l32L19N85j50l19J79l9j99k32
6348d33L69p03Q59l97r05J884q80j53M47L80j079O43n59M88M98n38O92j456N77
6367b66L02P21n94n86Q81k26n91M70k61l9p55O48k85L22M80K13J79n33J189k117
6387h48J019k67O42m39l34Q62p50K41N65K44K19o96k31l09m90O77L47l80Q90j164
6407b02M76j98M62q57N23M73m51K47n11j44J57J18J016j650J127j97j46l18O7
6426hNO78j45r28K69M68Q4m71L91o94o4j30J062L15j85R66q73j570R50r56J055
6447B19M08l75q46P12j73n3l65l09O77o46P90J40l21N2M13p92J65J85O15q73M72
$$ plain form
6309 -514 -213 -522 165 673 -681 -1276 -185 472 640 -531 302 -41 151 119 512 213 -89 732 -260
6328 -260 -9 352 -251 -421 701 -97 193 50 -444 494 -245 -577 -258 327 177 -142 37 -2 -201 -433
6348 -433 -64 -767 92 -305 -1210 674 -206 -359 88 468 -611 32 -527 -39 459 -79 613 -843 -266
6367 -266 36 757 163 -423 458 232 -359 111 -150 -189 -944 -296 -581 -259 221 434 613 80 1269 -848
6387 -848 171 -96 546 107 -227 635 -115 126 691 935 1154 458 227 -82 -572 105 452 72 962 -202
6407 -202 274 76 538 -319 204 677 226 473 -38 -182 -25 93 1109 -541 586 389 243 -75 -8
6426 -8 -3 675 530 -398 -129 339 423 -48 343 -351 -415 -545 517 832 647 1613 740 -830 120 -836 219
6447 219 627 252 -594 118 -55 -108 -473 -782 -105 -751 39 179 -142 -90 323 -469 -304 -119 496 -377 95
6468I5O41n07q60J093m4r97L97l62P42j93J74L94n65r61J012k80r16K025p93r92
6488h97O52P21l70j477K004M3k25K10k05l76K64r4q36l58J912j090N82n82J008
6507H86k15j244J041k78p02L87Q16p31P28p37K12n52K16J75K21k83N36k48k63
6526c5j26L54o87l62J478l21k78M54k76o81L3J016n96J21o28n7L20J59j19N28
6546B97j28r07J377j138O3q1O20J34kj140J161n08J87J7j33Q98j11k92r67J436
6566G83j585J053j75M60j3m53P53n97k84j09R57o56m13L58L37m75J47J99p75l88
6586h76K00N88Q17j710K875q21j287L12K17j96L8%l40k85R31k3N44j242N37K95
6606E74k73p38J305j168J186k24k107J061J85M30o26Q48n84N1l97O36o81J442
$$ plain form
6468 95 736 229 -631 462 418 -579 -182 -544 198 5 179 573 8 -953 59 -221 -1137 888 95 -897
6488 -897 -245 476 106 -1371 633 676 451 661 456 80 344 250 -586 -944 968 -122 460 -122 886
6507 886 671 -573 468 190 -512 -125 691 -40 688 -49 163 -389 -173 2 223 -60 476 228 -35
6526 -35 -161 193 -494 -856 622 301 23 477 201 -480 -447 569 -27 94 -534 -591 -271 -112 -231 297
6546 297 169 -738 639 -499 -436 -517 103 237 235 -905 256 -252 -65 -48 -181 717 606 314 -653 783
6566 783 -802 251 76 536 523 70 823 226 -58 -167 790 134 -279 79 416 -59 88 287 -488 -876
6586 -876 -676 -88 729 -981 1894 1073 -214 98 315 119 157 157 -183 -468 463 440 984 -258 279 574
6606 574 301 -437 868 -300 886 662 -1445 -384 -199 231 -395 453 -131 -80 -477 159 -522 920
6624I20l18m76q71J25K28P7n03J010j089M82J232j208k33J88L76M17m51J96l94
6643b92Q60Q1n22n38j84L32P71j054N39P7J541j377J72n00j158J027m55R57j37
6662A40R1o01M46K6n78J92j07J053j269R90N26p89l70p56J319m91j66l24J536
6681H68j264M22N62n6q46J97L54k83L61O17o88p12O61n05k51k43P25K35q76Q4
6701f38P95j76l45O44j98K01l1o8m7j104J619j367L62O21P35j579J476m71L27
6720G56L35j441n5J62N3R00r50K2L45J69m50k99J041l88q84J207j43k72p23R82
6740C67j240N16n16J018j95P8j119L25P11p34M66o48J096q9P07n8r67N49j060
6759g93J074k7n45r61J994r43J01P48R1J74j329J236n93L89Q6k71j309M14J44
$$ plain form
6624 920 602 126 -745 -620 -392 -315 -818 192 -897 -415 817 -391 -624 -436 -60 357 -94 102 -292
6643 -292 568 649 127 -411 -595 -263 508 -546 -7 70 1611 234 406 -94 -1252 -225 -680 277 140
6662 140 231 -370 76 102 -476 -284 -391 662 -607 383 909 120 -250 -1006 313 -178 -344 -668 868
6681 868 -396 26 588 532 -314 -117 237 -46 315 932 244 -468 193 -312 -563 -806 -81 154 -722 -638
6701 -638 157 -19 -364 280 82 283 252 184 137 -967 652 -715 -353 268 1003 -576 900 429 756
6720 756 1091 -350 -405 -243 -190 710 -240 -218 127 296 -154 -453 588 200 -684 523 380 108 -615 367
6740 367 -873 -357 -873 145 -50 28 -1091 -766 -55 -789 -323 -971 125 36 743 685 -282 267 -793
6759 -793 281 254 -291 -1252 742 -201 -100 648 739 913 -416 820 227 616 702 431 -878 -464 -320
6778c20J214j309K92j049M55Q49R32j040m32L32O01r43N36K06K83p71k41M27K72
6797B94o89M03k23J16k35P09q63l16K396j593n12J83k85J060m68L17m80j8N36
6816C32N8n37J13J37l80J331l09j297J00P2J445j483J245J6j565n9J172k66o94
6835e69P16p47P55n55j08J403q95N52J19m35K0l50K45R73j175l70M20o02O13l74
6855c64J11O86j84n31K49k19P35j229N2J489q60Q02n03j048L75m16J258p52O08
6874B59l71Q91q00M51J88r02Q16m15k12j87O13l9o75K31R63q45o04l29O67J052
6894G52q03m84J244r67k38N79l97M8J71K63K9K9k34N62j244M68k74M05P79p45
6914e7k95M9M15o80N8J210j51p19N63j067O75O0O4M04n23n6j15j75L99L4J08m24
$$ plain form
6778 -320 894 -415 -123 -1172 -717 132 1064 24 -408 -76 525 -418 118 324 607 -164 -405 22 294
6797 294 -395 8 -215 -99 -334 375 -488 -804 1592 -1 -513 -330 -615 445 -23 294 -186 -204 332
6816 332 390 -147 -34 103 -277 1054 745 -552 -452 -380 1065 -418 827 843 -722 -781 391 125 -569
6835 -569 147 -600 155 -400 -508 895 0 552 671 236 256 -94 151 1124 -51 -421 -1 -603 10 -364
6855 -364 -253 433 249 -282 -33 -252 483 -746 -694 795 -65 737 234 -814 -439 -855 403 -349 259
6874 259 -112 779 -21 430 618 -284 532 117 -95 -282 331 292 -383 -152 811 -34 -638 -967 -300 752
6894 752 -51 -535 709 -258 -496 83 -314 -266 -95 168 197 226 -8 554 -690 -222 -496 -91 688 -57
6914 -57 -352 -303 112 -568 -510 700 549 -170 393 -674 1 61 125 529 6 -50 -165 -340 59 93 201 -223
6936b23Q65j42o86O83K32q71p1M32r9q4P14m24l59j44R06j250O14o28m32J475
6956E08p71j74o65J779j16r92Q87j075J088j22j26Q0o6K38m46K02m72J10jP72
6976F38l08K50j160J376l05K28j488N95r1J75k65J145l46l77M83p65k3J60M91
6995D13o95j98N12l72j24P36q26j1L90K06q34Q95n36J235j036P21m56K6P33k72
7015E07l85k59M59m57J37O2m95L56P38p30J107j023j36J64p4k2K52K6m38N29q47
7036e29P51J69O0m18Q26q79j76L22K8L09j2o07N55M01r49l10O91J65m27m5J54
7057G9n08J291O7j128j55Q21m18l77M09M94j020R30o0m45j188J080M46r89J005
7076C34K11j89p87J290p11l38L01M83j102k11J155k31L76n29L27O31r88Mk7n70
$$ plain form
6936 -223 642 500 -186 497 729 -142 -213 219 120 36 750 326 -33 -177 729 -521 93 -535 -967 508
6956 508 -263 -437 -1102 677 561 -431 456 -619 469 347 221 301 235 473 27 229 -243 -133 -134 638
6976 638 330 580 -580 796 491 719 -769 -174 -265 -90 -355 790 444 67 550 -215 -238 -78 413
6995 413 -282 -480 32 -340 -464 272 -554 -565 -175 31 -803 92 -444 791 -245 476 20 46 779 507
7015 507 122 -137 322 -135 2 64 -431 -75 663 -67 1040 17 -119 45 -29 -51 201 227 -211 318 -529
7036 -529 222 391 451 33 859 -20 -196 126 154 463 451 -156 399 800 -149 -459 232 397 -30 -75 79
7057 79 -429 862 929 -199 -354 467 49 -328 81 575 -445 485 425 -20 -1208 -128 318 -671 334
7076 334 545 356 -431 859 148 -190 111 594 -508 -719 436 205 581 52 379 1010 22 26 -1 -571
7096e71p8J511o08J54n68o40O29k53k1J96R15m12p43P14q86J425o59m18L45j75
7116a43K6L98J283k877O39P18o96J286K53j562j24J745m6j226k20O32n47j70L52
7135b79R98j822Q36J370j375K49J231j011j149O62M78P56p36J57m63n82K53j37
7153e64k65N08O91o94M74m30O48l80j82n5R86p64m71J583j66j254O88k79o25P35
7173A84M53m18m92J310k5J58j148P97j497J49O63j93k41O80n67o9l04R99k23p93
7193e77J321o40J40p24K52R21o77m17O13n90j48R40q45j24J211l44K80m42j69
7212a9p37J398r9p12M0J002m69p76K9J527j219q53P92Q70k32l56N17j057J716
7231A362k179J143m59k99K13K08k30P64k66o13Q41k85m86k85N28L02k50j010J879
$$ plain form
7096 -571 -649 862 254 408 -160 -800 -171 -424 -445 -249 666 254 -489 225 -661 764 105 -313 32 -143
7116 -143 -117 281 1564 -1313 -674 44 -652 634 887 -675 -799 946 900 -326 -546 86 -461 -631 -279
7135 -279 719 -1103 -267 1103 -272 -23 1208 197 -952 -290 188 944 208 365 -98 -680 -427 -564
7153 -564 -829 -321 370 -324 150 -280 368 -12 -194 -249 737 -27 -498 1085 919 -335 353 74 -551 184
7173 184 637 219 -273 1037 1012 1170 22 819 -678 -529 134 -59 -300 380 -187 -256 -560 439 216 -577
7193 -577 744 104 244 -480 -228 693 16 -401 212 -378 -526 414 -431 -555 656 312 592 150 -19
7212 -19 -756 642 543 -169 -129 873 404 -372 -343 1184 -35 -888 -96 774 542 186 703 -354 1362
7231 1362 -817 326 -133 -432 -219 -11 -241 523 257 -356 485 200 -286 -571 -43 259 9 -1001 878
7250H78r26n20O88p67N96J327K6j225J67J15K3r74K24J95J96M50n41j13R4M5P64
7271G22n74n38P97K36j242J89m41L59P15m87J85N61M3m84l10P4L6O78j124k5J039
7292D09o63L11Q2O61m51J10o4l73k84M88M56j342N31M96j432P84J076r15N48l76
7312E2k86J09j09J43M86n52K87k47j92M12K79q86J006M20r99Q49j514N43M54q48
7332e93J053l01l34L84o01J71k3O66r33M95K85j183L34L47J99j76J082m63J066
7351A475j218q5N0r23N18j9r44K020r35L39q82m0O01L16k38j260J040R84p02n00
7371d03R30j354j13N27K13K89L75m71K75j475J131j70n67O76J032j321k56R10
7389B28m25L02Q55j530K13P26n62N03k84N42r20J2M20n7o85J76K88pn98Q41J46
$$ plain form
7250 878 -48 -568 120 -647 -51 1276 1302 77 244 359 382 -592 -368 -173 23 473 -68 -181 -87 -42 722
7271 722 148 -390 407 643 -599 -410 -851 -492 223 -264 -79 482 525 41 -269 -195 -159 519 -605 -630 409
7292 409 -254 57 139 800 349 459 395 22 -262 226 682 -660 -129 367 -1065 -281 795 -120 428 52
7312 52 -234 -125 -234 -91 395 -157 130 -117 -309 103 382 -504 502 922 -77 772 -742 -199 255 -593
7332 -593 460 159 -175 209 -392 -221 -244 422 -511 -16 269 -914 -580 -233 -34 -210 872 409 1475
7351 1475 257 172 222 -701 -183 -202 -1146 874 -61 278 -604 -644 -43 273 35 -1225 -185 799 97 -403
7371 -403 527 -827 -940 -413 -200 89 464 -7 268 -1207 -76 -246 -813 -137 895 -426 -682 228
7389 228 -197 105 960 -570 -357 369 -193 310 26 568 -352 -340 80 23 -662 -486 -198 -205 -803 38 184
7410A84k56j26M62N29m89j31j087k05J020m19J86M01j92L31m25k41R1K15m78N85
7430d5o27J86J617j042m5J58j3k20j52j96L98M47q99m62Q62J87j74N01k27j69
7450H5m83j10K57RO4N0l43N02O38j553L81R52L07o58J24q18j86N73p0R02j178
7471e55O37m88k47M37R38m06M11j289M05k03R71j268Q51n91R72p55l9J25q1L57
7491A82j01K74j6q83L27M60r09j1J144j256K02M30n48J174l37K96j43l31M30J74
7511E58j011L83R82r57m95R51m97n84Q0O99J06o73k00J291L03r82m4j18j55m9
7531d12N39K62n15J114q34m08O81j376R69l08K09K59k18O24j026K03N82k67q37
7550g59O32K54O54q53K45N0m83K9J5l06Q48j54k98L43j22k30j5P95l32M94P66
$$ plain form
7410 184 -72 -198 264 793 304 173 -914 -1119 -99 -518 -332 69 -123 208 -217 -458 -367 -152 -630 -45
7430 -45 -672 -486 1131 89 44 202 189 -31 -183 -379 19 466 -433 -895 -33 154 -20 481 254 85
7450 85 -398 -508 -251 -242 -178 -128 -471 31 669 -884 -503 449 756 98 222 -596 -782 -209 -279 623 -555
7471 -555 82 -406 -653 -216 722 316 727 -562 -157 -360 611 -657 194 -397 575 -180 -219 -94 -175 182
7491 182 81 355 339 -544 -217 243 -666 -677 467 -789 -587 -157 -705 469 132 428 285 -46 384 558
7511 558 -453 -70 912 -45 -540 411 -86 -670 -590 109 215 -458 -658 633 936 -46 -90 -208 -363 -412
7531 -412 127 389 -126 988 154 -254 427 -949 20 -288 -79 180 -38 586 -440 -237 345 78 -759
7550 -759 -127 127 781 -72 173 223 -260 -231 -216 -522 326 172 -126 217 95 -135 -150 645 313 807 1573
7571A573j863N43K01j006p6J237j305O97P88q10K27M9j07l30M6M44j58M54l64
7590B40J04L82p82K5J8M20m5o57N58K01J05j25q78n78R78l43P02m5j55l1N88j004
7612c22O4M9O96L76j195j097Q43J144j881Q85J146l07J23q51J45o91J789j370
7630d54K38j35K16lO92o85r86J698j059J297l62k78r8O7P4r2L35m97O98j039M97
7651A24r98M97L81P50n42M52l85J79n12j92k12J610j206L28M41m00j60j76K68
7670B47K6l11Q98j446J326j219J187r92l17P74l20m34R71k99n0J91j144J296j343
7689i59J027M11J28m01r39J101p99M07p61P13q51P06M35k89n25Q41k69M52m94
7708f6M70K71q08M85j29p21r99J482j007N15J87O46K92k7m42q77J57J77P31m17
$$ plain form
7571 1573 -290 253 454 -552 -628 609 -696 1 789 -21 206 255 148 -182 -136 308 150 604 240
7590 240 344 726 -56 -31 -13 407 362 -295 263 464 569 444 -434 -1012 -34 -377 325 280 125 94 682 -322
7612 -322 -258 -209 487 863 -332 -1429 -586 558 -1323 -438 708 401 524 -327 -182 -873 916 -454
7630 -454 -216 -351 -135 -138 554 -131 -1117 581 -478 819 457 179 81 148 222 130 465 -32 666 -373 124
7651 124 -874 -377 4 754 212 664 279 458 -54 -246 -458 1152 -54 274 715 315 155 -21 247
7670 247 273 -38 860 -586 740 -479 708 -284 -601 173 -147 -581 390 91 41 232 -912 384 -959
7689 -959 68 479 607 206 -733 368 -431 -24 -785 -72 -923 -217 218 -71 -596 245 -24 428 -66
7708 -66 404 675 -133 352 223 -498 -1497 -15 -1022 -507 -320 326 618 591 149 -728 -571 -394 337 -80
7728h0N24p35N84r09O64n09Q23k1k64J90o51Q27m96L80M7m07J56R73l02o21o60
7749d87j87N03o22P39O36q23M63j97l91O4K69K8j88J333j193P0Q7Q28o32Q3O97
7770A080j034N21m84n6K45m92k31O79o12j07R34q89K32L06j91o62p81J423n82
7789g01m10J226J44J16L5N5J50j204R41K09m87K0j21k45K7M6J000n79l24R75m71
7810D02k43k66K51m79R52n41l3L66k35q1K21j02k78m7R71p77o43R44n4o3j702
7831a437J874m24k91P0J03L40J73m68J19K91K4m82l20M07K14K49L64o72L98m37
7851I5k69j3n17M26m66M52O50p90Q87n38l4L26J38k56q5l91O61m90K08N10L74
7872H78m51o68P96n3j324Q6P76P03k22q58R92o22P5l13N8N2l65M14k02n22Q86
$$ plain form
7728 -80 444 -291 293 -616 48 -461 362 341 77 267 -384 443 -53 327 374 -33 123 1096 794 173 -487
7749 -487 -674 -171 -793 -54 582 -241 222 25 -366 -302 -33 -5 -193 1140 -53 17 104 932 300 383 1080
7770 1080 46 567 83 27 272 -220 -451 228 -384 -491 443 -446 -214 92 -99 -761 -1542 -119 -701
7789 -701 -1111 115 259 375 410 465 615 -589 352 561 74 94 -27 -272 -245 -199 801 222 -102 873 402
7810 402 159 -107 144 -335 617 76 43 409 174 93 314 212 -66 -113 858 81 -562 382 328 265 -1437
7831 -1437 437 13 -278 -208 -105 235 408 -60 59 350 374 -108 -428 -21 193 442 806 134 532 95
7851 95 -174 -187 -704 -278 -744 -292 358 -432 455 -83 -117 209 347 91 6 -385 276 -214 -6 504 878
7872 878 427 -241 555 502 -822 -736 40 743 521 -337 655 33 108 -205 -147 -95 -460 -46 -248 -770 116
7893A16k68J40j049N4J242m73K63l96N81J76l5K6p10n28R38J20n43O21n43N90
7913C22q20M27O96p07l44O59l92o54J171m97J46M98O49j966K07Q88N12m50n31
7932a86K78J448k131j46N30k1J38j41R28q65K31n26O57m1k29M06r16N30J092j007
7952B9Q89j079M37K77k21l58j86K3Q04n95P20r32M26N44k79m66R20j265M61l4
7972A15j39m71k95R63l81R95m77r2j03K74r73K29O85Q0L54n38M82n94j181R66
7992a01k53R60q27Q76j15k50n48J207q47l55K84L39j045J004l56P5k31J030j007
8011a60M32r84L42N31o82K61J534p13n62M59q64M66J54l8j73R2L51l3n23L30r24
8032g04K11J077o91j28J18L65J63m66n35J408j705L39J127m64J26m74K76K47k1
$$ plain form
7893 116 -152 -12 -1061 -1007 235 -238 25 -371 210 386 351 377 -333 -861 77 197 -346 275 -268 322
7913 322 -498 -71 625 -82 -426 233 -159 -813 358 -139 7 505 1154 -812 -605 283 795 345 -186
7932 -186 92 1540 -591 -737 -207 -228 -90 -231 697 -168 63 -463 194 153 -76 330 -586 -56 1036 29
7952 29 918 -161 276 553 332 -26 -212 -189 615 20 740 -192 234 778 499 33 953 -312 149 115
7972 115 -24 -495 -790 173 -208 787 310 218 115 389 -584 -355 330 410 764 226 708 114 -1067 -101
7992 -101 -354 606 -221 655 540 290 -258 949 102 -253 31 370 -675 329 -27 48 -183 847 -160
8011 -160 272 -712 -370 161 -521 -260 1274 561 -1 458 -406 60 214 176 3 95 446 413 -110 220 -704
8032 -704 -493 584 -107 -235 -117 248 411 -55 -590 818 -887 -548 579 115 241 -233 43 290 269
8051B69r19R15l49K97o15j07L38O93p72J472j835J017q36M36O0k44j97M7M29q22
8071g23R75l12j24M7l88J103m49m22J459j507j21P79l34o45M15k86m05K94j2R27
8091B71o0p85R33k17M47j143P9O59l59J232p98l93L51p68O93mJ21k87J257p34
8111D95m67N5q79R07n87j06O26o15J527p46n19m05J75J086p17o5n05M89M88R80
8131A217p22m35J017j275j67j17M91j41m27N18Q6L69o97M56J01J83q05P49j91
8150B10j77k21L45K07j670J757K7j047P81k86M80j10K88K33J40j488J177l75k75
8169dp86O10J22M23r3q82J260j135K57k00O63p76j91R42l35L86k94q18K018j611
8189d44R98m33
$$ plain form
8051 269 -650 265 -84 213 -402 -509 -171 522 -250 1222 -613 404 -432 4 64 -180 -377 -330 99 -723
8071 -723 252 -60 -184 -137 -525 578 129 -293 1166 -341 -462 317 -17 -662 -247 -533 -938 -644 -656 271
8091 271 211 -574 359 142 589 -554 -475 184 -175 1057 259 -134 217 -551 142 138 259 -28 1229 495
8111 495 28 83 -796 111 -476 -582 44 -571 956 210 -309 -714 -539 547 -170 -235 -740 -251 237 1217
8131 1217 495 60 1077 -198 -365 -482 9 -132 -559 -41 45 414 -283 173 274 457 -348 401 210
8150 210 33 -188 157 364 -1306 451 478 -569 212 -74 406 296 584 817 957 -531 646 271 -4
8169 -4 -790 -180 -58 365 272 -610 650 -485 -228 -428 235 -541 -732 210 -125 261 -33 -851 1167 -444
8189 -444 554 121
8191A21
$$ Imaginary data points
##PAGE= N=2
##DATA TABLE= (X++(I..I)), XYDATA
0b0K0jK2m4O4r1J04j33J82k18K51k98L61m30M90n58O41p36Q42r52J087j239J387
23G31j567J767j960K200k485K773l090L472l907M383m938N617o401P342q547J0081
39E471j2128J5077j9696K7965m7337J45004L48315k36604k81191o3871K7981N189
51h5825J64052L5642j37372j4198J19101p8064j31991P1869J42295k9625o9579
62a3695K7834K4638q3543n5323O9398R9843L1346m3038j26823p7037J38290J53261
74A45151j14238j51858J01920J35117o1964j24685m6394O7638J66266L7837k00190
85d5400j13608J48185J08290q1443p4038K8143O3140M3536m8883j12588k990J09743
97B2087M0185m4523L761K6948p7486j14853N7304K07130P2243j66090j71913l065
$$ plain form
0 -20 0 -1 21 -23 41 -50 54 -79 103 -115 136 -162 199 -231 259 -299 342 -394 448 -504 583 -656 731
23 731 -836 931 -1029 1171 -1314 1459 -1631 1841 -2066 2317 -2621 2996 -3405 3937 -4610 5471
39 5471 -6657 8420 -11276 16689 -30648 114356 462671 226067 -55124 -118995 -91014 -85825
51 -85825 78227 113869 -23503 -37701 81400 3336 -128655 -56786 85509 55884 -13695
62 -13695 14139 38777 -44766 -100089 -30691 69152 100498 57460 -69363 -146400 -8110 145151
74 145151 30913 -120945 -19025 116092 54128 -70557 -116951 -49313 116953 154790 -45400
85 -45400 -159008 -10823 97467 16024 -58014 -29871 33269 76805 27922 -84666 -87656 22087
97 22087 62272 17749 21510 48458 -29028 -143881 -86577 120553 192796 26706 -145207 -148272
109a48272J42005J55345k8777k14932m3511K13398N4599k03994n9133J53732P9929
120A00389l6125o9603r3430J2433J52348L4936j34343k6966J06312p361j08955
131g0365J0598J18148K4553r8588n6159N0645N7861Q020m5773o4538K9186J27192
143I0780j5322j79268m611J95721M0026j64327q2411P4311J16160N5053j09186
154A6926j65899M5552J97750L3842j37682p3371M4149O0556Q806l3372n925L3397
166B4729j4127n7446J1974P6506J9735p4524o4842N1047J06846r424j24323m3401
178i7250R4649R6168k6456j25830n5760J26899J18827j01154j38884N0110J11003
189E2322J1349m6528n7283k0405P4993N1576q1379m6184R4542M0282r7482n5352
$$ plain form
109 -148272 -6267 149078 120301 -94631 -138142 75256 129855 -74139 -133272 20460 100389
120 100389 64264 -5339 -98769 -86336 66012 100948 -33395 -60361 45951 38590 -70365
131 -70365 -59767 58381 82934 -15654 -71813 -21168 36693 44713 -1060 -65598 -36412 90780
143 90780 75458 -103810 -108421 87300 127326 -37001 -119412 -45101 71059 126112 16926
154 16926 -148973 -103421 94329 128171 -9511 -82882 -38733 21823 30629 -2743 -8668 24729
166 24729 10602 -46844 -34870 41636 61371 -13153 -77995 -26948 79898 70474 -53849 -97250
178 -97250 -2601 93567 67111 -58719 -114479 12420 131247 30093 -108791 -58681 52322
189 52322 63671 17143 -40140 -60545 14448 66024 -15355 -61539 33003 73285 -24197 -79549
201g9549O4165O3629j1756l8381j0379R165p178j5418R34M0267O6701j2740j51633
214h2173p2864J62217J46107r0463j38075O371O4889M6588j142p5400l4687J05170
226C6538N9936j05522q3585O1556P3805p681l1271o821P860j3429k9089J0119
238b7584N8294L0542m3578o7844q220P9368M6022p3296o4352O6437Q1316l6005
250D1100r2349l0463O9964R3160j7400j06788j8352P9837J9913n3775k6182L1330
262a0005O0134J8658q7476q0211O1999R4850j2777m3135K330p201l3982m953L8319
275c450N4819J3737o3100p3731J3387Q3914M1861o2167o6495N3310Q4285n2214
287B4156j06499J9444R6858M2158k9188p5720n7924N8876R3199k9512p0333K9198
$$ plain form
201 -79549 -15384 48245 36489 -1892 -12271 -3106 -10284 -25702 -24768 15499 82200 69460 -82173
214 -82173 -155037 7180 153287 62824 -75251 -68880 -3991 42597 41455 -33945 -68632 36538
226 36538 96474 -9048 -92633 -31077 42728 35047 3776 -3045 4815 -8614 -37703 -27584
238 -27584 30710 61252 17674 -50170 -58390 20978 67000 -6296 -70648 -4211 77105 41100
250 41100 -51249 -81712 -11748 81412 64012 -42776 -61128 18709 38622 -15153 -41335 -10005
262 -10005 50129 68787 -18689 -98900 -36901 57949 45172 2037 4367 -2834 -36816 -41769 -3450
275 -3450 51369 65106 2006 -71725 -58338 25576 67437 5270 -61225 -7915 76370 24156
287 24156 -82343 -62899 33959 76117 46929 -28791 -86715 -27839 65360 35848 -34485 -5287
299e287M1069m0910l9486K8301M2689P366k9651k8468J0834K9422m639l4786n203
312b8749N0094L9128n2532p8207L2756Q6191q028o5343r317M3500L0777k0763
324A9507o9370j6807R2674O5113o5087q6500L499O0308L8592j8097m3905Q450
336a1623L4713k3715l9049K8438M3895o413l2710j5139J3861K5541j0373m1102
348c3676J4458O6366P150p7374n5997N0404R2631N84q7825l6739M9788M1915q657
361B3028l2278k2622L1181M8063l5619o9774L6981P1782k5157n7441J1698K9661
373I503P020r002k2839n065L4187J3895l9923j9497M0756K9381l7974m9392K7261
386b1689P1377n093p2891k4255M7358M5612m541n1715l9188M7219O8126l5952
$$ plain form
299 -5287 35782 -5128 -44614 -16313 26376 33742 4091 -24377 -13543 15879 11240 -23546 -28749
312 -28749 21345 60473 7941 -70266 -37510 48681 40653 -24690 -34007 9493 40270 19507
324 19507 -49863 -66670 26004 91117 26030 -60470 -56971 3337 41929 23832 -20073 -11623
336 -11623 23090 -625 -39674 -11236 32659 26246 -6464 -21603 -7742 17799 7426 -33676
348 -33676 -19218 47148 54298 -23076 -79073 -28669 63962 64546 -23279 -60018 -10230 31685 23028
361 23028 -9250 -31872 -691 47372 11753 -58021 -21040 50742 25585 -31856 -20158 9503
373 9503 16523 7521 -15318 -20383 13804 27699 -12224 -31721 9035 38416 442 -48950 -21689
386 -21689 49688 44595 -28296 -52551 -5193 40419 35878 -15837 -55025 -7806 60320 24368
398B4368p3873J4033O2143Q216l3238k8946Q078L6565M607l7777j888L7919k107
411A8100l4895p900K8088K7826j2475n0678r750O3115L5774n5879n4732K4899
423b8507N9610J0639m8049l1883L1855L7371j8767l8874j121M1639L6658l5600
435A4971p1089J4355Q0649L583n7948l182K5527m437q020l296k822K8074K3213
448C9578m7205m3929M3735M8859k8316m5007J8261M6462k470n5004k4681M2320
460g397N1506P70n3167m7596K8977O9082n460o7131J736N5071r71m2124q646J8274
474g076K5160P950l2214k2336L3754K1729l5760k7281L4604L9845q652m9842k6809
487d6928M1034M4477k1931m0332J2309L3858k739l9405k2300L5862N7055j0842
$$ plain form
398 24368 -49505 -35472 26671 34887 1649 -27297 -19219 17346 21953 -15824 -17712 20207 18100
411 18100 -16795 -24695 3393 31219 18744 -31934 -41684 21431 57205 1326 -53406 -28507
423 -28507 31103 41742 -6307 -38190 -6335 31036 12269 -26605 -27726 13913 50571 14971
435 14971 -56118 -41763 38886 42469 -15479 -18661 6866 2429 -5591 -8887 -11709 16365 39578
448 39578 -7627 -51556 -7821 41038 12722 -32285 -14024 32438 29968 -25036 -49717 -7397
460 -7397 44109 44879 -8288 -55884 -26907 42175 36715 -30416 -28680 26391 25420 -16704 -25350 -7076
474 -7076 18084 26034 -6180 -28516 5238 26967 -8793 -36074 -1470 38375 29723 -20119 -46928
487 -46928 -5894 38583 16652 -23680 -11371 22487 19748 -19657 -41957 -6095 50960 40118
499D0118o6510k1669M0708L8409j0656l8200j457M3343M169n5426j4033M8933
511G729K7399j7150k2965j7478Q797K9883r718l2734L0590M4447l8310o2546J3091
524c8965O2554K2090l3277m0410K745L4357J4819k5227k8242J9231M9382p821
536C1236o6392r382O3206J6955m3593j0411K1818P800l501j5719k2361K6827M9279
549D5762k4450n8949J0432M8263j162l2360o021K6284K0996k1775l9920N408M2846
562A5354K3273l1084l7954R546M2570K241m5385q844M5990K3117l2640l7539L7
575c1318M0001K8962k9615l6571K1660K7058j9900k0380J3285K2589R797k2312
587C256m0161J2563N6668J498n3983j0328M1595J5171k5524k3870P590L0278J1878
$$ plain form
499 40118 -26392 -48061 -7353 31056 20400 -17800 -19257 24086 28255 -27171 -41204 7729
511 7729 35128 17978 -4987 -22465 -13668 16215 6497 -26237 4353 48800 10490 -52056 -38965
524 -38965 23589 45679 12402 -28008 -25263 9094 23913 -1314 -29556 -10325 39057 31236
536 31236 -35156 -44538 18668 35623 -7970 -18381 3437 11237 7736 -7983 -30344 -3517 45762
549 45762 21312 -37637 -27205 21058 19896 -12464 -18485 7799 28795 7020 -32900 -27492 15354
562 15354 38627 7543 -30411 -20865 21705 23946 -21439 -30283 15707 38824 6184 -31355 -31318
575 -31318 8683 37645 8030 -28541 -6881 20177 277 -20103 -6818 15771 25568 3256
587 3256 -36905 -24342 32326 33824 -20159 -30487 11108 26279 755 -23115 -15525 14753 26631
600B6631k6420k8968J3702M0185N88m5473j4282M9395K2497m7189k4115L3037
612d12J9944j0003j0847j7233L822M1850m66n6596k716N9222M668m7503r107K9418
626D041J4071j1724j7652o828K3402K2440k0489l7829Q094M7989R276m9623k1185
639c6017M0545K4691k5361k1894N754J5644J5683j2632l1522J1833M2941j0453
651A9212m7838O217L8779Q636k1868k3884l02L3159J7714l6158k2318L1289K4057
664B6695k2996k8007Q199K9820J2094k3775k6493J0892K9638K998l0618j1314
676b2867L2860K3095l6975l4844K8668L9829j1295k2645j3292Q28K8134J2434
688B3930l8105j4827M8852J5720n2696j9733L9624K1985j2948j8292j0160J0919
$$ plain form
600 26631 211 -28757 -15055 25130 25718 -19755 -34037 15358 37855 -9334 -33449 -412
612 -412 19532 9529 -1318 -18551 -14729 27121 26655 -29941 -32657 26565 31233 -16270 -25377 4041
626 4041 18112 6388 -11264 -18092 5310 27750 7261 -30568 -22474 25515 34791 -14832 -36017
639 -36017 4528 29219 3858 -18036 -12282 3362 19045 6413 -25109 -13276 29665 19212
651 19212 -28626 -22409 16370 25006 3138 -20746 -21048 12111 29825 -6333 -28651 2638 26695
664 26695 3699 -24308 -16109 13711 25805 2030 -24463 -13571 16067 19065 -11553 -22867
676 -22867 9993 33088 -3887 -38731 -10063 29766 18471 -4174 -17466 -16638 11496 23930
688 23930 -14175 -29002 19850 35570 -17126 -36859 2765 24750 11802 -6490 -16650 -5731
700e731K3383n280l2924n46M1864J2464m3750k7574L6614L1074k5204k2273J5430
713b453J3338j225r947k1605K247M7503J0224n6876k0041M7693J7731k8479j4864
726a6754J0785J8571P061k3056k7584J7620M2030n586l5803p899K5171J1250k0353
739d547j5834K1384K5596j1043l4078j2381K9332L1761j2634l8056K258L5695
751A7453j718l0274m441K1836J9532j924l5419k2400L8217L5906l1100l5250K5410
764d172K6253j5013k0606k829J3177K4667j326l5245j1724L4281J6378k8750j8472
777b3381K7241K5522k4502l1825J0998K9396N347j3918j9682m440L1102J7574
789B9432m0500k7773M6610L3552l5881l4057J2613K2072R203n486k2055l112K8322
$$ plain form
700 -5731 17652 12372 -20552 -21098 20766 33230 -10520 -38094 -1480 29594 4390 -17883 -2453
713 -2453 10885 9660 -287 -21892 -19645 27858 38082 -18794 -38835 8858 26589 -1890 -16754
726 -16754 -5969 12602 19663 -3393 -30977 -13357 28673 23087 -12716 -20615 4556 15806 -4547
739 -4547 -20381 1003 26599 15556 -18522 -30903 -1571 30190 17556 -20500 -18242 17453
751 17453 15735 -14539 -18980 2856 22388 20464 -14955 -37355 862 36768 5668 -29582 -4172
764 -4172 22081 7068 -13538 -16367 -3190 21477 20151 -15094 -26818 7463 23841 -4909 -23381
777 -23381 3860 29382 4880 -26945 -15947 13449 18796 4878 -14804 -19244 11858 29432
789 29432 -11068 -38841 7769 41321 5440 -28617 -16004 6068 15271 9785 -12270 -15382 12940
802A2940M105l3415p858L5713J8662k7627k8507J2440K9052r68k2663n962J6425
815B337J4381p253k9186k821L7500J7322l6811k7096K6263K6218o683k4650j1331
828b1810K1386K8482j6843l9269Q465L8849J956k6956j1713R785K0391L153k5868
841i992j0072K7967J5567k6041k0772J9703K5245j0861k7919p61K9296J0799k0885
854A274k0895K762K8007J8035k8093l6188K5840M2599j9536l7929R658K5346L164
867A4044j0258j5858m823K5293J7115l0723k2023K7427K3927j8655k6278R671
879a1141K5511k57k2132p917J7696J3773o837k1128q803K6003K5321k5414l6963
892c2288J9269L8461r498l1448k442J8876J9407n574l2083r480L4139J9823k3726
$$ plain form
802 12940 17045 -16370 -24228 11485 30147 2520 -25987 -13547 15505 14537 -8126 -14088 2337
815 2337 16718 9465 -19721 -22542 14958 32280 -4531 -31627 -5364 20854 14171 -10479 -21810
828 -21810 -424 28058 11215 -28054 -19589 19260 21216 -5740 -17453 -7668 12723 15876 -9992
841 -9992 -20064 7903 23470 -2571 -23343 -3640 21605 10744 -17175 -17936 11360 22159 1274
854 1274 -19621 -16859 11148 29183 1090 -35098 -9258 33341 13805 -24124 -14466 10880 14044
867 14044 3786 -12072 -16895 8398 25513 -5210 -27233 194 24121 5466 -20812 -11141
879 -11141 14370 14113 -8019 -15936 1760 15533 8696 -12432 -21235 4768 30089 4675 -32288
892 -32288 -13019 25442 15944 -15504 -17946 930 20337 14763 -17320 -26800 7339 27162 3436
905C436k1898R796J8397J078j8576p196K1994J3970k2590k0154J4211K3270L41
918A6079k3620j1656K1014J8458j6124k5845P562K8354J0688k3310k9705J2632
930a5473L8480j475l7281l183K8688O569j4699j3839l978K0456K1756k2096l1135
943b7210J8455L0468j4985k2498Q623K1005j024j9248j1901J3661J9362j750k0567
956g609j0106J9237K0869j7440l3900J3925M3721m309l8700j0365J9998J8678
968A3999K785j9760j7990K0178K2807j9776k4688J6265K4397l503k1530j1199
980a8015J5211J6792q769j8890Q204J9732m291k1781q746J9265K4203q914l1334
993a7333k368K7487J2685k1223j9943J2164K8544J22l3381j3599K8481K0673j4268
$$ plain form
905 3436 -18462 -8666 9731 10809 -7767 -14963 7031 21001 -1589 -21743 -7532 15738 16079
918 16079 -7541 -19197 1817 20275 4151 -21694 -14132 14222 24910 1600 -28105 -15473
930 -15473 23007 21532 -15749 -18932 9756 16325 1626 -12213 -16191 4265 26021 3925 -27210
943 -27210 -8755 21713 6728 -15770 -7147 13858 12834 -6414 -18315 -4654 14708 12958 -7609
956 -7609 -17715 1522 22391 4951 -28949 -15024 28697 24388 -14312 -24677 -4679 13999
968 13999 16784 -2976 -20966 -788 22019 2243 -22445 -6180 18217 14714 -6816 -18015
980 -18015 -2804 13988 5219 -13671 -5467 14265 9974 -11807 -20553 -1288 22915 14001 -17333
993 -17333 -19701 7786 20471 -752 -20695 -8531 20013 20135 -13246 -26845 1636 22309 8041
1006H041j8649k943J3076J7741j0809k7327J0805L3143j0106l1023O003K1959
1018I911L32j2236n958M820J4860K62k2909j1248K4598K5994j8144l4750K674
1031b1794L8895N491l1276r198J8036J3883j918j7263j7148J6271L1969j1697
1043A4251l6245P479K9025m016j9416n33J1206J0085m400k0623k462K5179Q908
1056A8438k2354j4120J6016J8917o176k6319l585K8087J4710k2983k2813R398
1068a2784K7040P074k5741k0069J9583K6318r858k3901l703J8011J4570p824k3659
1081a4943J410K7490N73k9344J297K3850K297j6609p465M622J5285Q145k1956
1094e348j7221K1699K5000j4142l1650M633K9363J0543k5099j9407J4752K1183
$$ plain form
1006 8041 -10608 -13551 -475 17266 6457 -20870 -10065 23078 12972 -18051 -12048 9911
1018 9911 10243 -1993 -7951 -3131 11729 11991 -10918 -22166 2432 28426 10282 -24468 -21794
1031 -21794 17101 22592 -8684 -17882 154 14037 12119 -5144 -22292 -6021 25948 14251
1043 14251 -21994 -14515 14510 10494 -8922 -9455 1751 11836 7436 -13187 -15649 9530 18438
1056 18438 -3916 -18036 -2020 16897 10721 -15598 -19183 8904 23614 631 -22182 -12784
1068 -12784 14256 21330 -4411 -24480 -4897 21421 11563 -12338 -16041 1970 16540 8716 -14943
1081 -14943 -13533 13957 14530 -14814 -13517 10333 12630 -3979 -11444 -6822 8463 16608 -5348
1094 -5348 -22569 -870 24130 9988 -21662 -17029 12334 22877 -2222 -21629 -6877 14306
1106A4306n76j6194j5684J0229K7432k409l4946q74L3737J844k5947l483J5475
1119B910O373k311j2423q934J6256J5889j5341k2808J4835K3655o520k5838n050
1132a9307K6708J6143j9169k4100N423K3251J1059j6057k3638Q324K9940k169
1144A6408k9373n483K3242J1389j0320j6192l432J9793R072k0036j0753K0366
1156D681J0743j5396j4324O994J4976P974j3822k1402J1544K7462o668k9299n28
1169a7065K5483J2984j9250k0985O519K3089N740j7295j4901O390K1453L488k6219
1182a0569j0967L0547J3374k5397j3169J4653Q836l274m139p071M624J6865p648
1195F665k5835P372L0103p94k8341p847J9514J5190r930j7794K83J7604J1273
$$ plain form
1106 14306 13730 -2464 -18148 -7919 19513 17104 -17842 -18716 15021 16865 -9082 -12565 2910
1119 2910 9283 6972 -5451 -14385 1871 17760 2419 -20389 -5554 18101 11581 -14257 -19307
1132 -19307 7401 23544 4375 -19725 -14302 8949 20008 3951 -19687 -11363 18577 16408
1144 16408 -12965 -18448 4794 16183 5863 -10329 -13761 6032 15104 -4932 -15685 4681
1156 4681 15424 28 -14296 -7302 7674 15648 1826 -19576 -8032 19430 12762 -16537 -17065
1169 -17065 8418 21402 2152 -18833 -12314 10775 16515 -780 -15681 -9291 12162 15650 -10569
1182 -10569 -21536 9011 22385 -3012 -16181 -1528 7308 4034 -105 -7176 -2552 14313 6665
1195 6665 -19170 -11798 18305 17511 -10830 -18677 837 16027 6097 -11697 -11414 6190 17463
1208A7463j3067k1952J585K8878R982k8692j4467K0668J4321j2988j1178M088
1220e359Q717Q260r126j9338Q947K3724m809k2875J412J7331M152j2422j2693
1233a4079P546J9787K688k5190j0658K0502J6518j0092j9948n75K1823Q317j8378
$$ plain form
1208 17463 4396 -17556 -15971 12907 22889 -5803 -20270 398 14719 1731 -9447 -5359
1220 -5359 3358 11618 2492 -16846 -7899 15825 11016 -11859 -10447 6884 11036 -1386 -14079
1233 -14079 -6533 13254 15942 -9248 -19906 596 17114 7022 -12926 -13501 8322 16639 -1739
$$ [...]
8191E57
##END NTUPLES=NMR FID
##END=
