##TITLE=1H_SAM_20.108
 CDCl3, 108 sc, 
 11.3.2019
##JCAMPDX= 6.0         $$ Bruker NMR JCAMP-DX V2.0
##DATA TYPE= NMR FID
##DATA CLASS= NTUPLES
##ORIGIN= UXNMR, Bruker Analytische Messtechnik GmbH
##OWNER= root
$$ XWIN-NMR		Version 3.5
$$ Mon Mar 11 17:18:03 2019 Russian Standard Time (UT+4h)  she@DPX200
##.OBSERVE FREQUENCY= 200.1316
##.OBSERVE NUCLEUS= ^1H
##.DELAY= (6, 6)
##.ACQUISITION MODE= SIMULTANEOUS
##.ACQUISITION SCHEME= undefined
##.AVERAGES= 108
##.DIGITISER RES= 18
##SPECTROMETER/DATA SYSTEM= spect
##.PULSE SEQUENCE= zg30
##.SOLVENT NAME= CDCl3
##.SHIFT REFERENCE= (INTERNAL, CDCl3, 0, 15.7039)
##AUDIT TRAIL= $$ (NUMBER, WHEN, WHO, WHERE, WHAT)
$$ ##TITLE= Audit trail, XWIN-NMR		Version 3.5
$$ ##JCAMPDX= 5.01
$$ ##ORIGIN= Bruker BioSpin GmbH
$$ ##OWNER= she
$$ F:/spectra/data/she/nmr/H-F/1/audita.txt
$$ ##AUDIT TRAIL=  $$ (NUMBER, WHEN, WHO, WHERE, WHAT)
(   1,<2019-03-11 17:15:51.92 +0400>,<she>,<DPX200>,
      <continue with go, POWCHK disabled, PULCHK disabled
       configuration hash MD5:
       00 E9 B6 7A A2 85 ED C7 34 08 36 98 17 FE 4E 26
       data hash MD5: 16K
       AC 58 3C BE 87 C5 92 BC 8D 93 41 11 93 BC 8B C2>)
$$ ##END=
$$ 
$$ hash MD5
$$ 91 13 F0 7A AC B9 00 12 40 AA BB 1B 27 0B 6D 40
##$RELAX= 
##$RELAX= 
##$RELAX= 
##$RELAX= 
##$RELAX= 
##$RELAX= 
$$ Bruker specific parameters
$$ --------------------------
##$DU= <F:/spectra>
##$EXPNO= 1
##$NAME= <H-F>
##$PROCNO= 1
##$TYPE= <nmr>
##$USER= <she>
##$AMP= (0..31)
100 100 100 100 100 100 100 100 100 100 100 100 100 100 100 100 100 100 
100 100 100 100 100 100 100 100 100 100 100 100 100 100 
##$AQSEQ= 0
##$AQ_mod= 1
##$AUNM= <au_zg>
##$AUTOPOS= <>
##$BF1= 200.13
##$BF2= 200.13
##$BF3= 200.13
##$BF4= 200.13
##$BF5= 200.13
##$BF6= 200.13
##$BF7= 200.13
##$BF8= 200.13
##$BYTORDA= 1
##$CFDGTYP= 0
##$CFRGTYP= 5
##$CHEMSTR= <none>
##$CNST= (0..31)
1 1 145 1 1 1 1 1 1 1 1 1 1 1 1 1 1 1 1 1 1 1 1 1 1 1 1 1 1 1 1 1 
##$CPDPRG= <>
##$CPDPRG1= <>
##$CPDPRG2= <>
##$CPDPRG3= <>
##$CPDPRG4= <mlev>
##$CPDPRG5= <mlev>
##$CPDPRG6= <mlev>
##$CPDPRG7= <mlev>
##$CPDPRG8= <mlev>
##$CPDPRGB= <>
##$CPDPRGT= <>
##$D= (0..31)
0 1.2 0 0 0 0 0 0 0 0 0 0.03 0 0 0 0 0 0 0 0 0 0 0 0 0 0 0 0 0 0 0 0 
##$DATE= 1552309784
##$DBL= (0..7)
120 120 120 120 120 120 120 120 
##$DBP= (0..7)
150 150 150 150 150 150 150 150 
##$DBP07= 0
##$DBPNAM0= <>
##$DBPNAM1= <>
##$DBPNAM2= <>
##$DBPNAM3= <>
##$DBPNAM4= <>
##$DBPNAM5= <>
##$DBPNAM6= <>
##$DBPNAM7= <>
##$DBPOAL= (0..7)
0.5 0.5 0.5 0.5 0.5 0.5 0.5 0.5 
##$DBPOFFS= (0..7)
0 0 0 0 0 0 0 0 
##$DE= 6
##$DECBNUC= <off>
##$DECIM= 24
##$DECNUC= <off>
##$DECSTAT= 4
##$DIGMOD= 1
##$DIGTYP= 9
##$DL= (0..7)
0 120 120 120 120 120 120 120 
##$DP= (0..7)
150 150 150 150 150 150 150 150 
##$DP07= 0
##$DPNAME0= <>
##$DPNAME1= <>
##$DPNAME2= <>
##$DPNAME3= <>
##$DPNAME4= <>
##$DPNAME5= <>
##$DPNAME6= <>
##$DPNAME7= <>
##$DPOAL= (0..7)
0.5 0.5 0.5 0.5 0.5 0.5 0.5 0.5 
##$DPOFFS= (0..7)
0 0 0 0 0 0 0 0 
##$DQDMODE= 0
##$DR= 18
##$DS= 0
##$DSLIST= <SSSSSSSSSSSSSSS>
$$ [...]
##$SUBNAM2= <"">
##$SUBNAM3= <"">
##$SUBNAM4= <"">
##$SUBNAM5= <"">
##$SUBNAM6= <"">
##$SUBNAM7= <"">
##$SUBNAM8= <"">
##$SUBNAM9= <"">
##$SW= 24.9336934301222
##$SWIBOX= (0..15)
0 0 2 0 0 0 0 0 0 0 0 0 0 0 0 0 
##$SW_h= 4990.01996007984
##$TD= 16384
##$TD0= 1
##$TE= 0
##$TE2= 300
##$TE3= 300
##$TEG= 300
##$TL= (0..7)
0 120 120 120 120 120 120 120 
##$TP= (0..7)
150 150 150 150 150 150 150 150 
##$TP07= 0
##$TPNAME0= <>
##$TPNAME1= <>
##$TPNAME2= <>
##$TPNAME3= <>
##$TPNAME4= <>
##$TPNAME5= <>
##$TPNAME6= <>
##$TPNAME7= <>
##$TPOAL= (0..7)
0.5 0.5 0.5 0.5 0.5 0.5 0.5 0.5 
##$TPOFFS= (0..7)
0 0 0 0 0 0 0 0 
##$TUNHIN= 0
##$TUNHOUT= 0
##$TUNXOUT= 0
##$USERA1= <user>
##$USERA2= <user>
##$USERA3= <user>
##$USERA4= <user>
##$USERA5= <user>
##$V9= 5
##$VALIST= <valist>
##$VCLIST= <CCCCCCCCCCCCCCC>
##$VD= 0
##$VDLIST= <DDDDDDDDDDDDDDD>
##$VPLIST= <PPPPPPPPPPPPPPP>
##$VTLIST= <TTTTTTTTTTTTTTT>
##$WBST= 1024
##$WBSW= 4
##$XGAIN= (0..3)
0 0 0 0 
##$XL= 0
##$YL= 0
##$YMAX_a= 865577
##$YMIN_a= -1175526
##$ZGOPTNS= <>
##$ZL1= 120
##$ZL2= 120
##$ZL3= 120
##$ZL4= 120
##$ABSF1= 10
##$ABSF2= 0
##$ABSG= 5
##$ABSL= 3
##$ALPHA= 0
##$AQORDER= 0
##$ASSFAC= 0
##$ASSFACI= 0
##$ASSFACX= 0
##$ASSWID= 0
##$AUNMP= <proc_1d>
##$AZFE= 0.1
##$AZFW= 0.1
##$BCFW= 1
##$BC_mod= 2
##$BYTORDP= 1
##$COROFFS= 0
##$CY= 11.3945322036743
##$DATMOD= 1
##$DC= 2
##$DFILT= <>
##$DTYPP= 0
##$F1P= 18.9103706918063
##$F2P= -1.10871071338519
##$FCOR= 0.5
##$FTSIZE= 0
##$FT_mod= 4
##$GAMMA= 1
##$GB= 0.15
##$INTBC= 1
##$INTSCL= 1
##$ISEN= 128
##$LB= 0.24
##$LEV0= 0
##$LPBIN= 0
##$MAXI= 10000
##$MC2= 0
##$MEAN= 0
##$ME_mod= 0
##$MI= 1.114404
##$NCOEF= 0
##$NC_proc= 0
##$NLEV= 6
##$NOISF1= 3.799351
##$NOISF2= 2.8
##$NSP= 1
##$NTH_PI= 0
##$NZP= 0
##$OFFSET= 15.70392
##$PC= 1
##$PHC0= -8853.936
##$PHC1= 19.8001
##$PH_mod= 1
##$PKNL= yes
##$PPARMOD= 0
##$PSCAL= 0
##$PSIGN= 0
##$REVERSE= no
##$SF= 200.130013532006
##$SI= 16384
##$SIGF1= 3
##$SIGF2= 2
##$SINO= 400
##$SIOLD= 16384
##$SREGLST= <1H.CDCl3>
##$SSB= 0
##$STSI= 0
##$STSR= 0
##$SW_p= 3612.71676300578
##$SYMM= 0
##$S_DEV= 0
##$TDeff= 0
##$TDoff= 0
##$TI= <>
##$TILT= no
##$TM1= 0
##$TM2= 0
##$TOPLEV= 0
##$USERP1= <user>
##$USERP2= <user>
##$USERP3= <user>
##$USERP4= <user>
##$USERP5= <user>
##$WDW= 1
##$XDIM= 8192
##$YMAX_p= 0
##$YMIN_p= 0
$$ End of Bruker specific parameters
$$ ---------------------------------
##NTUPLES= NMR FID
##VAR_NAME=  TIME,          FID/REAL,        FID/IMAG
##SYMBOL=    X,             R,               I
##VAR_TYPE=  INDEPENDENT,   DEPENDENT,       DEPENDENT
##VAR_FORM=  AFFN,          ASDF,            ASDF
##VAR_DIM=   8192,          8192,            8192
##UNITS=     SECONDS,       ARBITRARY UNITS, ARBITRARY UNITS
##FACTOR=    0.0002004,     1,               1
##FIRST=     0,             0,               0
##LAST=      1.6414764,     0,               0
##MIN=       0,             -1175526,        0
##MAX=       1.6414764,     865577,          0
$$ Real data points
##PAGE= N=1
##DATA TABLE= (X++(R..R)), XYDATA
0@%%%%%%%%%q6J94k16K16k16L05m13M32n40O48p55Q74r83J188j396J604j824K063
27A095k347K669l020L412l847M317m825N394o026O704p447Q274r170J0158j1247
42e906J2451j3786J5266j6928J8791k0899K3315k6108K9369l3244L7950m3789
54b3518N1275o1284P5410r7017J34570k18191P38504m40818j334457J213590Q27513
65H65577p19557p48353N49774L00972k57871r7257J73499j86844o1149K36566
75E5357Q5188k67005m9408J58841Q6024l8106k3637j14536r169K19026J23472
86B26047k66552j94604K34712K82185j59224l02259N2042K95805L2258k49708
96d9298r5937J90986J00957j44462r4543J00085N6649q7593m1413N9295K7592
$$ y = [0, 0, 0, 0, 0, 0, 0, 0, 0, 0, -86, 108, -108, 108, -108, 197, -216, 216, -324, 324, -431, 443, -540, 648, -748, 856, -968, 1095, -1252, 1417, -1603, 1809, -2038, 2279, -2546, 2848, -3178, 3526, -3921, 4353, -4817, 5341, -5906, 6545, -7241, 8025, -8903, 9888, -11011, 12304, -13804, 15565, -17679, 20271, -23518, 27757, -33527, 41883, -55134, 79436, -138755, 599749, 158931, -1175526, 38064, 865577, 146020, -602333, -52559, 248413, -9458, -106715, 66784, -120060, -181209, 55357, 140545, -126460, -175868, -17027, 68997, 30891, 7254, -107282, -116451, 102575, 226047, -40505, -235109, -397, 281788, 122564, -179695, -127653, 168152, 200410, -49298, -145235, 45751, 146708, 2246, -92297, 7788, 64437, -23156, -64569, -5274, 22318]
107B2318l5239l7476j4542L8983P3772m0048j22440M2491J65217m0497j79319
118a26780O3357J96472q2321j95776J18968K04410j35593j98941J51062K01374
128A96232j46920j96550J28866J87661r6424j74177M1931J35310P427q8214n9268
139f4126J2377P5938M3616p9730r5539N5113J10622l6152r9877K3674P7347k8406
151e143m8365N5247L8959p9244l1462J09357N6820j15167p4816J12091J01457
162A19734q1906j08482M5632J04651o23q0514m4669M1079P0981j462r5501m7350
174g8430R1657P1738r1839r1809P8220Q1597q1391o9502R1203N2940j08915l9362
186i3893J26817L9049j30775l5811J32769M4625j14351l7760R9032M0287o9569
$$ y = [22318, -12921, -50397, -64939, -25956, 47816, 7768, -114672, -72181, 93036, 52539, -126780, -63423, 133049, 50728, -145048, -26080, 178330, 42737, -156204, -5142, 196232, 49312, -147238, -18372, 169289, 72865, -101312, -59381, 75929, 83356, -4858, -64126, -51749, 24189, 67805, -11925, -107464, -52351, 58271, 22119, -77758, -54084, 23263, -5143, -53508, 1739, 40698, -38546, -70008, 39349, 96169, -18998, -93814, 18277, 119734, 37828, -70654, -25022, 79629, 79006, -1508, -46177, -5098, 65883, 64421, -31080, -78430, 13227, 84965, -6874, -98683, -20463, 61134, -20257, -89759, 1444, 54384, -54531, -93893, 32924, 71973, -58802, -94613, 38156, 82781, -31570, -69330, 29702, 69989, 420]
197D20l2211M7601K6884k0677j5363l185L864K0996Q474m3423k1120N2107K1158
210D5525o6451k9406O8549K1845p7040k5194P8137J8883p9390j8278P1842J8469
222B7491o3006q122N4193N393l8888N507L4484m954j7299Q966P175l371J4201
235B1770J412k8684j496M9541L31o4623m074P1801L205q1771p991P9644K925q5332
249d3342l907P5816m265p0377O389N8659j4327m7364J8724L9843k0551k8578K4109
262i171K1893j6235o815J6344l019n141J8736N787k9714J361M2856n848m5017
275a3983P126M6715j0747m8577J0870M2355j6885m2377J6067L2387k1471k9010
287b7530J8534J7276k2602j1098J9935J613j7988Q199J4159j4003p808K5941P123
$$ y = [420, -31791, 15810, 42694, 22017, 6654, 3469, 7333, 28329, 36803, -6620, -27740, 24367, 45525, -20926, -50332, 18217, 40062, -36978, -62172, 15965, 34848, -44542, -62820, 9022, 27491, -35515, -43637, 10556, 15949, -22939, -17432, 17052, 12098, -5201, 3765, 10940, 7569, 21770, 23182, -5502, -6998, 42543, 42874, -21749, -25823, 45978, 49183, -32588, -40579, 39065, 41990, -43342, -47249, 28567, 24302, -46075, -39686, 18973, 4646, -42718, -23994, 15849, -4702, -33280, -9171, 12722, -3513, -10328, 6016, 2997, -2144, 16592, 22379, -7335, -5974, 36882, 31034, -13983, -6857, 39858, 29111, -19466, -8596, 33759, 16874, -25503, -9436, 22951, 1480, -27530, -8996, 8280, -14322, -25420, -5485, -3872, -21860, -13661, 498, -13505, -21313, 4628, 11751]
300A1751l1476L386L9951l901m0353J3502M5587j6124m4407K1993M3798k5883
312A7824l9652K6001L5572l0878l0583L0214J9195l2188j6160K5719M518k6641
324a7059J051J9947j1260j7800J6844J0411k2152m167K8440r41k6369R951L0297
337A7193j3226k5286K1873K7067k2620j8362K6833J5496k5147q877K6473K840
349B4257k6250K465K0453q896k0354J0263J3648j9701j1416K0090M576k7620j666
362b0151K7638o303k9034J0016K8313j7424k4652K1880K5573k3906j8206K9399
374C143J7160k8501p855L2477M601k8064M530K7581p000k4744J2761J9576j6675
387H990j5394J7788Q032k3940m356K0662k741k5034M198K0732j3544j9027J6515
$$ y = [11751, -19725, -16339, 23612, 19711, -20642, -7140, 38447, 22323, -22084, -91, 43707, 17824, -21828, 4173, 39745, 8867, -21716, 8498, 27693, -4495, -20655, 5064, 9582, -17059, -16008, 3939, -7321, -25121, -8277, 2134, -20018, -24185, 4255, 3314, -23055, -13104, 17193, 3967, -21319, 554, 27621, 5001, -13361, 13472, 28968, 3821, -5056, 21417, 24257, -1993, 472, 20925, 12029, -8325, 1938, 15586, -4115, -15531, 4559, 9135, -18485, -20151, 7487, 1184, -27850, -17834, 10479, -6945, -31597, -9717, 15856, -8050, -26256, 3143, 20303, -8198, -16053, 16424, 21025, -7039, -2509, 25072, 18072, -6672, 6089, 25665, 8990, -6404, 11384, 19416, -4524, -8880, 11782, 9041, -15993, -11795, 8937, -4607, -23634, -7119]
400g119J4533k2511j0759K3515P175k2842n82K4761l347k1005J2432K1876j4220
413A907j4403K1634J3229k1230n217K2901K134k5182N880K3391j1402k3848J4243
426D037J7444j9512j7625K0763Q863k7145o365K4544J793k7568L32K4743o437
439b133k2557J1954K1406j4179j6519K0241J3250j8363o196K1298L731j7642M376
452a333J8869o353j6459J3141J3081j2820j3037J6620O923j9139m470J8460l862
465I621k0709L277J9246j0012j9364J0759J3725j5261j2390J7416P537j9900l210
478a9265K1775j871j6910P970J7911j0668j2703J8151J2684j8895n176K2800L151
491A8954k1639K438K2292p663k2569J0749J9503j4781k0358J4864J4139j9742
$$ y = [-7119, 7414, -15097, -25856, -2341, 4834, -18008, -18590, 6171, 2824, -18181, -5749, 16127, 1907, -12496, 9138, 22367, 1137, -4080, 18821, 20955, -4227, 1653, 25044, 13642, -10206, 4037, 21481, 1969, -15656, 5107, 13970, -13175, -19540, 5004, 6797, -20771, -20439, 4304, -2133, -24690, -12736, 8670, -5509, -22028, -1787, 11463, -6900, -13096, 8202, 11933, -5709, -1333, 17536, 11183, -5276, 7865, 20946, 8126, -4911, 11709, 18632, -507, -4977, 13483, 9621, -11088, -7811, 11435, 1423, -17941, -7182, 6543, -8718, -21108, -3692, 3845, -16055, -19265, 2510, 639, -16271, -8301, 9610, -1058, -13761, 4390, 17074, -1821, -6997, 15803, 18954, -2685, -247, 22045, 14382, -8187, 2562, 22065, 7284, -13074, 1790, 15929, -3813]
503c813j1738J7045O509j9619m108J5901q42j5674L347J4059p832j0150J1629
516e286R592j2960k492J6424J963j5428M135J9755o703j7285J3975J7441j6581
529F550j4082J8033J2959k1807q081J8673L795k0800k254J6928m777j7522O498
542e887J0419j0881q070J2397K451j5329J249J7365p168j6261J2765J5891j2842
555c901j3201J8595J2678j7005r928K2494J0150k2385m689K2744M450k1859l33
568b190J8180l053j6630M514R925p599p792N792J181q787K04Q346p118r099P733
583f393R935j3506q768J6841Q905j9428n571K1597N685k0228k288K4504K161k1013
597g567K754J9855k277j5476M743J4237p445r457P706L063q490P78N732q847o843
$$ y = [-3813, -15551, 1494, 8003, -11616, -15724, 177, -665, -16339, -12992, 1067, -6765, -16915, -5286, 4306, -8654, -11146, 5278, 7241, -8187, -4052, 15703, 9000, -8285, 5690, 23131, 6550, -7532, 10501, 23460, 1653, -6428, 12245, 16040, -4760, -7014, 9914, 5137, -12385, -5887, 4532, -6349, -14419, -2022, 429, -14900, -13651, 3714, -3454, -19715, -6950, 8941, -3901, -17102, 1493, 14171, -2834, -12762, 9732, 19882, -2503, -7192, 15552, 20002, -1857, -2190, 15990, 12937, -3693, 821, 10746, 3147, -4645, 1147, 2328, -6459, -6255, 2091, -5027, -14126, -6393, 3542, -9964, -18732, -1891, 7014, -12414, -17985, 3612, 9297, -10931, -13219, 11285, 13446, -7567, -4813, 15042, 12765, -2711, 2032, 16269, 8824, -633, 7073, 10136, 1646, 2424, 8156, -691, -7534]
612g534J1184M502j7162m868J8659O81k3026O12K2426j191k3840L804K2687k768
626D166j9912O152J9110m940j6980R769J5770p153r148Q077N809m842j327M552
640I103m352k191Q035j373j2241K31J3015j025k0836L162J9543o690k2942N229
654a3332K2336q517k0265P656J9328r603j4756R782J2663p746q090R080N305l578
668B63j420O347j731j001P560j456j0244O317J1873o782j7369J0171J7198j2489
682G237j9604J1698J7957j3809j9888J0827J7161j4398j5661J0788J2194j0526
694f024q889Q572O704n621k967N668j51k98N245j368m825N984R194o779r842J2200
710F803J1782j3452j4250J7065J4091j7637j6752J8703J3322j9712j3891J6629
$$ y = [-7534, 3650, 8152, -9010, -13878, 4781, 5462, -17564, -16952, 5474, 4283, -19557, -15753, 6934, 4166, -15746, -9594, 9516, 4576, -12404, -2635, 13135, 5982, -3166, 4911, 10720, 5878, 4551, 9103, 4751, 2560, 10595, 9222, -3019, -2788, 10227, 9202, -11634, -8472, 11071, 4381, -18561, -13332, 9004, 487, -19778, -12122, 7206, -2397, -17153, -7371, 5292, -2454, -10544, -1464, 3841, 263, -1157, 5190, 3459, 2458, 10018, 8562, -1682, 4635, 16508, 9726, -7643, 2528, 19726, 7237, -12367, -669, 17288, 3479, -16409, -5582, 11579, -2819, -18480, -7692, 4502, -6024, -14913, -6341, 363, -5258, -8225, -2557, -2708, -3006, 2239, 871, -3954, 2030, 11224, 4445, -5397, 6803, 18585, 5133, -9117, 7948, 22039, 4402, -12350, 6353, 19675, -37, -13928, 2701]
722B701R280j5131r080Q872N584q077l930N492n14k300K725m2m779M865P511p523
738d346o027J2745R843j5630o368J9338Q198j9593p562K0225J0124k1527n742
751f322J8541N293j9210o119J5574K422j2105l413M499J048n000M79j542j463
765g318K990K951o249m486J0449M795j1824l959J4497N947j5157l075J9156M539
779A3256j7823k944K1329J392j8451j549J8596L57j7084J261J1719k701p984K241
793A615O97n120K681K052p791k904R042J664j4512L79J3897P09j6970J450J9870
808F759l373j7692M903K0267o128j5325P614J6376n760j1840N699R043k455o636
822A452R86L819n75n18j05m838J55N243j433j0825K244R177m387j2078J600J4474
$$ y = [2701, 11981, -3150, -12230, -3358, 2226, -5851, -9781, -4289, -4803, -7103, -4378, -4420, -9199, -4334, 3177, -4346, -10373, 2372, 12215, -3415, -9783, 9555, 17753, -1840, -9402, 10823, 20947, -580, -6322, 12219, 17512, -1698, -7817, 7757, 10179, -1926, -5339, -840, 208, -4792, -4313, -5855, -7318, -4328, -1377, -7626, -12112, -1663, 3132, -8692, -12651, 1846, 7793, -7364, -10439, 8717, 13256, -4567, -7511, 13818, 15210, -3241, -4790, 13806, 14163, -2921, -1660, 10059, 7358, -626, 1615, 2312, -2808, -127, 1925, -5866, -8770, 272, 1936, -12576, -12197, 1700, 2409, -14561, -13111, 6759, 3386, -14306, -9403, 10864, 4736, -10589, -2975, 13401, 7641, -4199, 1500, 10543, 8088, 1452, 2438, 6257, 5682, 5164, 5059, 221, 376, 5619, 4186, -6639, -4395, 4782, 395, -11683, -10083, 4391]
838D391n533j4075N558J6014p570j3980R330J3599p104j0704Q673R607o383o637
852d814P961M684m143j22L195l034m4M498j929o994J118J0228p038j2223P111
867a546J1899r864j3413R736R596j0260j1010J2021O401r921o005J0407N847r906
881f018j594Q263N19l694L99O036l231O71L600j089l948M737L594l640o594P362
897E373N326p827o916Q357M673r014r031R640N137j0618m249Q467L441j0105j884
912i230Q315j38o073J284O016j091m495N685P65m038J594O957l517n157N767P513
928A0157p276n551R338M647j1414k346J0364K568j2398j832R579p33j0229J099
942d027O943k953o453L037K881l733j240K668m4m272K751M475l650j499N104M889
$$ y = [4391, -1142, -15217, -9659, 6355, -1215, -15195, -5865, 7734, 630, -10074, -1401, 8206, 1823, -4814, 3147, 7831, 3688, 3566, 6761, 3727, 3683, 8181, 6252, -742, 376, 10604, 3566, -8657, -1546, 10353, 489, -12924, -3188, 6408, -3852, -14862, -2841, 3560, -6361, -12366, -1959, 3888, -6018, -7612, 651, 1170, -2524, -2125, 3911, 680, 1351, 4951, 3862, -86, 4651, 8245, 4605, -1989, 5373, 10699, 2872, -4044, 4313, 8986, -28, -9059, 581, 5718, -4900, -9149, -682, 2759, -7346, -9230, -915, -1053, -7126, -5842, 174, -917, -5412, 273, 1038, -3000, -1406, 5551, 2034, -3123, 2644, 10157, 2881, -2670, 6668, 11315, -99, -2445, 7919, 10487, -1911, -3743, 5836, 5103, -5126, -4027, 2916, -37, -6490, -3453, -572, -4305, -5545, -2877, -2921, -7193, -4442, 33, -3617, -5116, -12, 4877]
958D877o490j586Q175J391o725j303J0016j195q007J176Q793k481q203J535O366
973F339l171n839L390K221l141m274L443L82n528J048N031m073l331N679J203
988f21m090k163P100K306q839K466Q603k81p085J661R437l874o182M511O403o057
1004C295l555M677K264m513k167M840n81o179K781Q12k801m571M549k42m680N24
1020e547N298j262n051J420N843k420m939L642N372l030m548N028N631n006k195
1035a764M807L093m105j100M093l70l510J730L280l130m106M193O21n547k92L626
1051A519j921m709J140N572m210o157N833M066l414n466N335L415m695j881N782
1066B09K806n542k35O187n27l922M125L469l587l141M800J989m359j524M978l586
$$ y = [4877, -1613, -3199, 4976, 6367, -358, -1661, 8355, 7160, -847, 329, 9122, 6641, -1562, -27, 6339, 3168, -2671, 719, 2940, -201, -4475, -1032, -650, -6178, -5130, -99, -4172, -7503, -1824, -621, -4711, -6874, 226, 2532, -6307, -3841, 4762, 4481, -2604, -943, 8494, 4620, -1562, 2949, 9352, 3295, -260, 4417, 6681, 2168, 1, 4841, 4260, -1919, 862, 1674, -1127, -5698, -1149, -1391, -6071, -5547, -249, -1511, -6562, -5142, 701, -1719, -6658, -3016, 2356, -674, -5222, -194, 5437, 431, -1764, 3043, 6136, 2031, 931, 5024, 4654, 1144, 2874, 6154, 3024, -1082, 3111, 3732, -1815, -2107, 1519, -402, -5111, -3971, 1601, -2609, -8766, -2933, 1133, -2281, -7747, -2412, 1003, -3692, -5573, 209, 3015, -2527, -2762, 3425, 2898, -1024, 3101, 6570, 2983, -158, 4642, 6631, 2272, 748, 5726, 2140]
1082B140m727L604L818m033m396L103L016n745k158M746P67n700o31N697Q62o575
1098f212K418L615n22l034K324N741m971l3L708J94l306J121M266j87n775M285
1114C632K455k980m903N045K676o881j932N773p77m573m69L126o66n988L711L147
1130C96m147j530L863j5k122l59M967j385j642j11N643k064l450O038J191l678
1146A595k628N984M91n118J087M194n30n569K89K841j202m218J207K734k475k304
1162c622K505J67l125k51L568p89l179O88L861j062l226M466J250l276o83N349
1178B641Q30l647n39N374k74m066J883L057k897j909J282L430l259m011L553j2
1194A436l542k65L747k419k678J355J091k427o02K036J224l744j72N583j801k624
$$ y = [2140, -2587, 1017, 4835, 802, -3594, -491, 2525, -3220, -5378, -632, 135, -5565, -6196, -499, 363, -6212, -3794, -179, -701, -3735, -1411, 4330, -641, -674, 3034, 3228, -78, 1043, 5309, 5122, -653, 3632, 6087, 3107, -1796, 3249, 5925, -956, -2888, 2885, 2108, -2465, -2934, 192, -474, -6462, -2751, 396, -3751, -5281, -1418, -1433, -3555, -3914, 1053, -332, -1974, -2085, 3558, 1494, -1956, 4082, 5273, 1595, -1033, 4951, 5442, 324, 1411, 5605, 5075, -494, -205, 2636, 1434, -2784, -1577, 1157, -1318, -3622, -1117, -950, -4075, -4326, -758, -1547, -4726, -4038, -177, -1239, -4465, 1, 1251, -2025, -2708, 2641, 3471, -176, -715, 4659, 4385, 319, 2202, 5259, 2362, 453, 1735, 5165, 1906, -2105, 1448, 1436, -2106, -2371, 1376, -1043, -3721, -2366, -1275, -3702, -4304, -2268, -1044, -4788, -4960, 623, -1178, -3802]
1210c802J744N102k514k615L219L427k667j950L563J663l707j070L691Q45l340
1225A589m34J659n96k785J156J040l503k96K202m58k469M30J726n60m199J967
1241c531M123l024j304K594L568m442j190N002J163k937l35L268r8k485J983J474
1257C829j498j571J236L033m358k59L198j435k615p17K869l238j535K984O76l336
1273b737j927M300l79k946j119N021l32m236N79M679o22k901K370J846m7j866
1289c17K274O81k415J889J581q91j187J334r3j942k009L242K72l787j9K411M68
1306A492m873L75L838r38k342q92L244j524j685J242K161p53j205J789J427j807
1322d51r75L085m73r60J751P97j014j163K144O22l207n2L182N09n042J033L551
$$ y = [-3802, -2058, 3044, 530, -2085, 1134, 4561, 1894, -56, 3507, 5170, 1463, 393, 4084, 4929, 1589, 1155, 2814, 2218, -567, 589, 1629, -1874, -2170, 32, -426, -2895, -2465, -739, -1299, -5498, -3531, 592, -2432, -3736, -1142, 2426, -2016, -3206, 1796, 2959, 22, -313, 2955, 2857, 372, 2355, 3829, 2331, 760, 1996, 5029, 671, 412, 3610, 2175, -440, -1157, 1712, -1526, -3061, -77, 599, -2737, -4664, -364, -743, -3689, -4808, 213, -119, -4355, -3776, 903, 281, -2620, -250, 1596, 1549, -317, 1957, 2638, 223, 2112, 3693, 2802, 1615, 2949, 2856, 914, -1095, 2147, 2419, -1368, -1387, 1024, 1492, -3381, -3006, 832, -106, -2448, -3340, -96, -1620, -3305, -2063, 98, -655, -1860, -71, 1356, -451, -1426, 1659, 1186, 226, 1977, 2774, 1760, 597, 2741, 3363, 156, 104, 3286, 3795, -1247, -214, 3337]
1339C337j531m890J249L541j671k955J457J769k173k331K163K265k286K74K299
1354E17j610r08K365R45k975J552K495K41k063J71K987n81l501J842K369k055
1370A791l012J945L265k963l416K429K728m266j744K675J233k280j125J597q31
1385a974j162J334R41j317l22K978l0l247L372J127j4k259J515L263l985j037
1401h17K533J927j362l531N011p87k145j514K541L13k391j024J129P80k575Q34
1417a078J00j416Q29J157j416r21J263R55j278j945L328R99j236k553O200J21
1433C109k257p95K437R3k482J529J274q64q04n44K113j114k504J786o94O8j684
1450a333J679j094k407K115L22q64m19J322O06l008o17L759l93k609M04L929N12
$$ y = [3337, 1806, -3084, -1835, 1706, 35, -2920, -1463, 306, -1867, -4198, -2035, 230, -2056, -1782, 517, -1093, -2001, 364, 1309, -1666, -114, 2381, 2622, 559, 730, 3717, 3136, -365, 1477, 3846, 1791, -1221, 724, 3989, 1026, -2390, 39, 2767, -1499, -3243, -568, 665, -1615, -2740, -1143, -1974, -3136, -1802, -861, -2178, -2500, 478, 448, -2799, 573, 1700, 1686, -573, 942, 4205, 220, -817, 1716, 3643, 2281, -1250, 3761, 2974, 829, -685, 1856, 2169, -222, -1246, -117, 663, -1912, -1078, -978, -2394, -1565, -408, -1824, -2745, -1482, -527, -1805, -3750, -422, 577, -659, -3212, 2988, 3109, 852, 57, 2494, 2587, 105, 1634, 2908, 2044, 1240, 696, 2809, 1695, -809, 977, 283, 351, -1333, 346, -748, -3155, -1040, -718, -1582, -2001, -679, -73, -3081, -3698, 61, -332, -2941, -2537, 1392, 1904]
1467A904k996K03L340p29j441J184J801k228n39J523N68p48j745J840j134r58
1483a55J573o24j620m36J526k99k246q64L044q98k750J601K223j036j431J010
1499a382K482j139k043J769K564j678n95J93J890m68j94Q70p9r19O48N66j281
1516A204k268L446j334j466r06K481j813j835J279K583k391j576J994J236k448
1531a814j377K499L13j795j48J796J183r85n00K836j542k95o5K184j357Q00J67
1548A900l28j600J351J046j452k176J800J128k477q17K965n30k216p33J869n0
1564c20j897J163P20r54j531J744L77N8j650K593N50j193Q10P49j30j944J810
1581I55J530j621p32K102J198l297n29J827R72l191J80J064p16q17p67J435j248
$$ y = [1904, -1092, -889, 2451, 1722, 281, 1465, 3266, 1038, 499, 2022, 2590, 1842, 97, 1937, 803, -155, 1418, 794, -826, -1262, 264, -35, -2281, -3145, -101, -999, -3749, -2148, 75, -961, -2392, -1382, 1100, -39, -2082, -313, 2251, 573, -22, 171, 2061, 1593, 1399, 2269, 2190, 1271, 1919, 2485, 1204, -1064, 2382, 1048, -418, -1324, 1157, -656, -2491, -1212, 1371, -1020, -2596, -602, 634, -1814, -3191, -692, -379, -2174, -2322, -526, 657, -328, -828, 2008, 466, 171, 106, 2290, 933, 1733, 1900, 1572, -28, 1323, 2369, 917, -1259, 541, 1669, -808, -1625, 1340, 810, -1406, -2139, -270, -320, -2217, -1054, -334, -1288, -2819, -1075, -698, -640, -2290, 303, 853, -340, 470, 1219, 1089, -855, 955, 2485, 864, 132, 2234, 3432, 135, -394, 1433, 2405, -786, -606, 458, -258, -1075, -1842, -407, -1655]
1598a655k46p98K861r99n74J075p74k24p93L214j005j320J410j79O41M10O77J04
1616A825k282Q40J225N85l588J861J084n16q12N37J332p19k695J555J395k604
1632i77K34j86j037J65O70L96j229n68K061K23n43k638L891q97j156J60L849j032
1650A386j354K51J943j465l74K14K964j173j475J150j957L25r92K775k606n71
1666i59Q00L33q96L4k7N52j425J50R80n33k308J571J133M79p16J414L13r42j551
1685a598L242n54r09O54J636j507p6K0l29Q72p91L49m23m5m75P52n51M43j115
1704d05J753j392j587K71J504k16j445N79N81m32j592J750J173j997J188J035
1720G68J84r56r66J759J80o08M89K63l98R10K2l73j422J30J530j023n70Q08Q68
$$ y = [-1655, -1901, -2699, 162, -837, -1411, -336, -1110, -1334, -2127, 1087, 82, -1238, 172, -7, 634, 1044, 1721, 1825, -457, 383, 1608, 2193, -1395, 466, 1550, 1034, 222, 759, 2091, 1372, -1323, 232, 1627, -977, -743, -929, -1966, -1801, -1131, -735, -1964, -2532, -471, -248, -791, -3429, 462, -435, -1591, -1431, 2418, 1386, 32, 283, 2226, 761, 387, 601, 3565, 2392, 917, 2067, 110, 435, -557, 2218, -388, -959, -159, 174, -722, -688, -715, -163, -1588, -1438, -458, -991, -3299, -1728, -595, -116, -832, 582, 895, -47, -1598, 1644, 1090, 181, 835, 2471, 964, 888, 908, 579, 1451, 660, 1009, 586, 541, 66, 818, 267, 710, -405, 1348, -44, -1631, -1360, 144, -72, -1517, -938, -357, -789, -2381, -631, 542, -1455, -267, 768, 952, -4, -970, 789, 969, 361, 850, 1113, 715, 1625, 1647, 1274, -148, -18, 1512, 489, -81, 727, 1595]
1739A595k308j91Q44J93j977NP05J035j77k018K347l37n10j025K444n10j516J266
1757a35O17J228q26j104J476r01K44N15J726l124J614O17j286o88j25J560k905
1774a497J134M56l33j59r55J109k16q29J22M82r97r16K029J111k098J552Q76k141
1792a270J159r3J736j247j6J437n75k49r12M04P40j623O96J239k91r21p17J764
1810A261j498p73P94L73r56j215J009K74j296Q09P83j023N97p93J452j319L47
1827a174K586j035p33m62J796R53j732P46O23J9j574O53J263o15j310J062K85
1844A351j184q98J623q29j628Q90l17M98m91k40J114j237n93J807k89j765N07
1861a681K834j682n3P14J182j505J03J449J674k079j441K243P79j149o27J747
$$ y = [1595, -713, -904, -60, 133, -1844, -1839, -1134, -99, -276, -2294, 53, -284, -794, -1819, 625, 115, -1401, -135, 482, 1710, 884, -220, 1256, 355, 599, 1114, 2840, -284, 1330, 1947, 661, -27, -152, 1408, -1497, -363, 93, -240, -399, -1354, -245, -461, -1290, -1168, -686, -1683, -2599, -570, 541, -1557, -5, 871, -1270, -111, -204, 1532, 285, 269, 1706, 1131, 882, -30, 374, 1114, -509, 187, 1426, 1135, 214, -503, 1261, -237, -1010, -216, 157, -799, -2014, -1005, -731, -2027, -1218, -435, -1458, -861, -1654, -202, -1521, -1174, 1412, 377, -356, -818, 978, 1931, 199, 945, 1568, 1587, 13, 666, 1929, 1314, 4, 1066, 1351, 167, -731, 892, 63, -1565, -675, -992, -494, -985, -1225, -111, -1348, -1941, -134, -423, -2188, -1681, 1153, -529, -582, 132, 1314, -191, -88, 1361, 3035, 956, -485, 1758, 2537, 1388, 761, 2508]
1877B508p19r79J23k02k32o66K07j234q44Q68M15O12j884R61J175m99j541J004
1895i27K408k326o55K359N74j955n9J328M84j697J046J062j063o77J011j073J359
1912A199k47l06O47j211K62J132o23j896l04J332j077q03L38J357l79k541L224
1929A04o40j361J529J50O42k598J377J735L83j772J793n88m91q72K678m66j197
1946D06P22k18k26l38m34J161j301M34j2K02k407M65K474j413r20j069P55K228
1964E09l402K277K03j048k86J824L55L74r17L10Q58j680J59J363L07r08j29P82
1982I51m80j62K21l92O46p82R79r78l24Q5J114j941o06J085O80k098k11J305J138
2001B30j956q24K648p30K26j62J307r81m79J664n47r34J579k95J13n22P47M63
$$ y = [2508, 1789, 810, 933, 731, 499, -167, 40, -1194, -2038, -1170, -755, -143, -2027, -1066, 109, -390, -1931, -927, 1481, -845, -1500, 859, 1433, -522, -581, 747, 1231, -466, 580, 1642, 579, -98, 913, -160, 1199, 952, 646, 1293, 82, 344, 1476, 853, -1043, -1347, -15, -1092, -1895, -1557, -200, -579, -3120, 104, -536, -1897, -368, -218, 424, -2174, -797, 938, 1321, -451, 1342, 754, 263, -609, 2069, 1603, 406, 1128, 910, 684, 346, -88, 1073, -228, 206, 194, 396, -2011, -1546, 928, -485, -1405, -2474, -1719, 509, -2893, -616, -413, -1461, -1747, 77, 432, 806, -111, 199, 1057, -623, -464, 899, 1206, 298, 169, 951, 471, 309, 530, 138, 784, 2, 981, 3, -321, -236, 878, -1063, -1669, -584, 96, -2002, -2213, -908, 230, -1726, -2550, 98, -632, -406, -568, 739, -242, -721, 943, 396, -538, 1041, 746, 859, 337, 1084, 1547]
2019A547j90j977J887O60j416j310J889j35j561m24O39K13k444J206O57Q36k208
2036b131J108Q69n49j146J263L26n05ml57J498j246J121P33q19j03J532K04r63
2054H31j037J111O44N04j848M66J21j438P52l72p15l17m5J188r43P3L27K37r03
2073a364K45J471j199p76Q27N85j008J499l1M39q78O71O1Q47j419N08K134j128
2091A484q32J41J252j606j13L87o51J342j774O24K2r25K113j361j671M73n53K320
2109F72k262p77K637p72n32j454K731q48N4R9J746j540M96J895j841L76m65K63
2127D78J245Q05j814J197j454p89N41K481k462m78L84m71N6J33q65n63O14j228
2145b190J465p51j025J763L12j40j891J740J374n63K32l56J444j519P21O38O91
$$ y = [1547, 1357, -620, 1267, 1927, 511, -799, 1090, 955, -606, -1030, -391, -178, -2622, -1416, -759, 77, -2131, -1023, -154, -703, -1849, -586, -260, -765, -769, -1126, 372, -874, 247, 980, 161, 58, 1590, 1794, 831, -206, 905, 1549, 2053, 205, 671, 792, -646, 106, -266, -981, -1298, -1343, -155, -1098, -1025, -698, -461, -1364, -1119, 352, -847, -1623, -796, -211, -1219, 280, 249, 688, -190, 481, 542, 1389, -30, 478, 2612, 1484, 652, 793, 2045, 439, 326, 713, 62, 1404, -370, 254, 276, -649, 1464, 103, -1568, -1095, -1648, 672, -1590, -2367, 270, -502, -1034, -2488, 243, -605, -551, -452, 1294, -246, 250, 2145, 304, 680, 215, 478, 1723, 2528, 714, 1911, 457, -332, 209, 2690, 228, -250, 134, -337, -281, -148, -1013, -1576, -962, -2190, -725, -1476, -2501, -738, -426, -566, -2457, -717, 657, 94, 326, -30, 1414, -105, 616, 1254, 1945]
2162A945j041n05N88M8m31l9N43j724k4R18j085l38p85O31J091j595J802O80j481
2181h02r36K53Q85q33j049J454J119j289M44P25K80k64n26J417j1m46J387q69
2199I39L11k77M49k07k109J325M90l64o56J550j054q86j68J058o88j213n59K163
2217A04r56p44J134N1p3j025k0K118l23r41J62J343k20l17J319j192n95J395M67
2236A687j49j062J391r16o38m56J580q44k211J490m7l66n52J67J066j631N92o7
2254i66R62k76q20Q08l23o49K79J472J94r32J295N65j894N79J803P3k330J847
2272A687N66j442j207J377O67j419p70O85J177m91j146J260j339n12l43M34J66
2289f50k049J997j69k72n19J695l57K32m84l87J063q29J448L64j188m13J706P79
$$ y = [1945, 904, 399, 987, 1035, 604, 565, 1108, -616, -640, 278, -807, -1145, -1930, -1299, -208, -1803, -1, 679, -802, -1738, -1485, -600, -1433, -2482, -1028, 91, -1198, -754, -29, 251, -13, -539, 878, 867, 421, 1808, 939, 1250, 973, 1422, 1215, -894, 431, 921, 557, -99, 1451, 397, -489, -657, 401, -287, -1500, -2059, 104, -852, -1596, -462, -411, -484, -1509, -1529, 589, 266, -675, -513, 830, 610, 293, 1612, 420, -175, 1220, 1687, 1538, 476, 1867, 951, 313, -143, 1437, 593, -1618, -128, -175, -541, -1093, -926, 140, -1491, -899, -966, -4, -280, -1100, -292, -615, -1264, -985, 487, 681, -251, 1044, 1609, -285, 294, 2097, 2170, -160, 1687, 2253, 811, -396, 981, 1648, 229, -541, 144, 1321, 830, -316, 944, -395, -907, -1250, -816, -650, -2699, -702, -871, -1143, -1662, 33, -324, -92, -576, -963, 100, -729, 719, 1083, -105, -518, 1188, 1967]
2307A967j801m22J828p4l61o20Q9j94k32l4p94N98q5j071J667o12j392J858N2
2326C67j812m62Q10Q19j836Q49J645o06p06K49K033j309p15J146K27o05J203r8
2344A199M11J14K69j614Q4O09j533P82M64k29k86R6j328M56m44K13q85p5J261
2363d36j43j145O28J118j427P23r35K320j380M84J200o70k77j20K30Q96q34J80
2381D12M78q66N27j249J648l40o10M9n89p69Q85l7P81o30Q53j431l08N17l11J26
2401h64p18j76J269N82r92k57J675k79M2J813m07j178j68J431p37l82J105j110
2419F49M85j56o19j94k85l14J233P8j336m39J712M76j668N34l54k47J85j68j42
2438e70L14k87n15J054j513J728L74k06J77q35J76J243j712J171J016k18j629
$$ y = [1967, 166, -256, 1572, 1498, 1137, 517, 606, 412, 180, 146, -648, -50, -135, -1206, 461, -151, -1543, 315, 367, -1445, -1907, -1097, -278, -2114, -1265, 380, -226, -932, -683, 1350, 41, -674, 472, 699, 94, 1297, 1199, 1610, 1724, 1993, 379, 463, 1072, -461, 321, 785, 556, 270, 366, -962, -506, -950, -737, -1622, -1697, -436, -579, -1724, -1096, 22, -1405, -682, -1617, 703, -677, -193, 1007, 337, 60, -60, 170, 1066, 232, 412, 890, 24, 551, -698, 950, 610, 0, 49, -540, -1309, -424, -461, 320, -310, 543, -888, -1196, -679, -990, -864, -1582, -1758, -489, 93, -899, -1156, 519, 240, 282, 2095, 1688, 510, 342, 1773, 1036, 654, 1759, 649, 1134, 978, 359, 165, -120, -434, 799, 877, -459, -898, 814, 1290, -378, 156, -198, -445, -260, -428, -570, -256, -543, -1058, -4, -1517, 211, 585, 379, 556, -279, -103, 1140, -572, 599, 1615, 1397, -232]
2455b32J321q5j67J44q30N40j812R04j3J586j856n85J075o02k04M4j71n49R46
2474e46O59j240O08j247J911n13P2N49J300j574M96J221q66L56j962K155L60k369
2492f30N28O05Q3j66l10N84q64OL82K57j940K12O92l77p12R95j53j148J253J000
2512B97k319R02P33P66j264J77J47P41M39L16j130J856j157m67J787o68q17K28
2530E67L96p24j55J547j050J39k212O34J086j025j295K443r89O40j063K98k40
2547a003K56M66Q8o98L88O48n29L28o06K163k5j484M85N05m68J97M37k14K86j515
2567b95P08p2K70k36j278J57N3m87J751k090O31j52J253j872n02K264p11L71j249
2586a486P05o05J509l55L33J88k24P03N35j046O25K30j39J83J75M0j514j77R93
$$ y = [-232, 1089, 1004, 837, 981, 151, 691, -1121, -217, -230, 1356, -500, -1085, -10, -612, -816, -772, -943, -1492, -546, 113, -1127, -519, -1766, 145, -368, -296, 253, 1553, -21, 475, 1696, 830, 1186, -776, 1379, 1739, -630, -102, 503, 586, 420, 110, 694, -170, -164, 218, 475, -1465, -1253, -561, -938, -1650, -655, -808, -1956, -703, 297, -2022, -1120, -387, 379, -885, -708, -561, 180, 619, 935, -195, 1661, 504, 37, 1824, 1156, 339, 567, 963, 239, 84, 1631, 581, 720, -1492, -858, 228, -797, -2092, 351, -638, 2, -1061, -763, -1003, -747, -281, -193, -891, -503, 145, -384, -56, -662, 1501, 1476, -8, 477, 982, 514, 711, 1148, 934, 1220, -295, 413, 341, 611, 375, -903, -746, -693, -1180, 571, -1519, -888, -1040, 213, -1659, -2161, 103, -608, -237, -1486, -781, -1386, 123, -232, 101, 289, 65, 768, 1303, 257, 882, 1112, 973, 1156, 1331, 1371, -143, -320, 673]
2605F73p51N91J4j128P56j433J42J37P95p30o3R43n15o16J29P48j655Q90N22j76
2625g27R57j454J070P74p15R69O10p99Q80q49N42M74j776J614l93j337m6L24J834
2644A952k092J033l86l94k65k66n44rM16n62J929j766O77o17L64m36J014J20o53
2663d85L85L68O46q17K27J725j158K46n95Q9K50n88J556r51j287M54J852j712
2681B05m42m07Q11p12j04k32R33j319O28o28r8J417j456J665K42n36L89N10p10
2700A56k013K693QJ158k439n69J688j096MJ097Q43k37j92j81m0j382M92J91J60
2719C41L51m19j098O18j048M25l87Q45j550J134O53j291J633O1n40P60l97K75
2737C66q02J317m85N68p74j427K443J04j602J561p91k93p83M46L35k01L52M10
$$ y = [673, -78, 513, 527, -601, 155, -1278, -1136, -999, -204, -934, -997, -54, -569, -1185, -1056, -308, -1963, -1073, -551, -727, 230, -1224, -154, 620, -95, 874, 1484, 685, 1565, 716, 1258, 1732, -44, 1570, 1177, -160, -206, 118, 1952, -140, 893, 507, 113, -152, -418, -962, -971, -555, -1117, 812, -954, -277, -894, -530, -966, 48, 168, -485, -100, 268, 914, 97, 324, 2049, 891, 1137, 542, 631, 881, 293, 1849, 898, -389, 65, 1917, 205, -237, -644, 167, -545, -649, -881, 52, -1267, -639, -1267, -1365, 52, -1404, 261, 503, -33, 356, 866, 156, -1857, 836, 844, 2002, -437, -1006, 682, -414, -410, 687, 1530, 1293, 1101, 920, 880, -502, -10, 181, 341, 692, 273, -825, -207, -1255, -830, -1217, -372, -1922, -788, -135, -1426, 207, 268, -272, 488, 91, 366, -436, 881, 396, 964, 190, -1237, 1206, 1310, -292, 1269, 478, 185, -598, -152, 183, -18, 334, 744]
2755G44k65q31R9n31L44j580K003p55J42M11n92P36l94k69O91O91j720P70P60
2774D54k84J33k53J607k91j021J31j18P63j715K495p4k633J348o05J99o36M99
2792aR4j61j237M35Q0n75Q01L56o28Q87j232J074j04l80L58N08N20n47l32K195
2812B111j996L62R19J20q08m74O00p3N28j251J368J15r51r5O0m02J81j598J808
2831E24k358O39K050j611k3l63J396j447j42J026Q16j374J172p32P70o3j2J0J082
2850A360j027o87Q9P91l44m26J092n97o24J428nn27j192J633n03p13M92k76n17
2869e53o52K038k237J010p70R62p6o66J033q83Q14Q1m41J334j332O10l90O71j92
2888C61L45j044Q66L49J10m30k04nJ100p19r44R45j096O77j256o49J980j023m14
$$ y = [744, 479, -352, -253, -784, -440, -2020, -17, -772, -630, -219, -811, -75, -469, -738, -47, 644, -1076, -306, 454, 170, 303, 50, 1657, 1366, 345, 476, 358, 1121, -594, 1901, 1827, -806, 542, -63, 136, -500, -1, 93, -68, -1305, -870, -790, -1365, -564, -208, -836, 51, -1181, -107, -211, -591, -233, 275, 795, 248, -84, 2111, 115, 477, 1396, 1516, 708, 234, 834, 761, 1289, 38, 1406, 1521, 570, 475, 535, 133, 314, -1284, 524, -1834, -1195, 855, -756, -779, -1142, 254, -1193, -1335, -309, 507, -867, 305, -427, 343, 280, 268, 278, 1360, 333, -354, -265, 526, 182, -244, 848, 251, -373, 1055, 1050, 523, -669, 964, 461, -252, 240, -36, -553, -1205, 833, -1404, -394, -1164, -202, -278, -944, 89, -794, 20, 101, -340, 994, -338, 272, -118, 553, 361, 706, -338, 528, 877, 987, 557, 353, 348, 1448, 729, -215, 730, -366, 311, -945, -1594, 386, -637, -1051]
2907a051O19K95j183L60J233K26j057O82KL04p99l66J55J160n87m78J777r57J336
2926A671j715J103j88j313J876o59N8j215N87K36O3mo31K26m19J494j332j801
2944a963J389R52q66l21N57k03m77M29J19J254Q8r66O06J74j244J684n91N36j221
2963f4P69n71m73P64R65j301J332j260J084q45m85Q51k256J248m38N46j81p08
2981a023M30J482j785j54J16K81n6Q01p30P80o41r70K147J005j846O73J680q94
2999A296j932M38L68L20k09q55J855j676m08R11n49Q73L86l50N66k365m9R14r53
3018a419J623j724J470q57J039L32Jj167Q70Q39o28k14l35j26J518k64k43k12
3036E03m15J105l77j87q82O37j52O45j718K07J686p09j495J259p34j281Q33P72
$$ y = [-1051, -432, -137, -1320, -960, 273, 499, -558, 124, 126, 430, -369, -735, -580, 580, -7, -485, 1292, 335, 1671, -44, 1059, 871, -442, 1434, 775, 833, -382, 205, 441, 504, 500, -131, 95, -324, 1170, -162, -1963, -574, 378, -488, -809, -252, -455, -932, -503, -384, 870, 958, -8, 598, 772, -472, 1212, 621, 1157, -64, 705, 134, -339, 425, 1390, 89, 1421, 161, 1245, 400, -85, 766, -1490, -242, -680, -134, -315, -1023, -593, 889, -896, -1050, -934, -653, -709, 92, -638, 142, -499, -1469, 678, 1683, -163, 510, 2190, 1296, -636, -198, 170, 490, 281, -574, 1281, -395, -803, 108, -441, 432, 818, 468, 1034, -1331, -1380, -466, -1419, 204, -1520, -50, -907, 132, 464, 465, -702, 168, 1007, 379, 165, -170, -296, 1222, 958, 715, 503, 88, 1193, 816, 629, -253, 384, 232, 877, -841, -634, 1052, 343, -1152, 107, -627, -1908, -1075, -303]
3054c03k92j601K309R6j383R41q15L58J131j029Q14J480j879J426r07Q89j825
3071e90N05J157j168K148j128j968J474o94l66M54L78j309J273q06R38j282k24
3088a208P28Q0M78k85k68q35L28J450j146O14J511q91p28n2Q4M29n04J212o29
3107C68mm91J482p77p41M08J055j926K52j41J063n02l02J391j945O71n8m06P66
3126A63j135J319L54j275J33r3R02o98N25P33o09K31J67j478r8J540n83J039m84
3145F53R87q28j083Q71o77N47m91J67j340K074O0o15j202L15L90O25j169N34Q10
3164F28j890Q62m39P30j125N67R49m92l48N44L86j079J022l98P82J008r66K33
3182I74J87j05k5j344M92k03L58J16j262N76o55J110r92J030j572R82l08j90q82
$$ y = [-303, -595, -2196, 113, 209, -1174, -233, -1048, -690, 441, -588, 226, 1706, -173, 1253, 346, 1235, -590, -85, 1072, -96, 2052, 924, -1044, 430, -264, -630, -176, 202, -1107, 166, -640, 298, -984, -1208, -480, -400, 78, -207, -475, -1310, -982, 468, -678, -64, 1447, 556, -172, -224, -140, 289, -215, 997, 368, 364, -127, 1355, 578, -163, 245, 1300, -626, -374, -515, 548, 46, -256, 1135, -810, -139, -197, -603, 163, -972, 347, 701, -574, -441, -534, 368, -330, 195, 928, 319, 550, 717, -761, -859, 681, 98, 1137, 653, 1640, 812, -271, 600, -77, 470, -21, 146, -1194, 880, 940, 325, -877, -562, -172, 453, -716, -182, 628, -1262, -400, -839, -109, -1234, -667, 282, -210, -558, -14, 372, -707, 315, -83, 699, 1707, 741, 974, 1161, 1056, 1031, -313, 179, -24, 334, 450, -812, -236, -891, 219, -773, 257, -1315, -333, -641, -831, -1713]
3201a713J631j397J595m28p09P10R20q54J174o45k22N13K83l10j413J516r04J397
3219A144K72j135n55J325o73j156L90O1k68P72r76N54k23j560J819j744L32J329
3237b92J40j26K26k00Q77j77O10l19o7m04l14l3J036j84J36j4J3q60L21j236P48
3258a19L09j003N28M97j51k79j33R59j480J104q97K24k57N18J49N11o26M52N26
3277H32o37o10K78J343m90o90O78k86m96N35L9j74q99Q06P6K72J129j68k353K648
3297A833k562P79m57M34r33P53m22N05O8M1K15j360m48K048q36k17j26q77J116
3316d46o1J49L55j01M99k80P65j000R95K54M58j059P48j088O90q28k67N82k46
3335A19q6m81R23j358l36K009j477J013j039j19n8P97q8m2l06L35k35p0J786p00
$$ y = [-1713, -82, -1479, 116, -312, -1021, -311, 609, -245, 929, 284, 62, 575, 858, 548, -865, 651, -253, 1144, 1416, 281, -274, 1051, 378, -778, -388, -327, -595, 177, -799, -245, -468, -2028, -209, -1953, -1621, -292, -152, -278, -52, -252, 625, 448, 1058, 739, 672, 268, -46, -79, 957, 773, 909, 895, 908, 48, 369, -867, -119, 190, -813, -285, 212, 61, -218, -351, 608, -872, 232, -665, -441, -698, -180, -31, 480, -146, 306, 832, 195, -415, -137, 1206, 716, 26, 704, 418, -78, 457, 496, 322, -577, 229, 305, 577, 1706, 1538, -815, 1833, -729, 50, -407, 27, -906, -153, -575, -70, -2, 39, 254, -1106, -1554, 494, -342, -559, -685, -1562, -446, -507, -358, -3, -104, 395, 115, 880, -120, 875, 1129, 1587, 528, 1276, 188, 878, 50, -217, 365, 119, 33, -448, 475, -883, -1219, 790, -687, 326, -713, -832, -890, -93, -181, -223, -529, -194, -429, -499, 1287, 587]
3355E87L08r22O30j68k71j029J731j721J458r89K181k002N38j17n69J080j281
3372e56m54O30L79j08j33j130P12o68N10o2N9n9J020k99N05j032J770j043J50
3391A91P4L53n64M68p94P12L8p02J519j369n6P74j229o7P74n03J99Q5L61l76p22
3412h34P17p36j153J637M86J54l45l60L54l30N03J246q55j707K321j217j63k87
3430e69J090M74r93O13n9q53O60K4K42j204P24N09P39j813R83n85m54M82p40P18
3450a2k81J71l84K09m73P67M92N58j592J064M04L57l27p35l72O69j53M44J168
3469A974j285K09n20P03r81j86L76o83n47K041q44r38j068R22Q91J11k4p27R52
3488C76j020k77J603j47k01k93j603J339m03K90J229j202J11O51n51P46q0j64
$$ y = [587, 895, -27, 603, 435, 164, -865, 866, -855, 603, -386, 1795, -207, 331, 214, -355, 725, -556, -1010, -380, -1, -109, -242, -1372, -660, -1328, -818, -880, -821, -880, 140, -159, 346, -686, 1084, 41, 191, 265, 618, 54, 522, -272, 440, 478, -224, 1295, -74, -130, 644, -585, -652, 122, -381, -182, -97, 264, -112, -834, -117, -853, -2006, -369, 117, 271, -74, -434, -80, -410, 93, 1339, 484, -1223, 1098, -119, -282, -569, 521, 995, 2, 615, 556, -297, 363, 387, 629, -575, 149, 658, 1397, -416, 567, -18, -472, 10, -730, -12, -293, -122, -506, -297, -770, -3, 489, 1047, -545, 519, 923, 1280, 953, 218, -154, 515, 362, 806, 1974, 689, 898, 378, 1081, 100, -86, 290, -393, -940, 1101, 257, -681, -1749, -827, 64, 175, 151, -576, 376, -644, -921, 682, 535, 334, 41, -1562, -223, -626, -336, 893, -309, -198, 453, -98, 648, 568, 404]
3506D04n38L05j42R4m47J610j261J08l28j24J55K01k75J0K58n32p64N76M93m45
3526f42l04M60M51o06L71m9J153Q01k065k06P50Q24j087l9J533k116Q23O40j92
3545E00N01j158p82J105l23q29K143j701Q56k8K86j050K77R3O7J38n95J033K26
3564G59q59n42L2K182j687j329J242m4J062j142J31L23J40P28r23Q78p80jL6j389
3584a183J726l86J55k65J74M38n32j433K547j491J013k379J636j18j40O39n36
3601a35N30r8o9k76J025o08j262R69M75m12J10k031J910o53J94L8J369l13j235
3620d72Q69n80J099o80M77q39k38J42o26J472q75J08n25K50o38J70J179n17M09
3639A85j5o2J03K1M05N67o70M68K4q40R5l35J432j141q57Q53N99l51o31l3q31
$$ y = [404, -134, 171, 29, 123, -324, 1286, 25, 133, -195, -319, -164, 37, -238, -228, 30, -502, -1266, -690, -197, -642, -946, -486, -35, -641, -270, -319, 834, 1635, -430, -636, 114, 938, -149, -188, 1345, -771, 52, 692, 500, 1001, -157, -939, 166, -157, -986, 1157, -544, 312, 284, 570, -480, -203, -110, -43, 95, -500, 533, 759, -100, -642, -610, 1572, -115, -1444, -202, -246, 816, -326, -195, 128, 268, 996, 73, 951, 171, 170, 206, -1183, 543, 157, 312, 47, 221, 659, 127, -1306, 1241, -250, 763, -1616, 20, -98, -238, 401, -135, 395, 297, 228, -48, 977, 369, -893, 76, 551, 139, 249, -1782, 128, -525, -331, -293, 1076, 763, -472, 397, -183, 916, 236, 713, -126, -364, -222, -848, 624, -251, -143, -668, -418, -1056, -886, 293, -224, 185, 170, 108, 211, 232, 637, 1204, 534, 1002, 1026, 186, 281, -54, 1378, 237, -620, 233, 832, 481, -150, -183, -1014]
3660a014J909r25l70M44r99J220p70J93n73J137j142J04K97J91J342k186O79L76
3678h7m21M27o15J494n60n22J85k11J483j096R68j212N07o46J321q16K38n00J64
3697A01m0r1r2n18J445p02K34j278J104j008J483o68j09O00j204P20l7K64K90
3716D94o78O52k24k38O60m85K79M55j753K102j007n7m27J39M84l83j04p16M08
3735c99J209j126J22q08Q11P74j062j74K14P35J39p46Q98j71k29o09Q15L12m66
3754B39l04K25k61j19J247m81j0q47o74J681R98j674r1j62q0r61J217R90j869
3773i36l5Q02J01L68m30m15Q08J62o98J038r6j168j49P34j43o37M43J51l76Q41
3793C65r15P69Q07k27m39M67l12P71P24j439K95m73m15P82q63Q51o23r37Q90K61
$$ y = [-1014, 895, -30, -400, 44, -955, 265, -505, -312, -885, 252, -890, -786, -489, -298, 1044, -1142, -463, -87, -508, -81, -696, 798, 238, -284, -99, -310, 1173, 77, 1045, -167, 340, -306, 1015, 199, 437, -63, 101, 61, -30, -122, -640, 805, 103, 337, -941, 163, -845, 638, -30, -139, 461, -743, -23, -60, 204, 494, -184, 468, 244, 6, 666, 181, 460, 915, -838, 1264, 257, 200, -227, -88, 396, 13, -91, -807, -399, 810, -316, -194, -1002, -191, 583, -479, -653, -439, 296, 435, -311, 587, 416, 187, -422, 393, 705, 239, -65, 160, -101, -220, 1027, 546, 536, -311, -985, 696, 1694, 20, -71, -233, -313, -1274, -57, 933, -936, -971, -169, -68, 300, -130, -545, 263, 425, -273, 765, 669, -499, -648, 86, -57, -694, -251, -100, -476, 365, -550, 219, 1026, 799, 360, 827, 515, 1286, 2010, 571, 866, 393, -22, 760, -103, 748, 125, -812, 78, 339]
3813C39q35J233j503J151L42p98o6J25m74N4P05mr78Q71m1J278j115N26%L10J28
3834A248j380L26P93j386N30l54Q20K2j006R42O0m10p41K76K01n26R4K95j31q9
3854d16J400r41L57j061O89pJ89J02r5k6l61k59J292o23k5N88l62J65m39J0O54
3875H31j379L94oK89M74l07j434n91J131Q03l44o79N56K62ql86K19Q73J18k43
3895E73r02m14L71P66r65L86n96J148k48P79k90j135N72J997j989j33K69R39j084
3914D4P25j632J168n91O52m00J154k139L17N68j24n56J194m41j070K172j000K27
3932B68n57R1J50K18n32R50p16J44M71J14j595R46J287k26n61q77K91M1M43j107
3952g57M87k28R6M27q86O13K3j61l81P06P85n38p67K79R41q12L51J84J01p69N12
$$ y = [339, -496, 737, -766, 385, 727, -71, -137, -12, -486, -432, 273, 269, -709, 162, 121, 1399, 284, 810, 810, 1120, 1248, -132, 194, 987, -399, 131, -223, 597, 619, -387, 555, 615, 205, -536, -260, -59, -585, -491, -196, -327, -416, 984, 43, 400, -661, 28, 21, 210, 312, 217, 191, -170, -429, 863, 240, 215, 803, 441, 606, 167, 177, 831, -548, -154, -160, 129, 603, 296, -1138, -1729, -598, 205, -139, -818, -262, 0, -8, -394, -175, 698, 816, 573, -329, -743, -372, 394, -571, -185, -781, 367, 119, 898, 608, -527, 45, 2042, 53, -80, 189, 1128, 44, 769, -863, 305, -286, 366, -34, 1120, -1019, -702, -134, -258, -814, 380, -61, -1131, 1041, 41, 268, -289, -198, -48, 170, -362, 588, -128, 16, 487, 601, -994, -48, 1239, 1013, 452, -425, -134, -93, 350, -757, -270, -498, -402, 25, -861, -248, -225, -386, -767, -61, 724, 186, -581, -302, 639, -173, 178, 362, 463, -306, 206]
3973B06L86m39q44P40J107j741P56J778j549J14n40J243j745O58K53j81j094P2
3991h20N41J72n53J070o58N86K22j230N83m84O89J171j464j25J317j835J906m56
4009F32m53j59j229M96J924p92o41K012j866N37j136O92j074Q12N80m16J270j127
4027F2m29p65J084l51n86j54J601n28N96j218K84J025l38p39L12J927q93l15j094
4046e19l10J106j027J039K51j90L20j220J061q53L21PP6N00j017J072r02J534
4064A249j973n69K46O82k63O81k95K35J9m64l14J81J239n79j76L40j41P23m72
4083C49k08R96j022O9O43n02p0j258j33J595j206N83K07N72l38m68J18j67j47
4102c87j478K158n69L63p87N97n40N39o33K38N77P54p99N95l1k70L67o86k62O28
$$ y = [206, 592, 153, -691, 49, 1156, -585, 171, 1949, 400, 514, -26, 1217, -528, 130, 383, 202, -892, -820, -279, -107, -660, 410, -248, 338, 560, -670, -87, -571, 118, 1289, -175, -300, 1017, -818, 1088, 632, 179, 20, -1209, -713, 1211, 419, -222, 1790, -76, 461, -675, 17, -1057, -245, 335, -81, 1189, 62, -367, -1132, -48, -399, -985, -1139, 462, -66, 530, -688, -404, 621, 283, -456, -144, 1783, 890, 575, -519, -829, 277, -750, 289, 540, 350, 670, -550, 511, -342, -21, -14, 62, 562, -455, 617, -285, 1249, -724, -1293, -1047, -365, -628, 53, -242, -7, 12, -452, -766, -585, 654, 75, -101, 239, 98, 821, 349, 141, 1137, 115, 184, 827, 325, 255, -1003, -1136, 459, -747, -164, 43, 615, 277, -191, -73, -240, -387, -1865, 293, -276, 87, -700, -103, -643, -104, -737, -499, 78, 832, 33, 628, 597, 327, 694, 8, -254, 374]
4122C74R49K04o96q89L40l27j40k68J397M8j262J01j86j033J840o99j57K03o10
4141h11O34N27j447J186L04J132j130j96P10k81m07O20l8n34q79M06P67R00j563
4160a00J41K05j73O43m05m86J059j107L61q88J108k82l37nR68J85k89p52p76P19
4180b11J22k86j16o15J206N71m47Q55o24l20j3J787j341j075J782o76N08j193
4198h6O92n38n00J793j146Q51j129J94o29L80l02J387j44j727K20J153j666J297
4216A00j48q08J208o93k69J182r27L14j151K46J236L6j196J265K14n00n82O00
4234A27m0P50p82n38P48r53J391j077J14J56p13R3R45o84M94k97M65j64r12J227
4254C50j170J000r21J544j160n02R83N01j58lJ123j467j47Q27k75p88P68r37N66
$$ y = [374, 1323, 1527, 831, -58, 282, -45, -185, -453, 944, 992, -270, -169, -355, -1388, 452, -247, -404, -201, -811, -177, 350, -1097, 89, 393, 1525, 395, 199, 909, 628, 221, 841, 803, 269, -610, -204, 563, 1463, -100, 41, 246, 73, 716, 311, -175, 884, -223, 138, -750, 358, 76, -261, -266, 702, 887, 598, -154, -930, -211, -89, -375, -491, -1106, 100, 671, 224, 1079, 455, 135, 122, 1909, 568, -507, 1275, 599, 1107, -86, 606, 68, -432, 1361, 215, 1066, -63, 131, -498, -118, -420, 967, 823, -904, -684, 469, -1197, 100, -48, -856, 352, -341, -610, 572, -355, -41, -1192, -946, 290, 326, -870, 395, 609, 109, -473, 127, 87, 837, 55, -483, 265, -688, 703, -374, -260, -104, -817, -724, 221, -463, 31, -266, 199, 35, -877, 350, -820, 180, -741, 803, -357, -859, 124, 625, 467, 464, 1587, 120, -27, 800, 525, -263, 505, -432, 134]
4273A34q0j232R25Q10j139L93L65q15R60j266O25j114P82O59r22J49K84R4o9L23
4293a34j88J158j577P62J18O93q24P64l87J10J04k24j59q16R92o80J025o97N89
4312F29p98N80l27P30m65m79k92j06N58k3O16j632Q40J06K58k5j046J824j037
4331h9P33p3j133J290j695Q70O3m27P4N27N26j65K05K78j362K42m72Q56r94R10
4351A64p98q74K525j357P49o1r82P73m61o95J255j155J285j55J343j897K99J64
4369A22K26m38L90r06K96Q89l9l61J65J020k630L87K072n16j079R30j411J05P00
4388g8K53k46K4P69k089R61N81j240O23P88N86j484L15o6K6j28J049o59l57r7
4408d69O69J24j194P95L10j209K266o64j349K79J64n65j8J084J04q30M89n53O60
$$ y = [134, 54, -1178, -253, 557, -582, -189, 176, -639, 321, -945, -320, -1434, -652, 7, -915, -766, -482, -388, -457, -134, -322, 836, -741, 21, 139, 832, 8, 772, 385, 495, 599, 375, 216, -600, 392, -288, 737, 40, 629, -169, 411, 84, 814, 349, -130, -422, -528, 30, 7, 623, -1009, -169, -63, 195, 170, -876, 948, -89, 644, 571, -562, 728, -967, -97, -34, -461, -387, 140, 666, 501, 706, 984, -378, -136, -608, 248, -746, 164, -634, -1508, 1017, -340, 409, 348, -634, 139, -322, -1017, 238, -917, 368, 213, 1556, -341, -42, 122, 348, -90, 300, -606, -310, 579, 540, 179, 344, 1364, -1266, -879, 1193, 677, -402, 528, -883, -778, -78, 175, -71, -47, 722, -1367, -406, 175, -1065, -442, 346, 932, -552, -237, -303, -277, -405, 644, -15, -372, -469, 200, 324, -870, -75, 235, -974, 1292, 628, -721, -442, -278, -843, -861, 223, 327, -503, -14, -567, 93]
4427I3q32N34o77M52J77O54j38M73j819J038r36J161N03j235J437j507P60M55
4445E93j31j085N76m4M14j85k86J080N28j423L61K7l45J31J130j668k50Q92K19
4464E34j156j22Q83k16k06n38O77J276r04M29l54K24l45n40J418j200p97N58J893
4483A514j489M7J2K27K87r90P07N21k30r46J8P43j512P72M45J57O91J91j800L08
4503c27n3O54o93O24P64j142J68o50R68l8k296K915l26j718J356J71J83K14j221
4522d47J318n57m90j095J365l88L41n53O60j15n43O04k70K82M5j040J91M69R0
4541a33K7K7l77j74Q02K32k6m20K57o3P62j73m83n13m1n11Q83L07K48j165L72
4562a62M59r20j04O94j451K053M2k09l78n85N77j67Q24j212Q78j262J521l91q65
$$ y = [93, -739, -205, -882, -430, -253, 401, 263, 736, -1083, -45, -981, 180, 683, -552, 885, -622, 138, 593, 462, -623, -47, -91, 323, 138, -148, 932, 1460, 37, 398, 425, 80, 211, 1341, -327, -577, 315, 534, -622, -744, 139, -77, -283, -821, -144, 1132, 228, 657, 303, 527, 182, -358, 1060, -140, -937, -379, 1514, 25, 72, 84, 311, 598, -392, 315, 836, 606, -340, -322, 421, -1091, -319, 126, 283, 974, 1165, -635, -327, -380, 274, -419, 205, 969, -173, -5, -655, 313, 275, -2021, 894, 568, -1150, 206, 377, 560, 774, -447, 871, 314, -176, -1271, 94, -294, 47, -506, 154, 39, -504, 100, -170, 112, 157, -883, -692, -223, -133, -106, -79, -456, -630, 172, 404, 378, -42, 215, 152, 914, 741, 258, -255, -296, -807, 76, 383, 631, -534, -162, 297, -623, -727, -33, -1484, 569, 611, 402, 24, -561, 16, -151, 673, -539, 339, -923, 598, 207, -658]
4581f58J232n34R5J137j933M61M26o13m4N8J074j053J580j128O15j566R56M05
4599E10r5r02O78j25j49L90q74o34J102M93p92P00j92Q67j534n2M68J69o30K83
4619c19k48J236l43Q81j829O13J73L04J54n77o34K13N06O43j541J773L05j946
4637f36K791k763L46J052j212M1K00M79r86O69k41k32Q28r47N57O4l43m98M27
4656d04J382j026P67r33N58k19K88K62N13j042J54K97j100J332j485J828o88k77
4674B07K14n12J49l9l49N95j195P12J010j929J332n76O19l28K5q16Q41N1O59o74
4694dn65J210k91n89j97J371j719L73q24J364M29m22O35k445K202k60n09N92r44
4713e93J038n72L03k41O9Q83j096K53n20q9P47m11M91j482J292N23n94K6O0L32
$$ y = [-658, 574, 40, 135, 1272, -661, -200, 226, -387, -431, -373, 701, -352, 1228, 100, 715, -851, 105, 510, 415, -487, 191, 66, -83, 307, -567, -1201, -99, 394, -398, 302, 110, 977, -557, -609, -141, 28, -602, -319, -567, 669, 326, 1207, -622, -9, 164, 468, 622, 45, -589, -376, 130, 773, -768, 1005, 1310, -636, 2155, -608, -262, 790, -422, -381, -181, 298, -688, -19, -260, -492, 336, -611, -54, 10, -333, -831, -404, 978, -48, 719, -214, 344, 125, 413, 675, 1188, 146, 300, 597, -503, 829, -656, 1172, 484, 207, 421, -91, 58, 19, -330, 265, -930, -218, 792, -1137, 195, -381, 238, -90, -65, -881, -40, 11, 670, -4, -569, 641, 350, -239, -436, 935, -784, -411, -1235, 129, 558, 136, 771, -1674, 528, 268, -241, 351, -593, 445, -127, 176, -65, 4, 887, -209, 44, -476, -565, 182, -229, 262, -1220, 72, 595, 1, 27, 87, 419]
4733D19r41P68R0Q24j137j53J151j64m62j57Q56p31J86N6m39r32Q57p18J881j083
4753A71j08k71J287n00m57O37r05m98J98p45J860M69m88p56P50o93K6Q78j355
4772e00j69J720p88M00K16j115M51J29K6m11K36o43m50J162n82o60J20P23k81
4791d16j86R93r41O74j025M01J102j33Lk28p16M47O4m53N30L72J89J60p97k65
4811b25J66O37j46N74j120K87L9J104j371K92p73n67K260j526J228l24R3j165
4829e37K63n63O81K17R32j069j162J251Q57j380J540n83J99o84j82q00J317n33
4847b36L70R32o49m63k50J60m71R54J72j177j40P09R83n40j065J010p15l02M13
4866c05M95L35m86M28l80j27M75j64j239N81P7P05q03O24J56p6j168M33O24L35
$$ y = [419, -522, 246, 336, 1160, 23, -130, 1021, 857, 395, 238, 1094, 363, 549, 605, 166, -766, 91, -627, 1254, 171, 63, -208, 1079, 579, 122, 759, -146, -644, -446, -1191, 669, 1138, 650, -106, 644, -49, -23, 855, -500, -669, 1051, 263, 663, 879, -236, 215, 344, 370, -41, 195, -448, -898, 264, -318, -978, -858, -135, -416, -602, 391, -550, 124, -901, -500, 602, 469, 472, 244, -472, -25, 39, -414, 116, 488, 677, 837, 40, -225, -59, 578, 432, 1006, -114, 173, 212, 1316, -55, 237, -536, -1103, 1157, -369, 859, 535, 628, -537, -274, -837, -156, 61, 993, -76, -1238, 13, 870, -510, 1030, 447, 646, -38, -220, -1020, 297, -236, 134, 1066, 417, -46, -296, -136, -607, 347, 519, -658, -798, -89, 894, 354, -711, 299, -416, -718, -305, 190, 525, 39, 467, 87, -40, 435, 271, -968, -387, -310, 395, -408, 216, 372, 296, -872, -439, 185, 520]
4886E20R3o89j53P67o19L33j4l7n26j50K135j581K79q91J387r49j2k03k03N34
4906B1M65j110M56O87l77p61J323p30m43K25J43l35Q34j93j72n29J055r77K55
4925a63P94N1p90M17l23l78J112j158J105j149R96r37k0L87k90L21P29q29J34
4944Ik24k3K53k89l6l25J145r98K66K38R72K38J24j198l06J59m8K31j412J948
4964G24o99k42K00J56oo19P49L52o77r03M09o5N54O83o58P3k35J042o00l97k41
4985d00J656k294J347j87K05L7j83j73p7j347N32Q41M59l02p6M04ol63p72J896
5005A197k347O12P16K82p6o17k81l80K109k145J135K2p10K90k68J381M21r89M49
5024H01n89o81J233o57J327o51j199R72r35k49J349j96j811N35J45J125m18R37
$$ y = [520, 613, -76, -229, 538, -81, 252, 238, 201, -325, -475, 1660, 79, 358, -533, 854, -95, -107, -310, -513, 21, 486, -624, -168, 519, 142, -619, 704, -26, -469, -244, -101, -436, 398, 205, 33, -496, 559, -418, -163, 631, 682, -108, 309, -14, -392, 720, -438, 667, -482, 514, -423, -443, -56, -346, -25, 704, -125, 9, -215, -238, 15, -274, -310, -635, 510, -488, -222, 16, 988, 1226, 1350, 152, -154, 5, -43, 188, -1224, 724, 25, -217, -17, 139, 133, -486, 263, 615, -62, -965, -556, -621, -67, 616, -42, 31, -204, 838, 238, -159, -400, 1256, -1038, 309, 122, 327, 364, 181, 8, -69, -1416, -884, -43, 416, 114, 38, 442, 436, 73, -699, 1197, -1150, -538, 178, 460, 384, -233, -514, -894, 1215, -930, 205, 227, -483, -193, -461, 920, 1341, 352, 801, 212, -469, 764, 107, 1434, 783, -416, 556, -379, -628, 721, 525, -1286, -751, -606, 519, 101, 1038]
5042A038q77o7k12Q5L38r89O22j491K261j20o44o07L64j381J179j11O6K36N4N1
5062b05j40j11J054j104M38Q17n06M21M72j02o27Q4o09o03J95N56L36M04J07q49
5082B8m16N51N89j178Q62q50Q03M24m04J78J064k397L28L52J351r14k86O00j4
5101F71j556P88k38L52j365J374J307j555J046k061M93oJ195M00j697j82Q18L61
5119A45o43j45J974r51j152k05J012J408j118j734Q75M5N41r46J763m62k88j1
5137A08r04L95N33L93j173O20r5l27Q46n39O95j175P60j292M01p80J022K68j46
5156c90J014r76J006o62m86Q6P67r41R72L45r49J659j721J573q63P78q52m12R25
5175H73j076m64O89P51m35Qp40M52p14r3J461j017k04N08M23n94l11L6j146J980
$$ y = [1038, 161, 94, -118, -33, 305, -684, -62, -1553, 708, 588, -56, -663, -299, -1680, -501, -612, -546, -310, -256, -205, -345, -456, 598, -506, -68, 749, 243, 664, 1136, 1034, 407, 491, -118, -721, -526, 30, 366, 770, 877, 28, -388, 163, 752, -426, 436, -414, 389, 813, 409, 587, 1651, -746, -418, -66, 1285, 371, 85, 685, 671, -885, -97, -335, 17, -1348, 26, 1333, -222, 824, -1237, -744, -750, 445, 845, -852, -1034, -216, 145, -498, -643, 1331, 380, -772, -977, 35, 1443, 325, -1409, -534, -489, 52, -894, 869, 407, 119, 108, -796, -401, 132, 525, -648, -28, -123, -450, 396, -143, 552, -623, 137, -1155, -754, -1534, -512, -244, -390, 624, -352, 654, -8, -494, -408, 359, -582, 390, 735, -214, 1445, -276, 1297, 434, 1212, 360, -52, 873, -203, -667, 22, 773, 338, 346, -394, 58, -656, -749, 712, -305, -509, -1, 422, -172, -483, -447, -1593, 387]
5195C87j69o49o79Q51P08p17J32J330k047R98M68o77k28N92R90j793O59r1l05
5214b40R88q48o78J449j552J620j176P72k61n75J312m39R9p43J029j291K6L67
5232a41N48m37J424j842J017j98m59R10p54L83M57n48m56n30N09Q72P1m74o44
5251b92O65k75p82L91N67Ko00O09n09P14q30L15J30n53J320p08j060J533q49J24
5271h8Q06q8oj292O52J035p42o87R24Q8k002J641k41K07l28n15M58k64J95k57
5291e04l38K48K83J22P92j14j016J394r91K30m27Q46o95O13q00N19m31M62m22
5310b29q15R07P75J73m63m47q24J003M80L10j297J503l46j020k5J661r02Q39j126
5329A57n88N09m96Q06q94K9M38l67n25J833n71j072J043R4K76j481R7o69K025
$$ y = [387, 218, -431, -1110, -259, 449, -268, -136, 1194, -853, 145, 613, -64, -292, 300, 1290, -503, 156, 65, -240, 748, -100, -778, 671, -881, 739, -437, 335, 74, -501, 811, 372, 471, -272, 757, -534, -508, -141, 407, -30, 1394, -448, 569, 371, -88, 822, 68, 451, 908, 360, -96, -626, -117, 755, 826, 352, -292, 373, 98, -684, -293, 274, 276, -324, 285, -224, 490, -340, -25, 105, -448, 872, 164, -896, 637, -212, -88, 718, 630, 624, -668, -16, 1019, 277, -410, 514, 602, -1400, 241, 0, 207, -121, -636, -178, -442, -247, -504, -842, -594, -311, -189, 603, 489, -527, 867, -124, 106, -321, 525, -170, 443, -357, 162, -269, 193, -229, -1044, -137, 638, 811, 348, -99, -923, 80, 560, 870, -427, 1076, 730, -290, -315, 1346, 444, 1283, 157, -431, 78, -418, 388, -506, -477, -39, -406, -931, 902, 331, -741, 302, 396, 672, -809, -712, -1381, 644]
5348F44o91O80j144J020j60n96P06L2O39p43j77p05R37p41m89P00j60p09K075
5367A118l5j264J98K11k22r1K76o1r35J179j285P87N32j277J287O13n92j955N74
5386i42J606M8J30k31n42N18l7j267K052k376N87J112r34M78L1m42K236j633n53
5405a59K99M56k56l10L65mN39r12j31Q86j602J034L33q70L06o33N99L18N32j638
5425h48J52J072J8p5n75k33P33k24p5n38J013p36P79q36J22J039j809J178K3l55
5445a75m65P00J195j772N8J418j679L95J415k907Q93R34N80K1j233J503j322P05
5463B64J58j27L73m14L48J42l94m36j573L417j220r24P76r03K85l27J084r70j13
5482e54R20r00K89J205k424Q75J418j829J023M94m1o71J046n40J54j372J933j123
$$ y = [644, -47, 633, -511, 509, 349, -247, 459, 491, 1130, 387, 210, -495, 442, -299, -788, -88, -248, -957, 1118, 1083, -181, 17, 228, 6, -85, 191, 130, -805, 374, -911, -124, 408, -869, 418, 1031, 439, -1516, -942, 664, 712, 842, 611, 69, 587, 550, -717, 1335, -1041, -454, 658, -276, 202, 233, -209, 2027, 394, -159, 140, 596, 340, 30, 395, 391, 930, 18, -113, 773, -829, 205, 538, -332, -26, -659, -60, 258, 790, -848, -696, 376, 394, 319, -256, -489, 244, 20, -55, -593, 420, -316, 463, -373, -251, 788, -1021, 157, 180, -175, -640, 60, 1255, -517, -459, 959, -720, -325, 1090, -1817, -924, 10, 590, 611, -622, 881, -441, 264, 422, 295, 668, 254, 602, 744, 350, -86, -1659, 1758, 538, -386, 390, -513, -228, -555, 529, -441, -554, 366, -534, -245, 960, -1464, -589, 829, -1000, 23, 517, 476, -195, 851, 311, 465, -907, 1026, -97]
5500i7N60J09o27J76J33N13O15k467J302k05N37j013M80l86O66Q4q90K64P42m81
5520A5Q2m4n69J41J598m19j185J654j896J030O18o07n59L72l10o12J008L04o4
5539E57K61p48O6k80P46q03K05L23N84q38M08o90O95k93L77m64j382J484k93k80
5559c65j168m11K483j341J330n20k76J07N46p95M05J18l13J842j014l8K54j474
5577f30N0J48J379L36j152K46M04k73q21j4O62O29J79j105j192K250j201l38m9
5596d92L57K41J73o58j33J687r34r97Q68L25l78Q34j660J354N2o46L31j579P43
5615e12J294j293j99N13r45L91q4P23P51q86L80j51m56O53p5n28l96J571l01j136
5635f86Q54O28o72j286J810m48m88K85m43L77L28r6l9k50L19K82Q0j76m00N91
$$ y = [-97, 463, 572, -55, 121, 254, 767, 1382, -1085, 217, 12, 549, -464, 16, -370, 296, 380, -510, -246, 496, 15, 97, 53, -516, -375, 1223, 804, -381, 1273, -623, 407, 1025, 418, -141, 231, -79, -691, 317, 621, 557, 818, 70, 136, -144, 602, -201, 4, 327, 911, 73, 481, -209, 486, 193, 570, 106, -1276, 208, -85, -365, -1533, -1944, 539, -802, 528, 8, -268, -161, 385, -410, -5, 113, -200, 1642, 628, 590, 844, -630, -580, -432, 947, 1283, 131, 377, 781, 508, -313, -327, 335, 964, 1143, 38, -1154, 1096, -105, -443, -492, -135, 106, 279, -379, -512, 1175, 241, -756, 112, 437, 59, 893, -767, 587, 639, -7, 324, -1255, -512, 782, -511, -710, -197, -1142, -751, -835, -112, 639, -247, 133, -18, -474, 179, 104, -424, -820, 751, 450, -686, 168, 796, 124, -1162, 648, 200, -288, -3, -446, -69, 259, 163, 124, -126, 193, 475, 555, 379, -21, 570]
5655E70m06P13O83j117l78o9j67M21m93m6j226J820j292L39P90r8O6k19P5N49
5675E15n34l7O85j128j21K68N38K58r48Q23p78P64j495J332N62k0J80j415O36
5694H5J19m53P83J78j110L12R20m63p83N06N88j364L30k74k56R30M00q69k94J88
5714e27J63J551j560L57q81M15J263o74k21L79L53l70R7j3j21j91r59L31N5L21
5734b32J496r99m4N89k73r48J95o16J222M27k575K260r50N12J29N2q41J36J92
5753b68N87N48j790L81NP20Q27j077j49p96J240j19M73j589J556j385J369p51
5771b18q75K299k500J517j48m88n76K73L59N74p17M81l82Q83K68p59ll4N75j418
5791h89R57Q71j025j67O34k61q27J114m65j22j01l20J402q64M61j79p73J021m27
$$ y = [570, 164, 877, 1560, 443, 65, -4, -171, 250, -243, -289, -1515, 305, -987, -648, 142, 44, 110, -109, -34, 515, -19, -56, 629, -499, -620, -352, 186, 444, -504, 319, -459, 305, -1190, 142, 704, 684, 864, -551, 85, 204, -249, 534, 712, -398, -86, 834, 371, -412, 94, 682, -682, -352, -626, -882, 48, 448, -421, -715, -527, -364, 1187, -373, -16, -897, -482, 781, 107, -114, 265, 618, 248, 345, 332, 211, 20, -939, -608, -553, -232, 1264, 265, 221, 810, 537, -411, -216, -832, 390, 817, -1758, 502, -448, 64, 193, 245, -596, -460, -268, 319, 867, -923, -542, -537, 183, 1010, -67, -216, -1012, 228, 109, 582, -1007, 549, -836, 533, -218, -1093, 1206, -1294, 223, 75, -413, -989, -716, -357, 217, -500, -19, -401, 482, 750, -9, -12, -46, 529, -889, 68, 939, -86, -253, 381, 120, -707, 407, -58, -180, -281, -601, 801, -63, 398, 219, -554, 467, 40]
5810D0K3n98O28K00K10p9o45L51L37q04N59j37j080N62Q85L15n19p75J515q12
5830A76n41M14o47M68J014k86j319N66L43M53j118K33o3j13P71m61o26M21l96
5849g11O67k78p7Q41j09O72j224K76M86j183P89J20M96m25j38J63l99L41j254
5868i47p1P32L5j20J064l24k0N46J41q61n17N3M47j269P23J46J452k03o84J90
5888E13n23j370K078p59l30P04n42M15M24j501J327j89L21l04k30P76p64P49o02
5907A93J165j225r82J114m70L44m27l69Q13m16o1N68N48p88K68j9o38N1K31j3
5927a13L9J105m84k34k74p1n37J258k376J019O15J66l2O11j012m6O4R55n84k5
5947D4l64k13R02O21o75n88r13J425n67R1J050n13m71K96k77r63K594j099n51
$$ y = [40, 63, -535, 93, 293, 503, 424, -221, 130, 467, -337, 222, 85, -995, -433, 452, 767, 248, -527, 988, 176, -365, 49, -598, -130, 884, 598, -721, -155, 188, 641, -477, -244, -307, -420, 351, -110, -736, -315, -711, -44, -322, -399, 442, 333, 1005, -219, 57, 543, -640, 149, 269, 765, 340, 202, 365, -34, 307, -947, -1018, -286, -251, -371, 693, 369, 349, 895, 1036, 175, -342, -289, 158, -1111, -388, -242, 1210, 1007, 323, 513, -10, -1380, 698, -61, -391, 313, -229, 186, 610, -891, 436, 247, 568, 264, 34, 810, 46, 795, 193, 1358, 133, -849, 265, -205, 139, -288, -657, 156, -260, -321, 247, 795, 7, 275, 256, -382, -331, -100, -113, -74, 1031, 547, 313, 39, -32, -569, 689, -1687, -668, -53, 113, 81, 692, -320, -366, -302, 653, 69, 44, -320, -533, 369, 990, 315, -273, -1186, 239, -328, -237, 813, 300, -171, 125, -152, -1115, 1479, 380, -171]
5966a71K25p16N56L64J57l44k11P51q70J85K5m66R07j160K137r0j540j088R30
5985d19K45l40J316k29K59K82j647j29j9J515j439J302Q9j883J731J53j446k90
6003i49K58L19J496r9j255J13P06j719J228L7k31L47l2r56O13N34q96J64n62O49
6023b35r69K019o58k41j24j002J278j82L71m20J145r57J04q70J295o87O52ro25
6042a15M47j202J894m86j084O86J37o55n51J719p67O85j154N03n95L84j24p56
6060a034J329n58N73n02q8O80J86j146R68r44K01O79r94O82m56m10l62J118p72
6079h50O67l91J425M29q97r53L96j02K12O28n62M25j61m20J271j166j216J826
6097E61k161J146K47M35p81R50K98j072L43K20q74J61r1J678j321P05j804J084
$$ y = [-171, 54, -662, -106, 258, 415, 71, -140, 611, -259, -74, -49, -515, 392, -768, 1369, 1279, -261, -1349, -419, -174, -514, 802, 573, 832, 1114, -533, -662, -681, 834, -605, 697, 786, -1097, 634, 787, -659, -949, -691, -372, 1124, 1025, -230, -117, 589, -1130, 98, 135, -96, 251, 219, -737, -124, 410, -486, -322, -884, -235, -1204, 815, 157, -84, -208, -1210, 68, -114, 257, -163, 982, 25, 129, -741, 554, -133, 519, 510, -115, 332, -870, 1024, 538, -546, 140, 277, -378, -929, 790, 23, 708, -446, 57, -538, -154, -278, -1034, 295, -263, 310, -192, -280, 400, 586, -560, 408, -536, -335, 344, -650, 32, -424, -834, -1196, -78, -850, -183, -574, 851, 1280, 383, -570, -174, -276, -64, 564, 2, 427, 266, -154, 1117, -49, -1265, 561, -1600, -454, -207, 228, -553, 397, 695, -377, -34, 186, -688, -527, -618, 1060, -261, 444, -1360, -276]
6115b76j63P79l85l29R75M22o90J20m31k57R93k37R24k107J146j54j089J01L41
6134c17j30L03l19M8l8K58K3M27m03Q69M8R62j677J2L84n08M42l63K60j089L36
6155d72L43Q57j626n88J412M61O68p68O99m45j78J03M27j383J717j698N28K53
6173C10Q0R64j480R40r9j680J050J513q02K9K8L46q31m83m08Q39k14p4N66j34
6193D60M10j000L04L46p4l9K94j235R02n22K77j16J727k976o6L84N69J527j619
6212d47O59M69l69j267J159J45J174j579J87o72P33j189R06P57J44j061R4n62
6230g19N98m08P94l00l03L83nk04Q0M02j77q93P25M36j000P38r16O84P07l39l03
6251b0K58p19m09R71R10j469J003j02j71L80Mj273Q49J76j486K44N46M95N09j005
$$ y = [-276, -439, 340, -45, -374, 601, 1023, 333, 453, 22, -235, 758, 521, 1445, -662, 484, 330, -759, -658, -317, -447, -144, -463, -415, -453, -195, -172, 255, -148, 721, 769, 1731, 54, 66, 450, -58, 384, 21, 281, -808, -472, -129, 728, -898, -1486, -74, 387, 1055, 287, 986, 541, 363, 466, 893, -490, 1227, -471, 57, 310, 390, 1354, -126, 814, 715, -965, 85, 1598, 796, 825, 853, 1199, 368, -115, -523, 316, 102, 28, 594, 460, 870, -130, 174, 520, 446, 407, 701, -534, 368, -154, 123, 7, 1734, -1242, -1308, -924, -355, 1172, -447, 212, 681, 312, -955, 204, 349, 1523, -56, 131, -541, 192, -997, -91, 666, 810, -251, -157, -719, -121, -529, 265, -35, -338, 45, 40, -164, -84, 318, 141, -752, -27, 409, -591, 147, -769, -85, 622, 283, -20, 238, -481, -890, 81, 991, -478, 525, 423, 252, 632, 636, -637, 212, 388, -1098, -854, -308, 187, 696, -309]
6271c09J574j473j60M70j028N3J073j233J500j664K231n15j364L6J96R53j09l23
6289i2J50o15K65j24j14J720o67k51j676J642J51M04j174J213o19M52j41p69Q92
6308F47r51R50L3j172J43K58j842K642o64j02n71O33Q51o1l70j077Q49q87O9l68
6328i90J565m1n60n3P4n20M07L15m60N38p5J0j57K54l04J310j803L12K73N58j049
6349c96N45j104J205L61j049R39m6m13Q8P6n35q06J474j05k31n22L05k47k64j46
6369h71J148N75q51J166o54m34r39Q35R75o53j874J494o64P42L83p7l54r33qK020
6389A026j080l68M89L18j273J742l60p4j028m99J739n26O20r64n24N13K72j643
6407a620J307J227j268L08R50j400m58J204l68K05N7P23j222o63O29J196j886
$$ y = [-309, 1265, -208, -368, 102, -926, -873, 200, -1033, 467, -1197, 1034, 519, -845, -809, -613, 340, 231, -92, 58, -557, -292, -416, -530, 1190, 523, 272, -1404, 238, 389, 793, -381, 832, 213, 665, 524, -245, 647, -304, 646, 679, -493, -350, -92, -1934, 708, 44, -58, -629, 4, 855, 794, 424, -653, 196, -691, -622, -990, 575, 534, -26, -79, -5, -525, -118, 197, -263, 275, 200, 210, 53, 307, 3, 1313, -490, -178, 95, 653, -396, 149, -955, 250, 611, -438, 501, 455, 42, 130, 206, -329, -1135, 339, 234, 3, -519, -214, -461, -725, -871, 277, 852, 1, 1167, 513, 79, -860, -25, 950, 297, -1577, -83, -747, -5, 378, 301, -53, -986, -994, 1026, -54, -422, 67, 385, -888, 854, 494, 420, -608, -1107, 632, 106, 726, -238, -762, -249, 23, -1620, -313, 914, -354, -46, 904, -496, -954, 250, -118, 87, 144, 867, -355, -1018, -389, 807, -1079]
6424a079O38P31J419k013P90j97N80m93k97J119k44j081k0p35P39j76N29p13l52
6443h55M46J021J98j43r53O31k03n89M47L82q40L07L36Mp03J430q15K04j314J402
6463C93p74Q1j039J661M82j352l5J083p05R54j58j59j404K338j444M37m83M76
6481C52R4j2O17j823k84J375l85l87N49K50j543J132k98M2L44K17l63j56n12J703
6501I12r64L34l59K5J50o8m13Q48l07J066j25j495P38K11j564J001L06P0p96M64
6521C4l52R53m09j658J926j928J808j123N12N14r1k6j143J157l32P62j89J35q16
6540b66o31M29P33m31l96r2J414J07q51j83J203m38N49j965R87m7j82n78N11j12
6560b39J69r49J228L84o99N2o70J645k029P8N41N23K17j16p31J82P84j253P88
$$ y = [-1079, -441, 290, 1709, -304, 486, 289, 869, 376, 79, 1198, 954, -127, -147, -882, -143, -319, 210, -503, -855, -409, 612, 810, 667, -286, 345, 142, -447, 0, 382, -458, -151, 185, 189, -514, 916, 101, 305, -1009, 393, -381, -300, -1339, 322, 804, -548, -583, 500, -205, 749, 591, 432, -972, 1366, -78, 359, -124, 352, 446, 434, 1051, -772, -1056, 319, -66, -453, 96, 346, -1197, -65, -363, -321, 23, 240, -123, -279, -791, 912, -52, 282, -77, -52, 98, 30, -383, 465, 158, 1224, 1099, -396, 342, 553, -1011, -10, 296, 366, -430, 34, -318, 635, 226, -1432, 494, -1434, 374, -749, -237, 277, 186, 160, -983, 174, -158, 604, 415, 550, -266, -897, -468, 265, -166, -562, -654, 760, 867, 16, -167, 1036, 598, 1147, -818, 169, 122, -60, -638, -127, -239, -70, -1019, 209, 593, -106, -54, -724, 921, -1108, -1030, -489, 34, 251, 135, -596, -414, 370, -883, -95]
6579i5O36M25m01M31j344L28r01K217j082j31n74L52J44j97Q71j003M79N4q81
6598f72Q24K41j069P07k84LR1j5r5l86L20l12P26J044p67K0j311R52L38n73K57
6619C9r97J859j778J441J43r57J28J170q21j239K080j125j071Q35J554j358j14
6636b11P58k306J569k62M41n33J063r84P95L54j273Q55O1j027Q22k21M54L72l61
6655C66r96J153n89N32q55l25l86N22J585j119R60j317R01r26n4J467Q6r92R16
6674I29j58l91j1N30r47l94R15O14r43R07j101J54k76M8P4n30O04l05N92p99J112
6695F24j134O75r4K22j9k4n92M52m9q44J302r55M70q80J365l5j125J524k007J539
6715D15N45j409O46p46n67P27j61K57M84O37l19J64l24o92K65j82Q85J86q68J02
$$ y = [-95, 541, 966, 565, 996, -348, -20, -921, 1296, 214, 83, -491, -139, 5, -192, 679, -324, 155, 209, -672, 152, 393, -676, 31, -253, -250, -159, -174, -269, -655, -335, -647, 79, 1123, 356, 376, -935, 17, 355, -218, 39, -958, 901, -877, 564, 707, -250, -122, 1048, 227, -1012, 1068, -57, -1128, -293, 1261, -97, -211, 547, -1759, -190, -452, -11, -544, 519, -465, 330, 684, -589, 266, 327, -700, 122, -99, 355, 727, 366, -630, 523, -66, 466, -389, -714, -1100, -578, 1007, -112, 848, -469, 432, -494, -548, 919, 1005, 13, 929, 771, 380, 369, 899, -48, -442, 473, 1087, 144, 1051, -50, 104, -172, -124, -50, -580, 24, -281, 311, -488, 624, -510, 165, 71, 293, 274, 250, -342, 110, 61, -783, 519, -436, 34, -846, 519, 484, -641, 883, -1124, 415, 960, -449, 197, -549, -1116, -389, -550, -293, 191, 828, 509, 673, 349, -343, -78, -260, 625, 811, -57, 45]
6735D5O88n42k00j64N69k20K88o94o38K080j198O13j382J359q41P40j190k84K29
6754g42J926j801J35L40j28P35m07k03q06J575j625j156L302n70j48N14j494p6
6772f29R45j21l68K77Q57r97k24m03K36L31j0K39j714Q97l57K65J205L52o66K30
6792C45r92J720J43j578L06j20J484k579J394o44J127j479L92J50L78j19j92P87
6810E23o96J043q36j202K39N23p8q08M04M69N46j049K50J931j755J25O45l78R56
6829H52j224O66l50K9l97m36K51m04J677j139k46o4P59k60M85J9j0l32n4J500
6849A322j469p60J557l58m4q88J152q42m50R15o21o94N94O94p42K76M50J66N57
6868H15j83j242K6l45O55j077J155O51n32n17m29J348o0k60r6p8O51m15L33L8
$$ y = [45, 733, 191, -9, -173, 396, 176, 464, -230, -868, 1212, 14, 627, -755, 604, -237, 503, -687, -971, -742, 1184, -617, -482, -142, -270, 465, 58, -145, -951, 624, -1001, -2157, 1145, 575, 427, 941, -553, -629, 316, 195, -173, 104, 961, -36, -260, -663, -427, -96, -106, 133, -1581, -684, -1041, -776, 429, 781, 115, 345, -647, 1073, 1216, -362, -56, -176, 1308, -1271, 123, -521, 606, -873, -481, -331, 47, -72, -264, 523, -173, 870, 34, -1168, -929, -406, -484, -1292, -888, -419, 127, -922, -672, 1259, -496, -371, 274, -104, 852, -372, 294, -56, -27, -424, -860, -609, -1013, 664, -475, -721, -785, -26, -286, 199, 218, 208, -124, -178, 1322, -147, -907, 650, 292, 248, -640, 512, -330, -780, 135, -486, -1180, -586, 108, -634, -358, 92, 258, 815, 632, -610, -584, -929, -274, -1351, -196, 455, -77, -594, -1023, 325, 265, 5, -91, -169, 482, 67, 400, 438]
6888D38j178J746j426R35m97J74k75p81J826j607N55l89N30k3N10q10J422q24
6906C26M7k166J264J435j245K55M22J43n23J03l8L46j284J53K17o76J733r0k55
6925A67o70K70M99m08J95k07p38%n86P77M02P92j554K37O47J408j124k46k14O44
6945B91M51q22Q3n69N68O69J84q93K03m72J670m77m27o60k41L05L85M59l22l86
6965ao3N29J12j584R30K04J52j184O24N30l68P52P68j635N28N91n82L10k67o93
6985c47J02O6n15J556p64m56N52q40J49j02O47q67K175r27j289N19J340j067L7
7004c1R2R57j842N98m27M10r9m77L36J07J456j296N36q6q38J427j48j853K787
7023A609k425N13N50p95L83k59P90o30Q56p02m66J096q40Q04o41M69p73L73O18
$$ y = [438, -740, 1006, -420, 515, 18, 192, -83, -864, 962, -645, -90, -479, 51, 28, 538, -272, 1150, 326, 373, -1793, -529, 906, -339, -84, 338, 481, -42, 61, 23, 369, -915, -762, -545, -1221, 512, 422, 167, -503, -233, 266, -142, 53, -154, -892, -892, -1478, -701, -299, 493, -1061, -824, -177, 1231, 107, -139, -353, 291, 742, -80, 3, -566, 2, 671, 855, -38, 165, -307, 1363, 886, 459, -201, -442, -137, 248, 707, 385, -1, -64, 465, 577, -1007, -77, 127, 279, -905, -281, 249, -119, 633, 1401, -234, 294, 885, 303, 613, 346, -347, -245, -179, -694, 862, 98, -358, 194, -646, -497, -599, 48, -819, 1356, 429, -860, -341, 999, -68, -31, 61, 1018, -824, -226, -653, -243, -342, -819, -483, -376, 1080, -216, 320, 234, -604, 823, 675, -1178, 1609, -816, -303, 247, -548, -165, -424, 366, -264, 592, -110, -576, 520, -320, 484, -157, 312, -461, -88, 530]
7042E30K21k77n0n88l65J450j95j149M90o27K71J22M06k2M5j353L93J010J11n26
7062a03m37P16j039J305j301J132L31m21l61Q65p60K85P16j116J503k222K008
7079A101r36r02Q56J45j42r27l38J253p81J239P09k234J518j633N25K27R91J97
7097H68o73o53J563n54q08K11J65l16r79L66M40K058m76r60n07O41K56p24k8o98
7117h08k53J222k2j042R40r90O94J006q80p83K47P98P79p49Nl41o50J914r85n62
7137d60Q47k66n74J105J60l42k29j73r15R15O99j305L39M95k06j92j65J05R65
7156H03n09p78Q61j200K98J056j067J608j000J25n40P76k31M85k59o87M60j302
7174a101q21J425J524l91k74m74m94O27k54M47L29j067J462j264J125p05m50Q07
$$ y = [530, 751, 474, 424, -164, -529, 921, 726, -423, 67, -560, -289, -167, 239, 217, 262, -1091, -698, 312, 423, -103, -540, 176, -863, 442, -859, 273, 604, 183, -178, 687, -73, 212, 928, -188, 1315, -907, 1101, 165, -737, 119, 264, 122, -805, -1143, 110, -671, 568, 1277, -957, 561, -1072, -547, -320, 671, 868, 195, -458, 1105, 551, -257, -46, 119, -197, -1176, -810, -370, 1688, 1212, 252, -255, 386, 642, -82, -110, -808, -1061, 161, 139, -903, 37, -953, -259, 747, -133, -916, -669, 129, 908, 159, 164, -177, -827, 1087, 102, -460, 387, 121, -453, 652, 812, 470, 241, 68, -847, 68, 767, -538, -199, 296, 90, -102, -267, -162, 803, 294, -484, 377, -823, -525, 531, -536, 1072, 72, 197, -343, 433, 202, 687, 428, -259, 201, -1101, -1922, -497, 1027, 636, 362, -112, -606, 21, -233, 214, 543, -524, 938, -326, 799, 94, -356, 451]
7192D51m6l93m36P54J78o90r61Q30L11L23l45m94K55N65r65k92Q9J032R30j978
7212h82o4R28P98k82m93l0l74J001n28M71j054j8N02m39Q75q72P62J04j173J44
7232f24O52j098N70R42j418J722k46K67l43j021J080J84j016M33P86m22J5r01
7250d38O61R33j304P68P5p08Q93j154O41N58j45j908J141l0n84J136o4p44l30
7269f03J085o98K34r13J476n52r34M49J436j537J654k112M98J628m50q09R37l64
7287D25J179j836j532K340Nj074P20n91L86P2J02N26j366J097q12J636l65j468
7305e56O58K13r08J55P03k35k10Q35r63P40q64N03j504K542j807Q97J32j31K28
7324D28Q46n40j837J757n26J427l644L348O6J61j357n10o04J795r73o12J284Q3
$$ y = [451, 405, 12, -424, 330, 508, -182, -1143, -313, -2, 321, -24, -518, -263, 302, -663, -955, -866, 166, 1096, -882, -946, -18, 780, 498, 5, -25, -399, 602, 74, 545, -509, -527, -25, -464, 411, -461, 301, 405, -768, -624, 28, -1070, -500, 442, -976, 746, 500, 767, 424, -597, 483, 667, -349, 84, 870, 448, 463, -438, 223, 1156, -148, 620, 695, -13, 880, -274, 367, 925, 780, -1128, 13, -17, -601, 535, 471, -273, -603, 482, -216, 18, -895, 581, 29, -905, -456, 980, -557, 1097, -1015, -517, 1111, 661, -148, 789, 425, 1604, -232, -1764, 576, 581, -493, 227, -364, 22, 94, 196, 722, -644, 453, -359, 1277, 912, -556, 102, 315, -593, -438, 265, 30, -180, 655, -308, 432, -432, 71, -1433, 1109, -698, 199, 331, 200, 428, 1274, 734, -1103, 654, 128, 1555, -2089, 1259, 1325, 1486, 129, -381, -985, 810, -163, -775, 509, 592]
7342E92Mo71K33j075J098k4l36K72L71p28O80l89k32M51q31J18k90N01k07J59
7362c04l17p22J249K99j065L23Q5J026j525k93J960m62m12K07j12R7l48M20O41
7381G47M57j829n40R05R9j13j29o2Q02L40r42N04L26j259k8P52N71n81L98p9r89
7402f50J221r02p79J659j164N88Q23j094K51l36K96K23L51J63r54J114p67n26
7420d83J036L0j10l43n80Q7J046j414R56o67L57l41n58K98Q08l0M63o03q27R09
7440C4k4K40l54n80J134m28j287K435j364rN30j24L5r81O58l06J540l50m12m4
7460C43q23J341r8N33j583O28r39m60K132j532o10J837j158M81L89j215O12m7
7478a69l23p9L77N13r95O66j38m6Q01L49j45n21J048j306J59k02o18J448j284
$$ y = [592, 596, -75, 158, -917, 181, 157, -179, 93, 464, -264, 416, 27, -205, 246, -585, -467, -757, -256, -463, -304, -621, -1343, -94, 205, -860, -537, -452, 574, -951, -1244, 716, 254, -158, 49, -63, 34, -314, 106, 747, 1204, -625, -1165, -260, -161, -274, -403, -465, 337, 677, -265, 239, 565, -694, -722, 30, 601, 20, 418, 339, -650, 571, -331, -1110, 549, -615, -27, 796, -298, -47, -383, -87, 136, 487, 650, -304, 810, 43, -483, 553, 583, 473, 130, -450, -363, 683, -731, 225, -442, -85, -426, -984, -686, 122, 92, 555, -48, -875, 34, 10, 250, -104, -684, 450, 22, -1265, 1170, -194, -203, 327, 203, 238, -743, -85, -391, 1149, 799, 387, 343, -480, 861, 763, 1296, -287, 341, -598, -1058, 1074, -458, -1068, 769, -389, 92, 481, -734, -122, -169, -492, -571, -194, 319, -676, -10, -148, -194, 607, 956, 811, 290, 1338, 32, 191, -11, -629, 819, -465]
7497d65R77p93q76J351J244j102L60j121Q93q34k17O63L16p95m38J207J01m44
7515B7J014j378J10J96m74J761p97j246j89R49l38O57m96M60n18M12J5n13J43
7534b05O05r79l18J246q80O40m6j56k53j72qK97L98k43M44j706K277j030p69Q19
7554c9P77p21N43L35M40j262J036k38j261K1m06M95J233j74r43j77L85m43R79
7573E80j94L96N43j276l36j50j50P28Q1J45Lq93P13m99M01o53O25R93j583M22
7593a04L37k79n7M30j035q51P80N82J81M93j49J11k29j09m80J422l13m84J6j259
7613i97L29j39R82p83O55M51o99J156j707P34l42k5P78j01j158M15m04O95J068
7632I08m87l50k25R31n61j3n46N74n16J32n19J073J76j330N29L18q28l94R32M98
$$ y = [-465, 512, -281, -1157, 194, 1438, 336, 696, -425, 468, -366, -583, 80, 396, -399, -837, 370, 471, 27, 1041, -337, -227, -31, -505, 1256, 459, -787, -976, -27, -365, 292, -204, 256, -262, 150, 165, -348, -205, 400, -579, -897, 349, -531, 109, 63, -93, -346, -518, -526, -229, 169, -74, 370, -1336, 941, -89, -858, -39, 738, 17, 560, 895, 1335, 73, 1109, 871, -390, -369, -775, -280, 953, 779, -164, -341, 44, -399, 580, 386, 782, 1325, 49, -287, -437, -587, 141, 222, 367, 370, -523, 190, -309, 92, -561, 64, 1057, -526, -104, 233, -46, -103, 327, -708, -1559, -779, -197, -16, 477, 328, 439, 210, 101, -379, 1043, 730, 246, 262, -997, -668, -807, 175, -608, 47, 498, -201, 955, -752, -18, -360, -385, 393, 292, -866, -451, -855, -160, 908, 421, 71, -154, 777, 216, 203, -343, 231, -285, -153, -672, 401, 577, -753, -224, 94, -734, -1128, -196, 302]
7652C02l70m15o36J710l64q44J002q67P8k50J257j470J191j298R58j68N53o88
7670c19K23k89l64J215j396J384j99J06j277O40M09o52Q41q94J204O69k251J137
7688A87N36m31j304K04P72M47r42R4O20R0j83P97m83l10N83j126O75n81L36Q90
7708H71j457J108o67P10m00q35K78O02J245o57N04j075j222J466j142J425j335
7725e81m29J060j17l19o03N40M46L09o22l70j46M66j223J518L05Q51o4j413O57
7744B65Q8l66k72n02Q25j35JJ53O22q07P36p7j019K33L36l27L08mJ33l93J200
7765I98j731P22K4m69J406j252M79j038J148o31K00N74n7j03K30o88r62M82Q48
7784A80K50M99p01M42j045k29R54r49N05l22R94o56l82k39Q34r54R36J192q63
$$ y = [302, -68, -483, -1119, 591, 227, -617, 385, -482, -404, -654, 603, -867, 324, -974, -16, -184, 369, -319, -96, -385, -749, 466, -930, 454, 255, 361, -916, -276, 133, -519, 322, -572, 632, 1301, -950, 187, 723, 292, -1012, -808, -36, 411, -531, -437, 183, 273, 90, 887, 404, 94, 677, -449, 226, -355, -19, 871, -586, 522, -145, 565, 165, -670, -392, 210, 1455, 798, 1302, 227, -995, 471, -671, 754, -581, -1010, 50, -67, -386, -989, -449, -3, 306, -316, -686, -832, -366, -1589, -71, 234, 1085, 1021, -392, 265, 353, -13, -285, -787, 38, -97, -96, 57, 679, -128, 608, 531, -488, -255, 81, -246, 62, 58, 191, -202, 998, -733, -11, 13, -456, 950, -302, 177, -861, 287, -344, -144, 430, 373, 270, 500, -188, -1150, -668, 180, 430, 929, 228, 670, -375, -604, 350, -599, -94, -416, 578, -78, -460, -699, 135, -819, 117, 1309, 446]
7803D46j044O71N32j758Q98O13l92q62J365L5R78j579Q00q14n88R15K92J8j045
7822e19Q75o91N7o70J229J66L83j33j391N32k41R41n47n79N87n21M60j43O00o49
7842b54J09J15m6m68L53N52M96q51o14J301l60r41R82k4r9k50o42Q27j32l50p73
7863a069L64j273J841m3j88N99n06J140k77o05K78J46m36J2R25j011M88l83k38
7882b36L44K79p18J7M67l63O27q91J73M38j532J423j70K54O56q25L81M89j142
7901c29p9J37q3l85j15N26k76O77L56j220J475j86o11Q43j034J325j223k38P35
7920B95O70o77j108M79J127n95r26J296n42m84n45N46O62Q3r78j45J381l42j24
7939G3J86j84k56P10j222Q09p29p94J332J29q1O40K76n02P6L26q08N07k55p43
$$ y = [446, -598, 73, 605, -1153, -255, 358, -34, -896, 469, 504, 1482, -97, 703, -111, -699, 216, 508, 526, -519, 356, -335, -278, -948, 281, 447, 830, 697, -694, -162, -403, 538, -9, -588, -1, -522, -62, -205, 395, -254, -145, -30, -76, -544, -191, 361, 857, 6, -608, 693, 333, -608, 374, 350, 251, 1, -641, 186, 54, -296, -1069, -705, -1978, -137, -180, -368, 231, -275, 865, 588, -17, 261, 407, -29, -17, 908, -103, 385, 2, -236, 108, 387, -331, -314, 153, -210, 417, -474, -301, 137, -1395, 28, -142, 112, 768, -57, 324, 813, -329, -408, -271, -354, -739, -854, -328, -604, 73, 429, -791, 684, 498, -113, 730, -304, 1021, -202, -440, 295, 965, 288, -820, -341, 786, 191, -735, 561, 19, -465, -1010, -464, 198, 281, -697, -842, 539, 197, 73, 259, 75, -181, 529, -693, 116, -613, -1407, -75, 54, -27, 613, 889, 387, 463, 789, -19, 488, 233, -510]
7959e10Q86r37K2J089p33J024m71K7K11j230J104o28k61R5M82k99Q30N00q49O82
7979A034j490K9M98o25J50j139J661o5M71r29J488l66j542K90M37l15K141j301
7997D27q65m78P73L04K43J89q25L09k07j13K96Q40k13l76r44O97p09L2N7R27m11
8018d7L75j263J976L84j809O85o51L86r01J149r7k96k66J011p10M11p72K94J185
8037A044j079J61k79n80O4J531M54k015O97J157j002Q3k37p45J449m35l53K60
8055A75M57q06j230J560M03k46k79l82O87o47j51M23j55N31m04L51j620J881J03
8074F51p48J001j72k02j25J19o31o03k27M83K034j635l78Q82l45L89K08j065M59
8093I5K5o22J663j853J273j902J231M0O28j280J652K52k395K370j109j80q02P78
$$ y = [-510, 376, -561, -539, 550, -183, 841, 370, 397, 608, -622, 482, -146, -407, -312, 170, -129, 701, 1201, 352, 1034, -456, -427, 71, -554, -404, -1543, 118, 53, 524, -405, 1083, 717, -825, -535, -98, -413, 1728, 427, -438, -916, -143, 161, 404, 593, -232, 77, -130, -243, 53, 893, 680, 304, -640, 57, -652, -620, -563, 364, -47, 328, -935, 1041, 1425, -384, 301, -350, 36, -865, 284, 187, -109, -375, 636, -74, 337, -435, -141, 1044, -35, 126, -153, -733, -669, 862, 1316, -699, -2, 1155, 153, 236, -1, -746, 703, 268, -85, 175, 632, -174, -1404, 156, 559, 313, 34, -348, 339, -308, -459, -36, -191, 340, -64, 287, -1333, 548, 651, -97, 904, 732, 530, 405, 524, -107, -710, -937, -454, 1580, -55, -433, 449, 104, 493, 701, -364, 95, 120, -502, 1161, -692, 581, -1321, -90, -50, 578, -702, 950, 1202, -1193, 1177, 68, -112, -914, -136]
8111a36l78J359o00M53m96k20j29R29j914K36J062o85J356j333k74O50l23Q32
8129C89o34Q21j219K98L91o18J546j446J72Q75r5k397O21K233r81j161O81J322
8147G98j463J128j300J386J68q77l17J200r52P76n74O88J254j861K9j57N36l10
8165A52k15P07k03j369J402j643j53J093M69o7m96l08j2N67Q66j36j32m02J30
8184B50m42m72J3M49M45q77P52
$$ y = [-136, -514, 845, 245, 698, 202, -18, -147, 782, -1132, -896, 166, -519, 837, -496, -770, -120, -443, 389, -245, 576, -643, -345, 46, -572, 974, -472, -300, 575, 480, -1917, -1296, 937, -44, -1205, -524, 798, -665, 463, -837, 549, 717, -160, -477, 723, -229, 547, -27, 661, 1915, 54, 83, -74, 462, 152, -63, 644, 441, -928, 474, -1169, -1322, -229, 240, 173, -323, -631, -643, -76, 790, 654, 522, 120, 250, -192, -664, -651, -202, 243, -634, 118]
8191A18
$$ Imaginary data points
##PAGE= N=2
##DATA TABLE= (X++(I..I)), XYDATA
0@%%%%%%%%%%%%%%k2J21k07K16k16K16k18K64l62M24m43N09o01O74p64Q61r71
31e19J090j213J355j512J688j876K088k313K552k827L134l466L835m253M718n245
47b764N845o541P357q320R477j0910J2744j5152J8482k3421L1455m6671Q5080
60E6661l18334o66208R20408O82012n55864o72302K85352M71663l7346k74250
70a08208n0877Q0308R5540N1330k2311q8768k0582O6529R4811J5820j02267j16632
82a05307P3403K05579J3495k61452j26040K47434K25683k01199l01575J05962
92a24017L07715k8243k79012m8630K08540P2131j41874q1243Q1883O1787m4071
103a5034m9566K7298N7700o751o5699j2178Q9527N8963r0953q5292R2527J22239
$$ y = [0, 0, 0, 0, 0, 0, 0, 0, 0, 0, 0, 0, 0, 0, 0, -22, 99, -108, 108, -108, 108, -110, 154, -208, 216, -227, 282, -319, 355, -409, 452, -519, 571, -642, 713, -799, 889, -987, 1101, -1212, 1340, -1487, 1647, -1819, 2016, -2237, 2481, -2764, 3081, -3460, 3897, -4423, 5054, -5856, 6888, -8264, 10218, -13203, 18252, -28419, 56661, -261673, -927881, -7473, 674539, 118675, -553627, -268275, 203388, 166042, -108208, -159085, -78777, 16763, 68093, 45782, -42986, -63568, 2961, 97772, 113592, 11325, -105307, -31904, 173675, 187170, -74282, -200322, 47112, 272795, 71596, -229979, -124017, 183698, 155455, -123557, -172187, 36353, 108484, -33390, -114633, -32750, 29037, -15034, -64600, -37302, 20398, 13647, -52052, -64230, 25297, 84260, -6693, -91985, 542, 122781]
115A22781p5339j32120P1692J42244p3958j51977Q5655J62058j01926j81985J09944
126b2931J89325j20943k07089J09735K04388r8697k03876N7130J77481j6230j36071
137f7778l0527O6005O2980P403o9578o6688O2464J11127l6624j08762K8458R6220
149E4700k2474n8423M3226M1145o4894k8297R3306L8670j11744o4349J11062Q6748
161A18676r6665j10171N7278J09163k2632j02015k7622O5804N7674k9245q4015
172f3770k1086Q9778N9107q6340q1773P9480R1764p1387p5436Q2219O7312r1854
184b1986m7850J20423M3961j29450l9281J36054M1998j26088m1998J09095L7622
195H2500q5468l8849N9328K5542l6622k3426O902O545R676K208l4138j6726M5657
$$ y = [122781, 47442, -84678, -12986, 129258, 55300, -96677, -11022, 151036, 49110, -132875, -22931, 166394, 45451, -161638, -51903, 152485, 53788, -150088, -92958, 84523, 68293, -67778, -98305, -32300, 30680, 38083, -31495, -98183, -35719, 75408, 38784, -69978, -41520, 54700, 32226, -26197, 17029, 58174, -6720, -35017, 58289, 96959, -14785, -79134, 31928, 118676, 22011, -88160, -30882, 78281, 55649, -46366, -73988, -8184, 49490, 20245, -63770, -84856, 4922, 64029, -22311, -104084, -24604, 67160, -4227, -79663, 2556, 69868, -21986, -69836, 50587, 94548, -34902, -74183, 61871, 103869, -22219, -64217, 44878, 82500, -2968, -41817, 17511, 43053, 6431, -16995, -10093, -3548, 6128, 8336, -25802, -42528, 3129]
208C129K1751o0009k5097O6395K6361p0739k3979P9616K5171p6849j7828P9830
220B7752K0783o6927j1895O2347R236m6415Q16L6166n952k4886O339J2563q158
233A1769Q99M45k3476k944L7230r48n9218m694O8090K666p9505p503Q2547N557
247C0915q4926j733Q1369K653p2172N139O5550q500n1355J9522M6979j7987l3354
260a7900K4545K4818j8264j3986J6899J490j0994J1444K724k5920k540L4222n214
273B1324m5476M280M4746j0574m9456Q926M5500j4985m3669J5453L7349j7737
285d319k9838K0328K4016j9590j2695K2175R973j7495L880J8035q525r940K1467
298A7472P543k9142J92L6547n981l9935P823M3276j5571m8560J8372M2685k3511
$$ y = [3129, 24880, -35129, -60226, 6169, 32530, -38209, -62188, 17428, 42599, -34250, -52078, 27752, 48535, -18392, -30287, 32060, 41296, -5119, -4303, 31863, 25911, 1025, 7364, 19927, 11769, 12668, 13113, -10363, -13307, 23923, 22975, -36243, -40937, 27153, 29819, -49686, -57189, 25358, 30915, -54011, -55744, 25625, 28278, -43894, -38755, 26795, 18295, -33060, -13538, 33441, 15454, -17900, 6645, 31463, 13199, -787, 16112, 17602, 6608, 18052, 20776, -5144, -7684, 26538, 21324, -24152, -19872, 24874, 14300, -35156, -26230, 19270, 4285, -39384, -23931, 13418, -4319, -34157, -13829, 10187, -9403, -22098, 77, 10050, -7445, -3565, 14470, 5945, -3995, 17472, 25015, -4127, -3935, 32612, 26631, -13304, -5481, 37795, 22224, -26336, -7964, 34721, 11210]
311A1210m5752K4296L5700k8973l4378K9043K5834l2999j8031L0004J1073k7573
323b0546M25K3878n118j6286J5291J4916j7227n710K5728K256k3980O732K7375
336B7734r810k8197J8324K5049k2556k4135K3869J6018k6698j3589K2497N928
348A4434k8462j348K2956n810k4892R682J8808j6888j2892K0076R005k4343j278
361b0952K7517q87k7227R923K9161j0157k6570K2030K6127k2402k0609K9047J7738
374C2739k8854j3105K9479N905l1529p78K7770o833k8772Q147K0781j6037j8388
387a9475J5674J0245k1161p286K2623o59k3951N299K3589p944k0500J7512J9888
400A3854j9708j1151K4338R740k1293k798K6201j301k3081R016K0807j3317j8737
$$ y = [11210, -34542, -10246, 25454, -3519, -37897, -8854, 16980, -16019, -34050, -4046, 7027, -20546, -20121, 3757, -1361, -17647, -2356, 12560, -4667, -10377, 15351, 17607, -6373, 359, 27734, 17924, -10273, 8051, 33100, 10544, -13591, 10278, 26296, -402, -13991, 8506, 14434, -14028, -15376, 7580, 1770, -23122, -13440, 5368, -11520, -24412, -4336, 4669, -19674, -20952, 6565, 5678, -21549, -11626, 17535, 7378, -19192, 2838, 28965, 6563, -14046, 15001, 32739, 3885, -9220, 20259, 26164, -5365, -6143, 21627, 14794, -13978, -5831, 14950, -1087, -19475, -3801, 6444, -14717, -22003, 620, -39, -23990, -18691, 4898, -3046, -23546, -6034, 13854, -5854, -17005, 7333, 17073, -4220, -7018, 19183, 17882, -5199, 3817, 24624, 11307, -7430]
413g430J7295J4008k1256j0443K0568K255k5791N96K2624r095k4485J0821K0186
426I853j6215k0552K0623J3232k2071r466K6492N359k5931L27K7425r36k3600
439a5460J0971K3631j2027j7303J8066J5120j7915j0714K0498N380k0392l23J8231
452A7763n661j9292Q302J3428j3951j5242J4719P826k0229n005J8979N9k0807
465a9111M160J8298n922j9391J3022J5262j2558j1015J8295J0840j7981k891K0594
478A1602J566j6655N796J6739q495j4789J3860J2505j9312p129J8431L712k4328
491f497l7K0978p195k3623P307K0047j2684k2189J5025J6980j8229j2972J7964
504e125J0930j9446l659J9158K894j6212K747J6160l147j1468J0228J0361r751
$$ y = [-7430, 9865, 23873, 2617, -7826, 12742, 14997, -10794, -10198, 12426, 3331, -21154, -10333, 9853, -6362, -26914, -6291, 6941, -15130, -24596, 1896, 7255, -18676, -18349, 9076, 8140, -15460, -4489, 19142, 7115, -10188, 7878, 22998, 5083, -5631, 14867, 20247, -145, -468, 17763, 12102, -7190, 1112, 14540, 589, -14653, 66, 7892, -12337, -17342, 1637, 1696, -19111, -14951, 3347, -2575, -21966, -8944, 6318, -6240, -17255, 1040, 11880, -6101, -8992, 11602, 13168, -3487, 2309, 19048, 10553, -4236, 9624, 22129, 2817, -4312, 14119, 17831, -6497, -6534, 14444, 7249, -16374, -9067, 10980, -1704, -23893, -8868, 8112, -10117, -23089, -5125, 5805, -13641, -17300, 1858, 4752, -11460, -8713, 7447, 4300, -7168, 3060, 13421, 3670]
517C670o009J6289K634j6472l82J9249p009j8721R674J6707j5854j7977J6354
530B153J2362k0221j2545J9436M002j9780k292J8655l388j5491N393J4376q614
543e954p641J1112O589j2551K601J5506m215j4064J0021J7020j2347j3595J6935
556I417J3378j9891j1523K0484R765k3306r530K2412M284k4223k334K0201l981
569E153j9384K847J3844n483r676N838L506o001M25P205j809q347P959J1478j0972
584c417o631J4591R766j6447o627K1556N422k0041m239K2287K559k1507j071J9152
598A5353k875j7192K240J3009o809j2559P369L569q584j382P285p121o607J0339
612c965O180j4264m954J9402L654j9268p75K3418P50k2190L545K3341j168k2639
$$ y = [3670, -2339, 13950, 16584, 112, -270, 18979, 11970, -6751, 2923, 19630, 3776, -14201, 2153, 14515, -5706, -18251, 1185, 5187, -14593, -16885, 1770, -1618, -17109, -11716, 2660, -5954, -13595, -2483, 4106, -8445, -5844, 9662, 5447, -8617, 1404, 18424, 6077, -7518, 9417, 22795, 2904, -8619, 11865, 21630, -1676, -11206, 11206, 15490, -8733, -11067, 9134, 5153, -14231, -11384, 2460, -3023, -12699, -6861, -3355, -9356, -8931, -1726, -3535, -11882, -3923, 7555, -3417, -10048, 4543, 14309, -2138, -8765, 12791, 18213, -1828, -6067, 16220, 18779, -2728, -3799, 15353, 12478, -4714, -2474, 10535, 3726, -8833, -1464, 2105, -6479, -7861, -576, -7697, -14304, -3965, 2215, -12049, -17003, 2399, 6053, -13215, -13990, 9428, 10178, -12012, -8467, 14874, 13706, -8933]
626h933P004K0452n213j7500M941J6067p619j1961O148O629p589l431L826l105
640b84m028L546K093j3520K381J2562k724j8015N236J9205m583k2540P661K4652
654A1642p231k0478R360K0255p329j6043R322J4482p464r762P991P264m767l238
668D004J783J146l696K956m50q176J314J0595q149j5220R280J6147j3194j9151
682b0811J1319J9826j3011j9373J3208J8275j1982j6426J3613J4574r912r675
694a0375J1704O925p059k729O233L430m112K434J232m659L359N595p401r481R925
709E021J0465j3996j3659J3952J3390j9160j4858J6525J4993j9456j5562J8938
721c407J1137j4802j0325J3680P385j0217j529Q200M77j760J846J907l767M444
$$ y = [-8933, -1929, 18523, 13310, -4190, 751, 16818, 9199, -2762, 3386, 10015, 2426, -1005, 2821, -284, -4312, -766, 1327, -12193, -9812, 2750, 26, -17989, -12753, 6452, 1869, -20671, -13010, 11642, 4411, -16067, -6707, 13548, 6219, -9824, -502, 13980, 6516, -3246, 4745, 12009, 7242, 4004, 5787, 6933, 3237, 6193, 5743, -2433, -1119, 9476, 1327, -13893, -4613, 11534, -1660, -20811, -9492, 10334, -2677, -22050, -8842, 9433, -2549, -18975, -5362, 9212, -700, -10375, 1329, 8254, 1195, -1534, 4699, 8129, 4017, 6451, 7683, 3024, 6383, 11978, 4577, -4904, 5021, 15486, 1490, -12169, 1783, 15173, -3987, -18845, -2320, 12673, -6783, -22345, -3407, 7730, -7072, -17397, -3717, 3668, -6549, -8078, 122, 599, -1161, 685, 2592, -1175, 3269]
735C269O553o421n874J0925P884j4792p307J5913Q787k0684q308J9373N831k0908
749e759q704J9332N103j9574o256J5078M415j2511m320R348J985m473J69J840
763d327J36K498J995j694k490Q388M995r772l332J3150M933j6474k684J7981L618
778A6921k1159k004J8943J119k0422k050J7119O83j6636j452J1982j523r767J426
792f820L239j748l62L519n687m95P697L338j0288k476J6774J885j6743K667J7967
807A2467j122j7503M415J7517m404j6115M988J4297l883j5787M207J1434m775
820E736r766J674N245l186k252p97k302J236L504k072p416J777J0312k951j0521
835a1779L414J4333l401j3162N713J5393m734j3378O916J5737q248j1248Q704
$$ y = [3269, 9822, 3401, -2473, 8452, 16336, 1544, -5763, 10150, 18937, -1747, -10055, 9318, 15149, -5759, -14463, 4869, 9972, -9602, -15858, -780, 3635, -8876, -13196, -3848, -1863, -6336, -6167, -4327, -4191, -1693, 302, -1392, -3882, 4506, 9501, -271, -3603, 9547, 14480, -1994, -4678, 13303, 16921, -4238, -6242, 12701, 13820, -6602, -8652, 8467, 9150, -7486, -8938, 3044, 1521, -8246, -6820, -3581, -5329, -5691, -2172, -7859, -8354, -657, 2681, -7607, -10083, 6691, 8576, -8167, -5500, 12467, 11345, -6158, -1743, 15774, 11370, -4745, 243, 14540, 10657, -5130, -923, 10511, 5736, -4030, -2356, 2889, -297, -2549, -3346, -5648, -4412, -908, -2980, -10396, -8619, 1693, -1258, -11779, -8365, 5968, 2567, -10595, -4882, 10511, 5777, -7601, -685, 15052, 6804, -4444, 4260]
848D260J0124q707q433O607M778m172n075L794J04m924L379n73o847o03Q852m674
864b110j1441P039J0127p962j0497Q643J3135j1507r225J1830R804r397p725J2898
878C612O017r760k246Q849K564o022j656N861k251j735J181j59l512J665J996
893D404l569n769M874L840p333o003P454O313j0316n717R560N566r986n115J0998
908g99M836r392k695J0439J785o765J781O048j296l968M615J904l880n20O096
923H189l422n051M197N027p643n821P821M393j1472n176J1115K319j1864k571
937i959J1404j912p461p2Q413j336p291K896N161j331l677N610K949m425O96O356
953F021k592m307N005L324n645j239P277Q27r035j807P754J711j1337j94Q077
$$ y = [4260, 14384, 5677, -2756, 3851, 8629, 4457, -618, 3176, 3280, -1644, 1735, 1162, -5685, -6288, 2564, -2110, -13551, -6512, 3615, -4347, -14844, -6201, 6934, -4573, -13798, -1968, 7836, -1561, -9286, 3612, 9629, -131, -2377, 6472, 9036, 3014, 1358, 7219, 4968, 3233, 4414, 4255, 743, 2408, 4404, 835, -4934, -60, 3780, -3553, -9556, -2102, 4211, -6105, -11822, -2262, 3304, -6682, -11797, -799, 4037, -5355, -8050, 2389, 4174, -2591, -810, 5238, 3942, -26, 4589, 6493, 2613, 2093, 8189, 4767, -284, 3913, 8940, 1297, -4524, 3297, 7690, -3782, -8958, 2157, 4476, -7388, -9959, 1445, -467, -7928, -8000, 413, -923, -8214, -5318, -157, -1488, -5165, 445, 3394, -1031, -335, 6021, 3429, -878, 4127, 7451, 1806, 567, 7844, 8671, -364, -2171, 5583, 7294, -4043, -4237, 3840]
968C840o30q712J299O035l097o633L264M553l234l547M560J260l807J399M267
983H17j208m396N653L802m577k271O971K451q618P22Q832q96q707P43R164k925
999E557q645L615O363o364o095N636J876l728m777N223J57k995q77L949l135j815
1015f055L633K964n470J86O349m34n188J877P183j241n712K684P224l392n236
1030f28M446M163n283k836L678K941o006k997N735j112m635J803K050j927l717
1045d325J823K104n132K98N969k132m651Q61O180k072o015N143N754j444n985
1060c624O257M124o725o13N640J225n692L58M730j290n117K214M063m457k350
1075a257L107J469o209P39L672l045n440K520M375l790l767M484M073n084k464
$$ y = [3840, 3210, -5502, -4203, 1832, -1265, -7898, -4634, -81, -3315, -6862, -2302, -1042, -4849, -3450, 817, -391, -4787, 866, 4668, 91, -2180, 4791, 7242, -1376, -654, 8178, 7282, -1425, -682, 8482, 5557, -3088, 527, 6890, 526, -5569, 67, 1943, -1785, -6562, -1339, -1182, -4177, -5054, -1105, -4240, -6055, -2422, 542, -4928, -4742, 1607, 1173, -4015, -2138, 5045, 3804, -1908, 776, 8000, 4608, -628, 3818, 7981, 2698, -138, 3540, 6481, 475, -2522, 3213, 2101, -2534, -731, 1319, -608, -4325, -2502, -398, -5530, -5232, 737, -1395, -6046, -5185, 995, -1077, -7092, -1949, 3805, 2361, -3624, 2633, 6757, 32, -581, 5059, 6284, 592, 950, 5680, 4390, -727, 1487, 5550, 1093, -1257, 1850, 3319, -2890, -2151, 1521, -1524, -6964, -4444, -69, -3859, -7626, -3142, 931, -4153, -6617]
1090f617O515J638l330k291N182J261m369P39O072j616l086L432L187m720j307
1105F90L778N45m773M85L851l288m171J891L447m043l015M175J587n269k882N005
1121a987K330n589R89N103n95m412J864L903k322k208L237K759j177p06K145J399
1137D733m195J252L789j798m172L171J310k612j933L268m32m479q92N549j311
1152A248n010k74M069l24o173J704O142m775j797J986L821l295Q43K660N72l322
1168a925J482L730j667k304L026K940k987k951N279J88m164K0M006j056o317K782
1184H2K874l215n132M945J884m226j860L017P21k192k049L230J57k282J179L725
1200H58k704q42K589J963j504r32M047m0m630K899M207k759l444K975K464l080
$$ y = [-6617, -102, 1536, -1794, -4085, 1097, 2358, -2011, -1272, 4800, 3184, 98, 3530, 6717, 1997, 690, 4468, 5013, 240, 725, 4576, 1288, -2883, -992, 2455, -1588, -4603, -428, 1159, -4110, -6992, -1987, 343, -5246, -4257, 846, 251, -4161, -2297, 1606, -716, -2924, 313, 3072, 1895, 1189, 3334, 4733, 538, 1790, 5579, 3781, -391, 2780, 4090, 1478, -455, 2813, 2381, -2098, -2990, 2559, 1248, -3762, -4036, 33, -291, -6464, -4760, 1382, -3393, -5190, -3204, 617, -2678, -1835, 825, 1397, -1925, -443, 3287, 1620, -684, 2342, 5282, 2295, -656, 4623, 4811, 647, 667, 4673, 3617, -2700, 82, 2956, -259, -5391, -446, 1438, -2788, -4648, -1631, -910, -3102, -5151, -1921, -1764, -4046, -2867, 858, -1846, -2688, -99, 1864, 360, -572, 3475, 3435, -1195, 1704, 5911, 3152, -292, 2683, 5147, 2067]
1216B067l412M971J146l785k521K371N10m158M82J690j313j235N46J556k439L1
1232c493K137q5k690J763L271q33k604K733L248j710l304L129K588k707j441L014
1248C016K358m552q44M132m72l717r11K512J061l345r02K050j296j792J808k77
1264a171l509M35L104j789j052K160K635k733j925M372R24l700R50L497Q56l631
1280e77J537K587j19l345J242L335l413j248K772n42j673j385J595J98j959K07
1296g88O24r11k662K821R12l751P41K178J12k432j158M327P73l647J687K708o88
1313H46j425N10L851j619l086L318K121k145j236J203Q16k401J41J823j476j132
1329A09O98n7k777M84J845k99l621J1M598j977l665K010M123k819l206K701M439
$$ y = [2067, -1345, 3626, 4772, 987, -1534, 837, 1347, -2811, -2329, -639, -1952, -3187, -2641, -1085, -3524, -3493, -1356, -1441, -4131, -2368, 903, 70, -2534, 199, 3447, 1737, -1567, 1562, 4150, 1443, 2, 3016, 5374, 822, -22, 4110, 3638, -79, -990, 1522, 2583, -762, -1664, 386, -910, -2702, -894, -1171, -4680, -4245, -1141, -2930, -3982, -1822, 813, -1920, -3845, 527, 1451, -2249, -1299, 2198, 3054, -577, 960, 3547, 3428, 83, 1325, 4660, 1247, -1, 2771, 2229, 556, -829, 766, 964, -995, -788, -164, -1075, -3737, -916, -4, -3755, -3014, -836, -724, -3156, -4314, 13, 786, -2861, -1174, 1534, 846, -579, -69, 3782, 2163, -923, 2395, 4516, 2371, 1135, 2338, 3154, 753, 894, 2717, 1241, 109, 807, 750, -2027, -1543, 302, 3, -3618, -3607, 991, -986, -4651, -2641, 1482, -1337, -4543, -1842, 2597]
1346B597l208j666L045J253k594k17J836J362j694J154J220k272P62J336L78l097
1362A95R52J128j146l014J530K401j752k955J585O03m25k380R79J897j668q60
1378b930N79J718l03j54J103O43k559J582K306j892R55J508j87j266j94J099l7
1395A971j840J178K977k788k394K365J773l180j937J917J735l637j129L179o88
1410d98j955o55K963j713j169P24J872q00q28K584K02k158J193K659j133q74R96
1427A410J362j482j624L487M2l894N61K408Q92l342j788L283k14k876p1J601o06
1444h51j397N46K72l44m06J004Pj3k87J360j959L57J903J671j595k193L485R25
1462B485j760J85L574k187k233P22L562k007j444j571K171k25k558J328J284j532
$$ y = [2597, -611, -2277, 768, 2021, -573, -790, 1046, 2408, 714, 1868, 3088, 816, 1578, 2914, 3292, 195, 1147, 2275, 1129, -1885, -355, 2046, 294, -2661, -1076, -473, -898, -3278, -2299, -402, -2070, -2930, -2351, -633, -936, -1090, 13, 656, -1903, -321, 1985, 93, 1048, 2556, 2369, 1103, 909, 2008, 1971, 131, 1309, 4286, 1498, -896, 1469, 3242, 62, -1875, 42, 1777, -1860, -2989, 190, -498, -2453, -3108, -145, -1858, -3027, -2303, -431, -1231, -2059, 525, 727, -1431, -238, 2421, 1288, 414, 1410, 2772, 1290, -334, 3153, 3195, -699, -138, 2270, 3162, -180, -1968, 1315, 1101, -1775, -1846, -245, -851, -2248, -1702, -1430, -1774, -2180, -1176, -1169, -1182, -1469, -109, -2068, -1711, 192, 1863, 268, -1925, 1560, 2485, 725, 910, 4484, 2297, 64, 786, 4348, 2341, 897, -674, 1497, 1272, -1286, 42, 1326, -206]
1478b06r28R17j471L05n90O18q87l14J667o66j149J167J614p59j575Q96L527j017
1496A149k133J979J612p17j501P89K000k218j008J339O85k084K70R10J8k018J001
1513G3o50pj475J586N28k195O38J736j096k952J605K188j013j054J147L126j829
1530C56k596K676J741k471j197K651N70j993J354J924k104m5K12O5J92j570J106
1547H71o42p49J47N34r72k300J167K019j662k063J800Q01M68p92K207M54k752
1564a464O47P72J511j701k34J681j49k93l46K768k058n18J800p15j735O72J626
1581B264j895k001K997j45k112j010J040R83k523k2J609J595l782K451K46o86
1597i91j012R21K122l91k936K426J466j689J079P77o15J81L88q5j117j93K345
$$ y = [-206, -1134, -217, -1688, -1383, -1973, -1355, -2242, -2556, -889, -1555, -2704, -1537, 77, -682, -2257, -1361, 2166, 1149, -984, 995, 2607, 1890, 389, 1178, 3178, 960, -48, 1291, 1976, -108, 162, 1072, 1090, -928, 73, -577, -584, -2059, -473, 55, -2140, -1502, 234, -862, -3814, -2209, -21, -1034, -2088, -941, 2185, 356, -2240, 436, 2177, -294, -1491, 1160, 1730, -263, 1091, 3015, 911, 866, 1078, 1143, 1335, -235, 871, 229, -520, -373, 161, -811, -3111, -1944, 75, -1587, -3650, -1850, -1049, -581, -1373, 834, 1288, -1464, -817, -45, 1466, -235, -469, 1212, 1063, 770, 424, 3192, 1134, 616, 2416, 1701, -34, 638, 2264, 369, -1632, 1365, 1220, -892, -1902, -862, 121, -2402, -2424, -815, 780, -3002, -551, -305, -991, -2003, -1082, 1040, 649, -2287, 139, 1605, -84, 995, 1772, 1157, 1338, 1726, 1641, 524, 331, 2676]
1614B676q72k357O16J499n63r67j619K244j616o13j6J228l2k385J792P00j482
1631a767K98J145l31m45P42J062l78q50R97j19j491J359J467M86j821J118J073
1648B545l98o96j415J324n64j627O33M71M94k088Q71N16j827J5J015k38j033Q77
1666a125J539j628p90J957P31j802J23J868p67K3O25J887o19k116J896J100k501
1683D01j251J819P5j151K2J740n6j248N21Q44j698q23r68J596p27r50M07R74o79
1702a152j200J348P09j590M4K420j217l29N49J826j037k34M99Q21R44k875J379
1719I05J162j330R7L35m10l7o25J307j204r22K68Q43j549J48n0R03j186K9K216
1738I00j748j381J979J177k622K40J717M93k082N95J945K48j824P63J744k10k314
$$ y = [2676, 1804, -553, 63, 1562, 999, 32, -1587, 657, -959, -1572, -1588, -360, -392, -2777, -985, -285, -1767, -1469, -324, -655, -1100, -358, 704, 326, -524, 473, 354, -1137, 222, 1689, 2175, 354, 1472, 2545, 2147, 1451, 36, 1360, 796, -831, -198, 273, 767, -1321, -450, 66, -1761, -1746, -731, -969, -2002, -1125, 414, -1214, -2004, -47, 684, -1118, -995, 873, 106, 129, 754, 2641, 2022, -94, 1802, 2902, 401, -850, 969, 1044, -107, -85, 1655, 1599, 351, 872, 1716, 18, -805, -1773, -177, -904, -1854, -1447, -473, -1152, -2352, -1004, -295, -1885, -1841, 579, -638, -967, -418, 1408, 371, 137, 636, 1457, 2401, -474, 905, 2067, 737, 834, 1169, 759, 722, 97, 1404, 200, -722, -454, 389, -1160, -1012, -1062, -159, -1345, -1316, 900, -848, -2229, -250, 927, -1695, -1455, 262, 755, -1327, -732, 1213, 1461, -363, 400, 2144, 1934, -380]
1755c80J469P99j389r32K90J912k093J1J531o58j746R73K52j213p40J782q71j029
1773b032N02P21P86k508J086J684l69r71J257M37k99q19P75J98q8J876M09l07
$$ y = [-380, 1089, 1888, 499, -433, -143, 1769, -324, -313, 1218, 560, -1186, -213, 39, -1174, -1914, -132, -1003, -2032, -1530, -809, -23, -2531, -1445, 239, -130, -1101, 156, 593, 294, -525, 250, 448, 360, 2236, 2645, 2338]
$$ [...]
8191d5
##END NTUPLES=NMR FID
##END=
