##TITLE=1H_SAM_20.108''-THF
 THF, 64 sc, 
 7.6.2019
##JCAMPDX= 6.0         $$ Bruker NMR JCAMP-DX V2.0
##DATA TYPE= NMR FID
##DATA CLASS= NTUPLES
##ORIGIN= UXNMR, Bruker Analytische Messtechnik GmbH
##OWNER= root
$$ XWIN-NMR		Version 3.5
$$ Fri Jun  7 16:25:38 2019 Russian Standard Time (UT+4h)  she@DPX200
##.OBSERVE FREQUENCY= 200.1314
##.OBSERVE NUCLEUS= ^1H
##.DELAY= (6, 6)
##.ACQUISITION MODE= SIMULTANEOUS
##.ACQUISITION SCHEME= undefined
##.AVERAGES= 64
##.DIGITISER RES= 18
##SPECTROMETER/DATA SYSTEM= spect
##.PULSE SEQUENCE= zg30
##.SOLVENT NAME= THF
##.SHIFT REFERENCE= (INTERNAL, THF, 0, 15.7039)
##AUDIT TRAIL= $$ (NUMBER, WHEN, WHO, WHERE, WHAT)
$$ ##TITLE= Audit trail, XWIN-NMR		Version 3.5
$$ ##JCAMPDX= 5.01
$$ ##ORIGIN= Bruker BioSpin GmbH
$$ ##OWNER= she
$$ F:/spectra/data/she/nmr/H-F/1/audita.txt
$$ ##AUDIT TRAIL=  $$ (NUMBER, WHEN, WHO, WHERE, WHAT)
(   1,<2019-06-07 16:24:19.93 +0400>,<she>,<DPX200>,
      <continue with go, POWCHK disabled, PULCHK disabled
       configuration hash MD5:
       00 E9 B6 7A A2 85 ED C7 34 08 36 98 17 FE 4E 26
       data hash MD5: 16K
       AD 37 36 E5 A5 10 35 B5 A9 AA 01 36 FE 51 CA EC>)
$$ ##END=
$$ 
$$ hash MD5
$$ 6A 01 25 16 CD 6D 90 4E 44 04 92 7C 00 3D 73 7D
##$RELAX= 
##$RELAX= 
##$RELAX= 
##$RELAX= 
##$RELAX= 
##$RELAX= 
$$ Bruker specific parameters
$$ --------------------------
##$DU= <F:/spectra>
##$EXPNO= 1
##$NAME= <H-F>
##$PROCNO= 1
##$TYPE= <nmr>
##$USER= <she>
##$AMP= (0..31)
100 100 100 100 100 100 100 100 100 100 100 100 100 100 100 100 100 100 
100 100 100 100 100 100 100 100 100 100 100 100 100 100 
##$AQSEQ= 0
##$AQ_mod= 1
##$AUNM= <au_zg>
##$AUTOPOS= <>
##$BF1= 200.13
##$BF2= 200.13
##$BF3= 200.13
##$BF4= 200.13
##$BF5= 200.13
##$BF6= 200.13
##$BF7= 200.13
##$BF8= 200.13
##$BYTORDA= 1
##$CFDGTYP= 0
##$CFRGTYP= 5
##$CHEMSTR= <none>
##$CNST= (0..31)
1 1 145 1 1 1 1 1 1 1 1 1 1 1 1 1 1 1 1 1 1 1 1 1 1 1 1 1 1 1 1 1 
##$CPDPRG= <>
##$CPDPRG1= <>
##$CPDPRG2= <>
##$CPDPRG3= <>
##$CPDPRG4= <mlev>
##$CPDPRG5= <mlev>
##$CPDPRG6= <mlev>
##$CPDPRG7= <mlev>
##$CPDPRG8= <mlev>
##$CPDPRGB= <>
##$CPDPRGT= <>
##$D= (0..31)
0 1.2 0 0 0 0 0 0 0 0 0 0.03 0 0 0 0 0 0 0 0 0 0 0 0 0 0 0 0 0 0 0 0 
##$DATE= 1559910080
##$DBL= (0..7)
120 120 120 120 120 120 120 120 
##$DBP= (0..7)
150 150 150 150 150 150 150 150 
##$DBP07= 0
##$DBPNAM0= <>
##$DBPNAM1= <>
##$DBPNAM2= <>
##$DBPNAM3= <>
##$DBPNAM4= <>
##$DBPNAM5= <>
##$DBPNAM6= <>
##$DBPNAM7= <>
##$DBPOAL= (0..7)
0.5 0.5 0.5 0.5 0.5 0.5 0.5 0.5 
##$DBPOFFS= (0..7)
0 0 0 0 0 0 0 0 
##$DE= 6
##$DECBNUC= <off>
##$DECIM= 16
##$DECNUC= <off>
##$DECSTAT= 4
##$DIGMOD= 1
##$DIGTYP= 9
##$DL= (0..7)
0 120 120 120 120 120 120 120 
##$DP= (0..7)
150 150 150 150 150 150 150 150 
##$DP07= 0
##$DPNAME0= <>
##$DPNAME1= <>
##$DPNAME2= <>
##$DPNAME3= <>
##$DPNAME4= <>
##$DPNAME5= <>
##$DPNAME6= <>
##$DPNAME7= <>
##$DPOAL= (0..7)
0.5 0.5 0.5 0.5 0.5 0.5 0.5 0.5 
##$DPOFFS= (0..7)
0 0 0 0 0 0 0 0 
##$DQDMODE= 0
##$DR= 18
##$DS= 0
##$DSLIST= <SSSSSSSSSSSSSSS>
$$ [...]
##$SUBNAM2= <"">
##$SUBNAM3= <"">
##$SUBNAM4= <"">
##$SUBNAM5= <"">
##$SUBNAM6= <"">
##$SUBNAM7= <"">
##$SUBNAM8= <"">
##$SUBNAM9= <"">
##$SW= 40.0377977309933
##$SWIBOX= (0..15)
0 0 2 0 0 0 0 0 0 0 0 0 0 0 0 0 
##$SW_h= 8012.82051282051
##$TD= 16384
##$TD0= 1
##$TE= 0
##$TE2= 300
##$TE3= 300
##$TEG= 300
##$TL= (0..7)
0 120 120 120 120 120 120 120 
##$TP= (0..7)
150 150 150 150 150 150 150 150 
##$TP07= 0
##$TPNAME0= <>
##$TPNAME1= <>
##$TPNAME2= <>
##$TPNAME3= <>
##$TPNAME4= <>
##$TPNAME5= <>
##$TPNAME6= <>
##$TPNAME7= <>
##$TPOAL= (0..7)
0.5 0.5 0.5 0.5 0.5 0.5 0.5 0.5 
##$TPOFFS= (0..7)
0 0 0 0 0 0 0 0 
##$TUNHIN= 0
##$TUNHOUT= 0
##$TUNXOUT= 0
##$USERA1= <user>
##$USERA2= <user>
##$USERA3= <user>
##$USERA4= <user>
##$USERA5= <user>
##$V9= 5
##$VALIST= <valist>
##$VCLIST= <CCCCCCCCCCCCCCC>
##$VD= 0
##$VDLIST= <DDDDDDDDDDDDDDD>
##$VPLIST= <PPPPPPPPPPPPPPP>
##$VTLIST= <TTTTTTTTTTTTTTT>
##$WBST= 1024
##$WBSW= 4
##$XGAIN= (0..3)
0 0 0 0 
##$XL= 0
##$YL= 0
##$YMAX_a= 1727241
##$YMIN_a= -2420566
##$ZGOPTNS= <>
##$ZL1= 120
##$ZL2= 120
##$ZL3= 120
##$ZL4= 120
##$ABSF1= 10
##$ABSF2= 0
##$ABSG= 5
##$ABSL= 3
##$ALPHA= 0
##$AQORDER= 0
##$ASSFAC= 0
##$ASSFACI= 0
##$ASSFACX= 0
##$ASSWID= 0
##$AUNMP= <proc_1d>
##$AZFE= 0.1
##$AZFW= 0.1
##$BCFW= 1
##$BC_mod= 2
##$BYTORDP= 1
##$COROFFS= 0
##$CY= 11.3945322036743
##$DATMOD= 1
##$DC= 2
##$DFILT= <>
##$DTYPP= 0
##$F1P= 18.9103706918063
##$F2P= -1.10871071338519
##$FCOR= 0.5
##$FTSIZE= 0
##$FT_mod= 4
##$GAMMA= 1
##$GB= 0.15
##$INTBC= 1
##$INTSCL= 1
##$ISEN= 128
##$LB= 0.24
##$LEV0= 0
##$LPBIN= 0
##$MAXI= 10000
##$MC2= 0
##$MEAN= 0
##$ME_mod= 0
##$MI= 1.114404
##$NCOEF= 0
##$NC_proc= 0
##$NLEV= 6
##$NOISF1= 3.799351
##$NOISF2= 2.8
##$NSP= 1
##$NTH_PI= 0
##$NZP= 0
##$OFFSET= 15.70392
##$PC= 1
##$PHC0= -8595.841
##$PHC1= 24.00019
##$PH_mod= 1
##$PKNL= yes
##$PPARMOD= 0
##$PSCAL= 0
##$PSIGN= 0
##$REVERSE= no
##$SF= 200.130013532006
##$SI= 16384
##$SIGF1= 3
##$SIGF2= 2
##$SINO= 400
##$SIOLD= 16384
##$SREGLST= <1H.CDCl3>
##$SSB= 0
##$STSI= 0
##$STSR= 0
##$SW_p= 3612.71676300578
##$SYMM= 0
##$S_DEV= 0
##$TDeff= 0
##$TDoff= 0
##$TI= <>
##$TILT= no
##$TM1= 0
##$TM2= 0
##$TOPLEV= 0
##$USERP1= <user>
##$USERP2= <user>
##$USERP3= <user>
##$USERP4= <user>
##$USERP5= <user>
##$WDW= 1
##$XDIM= 8192
##$YMAX_p= 0
##$YMIN_p= 0
$$ End of Bruker specific parameters
$$ ---------------------------------
##NTUPLES= NMR FID
##VAR_NAME=  TIME,          FID/REAL,        FID/IMAG
##SYMBOL=    X,             R,               I
##VAR_TYPE=  INDEPENDENT,   DEPENDENT,       DEPENDENT
##VAR_FORM=  AFFN,          ASDF,            ASDF
##VAR_DIM=   8192,          8192,            8192
##UNITS=     SECONDS,       ARBITRARY UNITS, ARBITRARY UNITS
##FACTOR=    0.0001248,     1,               1
##FIRST=     0,             0,               0
##LAST=      1.0222368,     0,               0
##MIN=       0,             -2420566,        0
##MAX=       1.0222368,     1727241,         0
$$ Real data points
##PAGE= N=1
##DATA TABLE= (X++(R..R)), XYDATA
$$ [...]
457 -296392 -96132 99065 219761 248920 205597 117603 4084 -116531 -206876 -227086 -149249
468 -149249 5341 162206 235251 174706 14591 -149263 -212646 -133133 37519 190589 221786
479 221786 111848 -71863 -214667 -235479 -132981 20710 135044 167602 131707 78193 43777
490 43777 16383 -38132 -135061 -237099 -262750 -150602 81284 324960 439803 335735 44678
501 44678 -282697 -470724 -410613 -146079 173307 366947 342170 138386 -102602 -234980
511 -234980 -195442 -39688 110002 153425 71800 -60068 -143824 -121351 -17534 85037 116262
522 116262 62926 -18772 -53228 -15078 62711 98534 39293 -99369 -228317 -246698 -109166
533 -109166 123154 324242 373876 228193 -38355 -290773 -396950 -314807 -96287 137838
543 137838 278545 280350 170280 23507 -94747 -152714 -152908 -113251 -52592 20921 87666 123088
555 123088 104603 31867 -60178 -118700 -97045 -5607 99574 148972 98673 -28175 -154778
566 -154778 -203225 -135427 6242 142050 200592 161366 62312 -36336 -90454 -101253 -97328 -101035
578 -101035 -102185 -64841 37081 174547 278037 262829 102250 -144243 -348509 -386578 -225635
589 -225635 58878 308220 383652 253163 445 -219761 -284015 -175887 18469 165144
599 165144 179260 69813 -72422 -147739 -114408 -5053 96120 125246 77099 -255 -45371
610 -45371 -34542 2657 15628 -28415 -102817 -142608 -89942 51416 209749 286158 214852 15435
622 15435 -209864 -341651 -304191 -121045 108662 268285 290262 183429 23572 -111646
632 -111646 -168330 -153556 -94860 -30682 24665 66172 91594 92551 60461 1047 -60685 -86531
644 -86531 -58982 8611 72916 88269 35864 -54099 -125534 -123655 -42660 74650 162294 167422
656 167422 87934 -26532 -117136 -143583 -112279 -56940 -8919 22490 56162 102096 145103 148636
668 148636 74557 -66391 -213014 -279280 -208252 -22501 189005 306972 261933 81840 -130325
679 -130325 -252918 -220929 -68416 102395 183113 133013 -996 -124355 -150820 -71339 56289
690 56289 143215 136218 49106 -53642 -107818 -88749 -33507 8242 4140 -27204 -38131 10320
702 10320 98212 168833 154654 38677 -131542 -258549 -265274 -134380 67367 234514 284177
713 284177 194466 28434 -128015 -204261 -178178 -86936 10109 74069 89547 75965 51270
724 51270 24627 -7438 -40327 -62076 -56305 -18106 35045 66814 50888 -9140 -79454 -107749
736 -107749 -65006 30007 126000 161525 112372 181 -112544 -166564 -144826 -65425 21358
747 21358 82605 103400 99776 85128 60932 15635 -56478 -138098 -187386 -159405 -44941 112728
759 112728 231719 244885 132629 -49261 -200225 -238232 -144501 16810 148239 172152 87449
770 87449 -40186 -123531 -110153 -15789 85690 130343 85928 -10274 -91896 -111441 -67189 270
782 270 43796 41302 13115 377 23549 69131 92958 52773 -47672 -155010 -201548 -139629
794 -139629 6103 163656 244121 202338 63265 -97702 -192805 -187351 -98343 13882 89731
805 89731 103166 73258 32122 4140 -10057 -19176 -31429 -40071 -33167 -4411 29158 46233 25379
818 25379 -20470 -58844 -57604 -5815 70354 124071 107044 23861 -87152 -159714 -153806 -71411
830 -71411 42558 127267 146765 102831 33181 -25706 -57202 -69067 -76922 -83744 -72555 -24462
842 -24462 58056 140082 170561 118672 -3268 -133070 -195109 -155249 -33863 96353 161071
853 161071 123984 18144 -86158 -120363 -68951 28475 103704 106708 34490 -58020 -114929 -102379
865 -102379 -32292 40208 74919 59560 21195 185 9244 32768 33062 -15833 -91380 -147432
877 -147432 -126319 -25140 112082 210591 204284 91728 -68874 -195082 -219603 -136401 -1448
888 -1448 113150 153950 115878 37830 -31870 -61993 -54452 -30689 -13732 -6958 51 11385 25405
901 25405 28139 7388 -24482 -43625 -28427 19561 71008 88743 45183 -39187 -117593 -139139
913 -139139 -83541 20603 115424 148646 106878 21533 -58230 -92386 -78801 -45212 -18876 -10627
925 -10627 -6708 14527 57084 99745 103501 50307 -45295 -133872 -158272 -100545 13150 116921
937 116921 150081 97845 -3103 -86877 -104114 -51078 29294 80893 69278 5063 -63181 -88182
949 -88182 -58624 7234 61700 76381 52301 13752 -11781 -14958 -12085 -19414 -45985 -72851 -69145
962 -69145 -15445 72366 143814 153539 80770 -44562 -156651 -192311 -130829 -4522 115351
973 115351 166695 127283 30985 -61844 -101883 -76195 -16017 32000 43680 17362 -16228 -29780
985 -29780 -16710 9679 26854 22243 7266 -1552 4116 16497 17118 -4559 -40074 -71028 -64552
998 -64552 -15090 55975 107242 107608 53290 -26439 -87501 -102052 -70630 -18894 22426 37253
1010 37253 37797 42398 54107 59528 36672 -22951 -95273 -135263 -107928 -16589 93661 157733
1022 157733 136224 37849 -76582 -140780 -116455 -24100 74989 117125 79237 -9527 -89397
1033 -89397 -107234 -57254 27953 92697 100175 53846 -12767 -59629 -67823 -47560 -21500 -5536
1045 -5536 -855 9677 37328 69418 80254 50879 -17761 -92401 -128153 -101938 -22104 66283
1057 66283 116122 104208 42169 -27555 -68568 -62917 -26807 9206 18150 4403 -14961 -16907
1069 -16907 2799 31367 45901 32688 -4486 -38017 -46933 -22514 14373 34694 22115 -13844
1081 -13844 -48775 -49091 -6431 53926 91371 79869 19260 -57679 -109193 -104483 -48178 23164
1093 23164 77393 88824 64800 24814 -11600 -35995 -48497 -55832 -52109 -33164 5563 52967
1105 52967 83896 75100 23697 -45302 -90558 -83203 -24001 50987 91437 67295 -6781 -80621
1117 -80621 -104142 -57121 31146 105665 117072 58154 -31192 -97581 -103692 -55227 13301 55450
1129 55450 55928 25584 -467 -1285 17879 32047 17017 -27246 -74268 -88867 -53540 18760 88101
1142 88101 113592 80350 8846 -61330 -93655 -75118 -26348 21239 44374 38829 22403 5251
1154 5251 239 -2683 -8483 -19846 -24777 -13723 12525 36396 36737 10231 -35344 -66533 -58496
1167 -58496 -7183 62359 105926 93622 25650 -63269 -123976 -122035 -55743 38709 107815 120817
1179 120817 74495 896 -59781 -78471 -57068 -19778 9487 18923 14191 12513 21047 31598
1191 31598 28720 6249 -25770 -48691 -45545 -15134 23452 43106 33492 -661 -32016 -36524 -9659
1204 -9659 29821 51497 38351 -1482 -44465 -60949 -38959 3427 37693 41536 19300 -9672
1216 -9672 -16945 2876 30907 36679 5438 -48918 -87699 -80310 -15537 67998 124172 111098 34493
1229 34493 -61463 -122073 -113187 -43600 39303 91321 83977 33374 -24486 -55457 -47000 -12078
1241 -12078 18587 31056 20933 4018 -9410 -14829 -14400 -16293 -16582 -10509 8352 37365 56928
1254 56928 47993 5985 -49505 -86600 -80699 -30616 40220 90931 94566 47633 -16293 -64411
1266 -64411 -70168 -39426 2538 27393 22616 4202 -10799 -3342 20147 36715 30143 -1607 -43928
1279 -43928 -65692 -51352 -4538 46657 70571 50854 1167 -47864 -63898 -39274 11907 52132
1291 52132 55433 23535 -23559 -55897 -54477 -22276 17720 42449 43309 27685 9048 -4248 -14018
1304 -14018 -24380 -38097 -45550 -33061 4230 52114 85090 77425 27629 -46523 -98340 -98915 -46842
1317 -46842 31347 86256 87635 39183 -25792 -66291 -57705 -13613 33885 50360 28096 -14936
1329 -14936 -44381 -41577 -9692 26892 41093 25131 -3081 -22919 -17210 3990 21254 17605
1341 17605 -9108 -36023 -41999 -18486 22479 52667 56297 26258 -16118 -45057 -47405 -25895
1353 -25895 2647 18394 17388 8795 5840 14216 23730 20779 -718 -33655 -53907 -44027 -5154
1366 -5154 41559 66507 52111 4276 -46095 -65712 -40810 10357 56841 66057 30502 -26694
1378 -26694 -68023 -68937 -26676 32191 72005 70295 32499 -17784 -54502 -56935 -32176 -271 21340
1391 21340 24708 16903 13056 14942 16843 10343 -10207 -34326 -45353 -32795 2161 39377 54547
1404 54547 37779 -183 -35265 -43766 -23495 9931 32383 28100 3285 -24992 -33837 -16434
1416 -16434 12598 31256 26159 1055 -21171 -27148 -7370 21022 32171 15230 -22136 -51716
1428 -51716 -50300 -10197 45586 78558 68492 14440 -49722 -86284 -74543 -23124 34915 65871
1440 65871 58702 24161 -13457 -32803 -30109 -16375 -6186 -3682 -4311 1705 15151 25675 25408
1453 25408 5794 -23505 -39692 -33907 -3829 31297 47507 31306 -8173 -44607 -54980 -28763
1465 -28763 18754 53353 57073 25976 -18512 -48257 -47263 -17882 14947 31355 22162 360 -14156
1478 -14156 -11281 6279 24000 21536 500 -28634 -45516 -33826 1233 36392 52702 38577
1490 38577 2717 -32665 -47073 -31504 -2009 25075 31303 15917 -6426 -20183 -16273 -1595
1502 -1595 12863 14244 5074 -5095 -6647 499 7443 5365 -9607 -23921 -22806 -5107 26807
1515 26807 51447 46663 10698 -36220 -67984 -61158 -18639 36111 69257 61781 21784 -27093
1527 -27093 -54069 -46682 -11714 21596 35113 22343 -3281 -20672 -16430 841 17362 15943
1539 15943 -519 -16497 -19643 -5923 14318 26029 16493 -10515 -30984 -31690 -8912 22048 39887
1552 39887 34546 7500 -23326 -37848 -30778 -7770 14708 22228 16061 3716 -738 5739 10588
1565 10588 8986 -5549 -26221 -37593 -26923 5773 39991 56684 40475 -730 -40976 -58873
1577 -58873 -41184 -462 35794 51213 34263 -159 -29891 -38058 -22286 3577 22978 26046
1589 26046 12753 -3931 -14440 -14583 -6375 -503 -210 -2123 -685 7540 16896 23193 13057 -8283
1603 -8283 -30998 -40251 -23912 7052 35990 44766 28584 -2624 -28957 -35371 -19668 5023 20581
1616 20581 16879 1526 -13390 -13703 518 17219 21876 8829 -13672 -29521 -26136 -3818 21703
1629 21703 31833 20092 -8504 -31335 -32482 -10348 21064 39398 30625 1656 -30583 -42405
1641 -42405 -29531 1607 28034 34208 21507 416 -14817 -15608 -6357 1867 -975 -8738 -10981
1654 -10981 -2593 14916 28049 25033 4931 -21538 -37760 -30735 -2815 27314 39424 27614
1666 27614 -2437 -31487 -37861 -22016 9081 32256 31809 13145 -14926 -29101 -24462 -7231 13777
1679 13777 18788 10101 -2874 -8244 -2174 8636 14905 6270 -12657 -27952 -28977 -8631 18791
1692 18791 38582 37997 14929 -16450 -36868 -35717 -14100 9431 27378 26223 11098 -4551 -12391
1705 -12391 -8245 -302 3539 -1863 -8648 -9833 578 14250 21867 14603 -5740 -26993 -32417 -16145
1719 -16145 15257 37555 39393 13967 -21350 -45398 -41353 -13129 22674 42769 36691 10506
1731 10506 -17370 -30599 -23938 -3793 12691 14986 5498 -6476 -8991 3044 14620 17253 6607
1744 6607 -13197 -27129 -24704 -4250 19790 31019 22929 -725 -21409 -26833 -11806 8978 21951
1757 21951 17641 646 -15019 -19109 -7979 8024 16574 11050 -4226 -13907 -12417 2076 15752
1770 15752 18213 4291 -15440 -28880 -23495 -587 28504 39408 26991 -2782 -32475 -40951
1782 -40951 -25730 5152 31411 36458 19420 -7157 -25675 -24787 -9415 9358 17388 13368 938
1795 938 -9278 -9461 -3205 4814 5291 -703 -7731 -6931 504 12182 15683 9847 -7737 -23613 -27200
1810 -27200 -13288 11956 30203 31593 13938 -12206 -29231 -28995 -10400 12036 21690 16519 -540
1823 -540 -10744 -10170 267 12750 11829 -43 -16946 -23615 -12758 7892 26960 30480 12903
1836 12903 -12764 -31954 -30949 -9544 15021 31737 26537 7237 -16540 -27191 -20384 -2352
1848 -2352 12647 18718 10032 659 -6748 -3484 634 466 -5748 -14981 -13749 -867 16625 27823
1862 27823 23308 2759 -22825 -35812 -28203 -4019 23033 34566 25548 1808 -20916 -27377 -15872
1875 -15872 3453 17051 18650 4696 -9405 -15506 -8506 6070 15078 12157 -2084 -14165 -16769
1888 -16769 -5940 9846 19603 14180 -1112 -17571 -19673 -11489 7674 21097 20221 7511 -10092
1901 -10092 -18462 -15261 -3429 8988 11705 6697 328 -4671 -3210 2169 4941 2101 -5434 -13111
1915 -13111 -11073 893 13801 20255 12503 -4723 -20503 -24401 -11669 9908 25856 24889 7796
1928 7796 -15744 -29062 -22818 -3004 19255 27574 19079 -994 -17651 -21470 -11958 2010 11606
1941 11606 11340 2184 -5195 -5774 1569 7691 8683 -932 -12611 -16414 -10117 7012 19835 22832 8559
1956 8559 -9974 -21412 -21121 -4756 11916 20133 13038 -1346 -11641 -12432 -2972 7400 9855 3045
1970 3045 -8692 -13241 -4819 9205 18531 15607 289 -19695 -28915 -18783 4934 25004 33012
1983 33012 18229 -7260 -27473 -32983 -16769 5555 24375 25804 12765 -5330 -15847 -13419
1995 -13419 -5793 2219 4354 1012 -2729 -286 4298 10613 7917 -1772 -12270 -16952 -10634 4066
2009 4066 16792 18811 9129 -5189 -17890 -17225 -6583 8423 16339 12166 793 -11458 -14542
2022 -14542 -6843 5602 13168 8560 -1991 -12673 -14875 -4492 10062 18586 14038 -1734 -18308
2035 -18308 -22574 -13009 6035 21637 23195 9583 -9515 -20783 -20006 -5205 11042 18151 15020
2048 15020 1900 -8761 -12694 -4771 2563 7555 4485 -2084 -5471 -4250 3380 8068 5065 -5470
2062 -5470 -11963 -12132 -1096 13992 22282 14639 -3642 -21609 -26691 -14613 7146 26537 27842
2075 27842 11403 -11826 -25745 -24608 -6306 13660 22410 15400 -827 -12711 -14788 -5379 7653
2088 7653 12673 7161 -4521 -12940 -11271 -475 12848 15714 7159 -6936 -17484 -15616 -3299
2101 -3299 11240 17285 12423 1095 -11402 -12962 -6090 3819 5876 3946 -1341 -3815 -1016 6895
2115 6895 9918 6245 -5773 -16385 -17476 -7621 9581 23860 24909 10039 -11684 -27280 -25860
2128 -25860 -9794 12267 28194 25405 9726 -13208 -22667 -19494 -3619 11655 16152 10962 336
2141 336 -7796 -8299 -1467 4557 5562 -206 -5846 -8489 -1541 7312 12294 8530 -1968 -11235 -15255
2156 -15255 -8677 4592 14085 13442 4921 -7761 -14921 -9983 2687 12613 11223 1312 -10860 -14841
2170 -14841 -5987 6383 16488 12653 1214 -16142 -20643 -10508 6716 20692 20621 5534 -12675
2183 -12675 -23316 -17271 -371 16840 21605 11971 -5007 -18008 -17802 -6694 7272 16488 12121
2196 12121 666 -9736 -13423 -5411 3156 7671 3585 -3737 -7801 -3388 3476 10590 8010 -2571
2210 -2571 -12987 -16337 -7038 6897 17045 17208 3784 -11684 -20322 -16192 -1403 14033 19703
2223 19703 12315 -1752 -13682 -15393 -6352 5194 12183 9835 -908 -9997 -11707 -2645 8305
2236 8305 13911 9741 -4090 -16204 -18219 -6358 10725 19643 16983 3703 -12852 -20260 -15662
2249 -15662 -1263 14136 16696 9870 -1699 -9250 -9149 -4427 2563 4905 127 -4480 -2370 3413
2263 3413 9743 11983 4513 -8594 -17737 -15834 -3356 14428 23704 18813 1436 -16220 -25042 -15786
2277 -15786 3351 19319 20449 9564 -7930 -17851 -14587 -577 12630 14198 5918 -7564 -13874
2290 -13874 -7833 3132 13342 13451 3251 -8472 -15699 -10220 613 12460 14980 6539 -4611
2303 -4611 -12408 -12153 -2272 7136 10898 5734 -4306 -7168 -4986 1243 8478 7499 -157 -8178 -10550
2318 -10550 -4368 6815 15094 11354 440 -12001 -17525 -10219 2939 15193 16301 7290 -7166
2331 -7166 -18394 -16706 -5498 9193 18941 14211 1168 -12178 -17621 -10685 2411 12475 13901
2344 13901 6314 -3866 -10297 -8550 -59 6319 5640 413 -4082 -4835 -529 7310 8142 4106 -5862
2359 -5862 -13285 -10265 -1863 10601 16263 10210 -554 -12684 -16094 -7980 6065 13318 11784 2150
2373 2150 -8863 -12184 -5231 4096 11216 8866 -3611 -13756 -15178 -5082 10700 18373 14566 1103
2387 1103 -15877 -20057 -12998 2701 16045 19041 9059 -5163 -13985 -12575 -4433 4189 8295 5256
2401 5256 815 -2640 -570 3323 5113 1919 -6040 -9615 -8103 1089 11705 15466 10434 -2996
2415 -2996 -15268 -18518 -9283 5270 15965 16036 5560 -7071 -14323 -11338 -346 8017 11141 5078
2429 5078 -3508 -9579 -7402 385 8161 7637 3748 -4943 -10455 -7693 -655 9360 11833 6544 -2005
2444 -2005 -11008 -11324 -3111 6316 11637 8456 -157 -7222 -9583 -3170 5169 9151 5109 -2167 -8625
2459 -8625 -7023 -939 7285 10652 5146 -5077 -11296 -9579 -757 9371 12909 5991 -4710 -12872
2473 -12872 -12002 -3210 8904 15689 11758 -1226 -13104 -17227 -8531 5649 16095 13865 3982 -8406
2487 -8406 -13968 -8590 1991 9196 9912 1167 -5706 -7774 -2861 5749 9393 4795 -5209 -11847 -10317
2502 -10317 -1187 9435 14213 8610 -1972 -13192 -15456 -7573 4866 14287 12991 4029 -7763
2515 -7763 -12947 -8280 1862 8537 9177 1031 -6486 -8665 -3205 5738 10967 8362 -1893 -11601 -13748
2530 -13748 -7083 6277 15198 14965 4366 -7004 -15043 -13618 -2827 7912 11931 10113 583 -7413
2544 -7413 -8288 -3515 3667 5812 2731 -4821 -6782 -4913 2869 9836 9404 2979 -8162 -13995 -10592
2559 -10592 474 11443 14549 8571 -2435 -13523 -12880 -4155 6943 13312 10241 256 -10489
2572 -10489 -10197 -3768 5829 10062 7520 -2285 -9696 -10971 -3882 7085 13373 9162 -2778 -11947
2586 -11947 -13592 -4790 6870 13279 10536 -543 -10661 -13832 -5326 5365 11494 9082 -455 -9582
2600 -9582 -10772 -4593 6154 11038 8775 -1074 -10224 -10438 -4058 5632 10278 7672 -828 -9315 -10898
2615 -10898 -4911 5698 12355 9292 -1019 -11464 -13747 -5841 5145 13452 13748 3357 -8466
2628 -8466 -13674 -9426 -58 9553 11137 6064 -2671 -8630 -6100 -1174 4647 5132 164 -4255 -5531
2643 -5531 -2404 4000 8555 7392 -382 -7651 -11531 -7636 2558 10184 12530 6903 -3765 -10142
2657 -10142 -10683 -2236 6976 9711 6644 -1853 -7899 -6967 50 6960 7683 2354 -4460 -10736 -5974
2672 -5974 1771 10258 13629 6551 -4626 -14091 -13634 -5016 7523 15012 11057 1908 -7987 -11949 -8062
2687 -8062 571 5961 7028 1933 -4023 -5843 -1673 3653 5965 3004 -3324 -8610 -6586 320 9287
2702 9287 12067 5994 -4434 -12509 -10626 -3165 7077 13099 7770 -167 -8384 -9853 -4284 3638
2716 3638 10259 7585 459 -7368 -10292 -4506 3922 9011 9073 -40 -7599 -10533 -4954 2588 8237
2731 8237 8596 2960 -4326 -8595 -5695 1395 4688 5844 1460 -4950 -5334 -4184 1593 5019 5728 779
2747 779 -3962 -6169 -2623 1697 5940 5421 718 -3851 -6629 -1440 3256 8063 6572 -400 -6676
2762 -6676 -10013 -6795 3709 9995 10836 4349 -7099 -12977 -11799 -2287 7652 11778 8230 -344 -8516
2777 -8516 -10475 -5799 2890 7389 7082 2430 -3951 -5328 -2258 2943 3447 509 -1516 -5684 -4317
2792 -4317 1869 7237 8637 2609 -4306 -9448 -9444 -2698 6149 8824 6437 -1583 -6811 -7479 -1764 5828
2808 5828 5719 3001 -3731 -7176 -4318 1304 8727 9533 2977 -5285 -11347 -10335 -2644 8564 12493
2823 12493 9295 998 -7967 -11261 -9015 -1121 7172 8770 4066 -2911 -5974 -4810 593 3395 3308
2838 3308 -478 -3652 -3288 59 5282 6051 3898 -2950 -7445 -5438 -1033 4993 7758 6128 -179
2853 -179 -7067 -6755 -2967 2834 6568 4681 -871 -5558 -8479 -3265 2871 8298 6797 620 -6269
2868 -6269 -10148 -6226 1617 7942 9974 3732 -4892 -9299 -7518 565 6803 9445 3395 -3249 -8038
2883 -8038 -6459 -1728 6285 6802 4050 -2509 -5868 -6040 -2223 4417 6153 4108 -693 -5149 -3548
2898 -3548 -78 3708 4782 463 -5017 -5658 -2422 3716 7944 4362 -721 -7915 -10718 -6054 3321
2913 3321 10619 11585 3826 -6238 -11199 -9195 -1488 8605 10140 6941 -570 -6557 -6444 -2202 3313
2928 3313 5862 4386 -886 -4842 -4909 -1931 4384 6990 5162 -1080 -7156 -7120 -3678 2611 7005 6185
2944 6185 1881 -4553 -6180 -2979 234 2854 2494 -807 -3537 -1708 2504 4147 3701 -959 -6399
2959 -6399 -6301 -4354 3264 8279 9270 5425 -2944 -10524 -10356 -4319 4274 11574 9423 3755 -5790 -10151
2975 -10151 -7064 113 6361 8561 5085 -2408 -6645 -5689 -286 5477 6945 2304 -2726 -7154 -4868
2990 -4868 353 4135 5686 3950 -879 -4560 -3105 -632 3125 4019 816 -2874 -3551 -1357 3146
3005 3146 5896 3209 -1182 -6532 -6495 -2024 4014 9048 8765 441 -6757 -10120 -5460 2325 10202 10590
3021 10590 3250 -6036 -9763 -8768 -572 6373 9369 4791 -2418 -8869 -9425 -2790 4470 8045 6470
3036 6470 809 -4938 -7173 -4332 1145 4232 4121 1972 -1032 -1126 -744 2030 2446 -681 -4326 -3475
3052 -3475 -1004 2749 6320 5539 282 -5836 -7806 -4920 1726 7794 8994 4696 -2357 -6580 -7193
3067 -7193 -2517 3846 6697 5051 -1569 -5248 -6302 -2365 3138 7172 5333 -529 -6311 -9190 -5500
3082 -5500 2254 9059 8629 5009 -2724 -7578 -7482 -2502 4358 6467 5833 415 -1232 -2779 -1635 -180
3098 -180 1010 -82 -1796 -1280 1238 4559 4688 2032 -3073 -6065 -6099 -2349 5287 8256 7220 -183
3114 -183 -7191 -8858 -5705 2131 7549 8786 2326 -4936 -8546 -5797 1713 7790 7507 2501 -4195
3129 -4195 -9642 -6219 2 7513 8252 4325 -237 -6516 -6797 -2312 2010 5100 4949 832 -2433 -3376
3145 -3376 -489 1234 2540 2129 -408 -1831 -1524 779 4066 1798 -534 -4184 -4980 -549 2581 4508
3161 4508 3426 -1091 -6164 -6292 -3071 2768 6588 6231 1009 -5515 -7181 -5190 1413 7259 8954
3176 8954 5347 -2316 -7079 -9283 -4061 3963 6451 7899 1964 -2889 -6378 -6435 -1385 1659 5802
3191 5802 2355 -1768 -1042 -2480 -199 1507 932 -704 -3192 -2187 -743 3318 3450 548 -676 -4171
3207 -4171 -3249 -868 1552 2266 747 -1715 -3696 -2870 1216 4769 4220 2666 -4421 -8348 -7605 -846
3223 -846 5456 10385 7357 519 -8295 -11429 -7311 2459 8624 10211 5828 -2331 -8052 -5782 -3233
3238 -3233 2123 5355 3409 844 -2143 -3231 -1087 1522 942 -482 -518 -2561 -541 2126 2436 2291
3254 2291 -2165 -4247 -3335 -927 3354 3965 2854 -1880 -3829 -4244 -835 5030 7576 3575 -1693 -7204
3270 -7204 -7238 -1108 3633 9224 7704 2620 -5268 -9854 -6203 -1307 5229 8815 5335 -539 -6386
3285 -6386 -6035 -3433 1373 4410 4941 407 -3624 -3786 -1888 515 3066 2908 404 -1997 -2636 -1065
3301 -1065 1237 742 -438 -1374 -2601 -931 2417 3864 1583 -1243 -5312 -5552 -1095 3317 7152 7514
3317 7514 279 -4883 -9393 -7045 155 6672 10527 4739 -1973 -7640 -9699 -4579 2501 7950 6631
3332 6631 1898 -3318 -6597 -2794 1887 5205 5434 135 -4782 -4551 -2971 1967 5082 4468 2489 -3561
3348 -3561 -3957 -2733 -22 2861 1955 957 -751 -2115 474 3301 2371 60 -2732 -4820 -3699 2346
3364 2346 6190 6781 2908 -4589 -7819 -8827 -1688 5789 9840 7635 461 -7105 -8887 -7380 -217
3379 -217 7169 6610 4718 -2716 -6968 -5821 -872 4089 5681 1848 -1437 -4934 -6130 -1909 4010
3394 4010 6064 3208 -26 -3959 -5698 -1718 1378 2887 2894 -158 -2565 -2374 567 2951 2860 336
3410 336 -3920 -3622 -1087 2144 5819 5209 871 -4518 -7125 -3813 1959 7046 6945 2793 -3039 -8340
3426 -8340 -6063 357 5132 8897 5132 -1464 -7454 -8932 -1976 4097 8213 6128 1580 -5101 -8421
3441 -8421 -5935 1063 6629 6513 2770 -3430 -5755 -4259 371 2254 3019 791 -722 -359 541 1149
3457 1149 1048 -14 -2457 -3771 -2402 962 4788 6205 2489 -2576 -6449 -6037 -2014 3484 6040
3472 6040 3563 -319 -6030 -6957 -3051 3916 7160 3986 -15 -5232 -8075 -3309 2160 6297 6523
3487 6523 1990 -3340 -8212 -6560 -361 3824 6290 4709 282 -3228 -5310 -3232 400 3264 4523
3502 4523 2239 116 -1196 -1000 1257 1217 -1483 -3632 -3498 505 3318 5553 4694 -452 -4176 -5970
3518 -5970 -4040 1752 4773 5527 2189 -3851 -6131 -3982 1532 4713 5120 3958 -3227 -5840 -5611 -1357
3534 -1357 6340 6424 5408 -15 -6698 -7777 -3688 2583 7501 6563 1816 -3394 -4499 -2754 243 5473
3550 5473 4056 1347 -323 -3393 -968 1295 2317 547 -2825 -1658 -1592 1228 3283 3825 1606 -2864
3566 -2864 -5052 -3225 -1112 3473 3907 1698 -3104 -5033 -3289 564 5864 7048 4067 -1562 -6690
3581 -6690 -7062 -2165 3444 7560 7029 1099 -3892 -6179 -3936 -389 3126 5124 2230 -683 -2951
3596 -2951 -2832 -121 956 1572 1398 -1192 -3015 -1949 635 1210 988 106 -2438 -2496 -2838 1072 3138
3613 3138 2578 213 -2900 -3914 -2310 1236 4247 4313 -477 -3277 -3547 -856 2000 5308 3832 1158
3629 1158 -5042 -7636 -3406 1355 5545 7789 3486 -2285 -5809 -6838 -3383 2698 6251 5648 -353
3644 -353 -2755 -4074 -2745 2749 2854 1182 -390 -2970 -2336 -102 3470 4482 3114 -2148 -4554 -4334
3660 -4334 -670 3226 3229 2369 -1774 -3296 -2242 1525 1899 4023 1209 -1875 -3730 -4147 2248 5795
3676 5795 6051 2102 -3202 -6128 -4688 143 6139 6425 4712 -1616 -5843 -5720 -3380 2744 6289 4367
3692 4367 1678 -2980 -3902 -1682 1046 3671 3570 826 -2704 -2721 -1461 792 3030 3637 1164 -1874
3708 -1874 -3662 -2180 35 1436 1937 425 115 -1582 -362 1348 3147 1993 -1255 -4178 -3936 -1711
3724 -1711 3283 4861 2731 -578 -3721 -5278 -3032 1041 6148 4878 1917 -3292 -5315 -3150 -113
3739 -113 3823 6065 2536 -1283 -4563 -5760 212 3182 5858 2752 -2311 -5262 -4730 -196 4369
3754 4369 5377 4518 -733 -5072 -4132 -1623 2177 3730 2606 389 -2406 -2315 1196 2792 2934 266
3770 266 -3610 -3834 -1807 2420 5742 4653 1434 -2833 -7000 -4381 84 4857 6643 2958 -2954
3785 -2954 -5325 -4610 -112 4955 5545 3554 -1457 -2865 -4437 -836 3505 4558 2941 -1826 -3102
3800 -3102 -4145 -2558 1667 4553 3233 1597 -2331 -3095 -1884 435 2482 2780 593 -716 -911 -1319
3816 -1319 311 1373 1039 -1492 -2862 -3146 754 2416 4835 3502 -1195 -3037 -4180 -2270 2143
3831 2143 3492 4258 1736 -2757 -4561 -2376 413 3151 4019 1088 -2909 -3677 -3019 548 5178 5281
3847 5281 2151 -2060 -5423 -4822 -1326 3969 4399 3110 22 -3938 -4732 -1523 1925 3929 3048 -1868
3863 -1868 -2788 -3166 -153 2481 3128 904 -1754 -2355 -2409 1398 3056 3592 1235 -2715 -5152 -3333 -1747
3880 -1747 3034 5068 1363 -1196 -3753 -2119 -134 2378 3214 -91 -2156 -4667 -3640 1917 5285
3895 5285 5987 2394 -1459 -4710 -4333 -1078 2210 3444 4234 1297 -2149 -2076 -2100 -1045 731 2013 607
3912 607 -2694 -2666 -627 1214 2168 448 -48 -1658 -2365 -289 1381 3586 1416 454 -2168 -3114 -1111
3929 -1111 223 2391 1610 905 -1159 -2149 -945 1168 2330 2659 -905 -3270 -3180 -1146 2868 5078
3945 5078 4180 644 -3096 -5260 -4359 -1717 3831 5272 3723 -320 -3391 -2917 -1591 2280 3008 2773
3961 2773 -1326 -4129 -2241 -281 2597 3014 1453 -1128 -2137 -3512 -388 1774 3070 1383 -1363
3976 -1363 -3580 -1518 517 1788 1701 990 -2194 -2001 -1708 1491 3482 3056 503 -3381 -3881 -1872 943
3993 943 3467 4767 2533 -1738 -4572 -4088 -597 3223 2976 1541 -1368 -2612 -2249 -165 2076 3211
4009 3211 472 -493 -2710 -1811 -161 1690 2951 2203 -254 -2026 -2410 -2239 613 1083 2398 1134
4025 1134 554 -680 -205 2089 1337 383 -1348 -636 -698 740 1842 2253 -679 -1169 -3372 -3020 351
4042 351 2024 4091 1954 -810 -2212 -4740 -1961 1348 2169 3646 1329 -1273 -2726 -2386 347 1437
4058 1437 2986 543 -3262 -3189 -2765 1810 2528 2755 706 -2875 -3364 -2991 -268 1834 3272 2281 -450
4075 -450 -1775 -386 27 1072 413 -1244 -2016 -2725 823 2674 1594 1759 -1099 -2909 -2528 -1491 1419
4092 1419 2703 3357 -114 -1829 -2436 -1704 1059 2486 2121 364 -1866 -1503 -630 840 3182 2974 914
4109 914 -2022 -4058 -2316 535 2710 3033 1624 -1571 -2701 -1850 -906 2024 1945 985 309 154 -1809
4126 -1809 302 989 604 45 -1576 -2048 -758 263 2630 2433 1309 -1566 -1725 -1671 -535 1145 2317
4143 2317 2074 -598 -1433 -252 117 1204 2785 976 -1492 -2376 -2493 -228 2965 4650 1858 -820
4159 -820 -3063 -3067 -701 1210 4157 3597 1704 -2163 -3854 -2527 1222 2325 2707 69 -2028 -2745 -1543
4176 -1543 1375 2686 619 -2242 -3254 -3265 -492 2479 4115 1726 -254 -3675 -3452 9 1009 3782
4192 3782 1625 -591 -1734 -1789 596 1491 2283 1218 -2255 -3110 -3379 42 2948 4045 3091 -140 -3131
4209 -3131 -4189 -2239 927 3381 3549 1604 -1300 -3945 -2994 -1038 1812 2484 995 -1024 -3456 -2027
4225 -2027 37 1835 1161 232 -2082 -1438 -2186 396 1828 2578 528 -745 -1942 -2529 36 1853
4241 1853 2112 -27 -1196 -1409 56 1272 3083 2030 163 -2481 -2478 -1696 1360 4414 3695 1302 -1213
4258 -1213 -4110 -3918 -530 2814 3616 2646 178 -2847 -3089 -2011 870 3196 1482 -577 -1583 -2772
4274 -2772 -937 2151 3171 1831 -612 -1789 -2808 -1833 1361 2620 1696 300 -903 -1427 -996 1119
4290 1119 1993 770 -1982 -669 423 994 2479 3036 1001 -2114 -3554 -2287 327 3786 3795 2021
4306 2021 -821 -3485 -3432 -1671 2139 3711 2985 -144 -1332 -3980 -1039 1660 3115 3466 -576 -2613
4322 -2613 -3429 -1576 1566 2728 2711 715 -864 -2450 -2208 -28 2380 1818 636 -107 35 17 400
4339 400 -535 99 3 -330 -758 357 1469 585 1137 -2275 -2642 -2730 -1119 1750 3612 3390 1150 -1798
4357 -1798 -2522 -1300 1139 1385 2409 1128 -1975 -2564 -2003 730 2199 2370 791 -1253 -1859 -2424 -553
4374 -553 2115 3446 1499 -450 -1686 -3299 -2803 -72 1732 1859 547 -613 -1550 -1234 -211 715
4390 715 708 -439 -1330 -125 1501 2401 1459 551 -1310 -3003 -1515 642 2998 1767 552 -1183 -2099
4407 -2099 -1262 -598 1278 2161 735 -597 -2727 -2545 -332 1828 3603 2268 -953 -3756 -3725 -851
4423 -851 1063 3846 2327 -200 -1652 -2897 -3051 -74 313 1152 924 -28 -848 -402 -558 735 -114
4440 -114 -978 -391 -67 -172 1020 1327 -31 36 -1487 -757 -122 2025 3512 1466 -500 -2292 -3122 -213
4458 -213 1113 3735 1636 -761 -2546 -3341 168 3149 3705 2640 -564 -2937 -3792 -2582 33 2052
4474 2052 3242 1168 -337 -2532 -2248 -1299 729 1687 1811 123 -1360 -1746 -930 1354 627 -65 -1674
4491 -1674 -2254 -1264 1053 2359 2159 357 -1261 -1404 -447 2285 569 2155 -329 -1602 -3138 -1392
4507 -1392 1535 3234 3007 73 -2291 -3224 -2547 1295 4398 3476 2629 -1541 -4457 -4106 -1666 2770
4523 2770 2704 3405 68 -2876 -2899 -1099 540 1900 1923 643 -1651 -1124 -678 110 945 861 -187 -2039
4541 -2039 -2020 -374 551 1466 1140 -1130 -496 -1072 -331 1686 348 294 -694 -1640 -1059 1073 3090 2074
4559 2074 1099 -1410 -3572 -4626 -843 3025 5174 2353 -800 -3571 -4153 -1455 1009 3806 4276 1586
4575 1586 -2230 -4207 -2206 -508 864 2653 790 -1082 -2150 -1699 5 2497 1786 750 -1468
4590 -1468 -2275 -1597 1034 2578 2242 1216 -1303 -1601 -998 1754 2382 759 -450 -1539 -2643 1336
4606 1336 1578 3757 1880 -1737 -3328 -3063 -1044 1873 4350 4330 342 -1981 -4709 -3348 275 2244
4622 2244 3880 1941 -1236 -2726 -3873 -1078 1561 2803 1674 1171 -2926 -2706 -1445 1575 1575 2176
4638 2176 -314 -1951 -1488 -455 1315 2260 1890 444 -773 -1202 -531 -6 1291 -1409 -1592 -1522 -1088
4655 -1088 674 2625 945 -539 -2213 -2174 -2880 -105 2327 2412 3459 -972 -2671 -3319 -1862 2464
4671 2464 3419 3025 795 -2173 -2564 -2003 289 2055 3148 1301 -1976 -4251 -2033 -21 2579 4473
4687 4473 2547 -353 -2893 -2628 -1413 602 1925 926 300 -833 -1784 317 384 1018 -823 -2268 -1389
4704 -1389 682 2168 2205 565 -1411 -3091 -2594 -1343 2227 4675 1030 590 -2106 -4176 -2169 1221
4720 1221 3270 1735 971 -1636 -2686 -1738 -199 2502 3405 2173 -2353 -4824 -3591 -1759 2024 5186
4736 5186 2582 65 -2315 -2970 -1793 -851 1291 660 499 1073 -1277 -249 -27 -701 162 -680 -804
4753 -804 -456 109 1879 1128 -710 -1252 -2291 -535 243 1471 2262 648 -623 -2287 -2007 -53 2558
4770 2558 3703 2147 -1255 -3314 -4136 -1539 1375 3264 2782 -900 -2499 -3596 -1519 395 1722
4785 1722 2850 2185 -1268 -2663 -2265 -676 429 1516 2491 -319 -1539 -876 -1324 675 450 246 -868
4802 -868 -302 611 267 2346 2419 128 -1213 -2448 -903 2617 2056 3374 -406 -2299 -2743 -864 1912
4819 1912 2491 1548 204 -4038 -2638 -1467 1046 3154 2492 1247 -2472 -2728 -2150 -1301 2709 2710 2440
4836 2440 995 -2719 -3593 -1350 -226 1721 1581 1027 -1276 -1114 -287 -166 694 93 -930 -80 -301
4853 -301 1090 138 1011 1485 -892 -796 -550 446 824 1443 878 -872 -2458 -747 629 1524 2339 502
4871 502 -1683 -3117 -2616 -503 2675 4315 1968 -979 -2889 -2418 -2001 1150 3854 2602 1169 -1234
4887 -1234 -4216 -1999 -26 1827 2286 1696 -674 -376 -385 -655 782 644 -136 -25 -1198 -51 971
4904 971 1663 428 736 -421 -447 -500 971 523 230 -558 -1981 -805 1796 2485 2572 875 -1329 -3407
4922 -3407 -2254 -167 1715 3591 3311 -984 -2289 -4487 -2501 463 2302 2535 1660 -39 -2478 -1790
4938 -1790 -890 1413 1445 625 -166 -1283 -1660 -553 1561 341 1266 1068 -2287 -699 -1600 1413 772
4955 772 -552 -623 -1714 28 818 916 -28 -2121 -1690 -791 -713 1950 1537 839 125 -2932 -2135 -2648 -77
4974 -77 3042 3487 1790 -1447 -3095 -3992 -867 1025 2694 2374 879 -2121 -2149 -657 1382 2642 1351
4991 1351 1012 -2162 -2072 -1469 1066 2941 2122 1001 -899 -1621 -2183 -783 1516 2278 -296 -703 -628 -962
5009 -962 248 549 32 -2485 -2167 -569 918 2383 2736 992 -1641 -2505 -1174 274 1592 3196
5025 3196 2062 -679 -2165 -3177 -2093 962 2534 2563 724 -964 -2968 -1688 457 2304 2722 392
5041 392 -1151 -2449 -2942 58 1212 1422 1742 -399 -1700 -1523 -1002 374 931 815 -109 -826 49 472
5059 472 1000 445 -91 -513 -1527 46 848 1579 1024 -114 -1892 -1818 -619 1657 2028 2011 51 -1677
5077 -1677 -2478 -1606 639 213 1902 837 -1049 -1826 -2590 -830 1723 2172 2062 -871 -2340 -3197 -954
5094 -954 1702 1139 2585 593 -922 -1711 -1338 -461 605 1046 1353 314 -1513 -251 -7 -769 -623
5111 -623 -455 25 -1189 747 1862 2219 -17 -1072 -1645 -1136 194 1742 1500 2061 -1494 -2432 -2027
5128 -2027 5 1880 1717 1342 554 -2050 -2045 -788 1280 2438 1076 502 -2257 -2945 -2244 794 1607
5145 1607 3082 1359 -250 -2438 -1011 -2177 1010 534 660 336 -1153 -326 -160 395 77 -338 269
5162 269 400 -320 831 944 413 11 -1699 -884 -135 284 1576 906 81 -887 -1734 82 1242 2579
5180 2579 931 -426 -1539 -2172 168 100 1573 1852 1355 -1123 -2362 -2505 -2094 -602 1827 2602 705
5197 705 -323 -2688 -817 -122 1194 1043 80 -487 -925 -404 452 247 508 25 -717 -610 -192 793 123
5216 123 700 -566 -428 -646 -1072 1031 1841 431 -1834 -681 -1877 1412 2139 1579 -351 -2579 -1845
5233 -1845 -2426 508 2590 2696 2821 -643 -2520 -2499 -1669 615 1663 2814 -69 -1847 -623 -1043 363
5250 363 1206 862 833 -339 406 -921 -148 1187 688 431 -325 -598 -154 266 1088 148 448 446 -728 841
5270 841 -173 -275 -567 -1037 -351 -310 -25 2899 1799 658 -784 -1984 -2007 -239 1618 2131 1735 993
5288 993 -1911 -1854 -839 213 1679 1586 1084 -847 -1706 -1540 -1170 530 1122 750 1553 -28 -1346 -590
5306 -590 -413 1361 501 -681 -1751 -1476 -551 -56 665 599 -493 216 702 911 727 -538 -216 -1433
5324 -1433 -681 175 1120 2985 277 -677 -2441 -3279 -1174 14 2164 3048 862 -993 -3586 -1074
5340 -1074 770 1978 1735 446 -75 -1834 -2343 -178 64 239 1281 -757 -859 -602 68 -170 314
5357 314 1216 684 -210 -1349 -1022 724 343 -153 516 -293 821 475 -508 -173 -949 -1587 -1513 -755 671
5376 671 351 -819 -123 -1788 -2366 -1023 860 750 2530 800 -338 -856 -1851 -544 1703 1353 839
5393 839 46 -1548 -849 -687 360 2035 2173 320 -1539 -1228 -763 -441 2324 1871 -314 -717 -1637 -431
5411 -431 40 -329 665 132 -350 -982 -316 119 426 767 -378 -631 -394 -504 1238 2263 943 -1268
5429 -1268 -1744 -1870 -832 651 1555 2152 415 -2011 -1264 -871 701 2053 901 -719 -869 -1969 -472
5446 -472 1360 1477 1820 1050 -1010 -2818 -2240 -197 756 2224 2044 -617 -992 -1043 -261 -496 596 1333
5464 1333 -973 -917 162 929 920 950 46 -966 412 -119 -627 580 841 -348 -813 -2084 -1037 174
5482 174 1909 2273 257 -1178 -577 -1267 -72 -641 952 705 -904 -1149 -1203 93 1387 3214 1514
5499 1514 265 -2136 -2307 -1493 -159 2471 2060 804 -1774 -1105 -1388 116 311 1264 1412 -656 -1548
5516 -1548 413 665 989 396 734 -1285 -1197 197 998 1044 402 -749 -286 -429 165 1029 292 -897 -1119
5535 -1119 -1089 -898 215 811 749 1499 -1291 -2279 -1827 -1644 414 2118 2036 1261 -2275 -2085 -1389 -955 2024
5554 2024 1734 1257 586 -1192 -1450 -1293 -235 16 446 -163 -1479 -495 -158 839 1564 77 -621 -1317
5572 -1317 -1080 170 110 784 512 31 -351 -275 181 1873 -213 690 -1615 -963 103 772 2882 928
5590 928 435 -1431 -1824 -480 687 1361 1920 75 -798 -1674 -1880 -1084 1310 2384 651 410 -756
5607 -756 -1041 -684 215 1527 1741 -266 236 -1688 -534 281 1278 -79 5 -886 -1279 -1616 1125 379
5625 379 221 1560 -875 -84 -169 -161 -333 332 -657 -1779 -613 629 1576 2072 166 -1204 -2206 -2028
5643 -2028 -121 1454 2029 2242 -881 -1367 -1824 -747 412 1468 1931 749 -1859 -2672 -2239 -143 1817
5660 1817 1885 693 -713 -1755 -164 37 1810 257 690 345 -1822 -205 -272 1131 269 -107 879
5677 879 -1170 490 285 226 -145 -1029 -595 -138 340 1817 1486 272 -202 -1951 -1741 -647 1673 1935
5695 1935 2313 779 -1080 -860 -675 934 948 -15 -38 -1256 -1766 -1063 327 -27 1174 1723 -431 -1532
5713 -1532 -1546 -1064 -288 2037 69 520 -485 39 576 295 1282 772 -416 -1238 312 268 -78 -211 -180
5732 -180 -763 379 572 1050 1564 1512 92 -1418 -1470 -785 -1913 796 1422 477 63 -1355 -1155 539
5750 539 1318 1241 939 -996 -1735 -1496 1296 1430 1988 424 654 -1878 -1329 -1851 -81 1934 2304 2004
5768 2004 -1139 -495 -793 -258 -232 -234 293 -467 389 -112 373 1465 89 -546 -1008 -905 -305 595 369 193
5788 193 -519 -849 -751 119 850 1629 566 -1009 -1597 -2088 -184 597 1061 1255 -232 -1487 -914 -545 835
5807 835 908 1221 -91 -2160 -2306 -2170 -43 1675 2038 1951 687 -670 -1148 -576 1126 -5 533 475
5825 475 -666 -490 -428 1157 552 -563 -157 -916 -1172 -103 -405 1078 1095 -173 274 -1238 1128 2027
5843 2027 1583 636 -810 -94 -422 1407 997 2223 526 -1096 -2260 -1414 -541 667 2855 729 -790
5860 -790 -979 -741 -1627 -76 3195 1817 667 38 -1192 -2071 -35 489 565 147 -951 -1732 -445 -177
5878 -177 1107 377 598 -952 -2155 -1766 -491 1358 2150 -151 -855 250 -1156 560 863 323 -735
5895 -735 -860 -538 -595 782 1646 1838 -474 -2535 -1184 -534 1143 2044 1964 35 -735 -2266 -874 862
5913 862 1789 3305 400 -225 -1723 -1081 -609 583 1133 1569 -138 -749 -1670 -1138 943 1861 640 -114
5931 -114 -1600 -1089 -603 504 982 1110 -624 120 718 -609 349 540 -965 -144 -775 1153 1376 1386
5949 1386 834 1536 -278 -2047 -1263 243 1766 1527 1452 -1071 -1344 -1485 -1360 1451 1820 2146 624 -808
5967 -808 -871 -890 792 2264 1270 -999 -427 -1192 -1804 -794 1035 422 204 -43 -85 -278 -243 830 753 391
5987 391 137 -899 -13 -403 548 276 -267 -1192 -430 -77 1346 1009 -395 -658 -2127 -1945 -1330 347
6005 347 1910 2196 1243 -634 -1391 -941 -230 1410 1254 76 -1909 -1605 -342 132 1684 1185 -763
6022 -763 -1737 -1401 -600 458 1126 1458 200 424 -686 -1913 -1464 -41 1329 1120 -22 381 -672
6039 -672 363 1131 -518 -609 -882 -15 815 562 1322 329 -1484 -793 -1564 188 935 2054 1153 189 -865
6058 -865 -907 -1990 -219 1275 948 1086 -618 -1970 -2489 453 1277 2114 1611 -447 -1846 -2115 -795
6075 -795 -93 1485 2844 487 -114 -1356 -1517 -1063 1380 148 445 59 -1177 -40 -1216 566 -149
6092 -149 1011 87 -344 883 559 624 -1749 -624 -431 -351 1480 1024 578 195 -960 -729 -1173 387
6110 387 779 976 267 -929 -1745 277 -60 1197 2073 -15 401 -1481 -2002 -966 708 825 1411 1655
6128 1655 -663 -1830 -1077 -525 -583 34 1178 -68 324 575 -705 823 -1074 492 252 -891 5
6145 5 -1114 769 -203 -1291 -646 29 -626 471 1175 -12 -146 -1725 -646 677 1137 2075 1108 -182
6163 -182 -996 -2259 -1196 840 1643 1145 691 -1094 -1784 -1428 -883 1624 1449 1949 217 -797 -911 -1325
6181 -1325 -746 553 -145 1362 -248 -30 -1222 629 -302 331 -1127 231 -195 674 407 -193 -107 -649
6199 -649 48 -599 186 -327 769 -1387 -148 -1287 405 1716 1215 1642 -896 -62 -707 -1846 141
6216 141 1129 1428 1443 435 -1124 -929 -1836 1059 1022 1827 56 -1498 -325 -397 380 -582 176 332 -1864
6235 -1864 -1063 -1667 576 160 172 479 -84 -789 -1050 -1868 694 -437 425 -303 -1458 1108 -28 853
6253 853 612 -917 -50 130 429 1605 284 180 -2185 -424 -1246 -607 603 1800 -326 299 -1062
6270 -1062 -630 -1248 -251 1094 1964 577 395 -906 -1591 -455 243 26 897 316 -1350 -989 -1303 753
6288 753 262 402 754 212 -585 -401 -520 910 271 665 824 -125 521 528 1013 325 286 -161 325 489 447
6309 447 771 479 -982 -1545 -270 155 2212 2323 99 -1549 -1815 -2053 251 569 2645 1238 167
6326 167 -618 -875 -1546 -853 444 823 41 -824 -1563 -16 -248 1137 2242 1297 602 -664 -1020 -573
6344 -573 -1030 1315 -247 1591 742 -1282 1337 -436 -834 -795 -1174 -530 445 -207 73 278 -576 -805
6362 -805 -234 416 1123 889 -775 -878 -1129 -1028 462 1543 469 561 134 -656 -2331 -1663 -135 596
6380 596 998 336 -953 -888 -808 -285 1220 1406 1646 -403 221 -1375 -835 614 459 371 1029 -996 -97
6399 -97 -943 -752 1811 -262 -1139 -189 -218 929 543 -226 -766 -1584 -292 -68 -436 -458 1157 150 -1447
6418 -1447 -1489 -730 375 864 919 497 -150 -678 -925 118 1319 1860 1537 -272 802 -2028 549 466
6436 466 978 840 1370 -669 -543 -1575 -1199 339 506 135 838 435 -14 -577 -957 -514 -36 946 362
6455 362 1722 549 425 -465 -355 -1785 -451 -744 347 -953 564 -13 -943 684 382 666 1900
6472 1900 -62 -352 -1450 -2028 -670 572 972 1310 366 -696 -1810 -829 54 790 -179 93 -915
6489 -915 -1130 -1097 449 1299 2392 915 137 -51 -2091 442 -937 378 589 -539 548 341 -81
6506 -81 297 371 -295 297 218 738 865 112 -1083 -693 -828 -731 1207 727 693 1521 -2714 -1002 -1726 -862
6526 -862 342 1187 1236 414 -1475 236 -1050 -505 -64 -796 1588 -507 -286 542 340 872 -736 535
6544 535 -261 -135 685 -225 -1168 -176 929 556 833 -1 116 223 -130 -566 -334 -585 -884 225 557
6563 557 1085 1168 -334 83 1491 1082 590 342 -137 -1065 -1496 -405 30 2610 1544 1221 -94 -2804
6581 -2804 -1275 -1627 -472 850 1118 689 -159 -1175 -1357 1058 1759 1279 489 210 -2008 -1718 -1223 -122
6599 -122 1447 310 1430 -495 -1024 -304 -1479 -108 -556 887 1360 1279 579 -105 -753 -130 54 -511
6617 -511 937 648 15 -265 -488 -1229 -1127 648 1012 2479 752 -1938 -752 -1383 -859 318 1357
6634 1357 1623 -70 -322 -368 -404 -186 -617 -121 -241 -1264 -1258 -453 950 1167 566 1641 -918 -382 -354 -673
6654 -673 -895 -82 889 -180 -20 685 1396 991 86 -766 -2130 -1219 -416 69 1345 1376 548 -682 -1155
6673 -1155 -772 523 956 857 865 -898 -2550 -1791 398 1847 1504 1368 -51 -562 -1404 -1636 686 -279
6691 -279 -176 18 -1039 242 -1003 753 480 -8 1998 648 -1262 -745 -1232 845 521 -724 1188
6708 1188 -25 38 1323 -641 -2365 -1155 -1346 484 683 1574 683 1128 -879 -964 -845 608 1026 191
6726 191 102 -879 -1558 -1318 -258 1188 2030 -308 -147 -374 -2143 -523 243 1473 149 271 -955 -1565
6744 -1565 -317 80 1499 805 -772 -131 -1782 -1907 -329 200 1789 295 593 478 -551 -843 -355
6761 -355 -1024 -27 -61 191 649 645 1422 246 1083 -797 -1699 -231 -1119 -511 564 -41 -747 -473 800
6780 800 2018 1552 354 -295 -2253 -1760 -1791 606 1292 1413 1086 154 53 -706 -904 -364 301 -242 516
6799 516 390 -70 -233 277 892 592 551 163 -326 -1141 -340 -233 -1106 -342 -16 1334 1254 -21 431 -683
6819 -683 -800 -602 -692 748 781 1448 -1439 -535 -549 784 949 1647 785 333 -1930 -1533 -756 -992 1881
6838 1881 2120 1242 372 -1061 -644 -736 -254 504 -52 676 -176 -396 -1401 21 235 562 701 232 -1077
6857 -1077 -1226 -763 671 237 -204 1317 362 871 -191 -975 -396 -1347 762 -596 206 1045 454 564
6875 564 772 -506 315 659 350 796 -223 -54 -934 -1134 1034 454 2252 1469 -470 -364 -1247 -616
6893 -616 -754 -177 2106 240 642 540 -147 114 -50 566 -106 -637 -546 -342 677 255 614 2185 324
6912 324 -439 -652 -2157 -695 -110 -547 -282 -315 21 -53 866 397 -354 -2098 -880 584 -790 894
6930 894 1224 -247 -1093 -1021 -82 1547 1092 1375 1119 -2320 -1270 -2796 246 1221 1067 1917 613 359
6948 359 -12 -660 -341 -511 -96 -139 45 -441 -430 464 361 906 -534 -493 -817 -413 -1142 -279 349 -679
6968 -679 592 294 1239 155 -325 -509 -656 -1127 -858 720 729 663 446 -648 -463 -160 -291 985 -526
6987 -526 -109 -1484 -1625 -2749 219 1189 2131 2072 299 -1181 -1384 -441 -1296 196 781 301 -278 -531
7005 -531 822 -592 1653 -88 -40 -639 -2199 -1524 -540 -331 312 952 1590 946 -469 -178 -638 -433
7023 -433 -1255 -1619 -692 -1873 264 816 1424 924 -1502 -797 -1107 626 -131 235 -1202 165 10 -206
7041 -206 190 1390 -200 -338 -379 -1929 -2181 -65 851 1997 752 369 16 -688 934 308 651 -337
7059 -337 -240 -1803 -859 -27 558 604 1666 881 301 551 421 -405 -164 -1020 -1820 -1121 28 407 497 804
7079 804 -615 30 -454 -1291 260 10 642 -152 37 222 215 648 1487 496 1303 -652 -1719 -1711 -1638 2223
7099 2223 567 1938 1440 -205 -916 -1349 119 -192 259 909 468 132 577 -49 1674 937 991 288
7117 288 138 -1307 -1239 -1279 121 282 289 746 341 576 402 441 -1199 -1370 -1727 -340 237 830 1236 0
7137 0 -1040 751 510 -137 6 -75 211 -2228 -1107 -116 864 1778 2493 612 55 -1418 -370 -1520
7155 -1520 -914 1363 848 1335 -338 -994 241 -163 775 895 -1007 -1319 -1326 -425 222 -101 1160 842 1162
7174 1162 464 -24 1179 -494 255 -587 -384 -590 327 961 -593 1109 800 -533 -435 327 54 237
7192 237 -712 451 859 1028 334 1326 1391 -13 -168 -1513 -2406 -420 742 820 1212 526 1217 -215 -121
7211 -121 158 -368 263 -268 -867 -495 -435 -405 118 627 1644 83 11 -1110 -332 -1281 -68 -66 348 -697
7231 -697 -153 1210 1012 922 185 -1184 -2121 -1426 -69 0 716 847 -123 -602 -128 1537 1016 -222 697
7250 697 -570 -1808 -1281 -542 320 1293 1742 -216 521 -573 469 -1541 -569 -1005 -231 -490 122 -337
7268 -337 1448 1498 2092 609 -555 -133 -987 -1579 -693 -651 1327 -400 -170 1217 541 -30 -1517 -513
7286 -513 -21 -414 1057 160 -645 103 -556 1235 490 -331 892 -186 -898 -984 -1335 43 -1120 1477
7304 1477 1967 1119 966 -435 -937 -1608 -1269 8 -376 921 -461 -1096 466 25 1234 374 -197 -49
7322 -49 -1360 -1478 -1196 -1070 518 922 1394 -17 -1832 -563 -633 -315 -450 -1462 -28 368 346 1132 140
7341 140 557 -373 -893 -131 135 -206 50 -531 -58 -943 -600 2189 1085 408 -114 -170 -1565 -1008 -590
7360 -590 805 1478 707 837 -415 -375 583 -589 319 -216 202 -1980 -926 758 417 -410 632 1079
7378 1079 999 63 -1448 8 -1056 -1530 -274 -1040 2284 1786 1075 1129 -1106 -500 -1367 -1909 498 239
7396 239 319 410 -1018 129 -268 1132 -158 845 -120 -1025 -1680 -1225 -986 1077 2185 1144 957 -1241
7414 -1241 -486 -948 -997 288 471 2276 -155 -262 -772 80 574 1414 1057 -482 -1102 -1011 -893 -259 857
7433 857 -467 1641 1333 1193 -423 440 775 -1156 -674 -348 -422 639 -365 -11 -249 -357 990 108
7451 108 -350 -416 -1386 -259 -909 82 830 1142 2040 65 -490 -1546 -9 59 -870 577 319 540 366
7470 366 -68 -527 499 -609 -99 -247 -238 -93 -1206 -64 360 874 493 802 57 1167 793 -901 -239
7489 -239 -1059 -972 -231 1016 350 643 411 -143 571 -1535 -550 -37 -53 1248 -724 -997 -1896 -613 511
7508 511 1291 1166 533 -1096 -700 -1333 -299 201 1108 759 544 1306 269 -751 -347 148 -988 125
7526 125 855 452 35 -250 1140 1073 682 56 -59 -1349 -1560 -708 -671 249 -177 45 607 573 -81 -649
7546 -649 -453 -816 0 -32 -201 530 -305 -750 -952 651 775 634 896 -557 -1621 -1390 -534 -842 1367
7565 1367 1442 271 885 -123 -947 -673 -714 61 -305 -484 -628 -878 -828 -107 1020 627 486 181 -1441
7584 -1441 -834 -1547 -132 1439 427 -339 1147 149 354 -926 1132 39 -828 734 -828 990
7600 990 927 992 849 -376 -387 383 -1383 481 269 -267 -399 -534 -325 -269 -48 713 438 695 -1075 -903
7620 -903 180 -102 395 80 894 498 610 347 649 391 -167 -1258 -167 -343 -322 73 -434 925 263
7639 263 896 331 250 -11 -1476 -283 -1579 186 -53 688 978 527 -819 -5 -648 -1083 138 127 513
7658 513 397 -1092 -397 -423 456 1529 1323 417 -1184 -860 -1239 -203 47 755 324 678 -198 -1712 5
7677 5 237 -737 397 -190 -438 -841 -648 -278 90 1343 1287 209 186 -546 -1093 -1305 -531 697 1065 1018
7697 1018 623 11 697 -859 -748 273 -517 -167 -299 459 460 -114 -19 895 1010 413 1202 -890 -1007 -1859
7717 -1859 -188 -608 1099 1099 201 459 873 -570 12 -684 258 128 -260 695 -869 1118 95 775
7735 775 440 -2019 -741 114 -812 -194 -942 -444 -64 -425 124 517 1169 -412 -106 459 -1566 -776 -162
7754 -162 -386 1496 -51 -301 -109 -115 600 340 229 275 20 -818 -1596 -498 904 736 1591 502 -316
7773 -316 -936 -1118 -114 -633 720 402 911 -122 -22 -511 219 -588 453 -174 -14 776 -1361 -269
7791 -269 534 343 1532 842 1453 -406 -779 205 -1684 -691 -587 558 1057 1075 897 -309 -1756 -474
7809 -474 45 76 -196 -157 121 -1013 -202 360 930 633 1894 -31 -1991 -1713 -421 -1166 536 -137 470
7828 470 702 -558 793 -213 -654 -185 -323 609 -531 -674 13 666 82 1114 302 623 -404 -888
7846 -888 -894 -188 126 155 338 614 300 785 45 669 560 516 -660 -478 441 1298 1217 371 -327 -1123 -151
7867 -151 -57 787 463 -728 -1721 -839 -1524 -769 1344 696 384 1418 283 575 246 309 469 -935 954
7886 954 610 175 1758 -411 -7 -271 24 357 -348 948 -33 -391 -725 -731 1103 1137 798 -211 280
7905 280 -1830 -1548 -918 -101 935 1614 684 -816 -433 -816 -1319 -178 629 1537 281 -216 -573 -1383
7923 -1383 203 533 1817 1058 -110 -1345 -900 -995 -419 1888 587 753 75 458 -500 156 -226 -164
7941 -164 189 -187 -588 365 -29 58 921 662 81 828 492 -2459 -775 -937 -1062 256 -408 988 -785
7960 -785 104 1340 -151 203 -75 -682 439 494 786 -680 -711 -203 169 982 687 772 433 -48 -257 -980
7980 -980 -248 1717 -683 75 -535 -1320 -102 -952 15 -771 365 580 -378 74 206 262 259 -416 281 143
8000 143 -792 -567 521 -95 -1439 -1216 240 463 913 -206 603 -351 -950 -922 -872 76 1152 683 1097
8019 1097 -1152 172 -55 -183 -608 1978 489 -52 -1517 -290 -785 237 1966 2516 686 -792
8035 -792 -345 -1458 -163 124 34 109 403 -17 -665 468 473 433 401 -30 298 -202 364 72 -614 -325 -489
8056 -489 245 844 -605 753 -1158 720 -583 -263 749 254 1417 14 955 -26 -52 671 873 118
8074 118 715 -960 378 -1407 766 875 1265 1259 -236 39 -742 -907 96 1321 -38 895 -582 -275
8092 -275 -785 7 366 -542 1238 -433 -736 278 -1181 144 -283 -559 -1199 -800 -843 -362 -366 -181 -930
8111 -930 -281 -1588 -468 1043 244 914 -1208 -1012 -192 -260 412 116 402 164 -1172 -806 291 -139
8129 -139 858 94 845 -546 -1782 -237 -361 211 -5 1437 947 -20 -408 -395 -255 -183 5 366 138
8148 138 -194 39 -726 -154 2 -190 -266 -263 149 86 -243 593 -120 61 161 -378 105 -226 -975 -764 1015
8169 1015 1027 581 313 1073 117 -1833 -745 -668 630 -8 150 329 -989 -1177 -1560 -555 298 803 653
8188 653 1409 -266 -861
8191h61
$$ Imaginary data points
##PAGE= N=2
##DATA TABLE= (X++(I..I)), XYDATA
0 0 0 0 0 0 0 0 0 0 0 0 0 0 0 0 34 -41 64 -64 64 -69 105 -128 135 -182 199 -231 274 -323 363 -421 480 -552
32 -552 621 -704 802 -897 1016 -1135 1268 -1413 1573 -1748 1940 -2149 2379 -2630 2905 -3200
48 -3200 3527 -3884 4273 -4713 5192 -5728 6326 -6998 7761 -8642 9655 -10846 12263
61 12263 -14001 16166 -18959 22717 -28033 36123 -49321 62466 -1672662 -2270341 -1639453
72 -1639453 -408925 1080656 1727241 1711875 571118 -504108 -1157672 -996004 -292723
81 -292723 155646 290839 102066 20478 251484 356919 346126 -73758 -424115 -514936 -326643
92 -326643 91174 346596 472737 372413 67012 -258399 -577786 -533322 -222641 240192
102 240192 559698 520757 311709 24685 -150504 -286804 -458172 -522359 -411822 13770
112 13770 521138 818915 740022 280772 -253149 -671633 -804954 -622646 -214831 328398
122 328398 730419 806498 474370 -94449 -548284 -675649 -426326 -19712 309623 432206
132 432206 315165 72156 -200718 -358663 -312707 -88738 204524 374479 349203 167086
142 167086 -47166 -205307 -327192 -406220 -399956 -198024 212932 662512 880489 647944
152 647944 20888 -692426 -1099478 -952393 -322449 472118 1001049 988519 467182 -247687
162 -247687 -718877 -701200 -277837 209941 408212 236904 -100034 -282795 -156509 155801
172 155801 384040 319281 -4938 -354635 -467212 -249782 153745 467410 462499 126842
182 126842 -325877 -596976 -491961 -59938 436742 702790 585803 168028 -316680 -633733
192 -633733 -660014 -423692 -39947 343475 601571 648965 455876 75886 -355671 -661769
202 -661769 -694887 -424751 36189 477076 685227 560925 177261 -254581 -506726 -462860
212 -462860 -179694 155777 343563 292360 63348 -182706 -287898 -197409 26377 239419
222 239419 315820 213538 2558 -192343 -272344 -211810 -79153 34525 76208 61783 56774
233 56774 110242 200247 241364 135333 -116799 -403010 -541877 -399110 -10188 430179 666907
244 666907 550523 142881 -316680 -566944 -483566 -156560 186542 338782 246505 26493
254 26493 -138793 -133729 3051 132859 132401 -2659 -152475 -178907 -43922 146914 228345
265 228345 99909 -164670 -367061 -325195 -12922 395468 626574 497693 47803 -480244
275 -480244 -780760 -679275 -228892 322544 691751 714326 420105 -10676 -373168 -537391
285 -537391 -485762 -284710 -21364 221406 377570 403499 280041 42837 -211526 -364413
295 -364413 -337339 -143922 104654 268014 256275 87515 -123860 -241958 -190102 -10838
305 -10838 175443 248321 166956 -7958 -160217 -200791 -126296 -12833 47889 26597 -28014
316 -28014 -34514 57736 205108 293926 218817 -37697 -361768 -564234 -491390 -134688 340210
327 340210 681168 689559 339323 -186474 -609773 -701789 -429001 36900 427244 540755
337 540755 348134 5501 -267638 -322831 -169989 52682 187530 163935 35027 -85799
347 -85799 -116236 -59029 8284 18631 -26946 -57353 -1335 135995 259772 250466 59830 -235130
359 -235130 -462291 -463753 -203812 191128 507221 573285 355959 -15147 -344795 -477367
369 -477367 -385785 -159748 70824 212807 252476 222050 159085 72877 -40952 -165006 -249303
380 -249303 -237043 -107478 83794 234450 252922 128320 -62476 -197998 -193520 -59785 107195
391 107195 200249 160354 25991 -115438 -180107 -147864 -60857 21979 67931 89679 116977
402 116977 155964 166386 92268 -81186 -292831 -423383 -357447 -80720 295075 572346 585379
413 585379 295266 -158502 -540984 -645985 -419865 5997 390357 534204 383711 54558
423 54558 -244751 -347946 -229023 3105 185447 206349 78709 -90110 -175747 -128906 3285
434 3285 118414 136485 62253 -32806 -63405 -10813 71586 97166 11588 -143242 -260997 -233565
446 -233565 -43107 218800 396876 376411 153850 -153718 -384528 -420139 -264908 -12169
456 -12169 206858 303631 270532 155782 18349 -93163 -171248 -204146 -181296 -94696 37643
467 37643 165692 221793 163975 16957 -137011 -205756 -141565 16900 162473 201438 99090
478 99090 -78617 -219364 -233008 -109183 71148 206268 224983 138537 17568 -72363 -105839
489 -105839 -108066 -117968 -137422 -125204 -35644 130296 296500 354054 232408 -38394 -328469
500 -328469 -475697 -379501 -91198 244191 437957 391131 147070 -145068 -313757 -278967
510 -278967 -94643 109103 202027 141000 -8318 -131277 -145917 -53908 67665 133211 101412
521 101412 12735 -56155 -56556 1249 49744 29275 -62323 -161805 -175844 -62557 137449 307378
533 307378 333922 176803 -93856 -334251 -418671 -297815 -38270 223660 363489 328106
543 328106 159781 -42271 -190076 -232257 -187259 -95870 1617 80752 129484 141217 105047
554 105047 27404 -64917 -126427 -117747 -38369 66318 129542 103996 1625 -115056 -166906
565 -166906 -112706 16770 147493 198886 146820 26874 -88627 -144451 -130342 -79467 -34746
576 -34746 -9183 14331 65960 143333 199582 176298 43561 -155958 -320841 -339849 -180969
587 -180969 87902 326173 393757 253463 -11497 -249637 -326476 -214150 -1201 176887
597 176887 213240 107328 -53143 -152595 -130624 -14106 107727 152100 97116 -9737 -91240
608 -91240 -102366 -51880 2949 15706 -16953 -51901 -33861 49685 157813 205945 136500 -35734
620 -35734 -226016 -321065 -255489 -55640 176912 318903 302385 147831 -56216 -203382 -240018
631 -240018 -171996 -56326 44806 100801 109064 91022 56995 13047 -33721 -75119 -86538 -54269
643 -54269 8194 67807 82641 36542 -45252 -111210 -110566 -34509 80475 163853 162524 72611
655 72611 -59030 -158967 -181031 -121104 -23504 59297 103230 107858 102052 89448 59931 -6515
667 -6515 -109053 -206726 -233865 -148089 32810 222234 319522 255888 58095 -168354 -299521
678 -299521 -265607 -93600 108254 221881 190843 47587 -101832 -164297 -105978 21444 124895
689 124895 136456 55304 -55975 -122044 -107891 -35539 33922 52188 24362 -7315 -837 51759
701 51759 107295 105676 18915 -119404 -225551 -225746 -98387 95786 252615 287760 180930
712 180930 -6798 -176647 -246821 -197599 -74305 52687 125450 129487 88422 35155 -3911
723 -3911 -29721 -48450 -60323 -55437 -27222 17320 52020 54870 15536 -40886 -70028 -45633 25159
736 25159 100616 125337 74197 -29677 -129893 -165808 -120025 -18928 83471 137704 129244
747 129244 79456 20938 -21826 -51130 -79397 -108760 -117666 -80670 10070 128072 209164 200055
759 200055 87030 -82076 -216077 -238146 -136464 34183 172421 201942 108830 -35247
769 -35247 -138626 -136742 -41837 77026 137710 103734 -1062 -102575 -137385 -91102 483
780 483 73097 91746 61480 17211 1587 15101 29244 8809 -56640 -128209 -150347 -87818
792 -87818 46210 183219 242933 180320 21704 -148269 -243522 -215193 -90233 58328 154718
803 154718 162925 100417 16173 -43811 -65569 -59817 -45738 -31704 -15564 11230 39468 54066
815 54066 36198 -8617 -51083 -61415 -23020 43298 95393 89990 20279 -77475 -145703 -139756
827 -139756 -55849 57937 144129 159289 98773 6122 -70844 -102319 -92434 -66505 -42582 -19567
839 -19567 17299 71867 126223 140521 86862 -24296 -141048 -199149 -157964 -33919 104437
850 104437 179094 150144 41681 -74302 -131043 -95329 -2163 81157 96744 37744 -50716
861 -50716 -109015 -97057 -22167 64101 105211 81666 20889 -31776 -44990 -20748 4456 -3489
873 -3489 -43573 -83162 -76635 -4289 101590 174892 161996 55920 -92969 -203329 -210728 -112542
885 -112542 36173 153033 183324 122104 15856 -71300 -104275 -79062 -27256 11347 24800
896 24800 17327 8810 9556 13004 7108 -7235 -21845 -17648 10871 48295 58095 24731 -43288 -107330
910 -107330 -116755 -58503 44757 136402 161157 102828 -3119 -99767 -139833 -109228 -39475 23642
922 23642 53373 52988 43700 47181 54702 47607 5464 -64527 -124390 -134014 -69234 39321 136112
935 136112 163438 101758 -12576 -111852 -137472 -80033 18065 90581 94628 33570 -46779 -88842
947 -88842 -69467 -4280 61847 88195 62153 13079 -29474 -43507 -34363 -24971 -26569 -38067 -31933
960 -31933 8029 71379 125608 125115 55891 -60486 -161953 -188960 -121642 12294 140110 192989
972 192989 147220 34353 -79127 -132917 -110009 -37067 34592 60560 43218 3441 -21410
983 -21410 -15193 7296 26791 24133 2334 -18657 -23845 -9046 5591 4474 -12708 -35892 -36886
996 -36886 -6748 43889 84072 80692 31223 -41598 -96011 -100815 -58916 6764 54207 66969
1008 66969 50602 27459 16260 15287 5487 -25930 -72677 -99820 -79044 -6094 86814 144607
1020 144607 125610 35407 -76015 -141646 -123114 -34076 68748 117253 86377 -1397 -83704
1031 -83704 -107048 -56652 33056 101411 108422 49341 -34310 -92006 -97639 -55504 -658 37438
1043 37438 47030 38482 35280 36678 33858 8921 -39974 -89656 -107147 -70566 8105 90785 131095
1056 131095 105409 26894 -57426 -103402 -91163 -35493 23113 50269 40015 8395 -14476 -13863
1068 -13863 6532 24926 23585 -866 -30223 -40419 -24004 8989 31053 26377 -4790 -36282
1080 -36282 -41695 -7292 46183 81135 72615 12108 -63903 -113136 -104690 -41443 43574 102285
1092 102285 111736 72135 10309 -43576 -69414 -69520 -53139 -30026 -1735 32457 64961 83516
1104 83516 67241 16070 -52517 -98700 -93341 -36975 43090 93258 84742 21230 -56190 -92319
1116 -92319 -63185 13372 87051 104176 54201 -32364 -97648 -103703 -51041 27300 77757 76397
1128 76397 36644 -10430 -30286 -16474 8265 14250 -9035 -45335 -64024 -40053 18675 80404
1140 80404 104525 74264 3469 -67409 -99688 -78654 -22075 33578 60879 50213 22810 -1586
1152 -1586 -12319 -9135 -6877 -10345 -17533 -16858 -1892 17534 27703 14523 -14662 -39541 -39229 -3292
1166 -3292 47000 78701 65540 4893 -69879 -116135 -104187 -30899 61778 124712 125057 60563
1178 60563 -27418 -93915 -106938 -65803 -5789 41510 55813 41009 17221 3364 620 2843
1190 2843 -6110 -22556 -36459 -32244 -5317 27739 46071 35088 652 -33899 -43790 -20291 20641
1203 20641 49351 43809 5355 -41702 -65652 -49811 -5603 38940 57129 40049 5442 -18293
1215 -18293 -18455 267 13219 13 -34901 -65118 -55789 -1323 70964 118880 102337 23306
1227 23306 -75769 -137901 -124998 -46131 53204 114820 109502 48498 -26706 -73723 -72042 -32325
1239 -32325 12814 36963 33054 11202 -8866 -14994 -13199 -9932 -9972 -6536 3588 21917 37625
1252 37625 34415 4527 -38050 -71104 -67652 -24390 39023 86235 87809 43989 -21935 -72543
1264 -72543 -78677 -44154 6591 39036 39767 17532 -6475 -9210 7619 26347 26651 896 -35628
1277 -35628 -59896 -51558 -8143 42325 72155 59199 12560 -39567 -64590 -48704 -2057 40845
1289 40845 52186 26172 -16124 -48998 -47785 -14751 25826 50502 44628 16619 -13429 -29031
1301 -29031 -29507 -21377 -16551 -13267 -5095 14714 41901 60499 50789 8523 -47359 -87320 -83758
1314 -83758 -30404 42119 92754 90955 37775 -32502 -78862 -72324 -21328 37347 65894 45071
1326 45071 -3230 -46928 -54421 -23282 19123 46660 41319 10955 -18667 -28629 -14020 5817
1338 5817 11057 -3295 -23136 -29834 -10805 25981 53233 53120 20958 -25830 -60844 -61023 -32077
1351 -32077 10453 39975 42895 26624 6820 -3659 -3114 -2707 -11618 -28129 -39215 -29139 4516
1364 4516 45672 65538 48421 705 -51642 -74261 -51272 3641 55716 72076 41982 -16020
1376 -16020 -63752 -73364 -36373 22257 67518 72449 34494 -19575 -57584 -62158 -35969 4367
1388 4367 30771 35940 22805 9258 3701 4317 3343 -9630 -29635 -39673 -30677 -658 35473
1401 35473 55179 43656 7566 -30225 -47685 -34268 -1907 25476 29248 10051 -16365 -26263
1413 -26263 -13668 11725 33241 29393 3837 -27206 -38777 -23514 7907 32415 28150 -653
1425 -653 -33638 -42294 -17502 28024 60995 54538 12243 -44605 -77966 -66213 -14786 43528 74302
1438 74302 61367 17690 -28151 -49669 -40068 -14802 10248 16831 11058 3925 3537 9644 12525
1451 12525 4468 -12452 -26147 -23252 -3750 24789 37976 24484 -10034 -42640 -50492 -25201
1463 -25201 21542 57941 60977 26303 -22899 -61180 -61086 -27656 18147 46027 41975 18220 -9895
1476 -9895 -21550 -11880 3733 11017 -596 -18315 -28942 -20115 9277 40126 50758 33182 -6083
1489 -6083 -41793 -54958 -35158 2877 35701 46283 29704 -2554 -26268 -30312 -14531 6769
1501 6769 17930 15679 3023 -3350 -3140 1535 1641 -7313 -18203 -18390 -4228 22907 44684 42949
1515 42949 10926 -33538 -64461 -62615 -22015 32065 72011 69567 28182 -24160 -57897 -56736
1527 -56736 -21436 18072 38678 31033 5326 -15901 -19041 -2305 15913 18769 5107 -16246
1539 -16246 -26682 -15306 7700 26323 25689 4853 -19288 -29029 -16001 9444 30029 28723 6735
1552 6735 -19895 -35927 -28148 -4858 18939 26812 17778 1039 -11222 -10352 496 7427 3171
1565 3171 -13083 -25917 -21901 -36 28828 44277 35097 295 -34988 -52771 -39703 -2436
1577 -2436 35656 48270 32511 -2071 -32394 -39964 -21319 9255 30247 31004 11916 -11376 -26459
1590 -26459 -25479 -11068 6074 12599 12246 7460 4541 5376 5515 564 -12182 -25880 -28240 -13381
1604 -13381 14397 39053 43335 22827 -11558 -40114 -45395 -26325 7400 31023 33731 15359
1616 15359 -9293 -18522 -12891 3118 15126 10511 -4536 -18305 -20752 -3074 16836 27922 17264
1629 17264 -7957 -28701 -33242 -11309 21084 40581 35123 5708 -30615 -48058 -36346 -3186
1641 -3186 29319 44584 31539 3927 -19178 -26153 -18468 -6003 554 -99 -2548 3992 15270
1654 15270 26161 23648 2768 -21970 -39949 -35027 -8461 25472 43061 36089 6093 -24154
1666 -24154 -39394 -27193 -104 25681 32274 17631 -8434 -25812 -22855 -6020 14231 21633
1678 21633 12786 -4088 -15298 -10107 4184 13532 13303 -1646 -19700 -26720 -12587 10671 31197
1691 31197 32403 16844 -11316 -32548 -33267 -16132 9001 26768 25908 10274 -6716 -16347 -10940
1704 -10940 -633 7620 5840 -3535 -9713 -7130 3484 14445 16216 3446 -13669 -22890 -15064
1717 -15064 8651 28129 30642 11289 -18944 -38863 -34910 -7413 25814 44111 35986 6427
1729 6427 -27456 -42480 -30712 -4214 20762 28253 17974 -917 -14129 -11631 -845 10347
1741 10347 7465 -4512 -17088 -16830 -2504 16807 27836 19359 -3381 -25851 -29868 -14001 10505
1754 10505 27643 26966 6596 -16298 -24667 -19065 551 15541 18792 7767 -5425 -11032 -5580
1767 -5580 6115 9457 1916 -12445 -22705 -18014 2955 27854 37872 26461 -4816 -35599 -47702
1780 -47702 -31148 3213 35578 44149 28611 -1473 -27946 -33431 -20508 3010 17932 20225
1792 20225 8867 -2954 -9622 -3579 3581 4117 -96 -8167 -9322 -4151 8718 16672 13591 -1259
1806 -1259 -17416 -24092 -16779 4421 23422 27195 15635 -6093 -25297 -26760 -11825 8928 22439
1819 22439 16893 1311 -11858 -14453 -2729 11007 15060 6674 -12278 -23095 -18915 678 21971
1832 21971 30142 19306 -5109 -25138 -30504 -15081 11204 26477 26034 7640 -14553 -24752 -18695
1845 -18695 -503 17466 20811 10570 -4182 -14621 -12972 -1737 6516 5892 645 -7009 -3425
1858 -3425 6563 14761 15256 1508 -18125 -27534 -21155 736 25325 34645 22948 -3388 -26830
1871 -26830 -31756 -19549 5660 24245 26435 11749 -9566 -21318 -17777 -2760 11841 17093 8338
1884 8338 -4916 -11159 -7136 4016 13148 9520 -1868 -14374 -18246 -6334 10677 22638 22142
1897 22142 5457 -14553 -25840 -21956 -5919 11928 20088 16774 6075 -5342 -10207 -6525 -3540
1910 -3540 231 -2516 -5718 -2788 3813 13786 17994 10173 -7066 -23361 -26355 -12973 9568 27893
1924 27893 30330 14117 -11560 -29862 -28412 -8989 13506 28642 23900 5538 -14090 -22051 -14580
1937 -14580 -21 11282 12427 4221 -5585 -6944 -624 7306 10348 3478 -8892 -17704 -14497 -1276
1951 -1276 15241 21317 15089 -2317 -17928 -21425 -11076 6384 16094 13646 468 -9514 -11720
1964 -11720 -2614 8665 11145 4903 -7271 -14014 -11573 2885 16391 19378 6686 -10828 -22573
1977 -22573 -19610 -1028 18331 26691 17962 -4331 -23635 -28316 -15158 7665 24116 24166 9791
1990 9791 -9848 -22082 -20505 -5724 8453 14214 9418 -666 -5746 -4457 751 4049 1298 -4994
2004 -4994 -8654 -6155 3806 11775 14759 5172 -7465 -17038 -16231 -3763 12867 21046 17388 963
2018 963 -13194 -21503 -13941 1639 14791 16921 7603 -5668 -12474 -8622 2945 10369 9684 -1067
2032 -1067 -14230 -17370 -7620 6650 21564 21347 7585 -11870 -27325 -22800 -6280 14123 25756
2045 25756 20130 6149 -13215 -19495 -15643 -3114 7801 10115 5970 1901 -1374 622 2798 3092
2059 3092 -5402 -11411 -10613 -2011 13715 22052 18836 -68 -20171 -29178 -20012 1460 23950 30479
2073 30479 18399 -5244 -22990 -24692 -10073 8767 20258 16389 2201 -11347 -14480 -4862 7249
2086 7249 13724 8345 -3863 -14504 -15882 -4048 9632 18920 13890 314 -13827 -17383 -8495
2099 -8495 4254 14585 13037 2077 -7897 -10957 -5528 3613 8455 4793 -3095 -7783 -6316 1346
2113 1346 9154 9861 1844 -9760 -15552 -11076 3924 15568 19456 9281 -8651 -21329 -22603 -7935
2127 -7935 11263 23016 21627 5382 -13399 -24789 -19899 -1033 15391 22569 14578 -1489 -14648
2140 -14648 -15524 -8574 4304 9886 8776 -152 -5067 -5468 59 6304 5271 -1088 -9092 -10701 -4303
2155 -4303 7196 15008 13958 2505 -11202 -18711 -15743 -316 14091 17813 10023 -5464 -14345
2168 -14345 -13742 -2665 8727 12408 4302 -9065 -13302 -8790 5487 18806 17244 3694 -14882
2181 -14882 -23760 -18758 1486 20525 26721 16922 -3317 -21151 -24099 -12044 6156 18960 19136
2194 19136 8764 -4786 -11776 -9170 -1197 4895 3999 77 -4053 -3214 5050 9877 10267 576 -12247
2209 -12247 -17550 -11688 3507 15848 20049 9133 -6542 -17985 -17390 -6724 8588 15087 12570
2222 12570 1753 -10747 -13421 -5725 6318 12538 10321 -379 -11993 -13473 -5711 8333 17385
2235 17385 14350 825 -13226 -19133 -12191 3517 16749 17879 7287 -7728 -17614 -14482 -1546
2248 -1546 9361 15310 8651 -2347 -9946 -10104 -3105 4942 7861 3331 -2386 -6497 -4922 3484 8565
2263 8565 6116 -499 -10642 -12283 -4645 9260 18153 14505 1021 -14387 -20927 -13755 5222 20994
2277 20994 22391 9282 -9200 -21630 -18922 -3372 14390 20248 13137 -2228 -13754 -14089 -5705
2290 -5705 7602 11673 7166 -4639 -10098 -9423 607 10716 13050 5754 -6847 -14835 -13047 -2459
2304 -2459 10556 15474 9997 -1525 -12234 -11795 -4860 4256 9156 5454 -1909 -6786 -3340 3754
2318 3754 9568 7211 -2044 -11923 -14141 -8336 5596 17992 18441 8218 -8580 -19795 -20822 -8566
2332 -8566 8707 21542 20084 6370 -9589 -19291 -16546 -4804 8770 14223 9154 -1095 -8300
2345 -8300 -7372 -1471 5130 4931 -208 -5450 -8325 -1884 6667 10639 7616 -1184 -9593 -14225 -6739
2360 -6739 5161 12565 11081 2693 -7464 -12011 -9103 3460 9157 8925 1652 -9656 -10734 -7197
2374 -7197 4928 14050 11967 1959 -13635 -17659 -11228 5324 16870 16568 6177 -10006 -19405
2387 -19405 -14159 -1800 12687 16790 8689 -3796 -13069 -11497 -2331 7753 11409 5965 -2268 -7202
2401 -7202 -7298 -1192 5631 6060 2472 -4862 -6572 -2959 4648 9990 7875 -965 -10477 -13339 -6882 6213
2417 6213 15222 14910 3117 -9470 -17824 -13640 -1583 11155 17012 10583 -1531 -12264 -14690 -6093
2431 -6093 3314 8235 8509 501 -4676 -6574 -1744 4430 7654 4553 -5255 -9214 -8768 -1811 8015
2446 8015 13064 10297 596 -10371 -13374 -7632 3033 10839 11113 4185 -5608 -8269 -5676 842 7252
2461 7252 4558 -1652 -6591 -6368 1555 8861 12886 6214 -7188 -15577 -16656 -5988 8702 18279
2475 18279 17398 2764 -12215 -19649 -13116 -349 12541 16671 7779 -3668 -10923 -10823 -1837 6990
2489 6990 7722 2384 -6597 -8552 -3788 4845 11843 8559 -1553 -11492 -12696 -6693 5351 14142 12495
2504 12495 3187 -8299 -13911 -9300 927 9880 11865 2757 -6195 -10799 -7205 1921 10400 11045
2518 11045 1954 -7852 -11692 -7472 1880 11329 11422 4105 -7329 -13099 -8770 621 10654 11938 5372
2533 5372 -3973 -11814 -9709 -1202 7459 12049 7601 -1206 -8982 -10307 -3884 4322 9962 7420 -116
2548 -116 -7515 -9126 -2479 3463 8126 5298 -2559 -8474 -8157 -1212 8288 11135 7018 -5049 -13481
2563 -13481 -12738 -4520 9473 16321 11916 -268 -11814 -16965 -10174 2140 11717 12176 4872 -4955
2577 -4955 -10807 -7343 1532 7623 8252 608 -7921 -9467 -2542 7481 13158 11188 -577 -12093
2591 -12093 -15084 -8563 6092 15315 15448 4630 -7484 -14993 -9918 -347 7819 9720 3451 -4330
2605 -4330 -7530 -3844 3388 8406 5521 -2756 -9681 -10817 -3960 7016 14425 12098 1645 -10377
2619 -10377 -15736 -10537 1895 12200 13947 8500 -3097 -11747 -11153 -2916 6184 10379 6931 -2016
2633 -2016 -6850 -5639 -276 6494 6728 2437 -4877 -9297 -7170 -121 8194 8650 4832 -3980 -10173
2648 -10173 -8303 -2019 5163 10037 7121 -1046 -7612 -9060 -2484 6034 8762 6399 -2094 -7714 -8738
2663 -8738 -2589 7311 11925 7416 -1486 -10215 -11401 -4350 6485 11744 8985 1095 -8138 -10481 -5499
2678 -5499 3647 11545 10591 2139 -7962 -11174 -7011 1698 10248 10015 4776 -5454 -8958 -7734 554
2693 554 7869 8086 2313 -3977 -6977 -2632 3280 7011 3871 -3399 -9127 -9170 -1504 9243 13296 8784
2709 8784 -2663 -11630 -13897 -6482 3956 13044 13440 4457 -5832 -10568 -8922 -545 6585 7954
2723 7954 4328 -3355 -6245 -4792 1106 6449 6790 1686 -5273 -9431 -6652 1441 8247 9907 4177
2738 4177 -4018 -9625 -7794 -1657 4087 7460 4169 -206 -3681 -3806 -1120 1796 2319 244 -4027
2753 -4027 -4579 -452 4230 9416 6691 -293 -7844 -11487 -6734 264 10046 13651 8533 -2366 -11512
2768 -11512 -12205 -5561 4543 10378 7990 2442 -4815 -8416 -4561 2379 5062 5105 -961 -4060 -6497
2783 -6497 -2842 3068 6978 5488 160 -6692 -7094 -3767 2280 5908 4896 709 -6012 -5086 -1965
2798 -1965 3055 7182 4260 -1674 -7036 -6766 -1446 5771 10300 5493 -2946 -9173 -9814 -2462 5854
2813 5854 11177 6987 -1125 -7878 -8676 -4572 3601 9066 7475 755 -5962 -9897 -6204 3408 8155
2828 8155 9751 3339 -4909 -9498 -8483 -787 5292 7871 5532 -1144 -4268 -4138 -251 2674 3029
2843 3029 184 -2481 -3258 615 4389 5782 2892 -2596 -7947 -8480 -2654 4326 9777 9052 726 -5749
2859 -5749 -9531 -7319 -626 7517 7372 4741 -2658 -6378 -4597 537 5754 6416 2479 -4427 -8563
2874 -8563 -6106 314 8279 9105 5185 -4117 -9529 -9546 -3880 5211 11507 8803 2312 -5128 -7497 -4555
2890 -4555 325 4513 4493 1493 250 -1828 962 3168 3061 -555 -3767 -6744 -5057 3134 8057 8854
2906 8854 3137 -5019 -10716 -8627 -2525 8200 8786 5537 -2605 -8222 -7869 -2846 5783 8426 5243
2921 5243 -1457 -7980 -8609 -968 4607 10030 6286 -619 -5911 -8861 -4796 1549 7844 8727 2645
2936 2645 -3521 -6489 -5397 -269 5087 5843 2473 -3688 -3882 -3035 2313 4138 2589 -1495 -4362 -3603
2952 -3603 -429 2631 5448 2016 -1520 -4140 -5081 -532 3977 7500 2858 -3046 -6815 -8066 -3614
2967 -3614 4847 9309 7920 1015 -8222 -12224 -7755 1650 8764 12674 6479 -2659 -8966 -10165 -4075
2982 -4075 4754 7884 5830 639 -3593 -4047 -2500 3371 3574 1114 -960 -4562 -3717 1595 4384 4416
2998 4416 1186 -3763 -7167 -5412 1079 4657 6593 4083 -2101 -5920 -4693 806 5402 5495 1449
3013 1449 -4551 -7168 -4774 3289 8760 10279 3177 -6543 -12483 -9762 -491 8536 12458 9222 -983
3028 -983 -9615 -10388 -7281 2088 7793 8475 5595 -2103 -6316 -5523 -420 3054 3112 222 -2009 -2461 -895
3045 -895 2683 2982 1310 -2464 -4643 -3709 -229 4299 5516 2069 -3116 -6972 -3978 -380 5483 5171
3061 5171 3003 -2244 -7422 -6267 -595 4933 7243 5604 -516 -5623 -8597 -4686 2700 8775 8274
3076 8274 4070 -3911 -8809 -6744 -1862 5100 8491 4514 -717 -6243 -6623 -2767 2902 5588 3796
3091 3796 -727 -3067 -4657 -66 2134 2775 1268 -1017 -3432 -2549 626 2245 2073 -850 -3385 -2973
3107 -2973 431 2505 6802 4053 -511 -6594 -8744 -4307 4372 9419 10054 2724 -4711 -10422 -9057
3122 -9057 -1144 6672 9751 6627 -1882 -6771 -8075 -3937 3759 6378 4949 -658 -5617 -4603 -2874
3137 -2874 2823 5856 3622 -721 -6027 -6209 -2592 1443 5056 4768 986 -2828 -2724 -3018 -426 3177
3153 3177 541 -719 -886 673 3045 3831 2613 -1125 -6436 -6081 -2745 4455 9281 7888 2877 -4213
3169 -4213 -10038 -7119 -2841 4584 8091 6712 1261 -5097 -7984 -5339 10 4684 5202 2483 -2484
3184 -2484 -6946 -3103 -329 3520 5914 2399 -1926 -4185 -3441 -1476 3077 4240 2572 179 -2697
3199 -2697 -3067 -113 -104 2125 544 -1149 -1005 1707 3392 2547 1471 -2266 -6271 -4268 -236 3845
3215 3845 6713 4884 -959 -6499 -7775 -3798 2777 8424 7814 2976 -5360 -9572 -5588 66 7194
3230 7194 8613 3738 -3491 -7136 -6382 -1507 4198 7658 6252 -478 -3582 -5249 -2932 461 4100
3245 4100 4312 826 806 -300 -1947 392 -262 -1116 -2492 -1464 1900 4465 5473 3886 -1810 -5921
3261 -5921 -7789 -1396 4205 7050 6151 445 -5058 -7552 -4961 2167 6236 6779 2336 -4289 -6937
3276 -6937 -4912 780 5653 6654 4388 -1865 -6933 -6869 -2777 4371 8245 7150 1677 -4096 -6859
3291 -6859 -6272 -1074 3070 4636 3482 52 -1119 -2515 -2049 -525 -759 -2705 -1507 -385 4175 3895
3307 3895 4102 -230 -5557 -5761 -4478 1301 6314 6415 3762 -2783 -7156 -5932 -2567 4383 8621 6112
3323 6112 327 -6540 -7069 -3083 3739 7916 7393 872 -6331 -8645 -5787 750 7263 8515 3209
3338 3209 -2902 -7020 -5738 -2251 1988 5787 3480 -652 -1922 -2114 131 827 1982 675 -2423
3353 -2423 -2803 -840 3065 4179 2639 -1044 -4325 -4905 -1161 2643 5962 3984 -524 -4912 -5925
3368 -5925 -1447 3524 8460 5314 372 -6694 -7473 -4637 2121 7788 8670 3476 -3109 -8343 -8109 -1749
3384 -1749 3276 7650 6548 1578 -4924 -6994 -4248 632 5681 4115 584 -1385 -3623 -1302 965
3399 965 3261 2537 -1017 -3994 -3314 457 2796 3443 843 -1369 -4294 -4675 -961 2782 4594 905
3415 905 -2074 -4410 -2669 1474 4742 6055 1531 -3631 -6739 -5777 -75 6507 10023 7101 -1737
3430 -1737 -8506 -10395 -5656 3156 8360 10246 3051 -3679 -8200 -8314 -778 5210 6428 4816 -1974
3445 -1974 -3735 -3177 -473 3181 2456 82 -1790 -3576 -1318 1455 3190 3265 -337 -2907 -3509 -906
3461 -906 1860 3538 2386 -194 -2826 -3491 -153 3316 4820 3091 -1325 -6706 -6188 -3025 4149 8457
3477 8457 6417 750 -5661 -9142 -6564 -193 6430 8567 4721 -1160 -7106 -6234 -3915 1453 5709
3492 5709 4487 1044 -3787 -4237 -1957 381 4758 3502 187 -2688 -3738 -1697 547 2607 3065
3507 3065 -492 -1089 -1557 659 2410 1326 -29 -2822 -3665 -1900 2815 5336 5442 814 -3274 -8050
3523 -8050 -4413 84 5623 6973 5165 -1400 -7985 -8229 -4245 2888 7918 7313 1210 -3200 -5856
3538 -5856 -4243 493 5283 5120 1288 -3034 -5291 -2939 903 5708 4049 2453 -3582 -5785 -3695
3553 -3695 127 3144 3472 1652 -1373 -1698 -1038 1617 2453 833 -2245 -3357 -2332 1861 4923 5630
3569 5630 2380 -3085 -6037 -5784 -994 4479 8703 5483 717 -5452 -7986 -4538 1816 4477 6735
3584 6735 2184 -1954 -4335 -4248 -267 2857 3786 2790 -522 -3451 -2208 -987 4062 3100 3671 -434
3600 -434 -3468 -3301 -2130 915 4131 2670 1543 -1453 -2186 -795 875 530 -853 -979 -1713 -1032 2794
3617 2794 3725 3411 -474 -4187 -5363 -4118 821 4481 5485 2291 -2206 -5408 -5017 -2222 3734 6231
3633 6231 3142 43 -5155 -4329 -2018 3060 6605 4875 486 -3684 -6102 -3548 1350 6319 4566
3648 4566 1338 -3270 -5801 -1401 842 3261 2823 1787 -1732 -3227 -2029 849 2006 1406 -1844
3663 -1844 -4565 -2376 -200 4164 4997 2323 -1523 -6072 -6221 -876 2943 6064 3406 127 -4145
3678 -4145 -4934 -1110 2315 5249 3378 -1171 -4761 -4052 -794 3596 6637 5923 273 -4807 -5853 -3662
3694 -3662 1060 4836 6059 2810 -1190 -3895 -4346 -1501 1887 3227 1637 -991 -1966 -905 -112 1349
3710 1349 1212 132 -1292 -2544 -293 1571 3046 2614 -140 -3142 -5907 -2721 504 3435 4612
3725 4612 2324 -1889 -3211 -3543 326 3329 3655 1182 -2529 -3699 -3030 1015 4958 4947 3292 -1564
3741 -1564 -5450 -6133 -2588 3371 5687 4982 554 -4035 -5102 -2206 1541 4765 3605 1163 -2295
3756 -2295 -3688 -2748 2244 4551 3188 -648 -3740 -3209 -449 2554 2827 1069 -1151 -3851 -3330 -18
3772 -18 4112 4629 3998 -1410 -5285 -4196 -674 4177 4310 1761 -2237 -5261 -4996 -1627 4475 6673
3788 6673 3853 -1525 -6191 -7659 -3268 1552 4729 4146 1130 -1741 -4172 -2516 -508 2963 2992 -141
3804 -141 -1515 -1772 -679 1680 2580 1161 -498 -1641 -2869 -3165 -461 2118 2622 1629 -996 -1726 -1741
3821 -1741 -653 2592 2238 131 -1362 -3355 -1220 518 4298 3059 -116 -3903 -5493 -3517 930
3836 930 4826 4730 1659 -2655 -5311 -4852 -1854 2680 5921 5127 1165 -2881 -4513 -3113 867 3038
3852 3038 2781 453 -2441 -3097 -125 3409 4636 3050 70 -4823 -5247 -2115 2834 4528 3759 829
3868 829 -3353 -2836 -1252 834 3441 807 -2055 -2717 -3306 876 2760 4895 1887 -2286 -4224 -5242
3884 -5242 -464 2517 4924 3409 -1763 -5668 -5523 -2257 2399 4524 3721 360 -3146 -3222 -1912 819
3900 819 3043 3189 222 -2448 -1835 -1607 1789 4301 3103 1431 -1617 -3938 -2593 45 2690 3035
3916 3035 1697 633 -2441 -1928 -728 1245 380 31 -2393 -2779 -31 1847 2778 1683 -759 -3351
3932 -3351 -4082 -2632 81 4118 3649 2758 -1474 -2756 -2149 -514 3022 2971 1115 -378 -3031 -2101 -108
3949 -108 2236 4003 1659 -997 -4469 -3730 -816 2895 5111 3107 -494 -4333 -4342 -2722 1683 3765
3965 3765 3673 610 -1593 -3387 -1604 -670 1430 -20 -782 -3180 -864 317 2545 3140 81 -2964
3981 -2964 -5195 -2648 410 2472 3545 1349 -1162 -2900 -2870 380 1037 2792 328 -846 -4348 -2965
3997 -2965 712 3149 3183 2593 -2363 -4358 -3856 -1071 1484 3919 3611 -347 -1893 -2680 -3001 1018 1261
4014 1261 1682 1660 -693 -1045 -2086 168 846 1324 488 -1044 -1557 432 1156 1845 1921 -410 -2445 -2475
4032 -2475 -1647 1097 3261 2844 -702 -749 -1289 -1400 1291 2302 1688 -10 -3113 -2854 -1255 2485 3119
4049 3119 3603 221 -2591 -4431 -2636 -362 3209 4442 2423 -1737 -3702 -2814 -1303 1551 3188
4064 3188 605 -1018 -2772 -1913 1095 1630 2962 -1358 -1327 -2029 -2473 422 3034 1757 1664 -1545 -2230
4081 -2230 -1679 242 1429 856 220 -1476 -2070 -796 783 3164 1227 -1173 -2009 -3229 -576 962
4097 962 3535 4181 41 -3157 -5289 -3748 654 3369 4011 2472 -1162 -2678 -2937 -984 1359 958
4113 958 340 -1064 -1135 -1503 -188 2220 2160 1515 -1112 -2958 -1726 -629 1356 1732 1355 218 -2685
4130 -2685 -2607 -1415 295 1346 408 -421 -2012 -1123 -1273 1205 1818 57 -649 -2672 -2079 -878 2707
4147 2707 3327 2494 -1620 -3332 -3001 -764 178 3664 3069 907 -2849 -3565 -2093 703 1854 2942
4163 2942 203 -3067 -3286 -2007 800 4447 3162 1118 -1939 -3411 -2289 -374 3661 3484 1470
4178 1470 -1159 -3501 -2531 -514 1850 871 380 -1165 -2431 -229 2747 2802 1456 -1327 -2348 -1931
4194 -1931 -1691 2868 2665 2661 326 -2593 -3060 -1307 1763 2842 2957 644 -2966 -2788 -1509 -29 2544
4211 2544 3059 1367 -1543 -3437 -1761 165 2941 3917 1585 -968 -3132 -3378 -1867 958 2925 1916
4227 1916 848 152 -821 -1528 107 928 706 -9 -290 -677 679 2814 1890 -559 -2592 -2132 -420
4244 -420 -379 1931 3144 1562 53 -1845 -2875 -456 2292 3378 1623 328 -2673 -3101 407 1354
4260 1354 3868 2065 -1222 -2849 -3312 -475 835 3520 3275 1161 -2886 -3265 -2825 340 2911 3646
4276 3646 536 -1439 -2137 -2167 515 1242 626 981 -2184 -1093 145 2116 2542 352 -1308 -3092 -1853
4293 -1853 -755 1425 2758 2604 895 -2119 -2949 -648 2306 2207 1587 986 -2464 -2634 -1088 1847 3927
4310 3927 2425 -386 -2992 -4145 -1885 866 3979 3037 1043 -1907 -2440 -2937 -714 1545 2113 701
4326 701 -655 -2279 -1853 669 473 1225 155 -287 -1184 -1262 955 1655 2127 -37 -1509 -1465 -963 839
4344 839 809 1201 1246 -474 -2063 -176 336 2383 705 -373 -2404 -3480 -1480 1519 2352 2555 514
4361 514 -2032 -3639 -2722 -28 2292 3542 2139 548 -2988 -3156 -1019 187 2030 1510 -139 -293
4377 -293 -2140 -1267 -273 931 1539 309 -1918 -1604 -330 1332 1967 1555 -771 -1725 -1043 -1103 1351 1672
4395 1672 -487 248 -929 -578 1428 1870 1851 926 -1907 -3594 -1880 430 1977 3575 1873 -252
4411 -252 -3065 -4074 -2510 1728 2464 3759 -501 -2442 -1530 -1797 315 1181 2745 1209 -1320 -2092
4427 -2092 -724 437 1436 1895 1738 -1546 -884 -1522 -679 1401 1442 1188 -478 -489 -806 -70 1020 112
4445 112 1003 14 -251 -10 1039 217 1564 -838 -3007 -737 -1329 2943 2760 1121 850 -3741 -3932
4462 -3932 -2789 -516 3801 3367 1299 -2041 -2887 -2132 -1764 1561 2731 1771 179 -2911 -2429 -843
4478 -843 1497 2747 2227 1444 -2211 -2747 -1586 640 2199 2310 -886 -1514 -1987 -901 493 323 887
4495 887 -251 -1474 -1387 931 2048 1532 -153 -2600 -3145 -1526 1022 3204 2731 381 -1094 -3035
4511 -3035 -3485 -229 2193 3941 2792 467 -2377 -2486 -944 1243 4202 1626 -192 -2465 -3436 -1890
4527 -1890 635 3996 2871 662 -1743 -1910 -1752 -187 978 2301 639 386 -980 -791 345 263
4543 263 427 -415 -1289 -540 895 1627 2951 901 -1194 -2123 -2652 478 2296 3047 2740 759 -2338
4560 -2338 -3878 -1743 620 3450 3825 91 -2093 -2825 -1984 1850 2535 2550 513 -3255 -4232 -3357 -545
4577 -545 3732 3639 2150 -937 -3600 -3790 -1558 963 1380 2309 376 -1206 -1549 -346 669 2177 436
4594 436 -1495 -2039 -393 925 2726 1856 741 -3169 -3451 -774 728 3715 2780 1291 -2607 -4230
4610 -4230 -2967 72 2773 2033 644 -2046 -3234 -2233 215 2926 2899 1303 -1368 -4946 -3911 -726
4626 -726 3646 4715 2436 38 -2984 -4502 -2415 -228 3153 1722 468 -971 -1136 -1091 438 1031
4642 1031 1004 -964 -803 -766 292 1707 1084 929 59 -1298 -1065 104 1606 643 2042 -904 -2082
4659 -2082 -551 300 2345 1447 852 -192 -2590 -3852 -473 1807 4812 2716 272 -2796 -4382 -2049
4675 -2049 401 2342 3864 2004 -1829 -3408 -3796 -2485 1676 2845 2701 949 -596 -2099 -1553 1294
4691 1294 971 1799 134 -974 -1269 -879 1884 1894 1118 -634 -1957 -2248 197 1368 2038 -17 -44 -2126
4709 -2126 -1247 1471 3037 1433 -207 -2134 -3222 -2287 532 3865 2606 367 -2253 -3111 -3525 -80
4725 -80 2999 4265 3569 542 -2715 -4522 -2261 1546 2263 1136 1302 -1794 -1373 -84 -25 2759 815
4742 815 408 -1127 -1525 400 -72 1791 1184 232 -207 -1268 231 1193 255 377 -702 -1647 -472 868
4760 868 1809 2305 912 -2195 -2322 -2835 -399 3102 4049 2625 -547 -3021 -4866 -1285 1361 4110
4776 4110 2806 2344 -1986 -2522 -2135 -920 1399 3538 748 82 -2334 -3090 -82 1581 2893 1642
4792 1642 603 -2140 -1316 -249 1047 1839 1061 -464 -1081 -1179 -1067 1255 322 95 -668 -1430 -570 2022
4810 2022 2066 881 -1389 -2655 -2920 -867 1544 2912 2933 781 -237 -3290 -2140 -111 2160 3698
4826 3698 2961 383 -1926 -2570 -1167 814 3724 1072 -38 -1350 -3289 -555 488 2230 2588 157
4842 157 -1587 -1526 -1176 734 568 290 88 -1498 -56 -1113 -250 282 -579 185 -1166 -130 959 667
4860 667 1375 -1032 -1555 -2360 -1047 1014 1097 2813 1900 -1186 -2006 -2863 1 1737 2362 2598 193 -2068
4878 -2068 -1706 -1515 1739 1996 1524 162 -2549 -3060 -2394 631 1823 2174 1913 -1301 -2337 -2656 -1193
4895 -1193 928 1842 2007 -253 -1561 -527 -358 109 314 -740 -675 212 128 1980 1840 237 -483 -3004
4913 -3004 -1892 -107 2274 2388 1758 314 -1818 -3169 -970 521 3026 2298 923 -1523 -2524 -340
4929 -340 597 1252 2809 1468 -1154 -3366 -2608 617 1726 3409 1745 100 -2772 -3610 -1714 -68
4945 -68 1302 647 1016 681 -861 -156 167 180 463 -893 -1156 -725 248 1049 602 956 -579 -2169 -867
4964 -867 139 2486 1837 31 -1291 -3401 -2848 -487 1435 1409 1908 -793 -3069 -2848 192 1756 3273
4981 3273 3031 -609 -2431 -3702 -1044 501 3142 2472 703 -1151 -3675 -2434 -984 1392 2366 2065
4997 2065 10 -1468 -492 887 519 532 -17 57 -1403 -845 1068 1961 983 -1419 -2490 -2404 -562 386
5015 386 2220 1700 25 -1272 -1537 -824 1416 1637 2656 -1414 -2852 -2968 -657 1603 1603 3035 452
5032 452 -3310 -2774 -3272 782 2140 2190 2268 -1044 -2414 -2978 -1754 1078 1848 1140 318 -1851 -1794 -571
5050 -571 -151 1094 -282 -720 -1375 -1444 1319 367 2095 848 -76 -1617 -536 -954 338 1638 670
5067 670 -1607 -381 -1545 -81 2620 1065 -858 -1822 -2761 -1696 1303 3200 3114 1644 -411 -2215
5083 -2215 -2584 -812 725 4137 1848 1088 -819 -2066 -1038 299 2349 942 935 112 -1440 -1237 460
5100 460 1550 1958 -469 -356 -1200 -1115 36 544 1110 1666 302 164 -679 777 422 1333 -33 -835
5118 -835 -1 -1096 857 1908 635 -821 -1990 -2486 418 2736 2704 1797 -475 -2021 -2986 -1287 1063
5135 1063 2935 3325 1395 127 -947 -1115 -381 1223 2203 1413 74 -975 -2225 -692 547 2496
5151 2496 1711 170 -741 -2229 -941 353 1252 1559 -860 -1158 -53 -477 477 -590 -902 73 -3 1607
5169 1607 1225 829 978 -287 -1632 -1715 -122 2311 1632 1909 1605 -865 -1230 -1525 -739 1099 1521 981
5187 981 634 -988 -2350 -1696 291 2086 882 346 -1603 -689 -1229 505 1937 1369 64 -1335 -885
5204 -885 -2023 -465 1916 1358 1795 59 -281 288 -527 -602 -720 -1272 638 989 419 1710 381 337
5222 337 -716 -1813 -448 -438 629 2137 1409 -378 -1794 -2160 -1130 1312 1345 1588 599 -1462 -1875
5239 -1875 -915 145 1917 1690 -947 -1914 -1715 -1504 -425 1609 1632 312 15 -1351 -1655 -1116 -302 871
5257 871 531 1058 113 -1102 -667 -534 -108 1338 168 541 550 1192 1126 1044 -997 -2270 -1514 804 395
5276 395 1927 961 -860 -1173 -1922 -514 -185 1112 1854 -38 -628 -2107 -405 609 2087 1677 932
5293 932 -524 -1736 -1793 119 847 1802 2187 1343 -443 -1879 -1642 7 984 836 1326 -614 -1044 6
5311 6 -476 156 -746 -86 -333 -1081 1586 294 623 -162 -918 -1056 -1074 1199 248 1619 -540 -1062 -1427
5330 -1427 -848 223 1800 1925 1008 -1694 -2116 -723 498 2868 2459 953 -183 -1419 -1860 -1485 1121
5347 1121 1794 1081 1202 -210 -841 -2121 -1159 1103 1624 303 -282 -1281 -145 -533 468 602 -483
5364 -483 -18 -589 -1302 372 1435 -189 -835 -980 -631 -166 681 1253 -322 -1620 -2235 -268 1255 1310
5382 1310 1501 271 -560 -1822 -2479 -448 745 1768 1597 -814 -1960 -1820 -1372 446 2149 2503 780
5399 780 161 -1987 -1697 -610 -722 800 -186 439 -813 -1162 -265 201 1012 1291 389 -1713 -973 163
5417 163 1133 310 953 -524 -496 65 -87 499 840 -1085 79 132 -322 889 841 1391 -184 -1145 -1566
5436 -1566 -1273 899 1627 2108 1243 -1764 -2138 -2767 -503 2414 2832 2361 -612 -1539 -2096 -1332 1746 1572
5454 1572 1414 -28 -1019 -474 573 983 618 197 766 -1271 -771 -1095 404 1747 1667 594 148 -1232
5472 -1232 390 223 445 82 -920 -421 163 1072 1715 1894 70 -1195 -1001 -1507 -398 1415 1040 840
5490 840 210 -2032 -1097 -501 1249 1132 1613 -196 -1583 -2256 139 51 1390 1191 256 61 -1721 -1652
5508 -1652 259 390 1143 -112 -36 -1179 -2394 605 1301 1653 -757 -449 601 -1535 -371 -442 237
5525 237 231 -125 521 -191 9 282 157 -300 -2274 -2802 -32 1001 1444 1176 318 -214 -2365 -1431 286
5544 286 289 1840 880 -1136 -1437 -1375 1689 1099 3038 576 -270 -2258 -2970 -718 729 1214 1285 220
5562 220 -1157 -1478 -615 253 285 1553 577 -479 56 -1387 -43 184 591 224 -1021 -156 -1318 612
5580 612 1591 -1072 -1003 -914 -1304 110 2613 1183 823 -625 -1206 -1584 29 1306 895 1555 404 -1363
5598 -1363 -1589 -953 2048 837 514 -33 -1715 -1522 -1161 718 1811 1981 1072 -276 -1736 -1229 -644
5615 -644 312 707 1179 -408 -219 -457 -604 -194 1193 -206 -220 89 309 569 766 722 -904 -1690 -1134
5634 -1134 -1481 629 738 681 -640 -848 -1577 -661 283 1703 601 -497 -1474 -1890 -924 -61 2511 1721
5652 1721 195 -1520 -2202 -1851 -238 1319 1955 1891 -712 -1447 -2128 -813 336 1129 1062 930 -513 -1135
5670 -1135 676 -429 225 761 -1093 -878 96 -688 886 763 235 -361 -1746 319 63 1127 -70
5687 -70 -829 -1616 -1365 -185 502 1756 962 -97 -1466 -1416 178 821 1237 1721 487 -347 -2452 -978
5705 -978 163 1868 2196 936 -813 -667 -1469 -1788 96 922 1605 1153 -56 -1088 -1341 -15 474
5722 474 -635 -871 -1969 -1050 -296 -63 -560 45 -50 675 277 1042 -607 121 126 -569 -1737 -915 796
5741 796 2521 1683 833 -1255 -2605 -1029 -565 596 1640 2214 -470 -1684 -862 -2135 -237 2070
5757 2070 1780 385 -1575 -803 -1780 -242 1239 1648 442 234 -2094 -401 1051 648 -124 489 -675
5774 -675 -298 31 -99 1131 1924 161 310 -1641 -598 633 46 414 146 830 -243 903 1448 901
5792 901 8 160 -1751 -1888 -533 675 2119 1068 309 -1464 -2399 -396 356 1162 1805 227 -1844
5809 -1844 -929 -1561 643 537 1662 -324 -295 -1805 -1957 -19 375 696 380 178 -405 -2047 -1609 -24
5827 -24 462 800 431 -1723 -542 -355 -498 235 41 -1174 -631 -96 492 1077 915 -52 -840 -946 -908 583
5847 583 265 1132 1289 -1537 -1639 -1392 -1230 -31 1742 430 664 -575 -2566 -699 489 1191 2128
5864 2128 395 -2031 -1542 291 829 1883 1094 1587 -1255 -1868 -1396 376 1283 280 1589 -1364 855
5881 855 -1302 10 609 810 13 400 -710 641 1283 791 785 -1508 -1219 -1602 -755 1923 426 1998
5899 1998 -262 -1661 -785 -865 584 698 898 341 -915 -723 -1143 869 2071 1361 1284 -398 -2879 -1839
5917 -1839 -803 1775 2051 1655 364 -2724 -2235 -1484 -156 1727 1495 550 -786 -1048 79 337 677
5934 677 956 -62 274 -1173 -810 965 900 717 -463 -891 -190 -814 1499 1064 1302 -544 -2184 -1483
5952 -1483 -218 1026 789 771 494 -1359 -1877 -815 227 1515 466 -264 -1119 -2158 -1526 1102 974
5969 974 2762 478 -1251 -2586 -2171 286 237 1087 994 8 -995 -802 585 565 327 1174 -495 -498 -1390
5988 -1390 -337 553 -388 340 -1062 -1241 -521 -958 741 116 -955 -456 -1550 -1007 -56 1792 787
6005 787 -447 -1827 -243 -600 1762 1174 868 -1017 -2067 -1519 -1509 324 1587 2406 2192 236 -705
6022 -705 -2246 -532 142 32 1247 403 -572 -1083 -1147 23 1296 -930 435 -947 -1611 -717 28 697
6040 697 -819 173 -302 -604 76 976 309 261 460 -855 -173 530 1362 688 -877 -77 -2081 -1101 -16
6059 -16 737 2057 549 171 -2181 -1993 -1281 314 2033 1752 1652 -1448 -1863 -708 354 1816 664
6076 664 1199 91 -1238 -677 -249 46 659 308 -576 -493 -28 -196 -167 161 179 655 -476 -426 -1406 -614
6096 -614 319 -281 -247 -77 16 418 238 -175 -322 -1131 -1208 -419 260 1288 808 -48 -1203 -1578 -440 54
6116 54 1116 599 -605 -503 -367 -1133 -725 1223 708 685 -923 383 -2506 -1546 457 1118 1110 -536 -1435
6135 -1435 -1318 -1084 -450 155 312 511 184 446 -591 778 1052 -671 319 732 750 43 508 318 -1408
6154 -1408 -1586 -1169 -407 -69 1195 1808 -116 -89 -1387 -1386 219 -587 1853 69 143 -556 -1839 -590
6172 -590 1332 1184 1030 53 -1316 -778 -519 -791 975 838 37 521 -1112 -57 222 92 -235 1463
6190 1463 93 -680 -132 -361 878 -313 -146 469 177 724 447 330 -505 -848 -1894 -1369 164 764
6208 764 24 -156 -2358 -1628 -1395 -472 -46 882 1630 272 -957 -891 -414 781 2325 1009 1058 182 -689
6227 -689 660 -180 1619 1629 1544 502 -325 -485 -868 50 793 1342 -23 176 -666 -573 -924 411 27
6246 27 310 20 -581 1329 -307 -315 -224 -675 -673 -776 139 403 827 9 -564 -18 -224 1379 678 720 -543
6267 -543 -1410 -840 -1292 869 1517 1349 604 -630 -311 -1749 -495 740 1032 1638 -138 -275 -884 -1556
6285 -1556 -215 1285 638 1051 -594 1 -982 413 261 -64 76 -986 313 407 375 495 -204 -179 -227
6304 -227 -439 -907 -56 866 87 182 -353 -883 419 991 773 1201 -802 -955 -549 -344 1203 2783 1760
6323 1760 698 -2434 -1103 -1397 397 854 500 322 -258 -883 -693 81 231 1194 587 778 -428 -730
6341 -730 -724 -1360 1000 2014 1144 -348 850 -42 107 414 -96 720 -477 90 894 -126 166 847 -106
6360 -106 640 409 1015 1364 -376 -860 -1446 -1332 -27 968 2461 -305 302 -616 -1929 -1213 -632 678
6378 678 1971 1302 -662 -1030 -1031 -1375 -210 1911 1157 671 -725 -1243 -839 628 866 1078 1104 83 -272
6397 -272 -541 461 476 212 -151 -1479 597 -542 391 272 -60 -847 -395 156 894 578 881 321 -848
6416 -848 -821 -1152 307 1241 1347 -438 -597 -1398 -3318 -974 28 1191 921 782 399 -1364 -468 -62
6434 -62 799 250 289 -24 -646 -1049 -4 257 347 1963 910 -125 -546 -1158 -47 254 -16 647 1437
6453 1437 1336 260 -41 -68 -468 208 465 2010 80 815 -130 -29 -384 -203 -181 1025 1233 436 -868
6472 -868 -1253 -872 -722 752 1648 835 1445 -1357 -1439 -547 -852 139 -476 -141 304 -1105 -1136 117 1393
6491 1393 2014 1361 -123 -1123 -1844 125 237 2063 605 509 861 934 232 197 -1121 -926 425 123
6509 123 281 74 -533 18 318 -162 -1023 245 -256 279 675 -274 -739 -39 356 904 1548 -36 430
6528 430 -96 -1348 -1188 -549 488 293 284 -14 167 -22 1390 4 2403 973 -295 -682 -537 -535 -871
6547 -871 903 1117 1714 795 517 278 531 -1000 -323 -1533 -585 -145 628 872 130 94 962 -310 -629
6566 -629 139 638 519 -921 -292 -393 -576 1320 1462 655 223 -1294 -1750 -2111 -348 605 772 286 1152
6585 1152 -19 -1222 -467 728 1017 1063 887 -470 -1644 -775 -1023 551 933 1222 70 -284 486 -937
6603 -937 -218 -1112 -1065 -429 379 650 647 1228 30 -2132 -1205 -867 -339 1616 690 971 130 -868 311 1344
6623 1344 949 1662 -148 -771 -1819 -525 -611 1158 1345 1073 306 -1286 -1309 -441 365 592 68 285 -306
6642 -306 -1283 -275 597 490 2079 130 -1169 133 -999 -266 -580 135 393 -741 -244 250 -323 421
6660 421 621 315 -634 -116 -1203 -914 1245 1917 1170 67 -1607 288 349 629 902 335 -933 -90
6678 -90 -152 389 877 2759 697 -672 -1078 -1836 -1939 -1060 1787 2274 369 -173 -1268 71 755 -2
6696 -2 1607 -904 -747 -453 -949 533 -78 561 327 -241 823 -812 532 -653 -152 -657 -856 385
6714 385 806 1499 1359 29 -767 -1569 -1190 290 49 -100 38 -876 -731 -1190 731 1287 2112 1972 -413
6733 -413 -1967 -1517 -1792 34 1326 1306 72 444 -240 -1374 -113 178 -675 174 -902 -2578 -198
6750 -198 200 766 1801 1687 -101 -844 -579 -1682 -453 -66 -202 1394 -553 1040 604 -110 887 148
6768 148 -681 -448 -1021 1365 919 25 1009 -432 -1040 -787 1772 328 464 185 -414 -1036 -221 -26 2030
6787 2030 2184 1534 743 -491 -1455 -904 -1103 63 -375 761 423 605 658 -705 913 970 390 -22 -1194
6806 -1194 -1278 -1044 28 1070 -509 246 -309 467 268 -706 -631 -1577 -1216 1055 485 1097 1545 117 102
6825 102 -750 187 422 -365 1040 156 -1157 -827 -1320 -22 1654 2348 2294 56 -985 -2232 -815 -845
6843 -845 -994 700 -1082 -162 -897 -512 -376 -250 1046 -524 -739 217 -1971 -350 17 26 1140 1104 1095
6862 1095 -353 -371 -559 -501 -729 -692 -730 481 366 467 1161 -436 -1212 -659 -126 418 366 345 -780 -548
6882 -548 -1055 -325 1759 880 1072 -633 -1060 -1705 -1583 -560 464 781 1418 -467 -108 -177 -478 226 58
6901 58 306 -567 -1345 -497 883 -635 526 830 727 339 -521 -1735 -1043 -245 -1300 -227 759 -52
6919 -52 767 1095 453 573 -1319 -907 -1654 141 718 702 783 -348 270 348 1059 839 923 -1124 -530 -2791
6939 -2791 -550 -568 1824 1827 1674 1260 -948 -2143 -360 125 706 2149 87 1088 -1300 334 934
6956 934 -801 1147 -510 -37 -651 -420 -673 -1215 -355 409 863 367 152 309 -202 -1424 -449 -975 -622
6975 -622 -25 646 1413 947 445 89 -446 254 136 287 35 301 -596 -955 745 1898 2787 1126 476
6994 476 -854 -1534 -1963 -563 515 1342 626 -383 -794 -771 644 -359 -14 397 -1651 -1853 -1151 -139
7012 -139 503 595 734 466 228 75 -909 -3 -361 -8 -234 -1923 172 724 1392 395 167 -506 -141 -1455
7032 -1455 173 405 1751 -137 29 119 -648 -308 1797 647 577 -261 -790 -807 -1111 -539 2131 1743 1753
7051 1753 -655 -206 -686 718 -6 -321 -96 -1550 -420 -610 1796 940 1204 569 -248 -1143 -952 -563
7069 -563 306 110 583 454 275 1783 812 1233 850 -976 -770 -772 -252 1082 801 965 77 518 -10 -186
7089 -186 -283 793 575 -1868 -782 -1990 -841 715 935 782 887 404 -1073 -1525 -978 -942 587 -910
7107 -910 1006 381 -389 362 889 102 1599 -365 -1227 -1626 -1013 -365 145 1572 -371 523 67 593
7125 593 -192 -561 -205 -1082 -1187 -691 708 565 670 -180 -742 -1553 -567 286 90 -177 -895 -580 -1218 -182
7145 -182 101 1467 2657 1401 -775 -1512 -1783 -1609 -1222 82 1390 380 129 -251 318 100 842 817
7163 817 190 -1584 -1571 -585 976 545 1262 1961 -215 797 186 -65 690 -1205 -66 768 -697 1067
7181 1067 962 1303 353 -1028 -599 -820 -445 -305 401 847 219 107 652 -130 657 761 774 -481 -1632
7200 -1632 -2054 -1201 -277 1799 1092 1504 -290 -826 91 -749 1932 692 117 -1431 -1031 -1044 268 -84
7218 -84 1841 1099 682 -366 -1533 -1334 -888 765 375 60 -395 1678 366 1116 673 -142 -1328 -733
7236 -733 -44 -328 1142 868 279 302 369 153 350 620 -113 -82 -854 -1390 -657 956 97 1072 -137 903
7256 903 -960 -922 -446 -1353 463 1799 1315 -53 -1140 -83 383 1015 1110 -539 224 -6 339 -323
7274 -323 -654 776 841 446 270 -107 568 510 -461 -1786 153 424 120 1844 712 79 544 197 -139
7293 -139 -319 164 -214 -443 -200 -1363 -11 1397 641 1026 1370 -562 -240 -2030 -629 86 315 1047
7311 1047 1458 642 391 -274 594 -361 7 914 124 -377 -425 -562 860 1325 2339 1290 -1105 -790 -1765
7330 -1765 -704 1120 79 1185 22 481 1515 -1107 495 -537 821 -1128 -1383 27 -150 -297
7346 -297 94 157 459 818 340 2284 974 113 -649 -1400 -1179 -1036 1392 747 1166 400 -157 -309 -106
7365 -106 -907 -913 -480 1630 -1816 142 866 -592 731 811 851 -417 -967 -1677 -1714 279 540 196 -501
7384 -501 291 114 43 -498 546 -1900 -1235 89 -629 1220 254 -719 294 -558 -856 1096 1420 1097
7402 1097 -993 -655 -814 -446 -304 657 2106 573 393 -722 -1778 -872 -751 545 117 882 -190
7419 -190 -545 211 1893 142 1381 -187 588 -242 -1471 -1151 -504 166 1115 530 1592 -212 -116 -944
7437 -944 -349 -416 -1296 -806 337 -276 413 -946 486 780 -1187 250 7 -701 486 -419 -149 294
7455 294 -212 -283 1208 1436 -221 -1156 -482 -1732 -161 751 583 970 -612 -816 -713 -768 547 341 -365
7474 -365 -240 -1956 -729 -506 1502 583 346 508 -663 -286 655 -939 -757 -1275 -248 -222 185 1803
7492 1803 -141 790 -99 -2069 -1329 -1763 -582 -69 -178 347 -437 -266 290 462 415 1103 -126 -424 -1688
7511 -1688 -496 -979 -70 2109 2073 1467 603 -715 -746 -1901 522 -269 83 1098 492 -706 -1256 -5
7529 -5 1448 -153 1609 -20 -987 -513 -1320 -334 -101 1554 1194 594 1000 -1651 297 360 -771 -795 419
7548 419 1126 519 -417 140 -456 127 1205 -163 697 -349 -579 -543 -402 -317 1629 1289 2053 -125 -827
7567 -827 -202 -1677 333 1126 760 650 1427 487 -181 29 708 127 603 223 -1002 -1423 -911 1094 523
7586 523 1213 540 -186 -86 409 -326 -776 -641 -1082 -803 167 -1123 213 774 -365 -28 -896 -1203 95
7605 95 -694 616 398 545 1071 -1 644 217 566 152 -256 -1608 -33 -2109 108 1171 936 971
7623 971 3 13 -593 -717 -520 -971 -122 -913 961 527 697 191 605 1559 660 385 -198 -1504 -395
7642 -395 -1670 -1160 -554 886 1419 611 115 255 -900 -1006 -1091 -515 426 -580 631 -939 -1512 157
7660 157 817 929 382 605 -444 -2643 -1842 -77 855 1689 2792 1576 873 -1997 -1186 -1164 -1205 -469 792
7679 792 739 -876 -738 -428 34 971 910 -69 -1209 -1018 -1230 -985 -10 1437 1306 1571 852 664 -179 -1240
$$ [...]
8191B65
##END NTUPLES=NMR FID
##END=
