##TITLE=1H_SAM_20.108 red
 THFd8+Na, 108 sc, 
 2.7.2019
##JCAMPDX= 6.0         $$ Bruker NMR JCAMP-DX V2.0
##DATA TYPE= NMR FID
##DATA CLASS= NTUPLES
##ORIGIN= UXNMR, Bruker Analytische Messtechnik GmbH
##OWNER= root
$$ XWIN-NMR		Version 3.5
$$ Tue Jul  2 16:14:54 2019 Russian Standard Time (UT+4h)  she@DPX200
##.OBSERVE FREQUENCY= 200.1305
##.OBSERVE NUCLEUS= ^1H
##.DELAY= (6, 6)
##.ACQUISITION MODE= SIMULTANEOUS
##.ACQUISITION SCHEME= undefined
##.AVERAGES= 108
##.DIGITISER RES= 18
##SPECTROMETER/DATA SYSTEM= spect
##.PULSE SEQUENCE= zg30
##.SOLVENT NAME= THF
##.SHIFT REFERENCE= (INTERNAL, THF, 0, 15.7039)
##AUDIT TRAIL= $$ (NUMBER, WHEN, WHO, WHERE, WHAT)
$$ ##TITLE= Audit trail, XWIN-NMR		Version 3.5
$$ ##JCAMPDX= 5.01
$$ ##ORIGIN= Bruker BioSpin GmbH
$$ ##OWNER= she
$$ F:/spectra/data/she/nmr/H-F/1/audita.txt
$$ ##AUDIT TRAIL=  $$ (NUMBER, WHEN, WHO, WHERE, WHAT)
(   1,<2019-07-02 16:13:35.51 +0400>,<she>,<DPX200>,
      <continue with go, POWCHK disabled, PULCHK disabled
       configuration hash MD5:
       00 E9 B6 7A A2 85 ED C7 34 08 36 98 17 FE 4E 26
       data hash MD5: 16K
       C2 20 18 08 07 8E 4F A9 AE 60 B2 5E 68 82 82 EE>)
$$ ##END=
$$ 
$$ hash MD5
$$ 20 69 88 35 BF 85 1F E4 81 D6 70 FE 96 B8 74 1E
##$RELAX= 
##$RELAX= 
##$RELAX= 
##$RELAX= 
##$RELAX= 
##$RELAX= 
$$ Bruker specific parameters
$$ --------------------------
##$DU= <F:/spectra>
##$EXPNO= 1
##$NAME= <H-F>
##$PROCNO= 1
##$TYPE= <nmr>
##$USER= <she>
##$AMP= (0..31)
100 100 100 100 100 100 100 100 100 100 100 100 100 100 100 100 100 100 
100 100 100 100 100 100 100 100 100 100 100 100 100 100 
##$AQSEQ= 0
##$AQ_mod= 1
##$AUNM= <au_zg>
##$AUTOPOS= <>
##$BF1= 200.13
##$BF2= 200.13
##$BF3= 200.13
##$BF4= 200.13
##$BF5= 200.13
##$BF6= 200.13
##$BF7= 200.13
##$BF8= 200.13
##$BYTORDA= 1
##$CFDGTYP= 0
##$CFRGTYP= 5
##$CHEMSTR= <none>
##$CNST= (0..31)
1 1 145 1 1 1 1 1 1 1 1 1 1 1 1 1 1 1 1 1 1 1 1 1 1 1 1 1 1 1 1 1 
##$CPDPRG= <>
##$CPDPRG1= <>
##$CPDPRG2= <>
##$CPDPRG3= <>
##$CPDPRG4= <mlev>
##$CPDPRG5= <mlev>
##$CPDPRG6= <mlev>
##$CPDPRG7= <mlev>
##$CPDPRG8= <mlev>
##$CPDPRGB= <>
##$CPDPRGT= <>
##$D= (0..31)
0 1.2 0 0 0 0 0 0 0 0 0 0.03 0 0 0 0 0 0 0 0 0 0 0 0 0 0 0 0 0 0 0 0 
##$DATE= 1562069273
##$DBL= (0..7)
120 120 120 120 120 120 120 120 
##$DBP= (0..7)
150 150 150 150 150 150 150 150 
##$DBP07= 0
##$DBPNAM0= <>
##$DBPNAM1= <>
##$DBPNAM2= <>
##$DBPNAM3= <>
##$DBPNAM4= <>
##$DBPNAM5= <>
##$DBPNAM6= <>
##$DBPNAM7= <>
##$DBPOAL= (0..7)
0.5 0.5 0.5 0.5 0.5 0.5 0.5 0.5 
##$DBPOFFS= (0..7)
0 0 0 0 0 0 0 0 
##$DE= 6
##$DECBNUC= <off>
##$DECIM= 16
##$DECNUC= <off>
##$DECSTAT= 4
##$DIGMOD= 1
##$DIGTYP= 9
##$DL= (0..7)
0 120 120 120 120 120 120 120 
##$DP= (0..7)
150 150 150 150 150 150 150 150 
##$DP07= 0
##$DPNAME0= <>
##$DPNAME1= <>
##$DPNAME2= <>
##$DPNAME3= <>
##$DPNAME4= <>
##$DPNAME5= <>
##$DPNAME6= <>
##$DPNAME7= <>
##$DPOAL= (0..7)
0.5 0.5 0.5 0.5 0.5 0.5 0.5 0.5 
##$DPOFFS= (0..7)
0 0 0 0 0 0 0 0 
##$DQDMODE= 0
##$DR= 18
##$DS= 0
##$DSLIST= <SSSSSSSSSSSSSSS>
$$ [...]
##$SUBNAM2= <"">
##$SUBNAM3= <"">
##$SUBNAM4= <"">
##$SUBNAM5= <"">
##$SUBNAM6= <"">
##$SUBNAM7= <"">
##$SUBNAM8= <"">
##$SUBNAM9= <"">
##$SW= 40.0379777835988
##$SWIBOX= (0..15)
0 0 2 0 0 0 0 0 0 0 0 0 0 0 0 0 
##$SW_h= 8012.82051282051
##$TD= 16384
##$TD0= 1
##$TE= 0
##$TE2= 300
##$TE3= 300
##$TEG= 300
##$TL= (0..7)
0 120 120 120 120 120 120 120 
##$TP= (0..7)
150 150 150 150 150 150 150 150 
##$TP07= 0
##$TPNAME0= <>
##$TPNAME1= <>
##$TPNAME2= <>
##$TPNAME3= <>
##$TPNAME4= <>
##$TPNAME5= <>
##$TPNAME6= <>
##$TPNAME7= <>
##$TPOAL= (0..7)
0.5 0.5 0.5 0.5 0.5 0.5 0.5 0.5 
##$TPOFFS= (0..7)
0 0 0 0 0 0 0 0 
##$TUNHIN= 0
##$TUNHOUT= 0
##$TUNXOUT= 0
##$USERA1= <user>
##$USERA2= <user>
##$USERA3= <user>
##$USERA4= <user>
##$USERA5= <user>
##$V9= 5
##$VALIST= <valist>
##$VCLIST= <CCCCCCCCCCCCCCC>
##$VD= 0
##$VDLIST= <DDDDDDDDDDDDDDD>
##$VPLIST= <PPPPPPPPPPPPPPP>
##$VTLIST= <TTTTTTTTTTTTTTT>
##$WBST= 1024
##$WBSW= 4
##$XGAIN= (0..3)
0 0 0 0 
##$XL= 0
##$YL= 0
##$YMAX_a= 2748086
##$YMIN_a= -2865316
##$ZGOPTNS= <>
##$ZL1= 120
##$ZL2= 120
##$ZL3= 120
##$ZL4= 120
##$ABSF1= 10
##$ABSF2= 0
##$ABSG= 5
##$ABSL= 3
##$ALPHA= 0
##$AQORDER= 0
##$ASSFAC= 0
##$ASSFACI= 0
##$ASSFACX= 0
##$ASSWID= 0
##$AUNMP= <proc_1d>
##$AZFE= 0.1
##$AZFW= 0.1
##$BCFW= 1
##$BC_mod= 2
##$BYTORDP= 1
##$COROFFS= 0
##$CY= 11.3945322036743
##$DATMOD= 1
##$DC= 2
##$DFILT= <>
##$DTYPP= 0
##$F1P= 18.9103706918063
##$F2P= -1.10871071338519
##$FCOR= 0.5
##$FTSIZE= 0
##$FT_mod= 4
##$GAMMA= 1
##$GB= 0.15
##$INTBC= 1
##$INTSCL= 1
##$ISEN= 128
##$LB= 0.24
##$LEV0= 0
##$LPBIN= 0
##$MAXI= 10000
##$MC2= 0
##$MEAN= 0
##$ME_mod= 0
##$MI= 1.114404
##$NCOEF= 0
##$NC_proc= 0
##$NLEV= 6
##$NOISF1= 3.799351
##$NOISF2= 2.8
##$NSP= 1
##$NTH_PI= 0
##$NZP= 0
##$OFFSET= 15.70392
##$PC= 1
##$PHC0= -8592.021
##$PHC1= 13.40097
##$PH_mod= 1
##$PKNL= yes
##$PPARMOD= 0
##$PSCAL= 0
##$PSIGN= 0
##$REVERSE= no
##$SF= 200.130013532006
##$SI= 16384
##$SIGF1= 3
##$SIGF2= 2
##$SINO= 400
##$SIOLD= 16384
##$SREGLST= <1H.CDCl3>
##$SSB= 0
##$STSI= 0
##$STSR= 0
##$SW_p= 3612.71676300578
##$SYMM= 0
##$S_DEV= 0
##$TDeff= 0
##$TDoff= 0
##$TI= <>
##$TILT= no
##$TM1= 0
##$TM2= 0
##$TOPLEV= 0
##$USERP1= <user>
##$USERP2= <user>
##$USERP3= <user>
##$USERP4= <user>
##$USERP5= <user>
##$WDW= 1
##$XDIM= 8192
##$YMAX_p= 0
##$YMIN_p= 0
$$ End of Bruker specific parameters
$$ ---------------------------------
##NTUPLES= NMR FID
##VAR_NAME=  TIME,          FID/REAL,        FID/IMAG
##SYMBOL=    X,             R,               I
##VAR_TYPE=  INDEPENDENT,   DEPENDENT,       DEPENDENT
##VAR_FORM=  AFFN,          ASDF,            ASDF
##VAR_DIM=   8192,          8192,            8192
##UNITS=     SECONDS,       ARBITRARY UNITS, ARBITRARY UNITS
##FACTOR=    0.0001248,     1,               1
##FIRST=     0,             0,               0
##LAST=      1.0222368,     0,               0
##MIN=       0,             -2865316,        0
##MAX=       1.0222368,     2748086,         0
$$ Real data points
##PAGE= N=1
##DATA TABLE= (X++(R..R)), XYDATA
$$ [...]
3485a5116O520J0733J0130P446L532k069n043j1506j2223q960o315m441M176Q162
3499a4974J2533J0828R037N367M92j527q479j3294j0018p116o200p50K625R478
3513a1998J0683R726O325M875J1l143q797r470n828o091k011O43N457N029O305
3528A716P922K244K33k717m376o570o353l679j484J689M085P537N300N748K318
3543A3613J488m349o311p380p806o190k011J655L624R562Q231R082P111J337n35
3558B1121p728r420j0799r630o977j241M074P071R536J0689J0080N634O12l857
3572A9165p662p882j1974p437m554R07N398N713R909J0394N067K291j711n484
3586A2140q379q301p511l144m23L719O387Q918O627N158K251l586l661r911p561
$$ y = [-15116, -8596, 2137, 12267, 19713, 23245, 21176, 16133, 4627, -7596, -16556, -22871, -27312, -23136, -14974, -2441, 8387, 17424, 22791, 23283, 21756, 13277, -17, -10035, -17151, -23351, -24101, -21476, -11998, -1315, 8411, 14736, 19611, 19622, 16479, 7682, -1788, -7616, -13707, -15718, -15075, -9618, -4589, 1716, 9638, 11882, 12115, 9398, 5022, -1548, -7901, -11580, -13064, -11375, -7290, 247, 5547, 11295, 13613, 15101, 10752, 4441, -2939, -10745, -16935, -18946, -17291, -13667, -4105, 4126, 13208, 20319, 21656, 21121, 13393, 3973, -6826, -16456, -23433, -24674, -20600, -13529, -3993, 6696, 16776, 22410, 23022, 19165, 11503, 3621, -8353, -15790, -20344, -19437, -14039, -8326, 1583, 11977, 17044, 19335, 17624, 12140, 3761, -4540, -12051, -15195, -15618, -11899, -5512, 3406, 10033, 15191, 17442, 13856, 10195, 284, -7277]
3601g277o401l039K13L894Q365P434P420O546J524k032q357m923j0823p456m165
3616a9077j03M148O526Q778O802P058N284q86m477m962j0842p282o484m266R67
3631a8816M848O800Q367R563N127J984q21l709p454p925p700n524k157K416N781
3646i220O113O333O214M427K901m885n469q876l938o958l328K534K991P495P117
3661C451P289M581L96j305o644q500p085p019l329M47N905Q126Q857P168M828
3676A7166J919k424o647j1147r094o526m130n35O390N513J1263R010O707L948
3690B1413j909n767p914q994q928o471k326K435O984P751Q817N888N723J571m794
3705A3479m361q603q828n096j451J0L650O560P888N351M925Q93k749l536o644
$$ y = [-7277, -13678, -16717, -16504, -12610, -4245, 3189, 10609, 17155, 18679, 16647, 8290, 3367, -7456, -14912, -19077, -19180, -15032, -8506, 272, 7074, 14132, 19416, 18530, 14053, 9091, -1751, -9033, -15517, -19783, -18816, -13968, -7168, 1199, 10762, 15889, 17873, 17052, 13343, 5889, -2036, -9736, -15260, -17417, -15001, -9220, -3107, 3226, 9440, 13867, 16768, 11883, 6414, -2462, -6400, -13358, -16686, -14152, -11161, -3666, 3451, 10740, 15321, 15717, 14412, 7768, -732, -7817, -14836, -18165, -17718, -11813, -3687, 5170, 12338, 17166, 19085, 16661, 10014, -1133, -10227, -16753, -20883, -21418, -15028, -9515, 1748, 10758, 17465, 21413, 19504, 13737, 5823, -3171, -12099, -18570, -20896, -18461, -11477, -3726, 5091, 10979, 16702, 18273, 13479, 9118, 515, -8313, -13409, -14860, -14850, -11200, -4640, 3248, 8599, 13524, 14417, 11668, 8132, 1488]
3720A488r048m846k979J397J989O325Q221P287L412K702r57m569o234q984m778
3735i574n009k621K542O535P594P868O232L484l4k238o640p627q526n668j364
3750a5046j825M778O849Q287O453O924O63q5n006p313p951p757m495k560M261
3765a3823M355J0724M951P786J980J781n077o042q227p623n397k090K157N352
3779i193P412Q605N202M355m82l803o545p770o464n932j548J193N405N747P171
3794C353Q174L954K226n383m051q013q974n390l809J72N064P532P110P304O123
3809A5392J128n20m191j0082o722o703l659o01J963M530Q143N311P749K230J481
3824A5449m470o694n020r312m509o54K567L571M131P058N419N634J59l581m806
$$ y = [1488, -7560, -12406, -15385, -13988, -11999, -5674, 2547, 9834, 13246, 15948, 14991, 10422, 4188, -4796, -9574, -14583, -17204, -14662, -8127, -533, 7335, 13567, 17051, 17017, 14779, 8139, 512, -8014, -13682, -15046, -16871, -12093, -5244, 3043, 9496, 16420, 17083, 16998, 11992, 4679, -3272, -11029, -15524, -18084, -13823, -9468, 1256, 6207, 13993, 15973, 17754, 12677, 6635, -1592, -9215, -14612, -16702, -14545, -9193, -1781, 6824, 12026, 16381, 15899, 12096, 5551, -2219, -8683, -14615, -16163, -14970, -9565, -3818, 3353, 11527, 15481, 17707, 12324, 8273, 260, -8714, -14104, -17913, -17741, -12677, -5145, 1965, 9269, 15392, 16520, 16000, 11809, 1727, -4995, -11698, -15357, -15958, -13995, -9465, -1322, 3989, 11738, 13968, 15449, 10979, 4285, -735, -10047, -14556, -15210, -12643, -9072, -4941, 2117, 7536, 13170, 13329, 9748, 4942]
3839D942m451o950m220l832J512J922O538N239P771N131J333j643n314n347p596
3854d965m512n733J358J436N743P556P336L397M377n15k676o069p498p873n869
3869a4507q41J99L892P718Q487N164N851J622r52q548n372q346o330l620l15M108
3885a1790M212Q640O799M943K378p94l463o974p410p146l025j514L561L767O548
3900a268Q249N302J567J882m270p170m163p903m467k185K501M245P183Q061L873
3915A1437L084N7j886p684n664n637n865j231R05L531O643P701N068L330J432
3930A5221k266m509o064q399n135l137j77K996M678N265Q427N537J603O17m068
3945A0589p000m612p458m517k191J158L960N888P145L654M720J122j8n155n725
$$ y = [4942, 491, -6459, -10679, -14511, -12999, -11077, -4539, 700, 8471, 13602, 14935, 13292, 7978, 2631, -4965, -9477, -15210, -13852, -12416, -6673, 883, 8219, 11616, 15993, 15478, 12802, 6733, -765, -8638, -14507, -15348, -15149, -11257, -3539, 4948, 10112, 15963, 17585, 16633, 8085, 2713, -5633, -11963, -15583, -15898, -11790, -7578, 1062, 7861, 12804, 15182, 14388, 10925, 3951, -3459, -10605, -13630, -15144, -11583, -7816, -1268, 6981, 12283, 13850, 15732, 11462, 4292, 129, -7774, -12241, -14426, -11925, -7680, -497, 7564, 11437, 14521, 14578, 12692, 5008, -656, -6293, -12158, -13389, -12484, -8953, -2310, 5391, 10459, 13789, 15221, 12955, 8446, 2382, -6017, -11152, -14289, -14466, -11470, -6792, -1527, 6900, 12437, 14040, 14657, 10589, 3589, -1023, -8481, -12998, -15189, -14031, -10071, -4183, 2962, 6616, 11336, 12458, 12440, 7285, 1560]
3960A560o795m893j715O78J713L927O923P147L619M89j467n151n927o740m390
3975a1022l206Q06M093M710N967O128N529J493l84m424o386p293q005l885p2J220
3991a4731M818P985P914M679M114K35l049m724q196p265m769l033J099L518O799
4006d606O254P565M259m73J01m966n725p452l652m710n46L480M908P640L397N350
4022A0824J111r61l736m375n799n280l409O14K187K871O215N647M052K021J391
4037A3373l868n590n623m887m311j249J214M433M927O025M933N253j441j095o811
4052E283l756p062o115k576N52K956M925O735P595N215J888k049k077m485q388
4067a359o597m927n80J164L918P518N463N781L994l31j679m591o309o643l604
$$ y = [1560, -5235, -10128, -11843, -11165, -9452, -5525, 1398, 8545, 12164, 12653, 11186, 6035, 108, -6632, -11022, -14228, -13422, -9329, -4619, 1348, 7476, 13005, 14498, 14114, 9690, 3304, -3989, -11994, -15879, -15951, -14731, -9913, -1928, 5986, 10665, 14779, 15014, 11965, 7241, -955, -8220, -12989, -16022, -14923, -11405, -4606, 1648, 9213, 13472, 12999, 13100, 8134, 2409, -5043, -8695, -13405, -13951, -10471, -5563, 2077, 5474, 10824, 11935, 10974, 7238, 2863, -2936, -8216, -11625, -11011, -8824, -5953, 262, 5909, 9961, 11982, 13373, 9505, 3915, -1708, -6595, -10906, -12155, -10941, -6508, -1581, 4444, 9377, 14630, 13189, 12094, 5283, 1527, -5535, -11650, -14226, -13674, -10718, -5793, 942, 8537, 13752, 15640, 13591, 11514, 7029, -1359, -7956, -12883, -13463, -12299, -8381, -863, 4600, 10381, 14375, 14044, 12365, 7774, 1465, -5178, -8782]
4082h782l638J319M015L694O265M919L212L42j778l841m978p913k034k896J831
4097a0263M051M456M891N541K184N85o46o282n858n932l770l026m6L003O355O337
4113A580P451L285K850k884l607o439p445n265k690k079K624L786N527O964N146
4128H804M718K47j152n117m915o544m720l400o15K260K430O248O516L112J451
4143I323R31k019m726m977m466k533q92J099K131M712M962L839J118J54l390n135
4159A31j586n712l856O31j8N360M603N515L894J756l2j742n262n774o309m074
4175a2475j569J497K652P210O515N646L312K327j149m946p930o374n053l879Q03
4190a3413J952N338N576O456K921N848q29k232n250o973o921j906l203J634L187
$$ y = [-8782, -12420, -11101, -7086, -3392, 2873, 7792, 11004, 11346, 9568, 5727, 749, -7164, -9198, -12094, -10263, -6212, -1756, 3135, 8676, 10860, 11445, 10799, 4517, -1341, -7273, -11043, -14069, -14115, -11112, -4757, 1580, 9031, 12316, 15166, 12282, 8675, 2236, -5209, -10474, -13164, -15243, -12619, -8833, -3306, 3658, 8804, 13522, 13769, 12617, 7500, 2585, -3959, -8679, -12079, -12694, -10434, -8004, -1756, 4760, 7872, 9323, 10254, 8235, 3509, -1468, -5934, -8467, -9359, -8260, -6129, -1417, 3545, 7384, 8502, 8656, 5266, 131, -1455, -7167, -11023, -10392, -10410, -5050, -447, 5068, 8962, 10718, 10686, 8944, 3682, -2092, -8401, -12475, -14044, -12547, -9895, -2685, 3830, 9476, 12788, 15115, 13966, 9020, 1090, -5284, -10337, -14216, -13413, -11461, -6123, -547, 5909, 8830, 14678, 13849, 11617, 6367, -606, -7527, -9433, -12636, -11002, -7815]
4205g815L743O973M982L020M72k722l008m344n534m433r36J729K002N159L048
4220B336M356J684J511k305l708l953n084l746l062L097K129N449N338L731L577
4235A1350O46j720m238n706m478o523q55j533J803N775M585P040M660K770l97
4250A3179l591l932o066n886l275k570l56J337N914N703M855L862L188l0m134
4265H198l293o110m612m115n34P04K809M757N180M415K095q41l562j096o770k345
4281e120m148r87L454K845M310M628K328K145m18l294m286m324r036m81m27K095
4297a0716L988N990M710O018K039J778l894n253o422o079m647j629J70K946O707
4312d294O279N341M464K285j475l256n832m642p287k563j928L165R71O767O691
$$ y = [-7815, -4072, 2901, 7883, 10903, 11375, 8653, 5645, 1301, -4233, -8666, -9602, -7873, -5871, -712, 2336, 6692, 8376, 9887, 7582, 3874, -79, -5163, -8909, -11971, -8874, -6745, -1296, 4042, 7773, 11350, 11996, 10276, 6038, 332, -4146, -10669, -11524, -13057, -11254, -5479, -894, 6146, 10806, 13576, 13179, 9588, 5656, -410, -6296, -9571, -12141, -12497, -11160, -5246, 457, 5312, 9174, 12362, 12332, 8198, 4905, -1205, -5817, -9932, -10466, -9762, -6953, -2196, 2984, 7399, 9494, 8653, 5091, 3995, -2775, -5120, -9268, -10255, -6801, -3956, 354, 4982, 7310, 9455, 9037, 5743, 1457, -2867, -11903, -12384, -12811, -10716, -6728, -738, 3972, 9990, 12029, 13807, 9913, 4660, -1762, -7841, -12488, -14117, -13947, -11001, -4294, 1985, 7326, 11790, 14075, 12600, 9344, 3512, -1130, -8417, -10980, -12908, -9743, -8772, -2005, 4686]
4327D686K476K672j449J23l536m237n834l027J025k368J977M649M112L435J454
4342F158J561j480k955m762m286j468p92J376K046M656L696L791J880R04j548
4357H777m095n140n025l326j523J372k89O863M278N659L750K809j754l939l953
4372D464o059n851n828n20Q00M899M838O211O006M130K252l407l565n332n656
4387b618n307j405j451j18M592M699O219M054J474O76k481m262m344n334j367
4402f973k168L098K151L692M031J351L155p55k039m620n652k301k652J363K468
4417e851K299N643L778L664J826k364l123l565n611m608l560k46J090L692O088
4432h48M168M801K836P50j778k879o563m772n033k730r80L071L483M934L846O044
$$ y = [4686, 7162, 9834, 8385, 8508, 4972, 735, -5099, -8126, -7101, -9469, -7492, -2843, 1269, 4704, 6158, 7719, 6239, 3284, -1478, -5764, -7232, -8024, -6648, -4602, 54, 3750, 7541, 9421, 10325, 8777, 4682, -458, -5483, -8809, -10332, -8960, -9249, -2386, 1892, 7551, 11301, 14110, 12356, 8417, 4464, -1595, -7446, -13274, -13794, -12994, -8095, -3257, 2954, 8960, 13090, 15342, 11935, 8370, 3038, -2618, -7925, -9330, -10781, -10899, -6307, -1608, 4611, 8665, 10139, 10815, 8334, 4072, -272, -5606, -6973, -9141, -6043, -3892, -200, 3831, 5182, 8337, 7582, 5543, 923, -4729, -7030, -9682, -8319, -5851, -3552, 2091, 5869, 9533, 11359, 8995, 5872, 2307, -3304, -7912, -11472, -11718, -10628, -6936, -848, 3320, 8121, 10957, 11707, 9929, 7050, 487, -4285, -9318, -12048, -13028, -9957, -6474, -1540, 2306, 8350]
4448H350J571M51j959m156l202m347m034k765J138K294L517K470N754K811p50
4463G143n34j045n292l225l685k06q99J264M270L665L344K735j293j302j175m936
4479a171l477l820j791J250L625K285M664L932M113K420k556l221n242l696n964
4494h649k774j298K377M518N205N480L823L507o23k431l628n190m891n790p80
4509a1144k03K476M830M560L948N192R09k258r32n269l786l739k201O74m7L774
4525c216M100K006L334J533J35k746k881k957m407j610K21O49M104L343M089K105
4541G802L38n62k729l117l859l910k857J60K316J635M923L197M878P54J235q42
4557I362l157m751m574n052k745J65K811M370M653L579L601K877J59l224l883
$$ y = [8350, 9921, 10372, 8413, 4257, 1055, -3292, -7326, -10091, -8953, -6659, -3142, -672, 5082, 7893, 7143, 6609, 5564, 272, -2953, -6638, -6844, -7743, -6479, -2209, 1456, 4800, 7535, 6242, 4940, 3765, -1171, -4648, -8468, -10259, -9009, -5384, -3099, 1565, 5497, 9610, 12030, 9474, 6253, 1011, -2685, -8649, -11423, -12721, -10344, -5826, -621, 4859, 8682, 12189, 11566, 9135, 5507, 317, -4574, -10364, -11144, -11347, -8871, -4041, 519, 4467, 9659, 10568, 8310, 7378, 2109, -1677, -5416, -7617, -6943, -6990, -3216, 884, 2890, 6224, 7757, 7892, 5146, 2265, -692, -5099, -6709, -6488, -5839, -1735, 1608, 5697, 7802, 8140, 7578, 4849, 1732, -2127, -6037, -8894, -8734, -6418, -4783, 140, 3337, 8215, 8969, 10204, 9362, 6205, 1454, -3120, -8172, -10917, -10752, -7941, -3571, 1082, 4661, 8262, 11139, 11298, 8074, 4191]
4572D191n013l916k979k501O53K981L011N454L523J486K130k533j852m119m768
4587d252m357L57N4K335K703M617K593K950L82j188l080m211m174k513j4m00M017
4604d181J221O681J790L831j255j795k152n177l310l279j383j044L280L165M932
4619A324L141O168j760L99k477n704l822m858k167m09J083K401M559M062M551
4634F491J631j23l8k402l140o325j861k183j069L091K023L610L314L115O98L8
4650F870k171k390m441j467l994K219k01K389M028L744J661J632n41l563l841
4665f6k700m932R7j223J953L062L315M960L406J482K12j846l666m463n758k165
4681h332j145n1L762K212N724L088K959J928n33m836k954n437l363j128j407J809
$$ y = [4191, -822, -4738, -7717, -10218, -9565, -6584, -3573, 1881, 5404, 6890, 9020, 6487, 4635, 516, -4252, -8609, -8252, -8198, -5863, -3160, 1457, 4050, 7000, 7382, 6194, 3114, -1097, -5271, -7784, -7798, -8198, -4181, -2960, 3721, 5511, 9342, 8087, 6292, 4140, -1037, -4347, -7626, -9009, -10053, -6773, -3608, 1324, 4465, 10633, 8873, 9272, 6795, 1091, -2731, -7589, -9756, -10165, -9082, -6681, -2122, 1940, 6491, 8122, 7999, 7961, 5559, 2419, -3906, -5767, -7950, -9019, -5928, -3905, -295, 3019, 6134, 6832, 6870, 4699, 2309, -2132, -3599, -7593, -5374, -5575, -3186, 842, 4586, 6247, 7879, 7338, 3775, -66, -2766, -7698, -7601, -8824, -6871, -3809, -494, 4466, 7872, 9354, 9566, 7720, 4054, -409, -6167, -8332, -9477, -9528, -5766, -3554, 2170, 5258, 8217, 10145, 9612, 4776, 1822, -3615, -6978, -8106, -9513, -7704]
4697g704L621M870K987L045J361J952m555k894m419k896k403n65J79M124L800
4712E03L572O69M113m26k311m216m140l67m325L55R46L014K796M116J964J629
4728G892L88j687j953m196m534k329k59n93J544M419L248K687K905J09m62k638
4744D541l175l016m326k007o75J251L983J799L403L847J143J901k305l428k966
4759c0m578k684j172N30K522K154N109L028J364O98p01l912o25n779q70k354K3
4776g277J532L007L453L097K072J258P54m152k886l367k365k788J5K96N517O77
4792a157N777R43L364l094k306k534m265j417m465L5K508J981K737M888M280P49
4808H024M24j779k074m363m595l020j371M89K399L315K631L869K652O76J75k724
$$ y = [-7704, -4083, 787, 3774, 6819, 8180, 10132, 5577, 2683, -1736, -4632, -7035, -7600, -7421, -3297, 503, 4075, 4744, 8857, 8431, 6120, 1904, -2236, -2603, -6928, -6573, -5627, -2613, 183, 4299, 6263, 7892, 8280, 6593, 4640, 444, -4090, -6419, -6678, -7271, -5727, -1308, 1940, 4627, 7532, 7641, 7179, 4541, 1366, -1650, -5976, -7983, -8658, -7407, -3424, -1625, 1778, 5625, 6768, 8669, 6364, 2936, -30, -4608, -7292, -8464, -7934, -5412, -3258, 1851, 4879, 6243, 6941, 6240, 2328, 1703, -4076, -4946, -7300, -7277, -5745, -2738, 715, 3812, 5884, 7142, 7896, 3744, 858, -2509, -4874, -7662, -7647, -7351, -1834, -1157, 4620, 5563, 8927, 5833, 3527, 993, -3272, -4689, -9154, -9119, -6611, -4630, -1893, 2995, 7275, 8024, 8448, 6669, 4595, 232, -4363, -7383, -8754, -8265, -5866, -2551, 80, 3949, 6601, 7277, 7452, 4728]
4824D728k483m869j808k444J307J8J936L572L713K169m38K163k593m585j204l153
4840c971k648j8P66K357K366M242K794R74N12j583k932k221n109j997j85J805
4856d848M79K732L289K826K377M79m26k136k990m254l457j747K53J070L230L758
4872F35L710J966J868j011j242k992m047k550j416l035R09J789L941L123J195
4887B843M823o10q81l189j622l747m753q49J371P45M752K055L805K190n7l74m001
4904B501l032j627m458m89r83K770K985L016M438N9L196l172o50n408k289k644
4920e787j000j128K296L377K492K505K808K39L25p36l049l930k313k024j973N89
4936g309L300K578K728L237J526J942q71k287l697m160k370j639K8Q24K898M534
$$ y = [4728, 2245, -2624, -4432, -6876, -5569, -5551, -3615, -43, 3670, 5839, 5401, 7564, 4971, 386, -818, -3971, -6619, -6637, -5871, -3514, -1148, 3094, 5888, 6862, 7374, 5791, 2859, 638, -4471, -6468, -6653, -4848, -4369, -1637, 1652, 4478, 6855, 7334, 6908, 4772, 1782, -2472, -5929, -7676, -7423, -6353, -3123, 635, 4345, 6311, 8179, 7168, 5926, 2934, -1113, -3663, -5079, -8114, -7205, -5416, -1475, 1648, 2843, 7666, 7056, 6175, 2986, 1364, -2383, -7136, -7985, -6614, -5869, -1117, 938, 4743, 6933, 6876, 6502, 2501, -531, -2158, -6616, -7105, -8088, -5318, -2333, 683, 5121, 5180, 8376, 5204, 4554, -854, -3143, -5787, -6787, -7915, -5619, -2242, 250, 2755, 5563, 5802, 6127, 5391, 2342, -1588, -3901, -5925, -7898, -7309, -4009, -1431, 1297, 4534, 6060, 8002, 7131, 4844, 1147, -3013, -5383, -7022, -6994, -6170, -3272, 1262]
4952A262J229K396N73m24j807k097k764k619k65j419N07K582J005L454J322K898
4968E833k84ll762k563m282L5j54j68M15K212L721N013Q17J062o06m884j438l853
4986b889k355k490J218J732J717K856M452L084O93p70j527m868j032n059k342
5001g580K0J471K675K015N102L063J317j167j591k454n076j065j579k996J037
5016f808K841L172K191L717M32q9j281m62m722k275j931l70o36K100L597K132
5032A608K734J907k48j345j163l240k879j600j968J08J081K278K279L893K188
5047E633O93L98j968j596l927k862j892j160J34L136J776L500L517J592o46j50
5063F178j780m305k813k180j066k291K729L394K318L064J038J731r78n46j357
$$ y = [1262, 2491, 4887, 5460, 5036, 3229, 1132, -1632, -4251, -4516, -5935, -5428, -2846, -1841, 1613, 2935, 5833, 5549, 5546, 1784, -779, -5061, -5026, -5180, -5348, -4933, -2721, 1000, 6013, 6830, 7892, 7286, 2402, 964, -2889, -5244, -7734, -6516, -4784, -3067, -211, 4241, 7325, 8018, 7248, 5721, 853, -179, -5238, -7580, -7560, -6089, -3414, -1399, 3703, 6766, 8083, 6916, 5325, 2871, -2205, -3270, -4849, -7845, -6808, -3967, -795, 1396, 5113, 5545, 5456, 4175, 3713, -1009, -3284, -5215, -5585, -6221, -4121, -524, 1608, 4342, 6249, 6001, 4656, 3493, 253, -2626, -4226, -6194, -6086, -5005, -2727, -448, 3445, 5633, 6326, 6724, 4756, 3160, -767, -3629, -5521, -6681, -6547, -3411, -1635, 1865, 5382, 6974, 6328, 6178, 4398, 93, -2720, -4900, -5966, -8257, -5528, -2134, 184, 3248, 4286, 6017, 5039, 4493, 3136]
5078C136l648m381q5k020P17K985L141K699J516K429j536o05l635k437l065o60
5094e449J22r27L396J642L991J013R55K568k765k766k400l952j594n63r24J957
5110e696M938L627J237K211P97j081k392j781m963k012k723J748Q77J558N001
5125A346K665M04K139j39k092r28l575m661n39j193R96L156N71L738L079K23N31
5142E721k49l348j482k371k386j279L58L482J000K660J784R45m75q10k81k828
5158D41r54l701n83j01J049K973J139K885K330l81M26k223k820j570l263j630
5174e983o12J280J563K765L371K143K487j057o85k782j709m285k271l79j049J497
5190e706L622K839L302K018O23j71l502j802k541k801j319J553k19Q76L134K607
$$ y = [3136, -512, -4893, -4978, -6998, -6281, -3296, -155, 2544, 4060, 6489, 4953, 4348, 713, -1724, -4789, -5449, -5327, -6254, -2858, -1216, 2775, 3788, 4743, 7311, 4546, 1780, -620, -4572, -6166, -6729, -7653, -5696, -758, 2869, 4106, 6317, 7114, 6033, 3641, 1860, -3103, -5115, -7838, -6090, -5213, -3655, 1346, 4011, 4415, 6554, 6415, 4323, 3395, -180, -4841, -5380, -6573, -5577, -2421, -1850, 1888, 4967, 5190, 5721, 5472, 2124, 642, -1729, -4115, -5394, -5036, -1554, -554, 2106, 3890, 4835, 4360, 3550, 3269, 441, -513, -4214, -4797, -4898, -3849, -876, 263, 3148, 5478, 5097, 5523, 3300, 480, -1090, -4353, -5983, -6595, -5315, -3752, -987, 2384, 4527, 7014, 5957, 5272, 2490, 781, -3504, -5775, -6154, -7203, -5706, -2084, 755, 4057, 6075, 6698, 6527, 3025, 1223, -1318, -4119, -5438, -3885, -4104, -3228, -94, 2513]
5206B513K554n19O1j746m248J7k132j393J02J642J485Q24K763K250L9K95p93k927
5224G87j075l801j871Q61m86M050J725J569L593o0k48j842l70m452j749j993j740
5241g102Q28K162K060K898M316M23R09j908k039q88k921l128k21j830J453P34
5257d254L127L197Q57J771N57j756j302k764j601j969k087K589n23J327M207J453
5273B829K319j162Q29l066j512j602k362k063N09K319K250j41M335J343j69K18
5289D874k606l234j447j957j127K205p09K391K034K842K131K42L81q05l480j570
5305A65n189R01k003R17J797J519L944L623l47N62m76m033n16l716o53j636M92
5322d649K11L215K053J446K105M81J3k511k106j546k536o7R31L17N82K300M273
$$ y = [2513, 5067, 4548, 4609, 2863, -1385, -1368, -3500, -4893, -4791, -3149, -1664, -840, 1923, 4173, 4212, 4507, 3714, 787, -288, -4089, -5960, -5099, -5585, -1535, 190, 1759, 5352, 5292, 5044, 3202, 2832, -1620, -3369, -5362, -7102, -6274, -4112, -2052, 846, 5162, 5585, 6494, 4586, 2547, 1659, -1262, -4390, -4611, -6441, -4988, -4254, -1127, 2070, 2927, 4698, 5255, 3499, 2197, -567, -2168, -4137, -6224, -3635, -4158, -2831, 1376, 2829, 5148, 3986, 4815, 1749, 237, -1365, -3727, -5790, -5281, -2962, -712, -853, 3482, 4825, 4656, 4874, 2268, -966, -2413, -4370, -5497, -3292, -4001, -1610, 424, 3266, 5397, 5639, 6020, 5215, 1735, 165, -5024, -4123, -6126, -5209, -3412, -1893, 2051, 5674, 5327, 5889, 5413, 1380, 864, -2852, -3505, -5141, -4649, -4438, -1223, 830, 2276, 4381, 4862, 4875, 2364, 258, -1288, -3824, -3891, -2960, -2643, -2061, 239, 4512]
5339D512k159J782P86k191j509j392k289q18q22J287J013J881L729q3J524K9k317
5356B963n35j397l941j170j905J970n62L480K653J367J638J328M6k158l302l016
5372b541j164j500p18N01K949K027J634L609M53k7j028k276j735l645j0j703J66
5389e008K416Q82K697J983J127n72j442k401J150k907r97j526N84Q45L941k38
5405E34K187J794j665n6o18k942j357k211j262J353Q61L106K598Q72J655n32M25
5422D742k870j583j378l322k30j388K752J341K558K499R75Q60r94m58j533k673
5438g02l498m11m75P01o46M001Q73K241J748J668j297q04k446k491j253j022J153
5455b660j974L312O40J972J044K602K80j181l349M62m085L94o31M33J526J440
$$ y = [4512, 2353, 4135, 4921, 2730, 1221, -171, -2460, -3278, -4100, -2813, -1800, 81, 3810, 3727, 5251, 5280, 2963, 2428, 1031, -2910, -4080, -5985, -4015, -4577, -1097, 1556, 2923, 4561, 5889, 5935, 3777, 475, -2541, -3705, -5205, -5923, -5422, -2473, -446, 1188, 4797, 5250, 5223, 4195, 1919, 184, -3461, -3471, -5174, -5008, -2592, -1710, 987, 2970, 4097, 3525, 2083, -318, 832, -2075, -3072, -4598, -4014, -3169, 772, 534, 2721, 4515, 2850, 2794, 2176, -766, -2123, -4334, -5596, -4243, -3382, -276, 2322, 3194, 4849, 4317, 4742, 1872, 289, -1089, -4411, -4641, -6029, -3277, -1936, 622, 3121, 4096, 4956, 3962, 3504, 1971, -702, -4200, -4611, -5086, -4385, -5031, -1030, -157, 2084, 3832, 5500, 4203, 3399, 953, -1538, -2791, -3813, -2660, -4634, -1322, -682, 1290, 2334, 4936, 5216, 4035, 686, 1148, -2937, -2543, -3174, -2741, -1215, 225]
5471B25J858J149K455m65k519k140o19l387m47J94J201k64K416K159K674k80L26
5488D536R5l124k733j579j992L51k002K803J278R19N235K13J051l10p54l704j062
5505g79k879j02k410J995R16L140K842J679O86j73k109o05k497j813j523o56j70
5522d458K038J647J778K473O68O42k207M01m567l58j781l24J546J7K644K20L512
5539C891J467l16j378j970k240j782p53o13k238K746Q51K552J742J851L91J51
5555D352j065k807j476j247k654O20k66J358J326K299K405K007L59q93k663o60
5571I95j621m194j42J93K537p45K893J702K087p33J667k601m09k552k112O21j226
5588c640J265j16K442J217J165K089p02j774o60k742k119j039J12n67L505K573
$$ y = [225, 2083, 3232, 5687, 5222, 2703, 563, -56, -3443, -3890, -3696, -2495, -2759, -343, 1816, 4490, 4210, 4536, 4631, 1507, -1226, -2805, -4797, -4446, -6448, -3645, -2367, -1448, 3787, 4000, 5051, 4741, 3987, 283, -779, -3658, -3760, -6170, -4175, -3259, -119, 2723, 4402, 5088, 4915, 2806, 2201, -296, -2109, -3632, -4288, -4458, -2420, -773, 1005, 3478, 4146, 4788, 2581, 2982, -1585, -1943, -3724, -4048, -2502, -2485, 159, 379, 3891, 5358, 5042, 3664, 1694, -546, -2328, -3081, -3694, -5932, -3186, -2335, 217, 1959, 3810, 4201, 4352, 3287, 480, -996, -2243, -4897, -4277, -4543, -3185, -1859, 440, 2845, 4852, 5211, 4318, 1655, 995, -626, -4820, -4962, -4769, -2232, -2977, -84, 1618, 3705, 2972, 4639, 2038, 1629, -923, -3035, -2414, -3640, -2375, -2491, -49, 1168, 2333, 4422, 3720, 1946, 1286, -1456, -3575, -4614, -4502, -5069, -1564, 1009]
5604A009O86J016k23K348k252j703j660j690k295PP07J070J936L307j2K457p71
5621C937o00p12k543k207q06l63j538J511K192N4L371K319L54n90j641j899j819
5638i80N0j537r23O04J856L94J371K437N2j665K073k028j695j361j316k87J236
5655a719J113n58J504K680K64N27j644j353p90j591j396r67r69L255K28K588J005
5672B177R42K542k390j980o74j057l202j58j43k73K051J356K797R73J160J766
5688E887k227j602o25l634j120k51l21L38J869L117J275K249N3q88j722o91l026
5705a319k335K60l73L22Q03L686j40J825J479j747L06l007k915R59j509M23n56
5722c838J096K973L035J87J193j775J52k572k048Q21l284R16J312j141K609J743
$$ y = [1009, 1695, 2711, 2488, 4836, 2584, 881, -779, -2469, -4764, -4757, -4050, -2980, -1044, 2263, 2251, 4708, 3937, 3337, 2625, 82, -2125, -2931, -3294, -4832, -3321, -1129, -1075, 2296, 4615, 4969, 4379, 2738, 839, -980, -930, -2467, -3390, -2786, -930, -536, 835, 3272, 3324, 1659, 3732, 1704, 9, -1352, -2668, -2955, -1719, -606, -1164, 340, 3020, 3284, 3811, 2167, 814, 24, -1567, -2963, -3930, -4899, -1644, -1416, 1172, 2177, 3119, 5661, 3271, 1291, 617, -440, -3642, -3800, -3943, -4216, -2165, -809, 1988, 2961, 4121, 5887, 3660, 2058, 1433, -2201, -3321, -3572, -3893, -3555, -1686, 1431, 2706, 4955, 5008, 4120, 2398, 1707, -1319, -3654, -3394, -3767, -3445, -2642, 1044, 904, 2729, 4208, 2461, 2767, -240, -3155, -2196, -3705, -3282, -3838, -2742, 231, 3266, 3453, 4646, 2871, 3023, 451, -1597, -776, -4060, -3144, -1832, -2973, -364, 1379]
5738A379J548J769k86j782o48j172k783k375R26J71M93L661j149K384J27J692
5754C955j857j336J150m033J32j988J323j002K666J18J669K135j90L81k12k085
5770H26p0j350k667p45J31J014J260L079p25L515o72j970j022K57k608j058j102
5787c907r17K736O98K500j50K898O39j074j989r59k68k019j085k73J435j83P66
5804a152L509J266J012k56k380R16l738j877j544Q77N64J191J022J781K309k17
5820C283j396J02n32j907j605p01j28l76J261J248K031L06J230L41j214n54j87
5837A202k150j696M4l5L12J085N23L055m03M19K58l28j088q52k381p61r11K69
5855c438K848N50P45K610P56r92p33k262m01j357p75j324R78L18J408J985Q11
$$ y = [1379, 2927, 4696, 4410, 2628, 1980, 808, -1975, -4350, -3424, -3253, -2760, 901, -248, 2136, 2263, 3955, 2098, 762, 1912, -2121, -1989, -3977, -2654, -3656, -990, -872, 797, 2932, 2742, 3123, 2911, 826, 756, -594, -3261, -4006, -3875, -2861, -1601, 1478, 753, 4268, 3596, 1626, 604, 861, -1747, -2805, -3907, -4824, -2088, -1390, 1110, 960, 3858, 4497, 3423, 1434, 475, 207, -1812, -2897, -3170, -1735, -1918, -1152, 2357, 3623, 4635, 4379, 1999, 2915, -823, -2700, -4244, -3367, -2803, -1612, -590, 1191, 3500, 3283, 1887, 1989, 1457, -450, -2055, -2756, -2884, -3260, -1999, -751, 1280, 1586, 2816, 3157, 1943, 1389, 1202, -948, -2644, -2600, -2635, -2323, -1238, -715, 2340, 1937, 2356, 2614, 2286, 1198, 346, -2035, -2796, -3707, -3438, -590, -40, 705, 3315, 4071, 3079, 2346, 84, -317, -1674, -2449, -3773, -2795, -2477, -1069, 916, 1727]
5872A727K079O99j600p18j999k168M11k009j067K43L017K400o71J794k47l68Q40
5889B363l085K62j354p92r3R31J9J437j83K279K273j469p48n16k463L10k128r19
5907c876J540j73K911J342j378J289K247j358j636j241L25k988K74q14J709K84
5923a543J097J449J318O90M9n84l040q97j572O5p11Q80J197J989J988P56l63K94
5941C062o67k220j615l13o89M41J80J321k97R89J726K414q94j811R53j372o49
5958E59k570j039k7J700l6L285O25K72K60j435O25j406n50k256j326r08L171j43
5976a199K05K682j182L299r58p57j027K7k755k80n93J865o21k49J919K148m04
5993B120L48j729j96O44k347m30j106q18K166O4J015K530r61R55J51p76j638l10
$$ y = [1727, 3806, 4505, 2905, 2187, 188, -1980, -1569, -3578, -4645, -4402, -1385, 1015, 344, 2138, 1891, 1523, 2363, -722, -460, -1814, -2606, -2699, -1768, -1749, -312, -495, 1784, 4057, 2588, 1840, 1324, -1139, -829, -2957, -3876, -2336, -2509, 402, 1744, 366, 1655, 3902, 2544, 908, -333, -8, -2996, -2722, -3536, -1827, -1543, -446, 1003, 2321, 3011, 3060, 2476, -564, -1461, -3033, -2968, -3679, -2799, -1602, 387, 2375, 3131, 2768, 3062, 2395, 175, -1440, -1753, -2442, -2001, -1821, -500, -797, 192, 1918, 4332, 3438, 1627, 2580, 1208, 559, -2011, -3050, -3077, -1377, -1413, 1872, 2497, 2769, 3029, 1594, 2219, 813, 263, -1993, -3319, -4227, -1056, -1199, -994, 1688, 506, 3805, 2847, 2090, 1063, 1090, -1665, -1945, -2538, -673, -1294, -1543, 376, 2524, 2120, 2468, 739, 543, 1187, -1160, -1590, -2696, -3514, -1348, -1284, -269, 2261, 1300, 2255, 2406, 1630, -8, -318]
6011c18j398k44j247M41J336L19K290L69K256l08j418l460j80J47n38j050j699
6028d702M924J457O29j312J497J134k346N2r97q35k925j41K257n57L065P22j443
6045D79J643N91R04k884j383L3l164J289j240K312K08O37K314o59P13R27r42K92
6063B070k486o5j890j29M45k65K108J43J930J587j03M58k315k133J086j836q62
6080b257j53R51K41K137M22J510q70q33J228l768P2j65q11O59n23J708J602R49
6098B099k20J590o5K52l251j232l04k024r90J332K469J46J506K29J531j72j273
6115A623J67j97k735l30o44j932J816J408J108K974j040R36J67j085j444l280
6131b488Q04m8O42k644J770J674J531J669n72L84r01j506k097P35k082Q3J905
$$ y = [-318, -1716, -1960, -3207, -2766, -1430, -1111, 1179, 1548, 3804, 3496, 2078, -1382, -1562, -1415, -1953, -3003, -4702, 222, 1679, 2308, 996, 2493, 3627, 1281, 1333, 336, -499, -3424, -3565, -1308, -1865, 1200, 1922, 479, 2122, 2713, 3617, 733, -650, -617, -3781, -2492, -3732, -1420, -1212, -575, 1739, 1080, 1793, 2720, 1778, 2070, -416, -481, -2371, -2500, -2055, -2320, -212, -69, 1861, 3448, 3345, 3803, 1488, -645, 441, -1395, -2257, -2410, -1459, -1218, 919, 1341, 2851, 1981, 1148, 2376, -1392, -1320, -1485, -2296, -1637, -2160, -452, 1150, 2099, 1879, 3469, 3404, 3656, 405, -827, -1131, -3155, -4145, -2813, -344, -198, 1308, 1537, 3068, 2896, 1623, 1790, 1593, -1142, -1472, -2116, -4048, -2232, -824, 284, 3258, 2218, 3154, 3321, 2236, 792, -2488, -1684, -1732, -1090, -3734, -1964, -290, 1241, 2910, 2338, 2722, 1821, 315, -1782, -1047, -3129, -3046, -1141]
6148a141o36J227N37K108L8j25r71j039O1j009p56l40Q33N90J656j350L154n18
6166B319K43j18m36k506L1l73j711J179q41J733J424N81O15n34J473r26j089p66
6184B98r28k051m21Q28K09K387J310N42o62J549j357r06j488r90j458J388r08
6201b658J163O66Q46O53R53J42K23j798Q3j558K6k51k22J01J844Q5J541N94Q6
6220B519J4k362o76k87o07j438R97j065K014N01J792J102N26o54j466O6k316R28
6238d12n99j877N48Q13J043J532j2j78J388j242L09j342j865l43K44q6l65K374
6256g0K52O81o96K682l92k317k59q10j013j57P42O7L88K25J709J428M42k089Q9
6275I02P1q88q86L83j504o3M86J755R68R02j048J678q14j144j231n03k33j834
$$ y = [-1141, -1777, -550, -13, 2095, 2133, 2008, 1037, -2, 59, -950, -1706, -2046, -1213, -623, 1033, -317, 2837, 2319, 2562, 2444, 2008, -498, -467, -840, -2551, -1372, -2213, -480, 944, 1525, 2140, 1606, 3079, 2153, 1064, 298, -630, -2681, -3102, -2274, -2065, 322, 1632, 2174, 1512, 3061, 1704, 798, -690, -1680, -3138, -1750, -2658, -1495, -829, 17, 670, 1623, 1765, 1988, 190, 273, -1285, -1259, -1510, -1732, -1631, 213, 298, 1839, 2433, 2519, 2533, 171, -505, -792, -1399, -2837, -1840, -2905, -891, -390, 1402, 2504, 3030, 2376, 910, 976, -1340, -412, -1011, -2888, -2340, -1527, -484, 1048, 1036, 858, 2246, 1004, 1313, -29, -1894, -2237, -1993, -2079, -2444, -70, 182, 863, 167, 2849, 2457, 140, -119, -929, -1942, -2099, -1357, -1290, -902, -677, 1032, 2460, 2902, 813, 902, 973, 85, -801, -418, -1922, -1985, -1499, 256, 1224, 2126, 1078, 2756, 1942, 798, -433, -936, -1169, -3003]
6293c003L66K210L48J176M07Q6K29L24n58j441j800N12k39o71q21K006L65J671
6311A167R75l67O61r45j194j110J2q97p55P08M96J306k92Q40J054j658J147j63
6329I85J60j959O1k357J408j3K269m17J238J985r38R33j837j572O44j701n59L69
6347a301J444j380J239O53n66N42l51o31n18q8k16J76j549J187R5Q84R99m2K632
6366C209j673j89j704M67k111J035k62m85n64P69R43J847o17K11Q64q58r60r21
6384i99k36l85M1K36J578m35M49R94k45o0k76J166k077l82r24k06l3o99K987J03
6404E97J166K21L6r00k835O11J15j729j627K315M42R59R15J157J22J113k78k031
6422C69r79l89p59j566K51J865J037K13J595M71r78J000J533l338p89n29N86n87
$$ y = [-3003, -2637, -427, -79, 1097, 1504, 1590, 1819, 2143, 1585, 144, -1656, -1144, -1383, -2054, -2875, -869, -504, 1167, 2142, 1775, 2436, 1491, 297, -813, -801, -1698, -2453, -1745, -1249, 57, -235, 605, 1659, 1, 1148, 985, 1145, -814, -753, -3110, -1702, -1715, 554, 137, 1375, 3360, 2422, 3355, 1518, -54, 590, -1111, -1670, -1301, 143, -1237, 2, 655, 89, 631, 280, -351, -869, -957, -1173, -997, -2546, -1359, -1264, -380, 619, 577, 3209, 1536, 1347, -357, 110, -2001, -966, -1228, -1713, -2277, -1508, -565, 1282, 665, 876, 1740, 882, -78, -999, -1235, -1620, -1579, -1343, 235, -200, 249, 1243, 998, 938, 662, 1828, -249, -631, -1555, -1761, -1794, -2493, 494, 597, 1763, 1984, 2020, 1120, -1715, -1104, -989, -2718, -4345, -2030, -1588, -629, 286, 1443, 1565, 2678, 2400, 369, -610, -999, -1758, -3324, -3073, -1208, -171, 42, 1637, 2108, 1130, 2130, 3663, 325, -464, -993, -407, -994]
6440i94j33J592N1J71N04J258r18N23k004k32m47q76O45q87Q90J448O50k29K30
6459A242N39o87j14l21o75r94P51J57q73J45K33l16J167J374o43j293J578o63
6477F07k569J72m0j036K486J139J345j737N83J754p53k527O54j098r40J862j707
6494a805J342L93m01J570J337o31o60n9n65k318J0P91j747K798o64J176K670j874
6512A363P77q96Q8j743m07l33j548L73J353J261R1J535j180L54q65J40o97Pp62
6531a089k64o5k32n85J685J229L70p19l21L78M86j988K63j206J318n79o96K237
6549B22r42K059m67O62p27O45j616r35J21J261m01n25J15K35K292j051m53K05
6567G00L16k046K80j18m80j092J374j17J845j327J629p12P98r77o70P17k116J253
$$ y = [-994, -1127, 465, 516, 687, 1191, 2449, 1531, 2054, 50, -182, -629, -1505, -860, -1747, -857, 591, 1241, 1012, 1242, 1781, 1094, 980, 659, -16, -1010, -259, -102, -975, -830, -597, -913, 254, 1628, 985, -308, 1270, 607, -1962, -1790, -1830, -2866, -380, 759, 2104, 367, 950, 2704, 1951, -576, 78, -1020, -1960, -98, -1805, -463, -70, -471, 1099, 2436, 1805, 1145, 1086, 521, -1797, -1787, -996, -2743, 55, -609, 567, 3237, 1363, 2140, 1244, 1332, -411, -818, -1151, -2699, -2326, -973, 288, 379, 1914, 734, 1088, 223, 363, -334, -327, -1089, -1353, -1418, -1650, -2235, -550, 679, 1049, 330, 9, 387, 873, -1115, -852, -2058, -740, -1319, -2015, 222, -720, 1339, 872, 1534, 807, 1452, -164, -1099, -978, 283, -118, -643, -528, -293, 1999, 948, 495, 700, 1016, -1030, -750, -868, -1348, -2440, -1066, -1183, 662, -665, 964, 252, 1050, 73, -597, 120, -1996, -743]
6585g43j076j048J854P63J421m50L44P02L18j634L20k341r4J142n31l86J864J32
6603E57R1J324k44j073R14o86j148r47L81J344n38r28P53Q39m75O21N19o50Q33
6622A487j647j193j161J402J47j465J527J843M70l86Q70j632R2Pj986o20P26K033
6640E14r85j837J303K369o83Q67q54J017k353j7l11J113j353N31m25J703q6l55
6658A58P83n36J106q71j091O61j27j396J784n07Q47J233q02j414K162o85j363
6675e8O40k265j05M75Kp27N95J253K085m52k00l78L47J82l029L06r11K60J012
6694i68k085L085r0j872L457j88j98p7k524J05J914k717k98J777M57l32K513r10
6712A049j59k58P88k172J021j522o79K087m5o56J319J108l30o94L40N80k541J129
$$ y = [-743, -1819, -2867, -1013, -250, 1171, 721, 1065, 1767, 2085, 451, 771, -1570, -1664, -522, -1053, -1439, 425, 557, 648, 1972, 1728, 655, 1569, 883, -265, -1212, -831, 513, -25, -953, -200, 639, 164, 785, 1304, 654, 1487, -160, -1353, -2514, -1112, -965, -2430, -903, 940, 1410, 1024, 1894, 262, 354, 361, -1625, -2245, -1519, 514, -471, -2308, -1005, 1364, 681, 1548, 694, 1711, -642, -659, -970, 143, -1210, -679, -1104, 599, 513, 158, 941, 405, 1511, 640, -451, 210, 83, -1313, 471, -36, 811, 2044, 1242, -172, 1990, 1305, -58, 582, -1683, -1788, -1313, -1311, -2038, -1443, -190, 1895, 1443, 1243, 865, 1212, 1394, -1635, -1329, -2240, -1980, -968, -3053, 32, -58, -1930, 1527, 1339, 1141, 1064, -1460, -1355, 559, -2158, -2456, -679, -222, -554, 1959, 1049, 890, 632, 1420, -752, 269, -1253, -1932, 155, 110, -546, 773, 1881, 1551, 857, 1197, 1777, -764, 365]
6730C65j015j001n79J862n76J254q53J698k19j24n37M47o60j629m43j61R75O86
6748e10L83l80K93O15J947j329K46o50J3k453L34Q93j637J949P06J248j03L64
6766A929m81K12P6k418L66o82R50q58J439K36J267M79k049R24j311K66j46j48
6784E1q65l63o60K100k75R77J070j356k88l71N44j731P71P59j489l26J453j713
6802a712R55Q84P62J165p70o6j27p83j674J119r83k42J409N7p0J523M56p74j155
6821b6r37J077j1O76k446J53Q04R94J354k84m24R48j995N78n46o33M70J32p8j608
6841a802N64J438K67m29m76R22l76j257Q80r81q57J550J84o42M97L87K80m31l80
6860f62K009j074k93q52k020N83N60J140K229k237Q27P04J680k378m15Q06k241
$$ y = [365, -650, -1651, -2230, -368, -944, 310, -543, 1155, 936, 812, 275, 722, 62, -1567, -2010, -2171, -1196, -510, -127, -507, -214, 401, 2348, 1019, 1265, 615, 628, -1825, -1491, -598, -2235, -286, 420, 1668, 1565, 1929, 1448, 1660, 1736, -682, -316, -998, -48, -906, 533, 769, 2036, 2515, 466, 1390, 79, 345, 199, 51, -814, -1177, -1837, 263, -12, 965, 2035, 679, 391, 20, 564, -1167, -396, 363, -1126, -1452, 1, -1712, -757, 127, 889, 2054, 1284, 1218, 1091, 308, -1366, -247, -1230, -1472, -63, -6, -76, 1447, 1903, 1129, -26, -963, 114, 103, 779, -1667, -1514, -710, 284, 1638, 1354, 930, 1878, -117, 461, -85, -718, -248, -116, -194, -1802, -1238, 200, 467, 38, -438, 484, 108, -1149, -269, -1250, -2107, -557, -373, -1015, -518, -131, 149, -282, -662, 1347, 273, -20, -872, -2892, -2309, -1749, -609, 1620, -617, 210, 914, 2594, 216, -199, 607, -1634]
6877a634P40l62P37m1q05J459N10J323r84j87j61L64j354P34k435j28Q71J093
6895b60O51r01J631o8l64P90o14l75j215k45J99M09M2L97m99J107o30r3l11N03
6915A54k102J946r81r50k28J495p82R71J212L86L49n12j865J160l43K77m11n53
6933g77Q77n93J075P18P01J93q83J303j840m07o22o31L48Q76j653J240j005K351
6951A271n50j400J902o3k090J291j516J538j484L27k03K247k329K449p62j024
6967c96J002r36l95m5J167j409P28k3J74j31P27k92j226R89N15j347O00j617J602
6986c13j096J725n14J027j344O82J942o59n16q30J364j762o31Q05N76j022k80
7003h46N07J590j094P8K87k12O58q20n71j546Q70N06N17p88J238J62r95J56J097
$$ y = [-1634, -894, -1256, -519, -560, -1365, 94, 604, 1927, 943, 756, 595, 959, -395, 339, -2096, -2224, -1353, -260, 391, -510, 1121, 1053, 689, 1479, 865, 490, -725, -970, -771, -362, -320, 77, -422, 685, 55, -38, -349, 154, -1948, -2, -983, -1933, -2161, -666, -1448, -477, 735, 1121, 1470, 958, -907, 253, -90, 187, -224, -777, 100, -493, 582, 1300, 2001, 2194, 1311, 2614, 774, 367, -255, -886, -538, 338, -1315, -75, -1080, 1271, 721, -679, 1223, 1160, -930, 361, -1155, 383, -1101, -774, -977, 1270, -1059, 1390, 628, -396, 606, -330, -725, -770, 397, -1012, -284, -307, -133, -264, 463, 171, -1055, -66, 449, -898, -298, -1915, -313, -1409, 316, -198, 829, -515, 167, 2109, 1450, 934, 104, 1468, -294, -925, -120, 456, -566, -846, -339, 1251, 157, 235, 522, 310, 968, 148, -423, -1969, -1099, -593, -76, -864, 374, 536, -459, -303, 794]
7022G94J472k532j578P69J774J36j451K56k26O03R4m52J082m15p97K42M20o72
7040d81N13P74j679K167n95M36K15j126L5K08p81O96jk843J902J186n97R68o74
7059C23J133j475L42k82m66p87N58J24j335J689J326r05p20K94m79M85R96j962
7077a141J782j216M04J237j999J654k71P96p12n21K00O05j286j347K582k527J507
7094b53k45J325l94J258l28k59k260J529p29J130j870K73J531j72K42o43P57n88
7112C04K19k24O69j22r24j080p7k43J506k33n31M67n37J889M20k545O79O38j791
7131a516J357q37K83O49p61J856j405K050p49j246R48p04j73j113k41J894m05
7148a13n51J126M06r17R49R16r48o10m30jj93l02j80J095n69J348k45O72j12M56
$$ y = [794, 2266, -266, -1844, -1075, 699, 835, -616, -360, -586, 17, 111, -341, 741, 326, -471, -229, 191, -481, 32, 806, -873, 1294, 699, 1135, 1350, 224, 259, 467, -314, 382, 381, -2462, -560, 626, 29, 997, 323, 1456, -19, 323, 41, -425, -1212, -654, -530, -1865, -176, 1150, 245, -475, -181, -660, -175, 821, -1141, 641, -575, -171, 1066, -933, 721, 450, 1246, 534, 13, 213, 818, -468, -1815, 767, -1760, -253, -498, 827, 433, 1691, 1363, 1104, -1156, 373, -356, 774, -1096, -823, 708, 536, 778, 135, 892, 304, 523, 299, 968, 846, -78, -1158, -1235, -1478, 28, -205, -736, -269, -806, 1083, 1503, -1042, -363, 275, -1516, -159, -996, -713, -64, -825, 1031, -374, 1676, 927, -319, 629, -75, -248, -1361, -1602, 292, -113, -664, 462, 868, -49, 900, 1816, 868, 258, -172, -173, -366, -668, -848, 247, -322, 1026, 781, 1453, 1341, 1797]
7168A797j257j518K8o7P29M50L29o29P51K00j861R16N08M26j937J17m37k31L86
7187a300M73N37p07L49J508j023L03J31J63j448rq46J42J030K03J521j455J876
7205A448r58P56K0j113J284k794K122o91J50o27J46P21J002j029J340K99k041
7222C5N29j444P74K30n62R33j258J804J91j135J934k326m81l71J630m61j857J623
7240b12j53k24q87J339n17J126k56M18k44j791Q33L5M82j033P77L53p6M24J524
7259A918k851P49R81j261J327k681J613M08o50P87k95m07J417J4j416J195j023
7276a75l73J117j085L29j54q78J883q34K06P84k91j137M51Q2k3j861J214m8R99
7295B06J046n70n0L80q16n78J583k010L50p1p66J540j345P20R0J533l07q54J052
$$ y = [1797, 540, -978, -950, -1017, -288, 162, 491, -138, 613, 813, -1048, -132, 376, 802, -1135, -1018, -1455, -1686, -1300, -827, -290, -997, -648, 860, -163, 140, 271, 434, -1014, -1023, -1869, -1727, -697, -494, 1027, -428, 1448, 490, 1246, 1266, 153, 1437, -1357, 765, 74, 224, -403, -257, 464, 1466, 437, 1777, 2076, 35, 564, -880, -106, 124, -438, 495, -763, 1041, 1232, 97, 2031, -295, -776, -1147, 483, 22, -1835, -212, -365, -589, -1476, -137, -654, 472, 216, 634, 390, -1401, -568, -533, -51, -1084, -307, 46, -30, 394, 1918, -933, -184, 797, -464, 863, -1818, -205, 203, -447, 340, 45, -362, 1055, 1069, -347, 848, -175, -548, 569, -516, -187, -341, -1219, 664, -170, 36, 820, 529, -608, -157, -75, -98, -1959, -745, -793, 206, 1252, 682, 632, 1012, 196, -382, 1201, -809, -459, -530, -1296, 244, -1101, -381, -291, 1242, 935, 81, 1133]
7314A133J80n80k576K16J579l98n11M90P60P22R07o38k31r76Q08q83n58Q24j292
7333a024J374J006j550l34J082l91P75l93J84J14k180K68n60J096r44K294k2k251
7351a456P03m25L20M95J146j011j540K160j5j009J96J587k68l34J42N59r20q7
7369B43n5R51m58j83O32l53n88J778r82l71O92j415J344j267P41k325J092Q02
7387B78o08J417r60J148j210M77q37M14l58q42k12J186l03M09J29r58P33J76J40
7406B19j206P87n52K071j744J4M92l2r76J34J433j119J039j536J334n24J228p69
7424B93n8N63j190l05K01P70M63k95m58N03j95j3n77J511o52q22M63r1o71R86
7444D26k12J91k24p36P14p02K95o15J73O33J33J97l58Q6j056O51j026J051p41
$$ y = [1133, 1313, 733, -1843, -1627, -48, -446, -957, -467, 293, 1015, 1922, 1284, 1053, 77, 885, 2, -556, 268, -1024, 350, 1356, -194, -528, 554, 163, 938, 545, 729, 843, -1337, -1069, -1629, -533, -1477, 817, 795, -1456, -753, -1178, -858, -363, 783, -228, -1768, 392, 377, -632, -436, 1151, 883, 549, 691, 1250, 330, 243, 188, 1139, 681, 498, 1130, 777, 189, 1967, 985, 614, 1306, -109, 1235, -32, 709, -1616, -524, 278, -330, 1087, 127, 1275, 65, 542, -295, 119, -239, -1081, -1293, -107, -410, -1, 128, -830, -97, 79, 219, -987, -200, -752, 1319, -425, -411, 81, 49, -927, -793, 640, -479, 560, -976, 358, -166, 1062, 293, 235, 798, -392, -697, -496, 274, 737, 442, -16, 487, 292, 279, -298, 1213, 561, -261, 202, 111, -560, 426, 214, 405, 181, -555, 159, -543, -248, -863, -690, -57, 76, 273, -85, 1, -1055, -404, -1430, -379, -1120]
7463a120J441j501R4J040O43k26o44O87j2l0j519P43K24l48j57K25P22m78l0j29
7483c75R04P6p93P70l2m94L33M01q58N75L38j24J79j809K314j995j08k15J939
7502A026L08j780j657K303o57L46j874J193R66j391J058K3l91P13L33j68r65j306
7520a920J554n28m10J935o38K12j42n22o91P52K19J14l65N80M23j302N94m2O67
7539D90k10l06J22Q79o66K67j668K783k612k7R84K20l05n55J799j831Q27j672
7557a481J221j33J590j93j267r69Q97J521j171N80n12o47l10R32q6p85o02J598
7575A83j55J3J89L11m34M9L22l28j193L51P39J45o7l65N15K04j611K506m64j233
7595c23J289p32R4j092o79P93m30K00J741q97j121J389M52kl05n78J25L17j32
$$ y = [-1120, 321, -1180, -1086, -46, 597, 371, -273, 414, 402, 372, -1147, -404, -180, -528, -685, -460, 262, -216, -246, -375, 529, 605, -188, 582, 550, 56, 389, 790, -68, 507, 845, 721, 900, -909, 1405, -590, -698, -913, 1026, 1334, -446, -2103, 200, -457, -111, -1985, -792, 174, -1217, -159, -136, -527, 186, 519, 351, -614, -1920, -366, -894, -1304, 631, -7, 205, 63, -459, -1150, -398, -179, -65, -430, 150, 573, -729, -135, -177, 490, 280, -26, 96, 975, 309, 576, -1092, 1691, -921, -948, 36, 256, -49, -604, 1195, -636, 191, -1481, -260, -393, 1197, 1004, -263, -1232, -335, 1186, 15, 595, 83, -564, -874, 58, -28, -813, -1415, 183, 28, 41, 230, 541, 107, 156, 478, 150, -1043, -692, 47, 192, 125, -240, 275, 479, -1132, 1374, 910, -323, 966, 234, 328, -764, -1443, -650, -1080, -880, 861, -36, -1157, 232, 684, 682, 377, -201, -76, 241, 109]
7614A09n63Q32j823K646q42j376L88j03N66P50M28j652R11n94m74R03j885K340
7632E61m80l00L0l83P85L7L97q17k08o8NL0J234r26N89j600J836p86N30p45R51
7653F72j115J880j050n17J311j227J822n30m45M86j163N35j246N84Q1j171J76
7670i17j1R90k02K76O62L7k263J296J812k375J235j69N44j611O01J177k010O57
7688b71J030q19m59R51j011J85M85l00j473K703j716j06k45J164m94J174j420
7705f22N78N42M28p14l2M79q23L54Pr10K20J352j589K601j363K5k526J952m46
7724d87J223o10J23L50j160J486r59j99M05J035j471Q21j058P09l56o88P35K27
7742A26P26o57q59l80O49J302r78j261qQ91N3J394r49j12L25J453j468j114J084
$$ y = [109, -454, 378, -1445, 1201, 359, -1017, -629, -732, -166, 584, 1012, -640, 271, -323, -797, 106, -1779, 561, 81, -219, -189, -572, 213, 250, 647, -170, -378, -446, -441, -411, 823, -103, 486, -1114, 722, -64, 466, -279, 672, -443, 1437, 387, -130, 1181, -46, 1776, 1246, 801, 1287, 124, 659, -587, -3, 78, -1093, -917, -928, 62, -140, 136, 798, 835, -1428, -132, 1680, -695, 540, 371, 915, -696, -95, 1082, -928, -271, 759, -60, -519, 432, -579, -394, 91, -209, -1682, 1021, -695, -801, -1046, 118, -376, 798, -622, -44, 498, 926, 212, 180, 659, -164, 190, 197, -713, -493, 859, -730, 1871, 508, 533, -1993, -41, -487, 736, 126, 249, 599, -561, 925, -34, -233, 172, 1207, -264, 557, -501, 208, -148, -836, -101, 126, 852, 195, -664, -1044, -395, 907, -71, -1332, -1340, -449, -396, 998, 49, -63, 262, 1715, 247, -867, 217]
7761B17q97J462L01j706R43j337p52J275K8J037n42Q40N97j145p31l35R65m60
7779b40L66O29j658J234q11r2N07m42J213j912J897p67N67j183J175n78J061j200
7797b34M83p70k24Q14K78q45N25j16j94q79O59O17O70q48n3J455R8j648K86J195
7817A269j713J38J095R94j160q00k97L60M75n92O46k98j800J475O47L56l09R72
7835A458j518J041r80n17l01J154k85L69r05R10q8j91N48j045J90k68k34J049
7853C87j90l49k56J43M11J89j178R84K24j345J639r93j460Q3K209j415J10N85
7871b22J68P68k193K34J725Q47n9k144Q83N29j313R66J79mn7J321j271o13P93
7890E37j178J27J298k02n50J68j55K26n04O55k30o0Q79q43M38l22l64q29r2J325
$$ y = [217, -680, 782, 1083, -623, 320, -1017, -1769, -494, -466, 571, 29, 869, 1466, 321, -410, -745, 220, -240, 126, 755, -903, 331, -480, -572, -65, -507, 706, -1206, 691, -76, 491, -692, 483, -95, 966, -234, 249, -521, -745, 69, 347, -498, 27, -89, -283, -1162, -503, 114, 784, -64, -117, 1338, 1436, -212, 74, 1269, -444, -306, 789, 1783, 623, -177, -474, -114, 361, -231, 415, 117, -1683, -208, 439, 795, 486, 1458, -60, 981, 1, -516, -817, 337, 52, 421, -484, 426, 338, 147, 695, -350, -160, -428, -662, 387, 197, -152, -408, -265, 146, 335, -843, 141, 365, -980, 659, -334, -1794, -1711, 498, -917, -807, -222, -54, 714, -1479, -1245, 480, 1327, 1268, -876, 7, 536, -777, 189, 368, 364, 307, 1628, 357, -256, 537, -641, -514, 784, 582, 32, 200, 45, 271, -233, 422, 192, 132, 1011, 168, 606, 284, -80, -909, -1001, 324]
7910C24k560K909p46r0M42j314J656q86N12j31m71J554j691j67K25J536j073q52
7928h23K169j8o69J24q80n02o52J039j67K67j14l91J864o28o90j88O02m89K55
7947A09j264J299j70J74P43q72J176k530J136l26O93n46K95Q60l71L69j311l96
7965i32n0K136k135L73M66j593K087N8N18j149n02n79J433O39l44J7j702K69J491
7984E01J77j096n4J51j396J831m8q07L81K92O14o57p21K239r69j63p4J55j580
8003a224l53J638k01P56k137J248j04k2J707j044l27J194j355M38o40j383K354
8020E45r27L52L76O79k087m6L30J276j70j272O98k386J398O16J269p0q75J203
8038I09j242K1m30m81J029J44o32J143j206Q27k00R52J137q32n93j295O65n3J64
$$ y = [324, -2236, 673, -73, -163, 279, -1035, 621, -265, 247, 116, -355, 1199, -492, -659, -434, 1102, 29, -823, 1346, 1328, 659, 783, -97, -599, -1251, -212, -379, -112, -226, -617, 1247, 619, -71, -259, 343, -146, 109, -1155, 144, -26, 148, 891, 19, 1195, -1335, -199, -525, 168, -378, -83, 777, 406, 775, -536, -932, -982, 1154, -981, -608, -142, -1735, 352, 410, 928, -221, -723, -1302, 131, 770, 426, 443, -1259, -990, 501, 678, -418, -472, -321, -1717, 114, 66, -741, -360, -68, 546, -111, -832, 1407, 438, 275, 201, 356, -1224, -1577, 61, -140, 616, -1521, -273, -377, -399, 1308, 264, -63, 1131, -224, 214, -426, -1809, 545, -382, -30, 346, 1025, -1062, -1108, -778, 498, 328, -944, -246, -2632, -1234, -618, 651, 581, -294, 909, -333, -312, -742, -1223, -194, -50, -682, 461, -745, 82, -118, 834, 1971, 1139, 546, -749, -84, -137, 27]
8057B7n51Q37j050N91o66p29K733j278k15j46Q21p46j14P43m11o22J262r84J080
8076E82j085J093l25l30l01N24j035q45J495q45K167j151O5J078j59p14J37j27
8094B24M57j228J137l52J49K37L00j241M36n90J034N51j451K60J121j079j749
8111a784K737j905N32R52J185j576n0O24P88j726q98J183N6k42Q08j022R34j95
8129D01m08K38j867P38K28J601k215P75n90J740j142Q93J394q99j107k0R01p30
8147f9j5M68o68K47J044l24K58j596Q68o01O46K94j571m98J483j049M49L81n2
8166c05L19N72j57J404j911N49k27q33m09J641j017n65J521J34q63p12J704q60
8184a5J31r83J782j115j17J091r11
$$ y = [27, -524, 313, -737, -146, -812, -1541, 1192, -86, -301, -447, 374, -372, -486, 257, -154, -776, 486, -498, 582, -503, 590, 265, -65, -366, 158, -877, -1722, -227, -1072, 1095, -56, 9, 1087, 928, 214, 351, 224, 681, -547, 590, 238, 387, 624, 924, -317, 119, -471, 563, 1114, -337, -77, 1044, -35, -1784, 953, -952, -420, 532, 1717, 141, 91, 715, 1503, -223, -1121, 62, 118, -124, 684, -338, 596, 401, -7, 231, -1636, -898, -670, 931, -1284, -509, -1099, 641, -501, 392, 1786, 887, -220, -240, 661, -69, -84, 384, -284, -37, 1007, 683, 941, -655, 213, -388, 258, 552, -1019, -1517, -34, -1083, -634, -253, -305, 14, 586, 429, 1833, -78, 471, 244, -589, -998, 643, -374, -939, 582, 716, -147, -859, 845, -15, 116, -867, 915, -200, -317, 774, -137]
8191a37
$$ Imaginary data points
##PAGE= N=2
##DATA TABLE= (X++(I..I)), XYDATA
0@%%%%%%%%%%%%%%%%%k4J00j66J97k15K16k37K98l63M14m84N61o38P40q41R53
33E11j086J228j390J555j740J951k175K428k712L004l325L681m070M502m963N466
49B865o022O633p306Q058q894R815j0849J2028j3367J4913j6717J8858k1452K4660
63A3223k8751L4152m1608N2560o9337Q0972j972668q73622o0237R7574O88341
74b079401R03521R89500O62744M10428J27746o0532l66505n43916n54510k88722
84g99647k4758J69426K29253L41670M16584L96168J66941p6449k11686j88636
94D18866j78715j99280j93494n4482J24995K07664J27017L4053J8791N1936J544
105C58895j06057j44856l7692J00425J37333P4130L7432P0896Q5811j6639j68464
$$ y = [0, 0, 0, 0, 0, 0, 0, 0, 0, 0, 0, 0, 0, 0, 0, 0, 0, 0, -24, 76, -90, 107, -108, 108, -129, 169, -194, 220, -264, 297, -341, 399, -442, 511, -575, 653, -737, 818, -922, 1029, -1146, 1282, -1430, 1574, -1751, 1930, -2140, 2362, -2601, 2865, -3157, 3476, -3830, 4228, -4666, 5149, -5700, 6328, -7039, 7874, -8843, 10015, -11437, 13223, -15528, 18624, -22984, 29576, -39761, 41211, -1931457, -2805079, -2865316, -2767742, -2079401, -1175880, -186380, 476364, 886792, 1014538, 954006, 587501, 43585, -510925, -799647, -824405, -654979, -425726, -84056, 332528, 728696, 895637, 819188, 607502, 418866, 240151, 40871, -152623, -207105, -82110, 125554, 252571, 286624, 305415, 357351, 358895, 252838, 107982, 70290, 170715, 308048, 382178, 419610, 490506, 576317, 559678, 391214]
116C91214k29760j70464r8129j11816j58280j28033j9819M9862N899o0253k6404
127e55983P7900J42401R8800L5336N0625R8969O0159p5874j83596j67313p1335
138d89911j5598q963N0020J96345L28538L20024J83060M9065k1058q3564k09445
149B98513l31752l18824j50505M7854J55364K00131K59825L32932L03209J17810
159I14557j12615k43636k54608k42074k51143k05951k9942J96854L23458K92426
169C87326J91620J19372M6326j06212l12783m28196l65866k05418p8486j4J02880
180f49451K47846L42089K79133J04152m3873r7696j26186j97371k57951k05537
190f04845m5771J10503J52711J33102J46058J96631J90920P1003n4078q9293m0939
$$ y = [391214, 161454, -9010, -107139, -218955, -377235, -505268, -525087, -475225, -469326, -529579, -555983, -478083, -335682, -236882, -201546, -150921, -51952, 8207, -67667, -251263, -418576, -489911, -505509, -514472, -464452, -268107, 60431, 380455, 563515, 612580, 591522, 507958, 298513, -33239, -352063, -502568, -454714, -299350, -99219, 160606, 493538, 796747, 914557, 801942, 558306, 303698, 61624, -189519, -395470, -425412, -228558, 94900, 387326, 578946, 698318, 744644, 638432, 325649, -102547, -468413, -673831, -752317, -752331, -649451, -401605, -59516, 219617, 323769, 279896, 182200, 56014, -141357, -399308, -604845, -650616, -540113, -387402, -254300, -108242, 88389, 279309, 350312, 296234, 206941, 166002]
201A66002j8830o8584j12878o4336K4196N3430o514m7523k614P6738Q4753K1933
213A05773j2471L1213Q8041O0582k1047o5801k0341K5853L767o2191p6068j4742
225D2568K7384j3821r3098j04579m2722J0354k437k6362K2183J20934J61362R4059
237A95825o083n2737o1578j13064k05196k47415j63354r971J09202J59970K07727
248a86674K82577L19853K35179M6381j22308k06235k43942k88076l10696k30319
258g04260l7912J55542K52993K62938K65657K75134K05505M1569j40935k33168
268C43063k19467j79387j65554j30655j2595J40981K18014J82968J11293P6415
278C65076O5305k423j15713j84785j45662n5079j4915l0295k2649L6287Q6886
$$ y = [166002, 147172, 78588, -34290, -98626, -74430, -21000, -27514, -75037, -77651, -913, 83840, 105773, 93302, 124515, 212556, 273138, 252091, 186290, 165949, 191802, 195569, 133378, 57310, 42568, 69952, 56131, -36967, -141546, -184268, -173914, -176351, -202713, -180530, -59596, 101766, 195825, 189742, 137005, 75427, -37637, -242833, -490248, -653602, -663573, -554371, -394401, -186674, 95903, 415756, 650935, 697316, 575008, 368773, 124831, -163245, -473941, -704260, -742172, -586630, -333637, -70699, 194958, 470092, 675597, 717166, 576231, 343063, 123596, -55791, -221345, -352000, -364595, -223614, -5600, 177368, 288661, 365076, 430381, 427958, 312245, 127460, -18202, -73281, -88196, -118491, -141140, -104853, -17967]
289a7967N4881l2679q2257n0267j459j2761m8894l1941M5538J06890P9364J4636
301B3084j0697J6006K0529m2150j08398j02438l4611Q607Nj6583L0583J11477
313a04586J39788R0681L6175L5136N4382J8472p5033j38854j15140n9020l2970
324a50969m0569n991R1791J77554J82402J17703N5742L7081M519q8536j93228
335A87499k19104j52534p0335k6246O382P6234J73370K06679J38704K6912m4857
346C02704p8289j26043j95272k21571j48976j8078P8411J09368J27817J65596
356d333J78308J15455j7460j22203j48683j33253j33426j34126p9725M2388J51372
367b85686J81537J43371J11213J08513P2417k2774j23171j49631j03354m7981
$$ y = [-17967, 36914, 4235, -78022, -128289, -129748, -142509, -191403, -223344, -177806, -70916, 8448, 23084, 12387, 28393, 48922, 6772, -101626, -204064, -238675, -230068, -230063, -246646, -216063, -104586, 35202, 125883, 162058, 197194, 251576, 270048, 195015, 56161, -58979, -117999, -150969, -191538, -197529, -105738, 71816, 254218, 371921, 427663, 464744, 469263, 380727, 187499, -31605, -184139, -254474, -280720, -274338, -198104, -24734, 181945, 320649, 347561, 302704, 224415, 98372, -96900, -318471, -467447, -485525, -407114, -297746, -169929, -4333, 173975, 289430, 271970, 149767, 1084, -132169, -265595, -399721, -479446, -437058, -285686, -104149, 39222, 150435, 258948, 331365, 308591, 185420, 35789, -67565, -115546]
377a15546l8432k2588L3327J15118J45174R9962L5792J2750K0787q817p1060j12124
389I4343p7131j5357J3952o253j4824K2611O1165M0283k6502o5191m6741j3391
401c3036k5720o1846n3343J1016O2663N6393J6424Q006L1318L4348k2200r1647
413f7624j02290n7677k6830k6136k2897L1802J13210J51611J17397O5046M0201
424B15813L0918j9609j06208j62412j38155o6245j8241O582N7520J42702K05309
435A47974J95443J08306K7439j7827o5001j38804k05648k03880j20642k0290L5665
446b57265P0419J18872J78820J84653J08331m634p3366r9852j25316j69665j81403
457b50406j18836j2266O4292Q2969Q6986J06970J22842P9462q970p8442q3512
$$ y = [-115546, -153978, -176566, -143239, -28121, 117053, 217015, 252807, 265557, 286344, 277527, 206467, 94343, 17212, 1855, 15807, 9554, -5270, 17341, 78506, 118789, 92287, 27096, -19645, -33036, -58756, -120602, -173945, -162929, -100266, -43873, -27449, -19443, 11875, 46223, 24023, -67624, -169914, -227591, -254421, -280557, -303454, -271652, -158442, -6831, 110566, 175612, 215813, 246731, 227122, 120914, -41498, -179653, -245898, -264139, -257557, -200037, -57335, 147974, 343417, 451723, 479162, 461335, 396334, 257530, 51882, -151998, -272640, -292930, -257265, -186846, -67974, 110846, 295499, 403830, 399196, 325830, 225978, 100662, -69003, -250406, -369242, -381508, -317216, -234247, -147261, -40291, 82551, 162013, 153043, 74601, -8911]
468h911o7697n9327p6442n2012J2724Q4260Q4336N2987L1260L7835L8773n707
480G2079n6958o4654j8151K2850K5752J5074L4173P2313Q1396L2944k3927m4362
492A48529k8323l1350o0856p5081l3199L1026O4896N5575M0494N8116O9356L1047
504B70230m4426r7031r8401p6192p6995q5193n6486K1317Q7062R9811P6604N8767
516G9067N9019L7443l3968j09202j37067j09700p1556n6639l1983L4137J17082
527b23367J59053J32924Q1428N1104K5075k6606j02255j48824j30651o7165j4278
538b63562J2404M9900J18516J64940J52159Q5624J9838j6439m0989r1944j37608
549E2839j33691p0856R02L6395M7643O9204J08266J06683N3653j9779n9406o0940
$$ y = [-8911, -76608, -135935, -212377, -264389, -251665, -167405, -83069, -30082, 1178, 39013, 77786, 72079, 15121, -49533, -67684, -44834, -19082, -4008, 30165, 102478, 183874, 216818, 192891, 148529, 120206, 88856, 28000, -47081, -80280, -49254, 15642, 71217, 111711, 169827, 239183, 270230, 225804, 128773, 30372, -45820, -122815, -208008, -264494, -243177, -156115, -56304, 20300, 79067, 138086, 175529, 141561, 32359, -104708, -214408, -285964, -342603, -374586, -340449, -223367, -64314, 68610, 150038, 201142, 226217, 199611, 97356, -51468, -182119, -249284, -263562, -251158, -201258, -82742, 82198, 234357, 319981, 339819, 323380, 282391, 190447, 52839, -80852, -151708, -150806, -114411, -66768, 2436, 110702, 217385, 271038, 251259, 191853, 130913]
561A30913o5318q8068r9820n7032R948N5603M8898L3770L9250M6814K1646l4185
573D2419p9062o9288l6153k1021k4004p616L8255Q0185P4227L3698K703K7m405
586B9965l3665p3664o9086k1175K6396M5426M3719O1261R0810R1123L8547k3100
598B06557n0520n1533n6349p3969p4570k9314L7043Q2395Q1262P0043P7343P1480
610B89868K9301m8615j03551j12839r6363q2944p6573m0482L4736R9562J13289
621E389Q6812O2644M8434J7468m4595j15448j38736j10988p2364m8071k1646L0857
633c00244R9729J34112J10208O3162L3944J3466k3733p9895j15026r6402m3653
644b04332m185J2373L5898P9688J14677J00540M9983L930j2250k4068m8610p9800
$$ y = [130913, 65595, -22473, -122293, -179325, -169377, -113774, -64876, -31106, 8144, 54958, 76604, 42419, -36643, -105931, -142084, -163105, -187109, -194725, -156470, -76285, -2058, 31640, 34343, 34370, 29965, -3700, -77364, -146450, -167625, -141229, -95803, -52084, 9177, 99987, 191110, 229657, 206557, 156037, 104504, 48155, -25814, -100384, -129698, -92655, -10260, 71002, 141045, 218388, 289868, 319169, 270554, 167003, 54164, -42199, -125143, -201716, -242198, -207462, -107900, 5389, 92201, 154845, 203279, 220747, 176152, 60704, -78032, -189020, -261384, -309455, -331101, -300244, -200515, -66403, 43805, 106967, 140911, 154377, 130644, 50749, -64277, -160679, -204332, -208517, -196144, -160246, -80558, 34119, 134659, 184642, 188572, 176322, 152254, 103644, 23844]
656B3844p5383k7415K3494M2962L6347M4360O3196N8010J5851l8598o2926n1281
668E2461m1449m5790n0462j1779L4827O1653N0802K2585J2245O916j3068o2067
680A6874q9695p5528l3332n132O209K1538O0764Q7616P3848K3283j5723l3049
692C7673l8787o4381q5775p3608k0325L7009O4903O9930Q1704J01045Q9689L5399
704B34476l1172o6148p0275p1853p8638p1530k2833M3734Q5561R2507P9655Q0011
716B03495P2194L0563l5833q9737r9536q5242p0440o4105l4958K5756P5068R1866
728A9091O6004M4324L2858J2144l4232q6390j02433p8553m7297k9882j2075K1974
740a94467P0714Q8353O9202K8642M915p399k8206o3665q3508o2349j7173J9792
$$ y = [23844, -51539, -78954, -55460, -12498, 23849, 68209, 131405, 189415, 205266, 166668, 103742, 52461, 11012, -34778, -85240, -97019, -62192, -539, 50263, 72848, 85093, 92009, 78941, 16874, -72821, -148349, -181681, -186813, -180604, -159066, -98302, -10686, 63162, 86445, 70722, 37673, -1114, -65495, -151270, -224878, -245203, -208194, -143291, -73361, 8343, 109388, 199077, 234476, 203304, 137156, 66881, -4972, -83610, -155140, -177973, -134239, -48678, 43829, 123484, 203495, 275689, 306252, 270419, 180682, 81146, -4096, -74536, -138641, -173599, -147843, -72775, 19091, 85095, 129419, 162277, 174421, 140189, 53799, -48634, -127187, -174484, -204366, -216441, -194467, -123753, -35400, 33802, 62444, 67359, 59960, 31754, -31911, -115419, -177768, -194941, -175149]
752a75149L2723M1950O7617Q2005O9751K0155j7587l2145l3219m1809n6977m3499
764h6184j089M5055N8346N0134M3865M7490L6435k533n1508o5640n2320l1344
776i293k6055j7859J1099N2777O8984M8689J4261n383j8326l8274p3128r1440
788h3948o9205k1511J2564K5027M1946P0217Q3274O2781R008l4639n4749o3957
800b3192p5846q7766o7506j3763M0186O8714P6745Q2154R1716P4594K5874l2558
812A59352o5830p2878p0457p1808n9555j8417M3189Q0015Q6157P6459O7985O3650
824B17862K7208k5775p0015p8582o6771n3894m8140k4761K1296O1436P5083N5365
836I0312L4932K5764R299k5386o4672p6690n7206l1088j7600p894J1118M5658
$$ y = [-175149, -142426, -100476, -32859, 49146, 118897, 139052, 121465, 89320, 56101, 14292, -42685, -86184, -87273, -42218, 16128, 66262, 110127, 157617, 194052, 191519, 140011, 74371, 22051, -9293, -35348, -53207, -42108, 10669, 79653, 128342, 142603, 137220, 118894, 80620, 7492, -83948, -153153, -174664, -162100, -137073, -95127, -24910, 58364, 121145, 130153, 95514, 40765, -23192, -99038, -186804, -254310, -268073, -227887, -159173, -82428, -274, 91442, 166036, 191910, 159352, 93522, 20644, -49813, -121621, -181176, -199593, -156404, -76389, 9768, 86227, 154212, 217862, 245070, 219295, 149280, 70698, 3927, -49967, -98107, -122868, -101572, -40136, 34947, 90312, 125244, 151008, 160307, 134921, 70249, -6441, -63647, -94735, -112335, -120229, -109111, -63453]
848f3453N7002L8466N402j2701j5466k3601m2134n2637l2556J0046L5141L7945
860e8546L4105M2847M5318K0795j9228n2593n6142l9603l3619k7051j441L8712
872a06446Q0131Q7043O6811M6232K6489N184l9086q1584r4366p0572l8779j4258
884a33201R482M2332Q5486R6182P5482L5360L877j9159m7527q0931j00944q4427
896a17988m0518n430J4912L5332N9212P6261O4661K1811j3928l2373m1753n3770
908c3571o3960n2719j3988K4649M2330M3564M1428M7801L9626O714l1465n1439
920a030m5622l2168l0593j9600J0444M8807P2235O5150M3566L1893J9426n591
932A56917m3185o5943o4222m0085j8752o690J4633M6495P4174P2131M6065J4109
$$ y = [-63453, -6451, 32015, 37417, 24716, 9250, -14351, -56485, -109122, -141678, -131632, -96491, -58546, -24441, 18406, 63724, 84519, 65291, 12698, -43444, -83047, -116666, -143717, -145158, -106446, -26315, 60728, 127539, 173771, 200260, 205444, 166358, 84774, -9592, -80164, -118943, -133201, -123719, -81387, 4099, 100281, 175763, 211123, 215000, 195841, 148314, 67383, -33561, -117988, -158506, -163936, -149024, -113692, -54480, 21781, 86442, 108253, 94325, 61952, 20199, -33571, -97531, -150250, -164238, -139589, -97259, -53695, -12267, 35534, 75160, 81874, 50409, -1030, -46652, -78820, -109413, -129013, -118569, -69762, 2473, 67623, 111189, 143082, 162508, 156917, 113732, 47789, -16433, -56518, -75270, -81960, -67327, -20832, 53342, 125473, 171538, 185647]
944A85647k347k2847n4757p5837q3495n4813k0251J099J7399L4725N6918O3055
956D4496L7856K037k1959l0537m2876n4062n7487l4238K588L4248M2584L5250
968d2100M3648L9987J8698j9582m4907m9189l5125k3721j2605M318M3457O7270
980i851O9596M7222K2183M768j4801m2349o9502o7564m1371j892K3321M2660O4125
993B6545Q2030Q1719M8208J834l3985n7100p1032r0576r1427o2855j4874K5250
1005a56263M5690N8262P2896P5282N2826Q512l3966n4527o1816o6320p1573n5091
1017a86088j7595K2461M2899M7437M8921N3492M7959J9168j4321l3139l1807k9452
1029c0065l1213k6575j2100J9853L5443L1215J9903J6970J6536O974j3437k4886
$$ y = [185647, 183300, 160453, 105696, 29859, -53636, -108449, -128700, -127601, -110202, -75477, -18559, 44496, 82352, 84389, 62430, 31893, -10983, -65045, -122532, -156770, -154182, -119934, -77350, -42100, 1548, 41535, 60233, 40651, -4256, -53445, -88570, -112291, -124896, -120578, -77121, -9851, 59745, 106967, 129150, 133918, 119117, 76768, 7266, -60298, -101669, -103561, -80240, -37580, 26545, 108575, 190294, 238502, 240336, 206351, 149251, 78219, -12357, -103784, -166639, -181513, -156263, -110573, -52311, 20585, 95867, 148693, 157205, 123239, 68712, 6896, -59424, -130997, -186088, -203683, -181222, -138323, -90886, -41965, 11527, 59486, 78654, 64333, 31194, -613, -30065, -61278, -87853, -99953, -80100, -44657, -13442, 6461, 23431, 39967, 46941, 33504, 8618]
1041H618j7472L720J4406J7920K3175L2047M2318L1505J293k4061l9081m4510
1053D9878n2758n9330m8175j4097K3247M4639M9745N6378N9635M4373J1011l6138
1065A28408o2062p0169p0400o8271n6162j8320K9144O2963P4846P0845O5531M9615
1077A35968J7623k4951o3200p4192o2188n0845l7156j1378K8893N8454O5734N5242
1089C8004L6058K1725P193k1192m1858m7555l1805k999P341K0168L2421M5985
1101F3486M2368K1413r220k9154l4617l6208m3444l9601j7415J3536L5205L9255
1113E604L3234L2433K3353O353k8633n1036n4940m8563l7698k5468q049K3930
1125a29480N6984O3095N5255L9741K8198R825j8244n1128o4761n9160m4872l0349
$$ y = [8618, -8854, -5134, 9272, 27192, 50367, 82414, 124732, 156237, 157530, 133469, 94388, 49878, -2880, -62210, -110385, -124482, -101235, -56596, -6851, 49527, 109162, 153535, 164546, 128408, 66346, -3823, -74223, -142494, -198656, -216976, -187832, -124869, -50023, 20822, 86353, 135968, 153591, 128640, 65440, -8752, -70940, -121785, -158941, -170319, -141426, -82972, -17238, 38004, 74062, 95787, 102980, 81788, 39930, -7625, -39430, -42429, -35088, -14920, 17501, 63486, 105854, 127267, 118047, 88893, 54276, 18068, -25376, -64977, -82392, -68856, -33651, 5604, 38838, 71271, 94624, 100977, 72344, 21308, -33632, -82195, -119893, -145361, -153410, -129480, -72496, -9401, 45854, 85595, 113793, 123618, 105374, 54246, -10515, -69675, -114547, -144896]
1137a44896j4932J1466M4059O3833O0575M6799K9244J6634l699l3273n2148m8979
1149b5317l2358j2773J746J2646L6549N0656M6700K6851L482j2047j9799l4989
1161D1347m4001l7475j4761J1772K8799K8836K9383K8980J5637j0086l9644n5038
1173a6251n1633m0624k6580p968K4691N2987P2521O9125M6224K4586ol0682o5230
1186E1160q2942p9625n5335k3860M36K8788O1036P9968P7002N1469K0958m918
1198A24137k1350m8153o4404o2659m1159j1190J2211K6612M2585N5863N6411L8706
1210A07610Q520p410k0267k6309l4498l4576k6495J81J3562J8492J4896J6220
1222B9926J6295O806j1486k7666k7113j9712r547m555K391K2903L9502L8185K5746
$$ y = [-144896, -159828, -148362, -104303, -40470, 20105, 66904, 96148, 112782, 109083, 75810, 23662, -25317, -57675, -70448, -68702, -56056, -19507, 31149, 77849, 104700, 108182, 96135, 76336, 41347, -2654, -40129, -54890, -43118, -14319, 14517, 43900, 72880, 88517, 78431, 38787, -16251, -67884, -108508, -135088, -143056, -118365, -65378, 7143, 76268, 122492, 147078, 147072, 116390, 51160, -31782, -111407, -166742, -190602, -190166, -161378, -100342, -20374, 56628, 108097, 129055, 124137, 102787, 54634, -9770, -72429, -113588, -124778, -112567, -85955, -43370, 12493, 68904, 107610, 116130, 108720, 88453, 62144, 27646, -6930, -33425, -33244, -19682, -1190, 13706, 29926, 46221, 53027, 41541, 13875, -13238, -32950, -42497, -47052, -44661, -21758, 17744, 55929, 81675]
1235H1675Q565l623j7432l4704n2836n4691l6470j7457N321J9505L8056N5535
1247h556O1212M4205J5910q578k8197m1941o4512o3834m7370j5402J5896L6595
1259a04572N2555O6583O7557N5152K2008j3260l5504m7257n5038n7308m6083j7308
1271a12475J6965L6744M2751M4722M0198L0442M670k4506l8534l8718l1580k3628
1283e2949j3008N719K6733L8764L2901J6328M106p502j8569l6405m3136l2990
1295h0008j2788R196K0787K9566L9635M3018L0184M762k1160l1560m2254m3739
1307e4361m3819l0551k874K4502M1244M7967N3368M9790L9317J2525j5842l7630
1319H3636m4320m6426m4234l7743j5429J2767L3389M2685M0294L9269L3364J3802
$$ y = [81675, 90240, 86617, 69185, 34481, -18355, -73046, -109516, -126973, -121652, -102147, -64091, -8556, 52656, 96861, 112771, 104193, 75996, 34055, -30457, -94291, -141661, -157063, -141167, -104572, -52017, 14566, 82123, 137275, 159283, 146023, 110519, 63262, 8224, -49084, -95167, -112475, -95510, -58766, -16015, 28707, 68905, 99347, 104017, 79511, 40977, 2259, -29321, -52949, -65957, -60238, -33505, 5259, 38160, 54488, 58594, 51092, 32523, -3882, -47018, -80008, -92796, -83600, -62813, -33247, 6388, 49406, 79590, 84352, 63192, 31632, -10622, -54361, -98180, -128731, -131605, -107103, -65859, -17892, 35476, 85266, 124583, 137108, 121266, 83636, 39316, -7110, -51344, -89087, -104516, -91749, -58360, -15675, 24619, 63888, 97252, 111054]
1331A11054r155l0189l9389l7323l2879k4374j4108P718K7702L4241L1076J5616
1343C9990J1020m43j4389l4068l8018k3505j0007J604J2355K3681L4605L4005
1355C6830K1807k74j9282k5910l6441l9085l6683j8142J1607L3199M6506M7804
1367B1936M6879M0819J8782j0633l5868n2292m8848m3147l5120j3806J5989M1747
1379e3562N5244N3321M2999K8585R061j5718m3500n5273n1181l6576k1402n186
1391i3188J6194L5326M8651M1596K3296J0810k935j8806l1903m4554l7977j9064
1403g2554m607P842J6071K9416L1761K9335J0295q339j5276k0697k4868k8279
1415d9900j8565M04J5791K7067K8009K7367K3344J6638k085k0551l2265l3805
$$ y = [111054, 101899, 71710, 32321, -5002, -37881, -62255, -76363, -68645, -40943, -6702, 24374, 39990, 51010, 50567, 36178, 2110, -35908, -59413, -69420, -67816, -55461, -31780, 2825, 36830, 58637, 58363, 39081, 13171, -23270, -62355, -99038, -117180, -105573, -72374, -25868, 21936, 68815, 109634, 128416, 117783, 81915, 29623, -19225, -62372, -97492, -111298, -95309, -53562, 1682, 55003, 98002, 126587, 135648, 119930, 76430, 21157, -30024, -66600, -88002, -93188, -76994, -41668, 6983, 48579, 71875, 82685, 79750, 60944, 29041, -15513, -53490, -72554, -77161, -69319, -53248, -23832, 7929, 37264, 47559, 39220, 23944, 3247, -21621, -49900, -68465, -68061, -52270, -25203, 2806, 30173, 53517, 70155, 68070, 47519, 15254, -18551]
1427a8551k6124k1073j0251P436K9140M4992M3845L0164K2777P188j0221l3252
1439F6070m8674m8789l8839k0717p005J2180L1871M9821N0811L7929J7512J975
1451A04145j8192l6357m9263n0976l7139j5657M920J6402L2790M3627M1122K8278
1463F3700N564j2645k4470l0755l6149l2367j8919N208K3285L2973L4224K9910
1475C9559K2575R067j4757l2440l5478l2886k0768j2366O187K3780M1018M5206
1487C8697L3655J7605O969j1575k7092m4738m5707l4395j6263O19J5394L2226
1499c4605M2904M3654L1597J2166p258k1015l3496l9516m2173l0963j0125O673
1511h2157K1102L0825L3696L6748K5542O343j1811k5791l0376l2835l0218k2278
$$ y = [-18551, -44675, -65748, -75999, -68563, -39423, 5569, 49414, 79578, 102355, 109543, 99322, 66070, 17396, -31393, -70232, -90949, -97954, -85774, -53903, -4082, 46729, 84658, 102170, 104145, 85953, 49596, 333, -50643, -87782, -103439, -98519, -82117, -49327, -5700, 35422, 63700, 69264, 56619, 32149, 1394, -34755, -67122, -86041, -80833, -57548, -24575, 9649, 39559, 62134, 71201, 56444, 24004, -11474, -44360, -65128, -77494, -71307, -47527, -6509, 38697, 72352, 89957, 96926, 85351, 58259, 13521, -32186, -66581, -82844, -82225, -66831, -34605, 8299, 51953, 83550, 95716, 88458, 67443, 33947, -5569, -47742, -78705, -88830, -82157, -61055, -30230, 3466, 40214, 65756, 72099, 60288, 34497, 4121, -28714, -58932, -81210]
1523h1210k780J8544K9353L1828K9058K7061J6647j277j9404l0922l3550k4552
1535d1204j7470r376P517K5400L6499L6561K4359J2836L268j3798k9421l6571
1547a400l4647k0049p463O754K1104K9426M0068L2049J9303k809j6040k6970l5205
1560D121m3202l2076j5786O671K4300K9803L7361L8268K8822Q857j3300k8872
1572D4967l7519l7003l4096k5424n359J4997L1981L8606L5609K9034J8173K256
1584G6222j8107l4501l5734l0325k0059q048N648K0638L4073L8221K5097J2686
1596F5811J373r312k3224l4282l1152k3111m801O622J7555K6826L2467L0888J8551
1609G4211J288j5334k4126l1046l3048l0404j6873Q53J8957K7769K9254L0949
$$ y = [-81210, -83990, -65446, -36093, -4265, 24793, 51854, 68501, 67224, 47820, 16898, -16652, -41204, -58674, -68050, -60533, -35133, 1366, 37927, 62286, 75122, 78390, 64592, 35171, -1400, -36047, -56096, -63559, -56805, -35701, -6275, 33793, 65842, 85145, 82336, 66296, 39326, 4121, -39081, -71157, -86943, -80272, -55972, -26169, 11192, 49460, 78282, 87139, 73839, 44967, 7448, -29555, -63651, -89075, -94434, -79437, -47456, -8850, 26759, 55793, 73966, 76222, 58115, 23614, -12120, -42445, -62504, -70552, -64904, -44266, -10193, 28028, 53125, 65811, 67184, 57872, 34648, 366, -30786, -53897, -58698, -52076, -34521, -7695, 24772, 55660, 74211, 75499, 60165, 36039, 4993, -28055, -58459, -75332, -74479, -55522, -27753, 1501, 32450]
1621C2450K7882J3142m842k1249l0722l4008l1365k4513j2331O798K5163L1684
1633b1911L1933K9177J9069O851p089k6714l3903l2472k0394j2116K19J3822K6674
1646b6854L8294L3191J9200O133o234j8790l0292l4298l0980j4949K785J3091
1658d9703K4778L1617L4504K7612J0642q417j8168l0996l1688l2932k3915q053
1670g4719J1933K5174L0124L3949K6786J9063j909j7390k9661l4530k8631k2858
1682f2669j1580L186K0874L2945L2932K6791J7869P553q016k5774l6072l3991
1694c5952k3655j2781K278J3967K7125L8230L4638K1931Q292o030j7946k7041
1706B3056l5171l1251j9029k167J2691J8695K9516L2586K9684J3682j852j3933
$$ y = [32450, 60332, 73474, 68632, 47383, 16661, -17347, -48712, -73225, -85556, -78758, -53595, -21911, 10022, 39199, 58268, 65119, 58030, 31316, -2587, -35059, -55453, -67569, -67350, -53528, -26854, 11440, 44631, 63831, 69964, 63730, 44940, 14648, -19650, -50630, -65579, -62794, -49703, -24925, 6692, 41196, 68808, 79450, 71033, 52865, 21869, -9819, -42751, -66666, -74719, -62786, -37612, -7488, 26461, 53247, 72310, 70401, 53011, 23350, -11180, -39811, -62669, -74249, -71063, -50189, -17244, 15688, 42479, 60348, 67901, 59885, 34111, -1961, -35952, -59607, -72388, -70110, -56143, -29018, 9212, 43850, 65781, 74073, 68043, 50097, 23056, -12115, -43366, -62395, -64562, -51871, -33176, -3660, 28926, 58610, 72292, 70440, 56507]
1718E6507k7911k6244k9792k4349j0761N732J9939K6636K8559K2532J6874M854
1730F2576j0717k5060k9957k7489k2978j3730l69J5884K7184L5438K9513J7167
1742E7462P549k643j9409l2750l4296k8484j4164m366R513K2279L1223L5973K9127
1755E7014J3233q11j1788k4169l0791l3383k4467r676N140J5740K7143K7501L1708
1768D2394J9462L122j1576k1576k6709k7764k3213j6920J627J5391K6367K8535
1780I140K6676J7894Q256n469k3705k9990l0669k3420j5278k488J1515K5118L3465
1793A045K9638K2640Q002n19j7749k4800l5129k8901j8263m359Q058J8526K9691
1806a2120L4930K9513J4098j001j3933k1143k9441k8737k7976r911M969J6970
$$ y = [56507, 28596, 2352, -27440, -51789, -62550, -56818, -36879, -10243, 18316, 40848, 57722, 62576, 51859, 26799, -3158, -30647, -53625, -67355, -67724, -51840, -24656, 10782, 40295, 57462, 65011, 62368, 42959, 10209, -24087, -52571, -66735, -71101, -61588, -39309, -8086, 27887, 57014, 70247, 69436, 57648, 33479, 2688, -30695, -55162, -64838, -59698, -43958, -16815, 10686, 42394, 61856, 64978, 53402, 31826, 5117, -22647, -45860, -62780, -61153, -45762, -19395, 9140, 35816, 53710, 61966, 56497, 32792, 2802, -27867, -51287, -66565, -69053, -57538, -32420, 1045, 30683, 53323, 61325, 60806, 43057, 18257, -16872, -45773, -64036, -68395, -60337, -41811, -12120, 22810, 52323, 66421, 65420, 51487, 30344, 903, -27834, -55810, -65721, -60752, -43782]
1818d3782K5514K9520K8990K1260O758p281k0265k7665k8662k4480j8890n224
1830f4207J1805K3290K8835K4929K4333J1334q5j2958k3020l0319k6132j7142
1842d9337q007K744J4569K6829K7701K3318J1288J843p695j8524k6827k7599j8625
1855d8322q036N329J4717K3933K7306K7800J6691K843j2969k0712k6017k9020
1867b6457k4933j7510K858J5092K7882L1361L0567K5552J3287m774k0270l1024
1879B1631l1937l0294k2057j0465P266K0607L0854L2735K7614J7009P485q523
1891F1925k3013k9551l0375k1896j3313j78J2689K1284K7088K4953J6000K648
1903D8261m737j4683k2937k5526k1150q532L884J1687J8502K2924K5213J6866
$$ y = [-43782, -18268, 11252, 40242, 61502, 68260, 60979, 40714, 13049, -15613, -40093, -58983, -64207, -52402, -29112, -277, 24652, 48985, 60319, 60234, 47276, 24256, -6063, -32195, -49337, -57344, -54600, -40031, -13202, 14499, 37817, 49105, 50948, 43253, 24729, -2098, -29697, -48322, -56358, -51029, -36312, -12379, 14927, 42727, 59418, 62261, 49292, 28580, 2563, -26457, -51390, -68900, -66042, -50950, -23068, 8293, 38860, 64412, 77699, 72925, 52655, 21631, -10306, -40600, -62657, -73122, -65856, -45249, -14395, 18340, 45954, 62963, 70448, 61925, 38912, 9361, -21014, -42910, -56223, -56401, -43712, -22428, 4660, 29613, 45613, 48261, 43524, 28841, 5904, -19622, -40772, -49304, -45420, -33733, -15231, 7693, 32906, 49772]
1915D9772L006o688j9563k3620k3394k3467j3766R42J1774K5030K5464K4814K0657
1928E0961J0912J31j7239k7586k8764k7131j8108j0233M443J8366L0578L0504
1940A6834K4510J7024P818o707j9886l0217l0704k4931j4667l377O227K1007K7533
1953i536L0039K1691J2674j225r260k1338k6885k6467k0746n616M864J3920K0539
1966a7346K4963K3872J3841J786j0111j7092k0854k1948j5682q072L989J6073
1978b6581K2688K3004J8620J1698L63j1133k2847k6183k2857j6274p108N123J8055
1991c3432K7828L2084K2533J7092L232p321k4004l2067l3541k6774j4849k420
2003g1639J1770K2975L2530L3030K6581J4674j114j1934k4686k9513k9075k4772
$$ y = [49772, 52778, 46090, 26527, 2907, -20487, -43954, -57720, -56778, -45004, -19974, 5490, 30304, 50961, 61873, 62004, 44765, 17179, -11585, -38716, -56824, -67057, -62614, -44248, -13670, 16834, 41344, 58368, 66186, 59479, 39593, 9376, -21328, -46259, -60926, -64303, -58076, -37069, -9536, 20503, 42194, 54868, 53643, 44383, 23045, -3840, -30307, -51053, -56669, -51805, -37885, -17346, 7617, 31489, 45330, 47116, 37005, 19913, -941, -22889, -38571, -46643, -42654, -26581, -3893, 19111, 37731, 49429, 49792, 38659, 15812, -10371, -33228, -49502, -56610, -51487, -33432, -5604, 26480, 49013, 66105, 69337, 62016, 38012, 5945, -27596, -54370, -69219, -71639, -59869, -36894, -4364, 28666, 55247, 69921, 68807, 56873, 32187, 2674, -26401, -51173]
2015e1173j2289J833J1183J9849K5608K6115K0268Q045j112j4210j8246j9591
2027c720j8867j1939k616Q308J7680J4678J6355J3506L917l887j4612j9603j8613
2040a9413j3304n556k77J1860J9049K5728K0014J3707L589p411j7918k4608k8028
2053b2568k5091j3350j353J1026K0529K9652K9204K7161J4207r00j3437k2915
2065C2165k9839l2360k6524j4458K49J4221K5072L0796L0336K4256J2202k790
2077F3326j6345k2924k7241k3646j9010r586M001J5446K2148K4633J7376J3896
2089D2074L502p802j8282k1350j8364j4384l467K478J2661J9001K0367J2742N401
2102C4577k273j0512j7683k1195j7825q142k34R011J6932K2426K2346J9149P844
$$ y = [-51173, -63462, -61629, -50446, -30597, -4989, 21126, 41394, 49439, 48327, 34117, 15871, -3720, -22587, -34526, -37142, -28834, -11154, 3524, 19879, 33385, 37302, 33415, 18803, -800, -19413, -32717, -38273, -38550, -26690, -7641, 18087, 38101, 51808, 55397, 47986, 30068, 5460, -22568, -47659, -61009, -62362, -51336, -30807, -1155, 28049, 55210, 69417, 68517, 55080, 32165, 2326, -30034, -56558, -71016, -70767, -56546, -31474, -678, 29658, 53914, 66116, 63326, 46981, 24057, -3184, -26830, -45840, -55426, -51425, -35979, -13831, 10802, 28178, 42074, 45576, 37774, 19492, -1858, -20222, -34606, -38073, -35595, -22934, -3933, 16434, 29176, 34577, 32304, 21792, 4109, -17086, -34911, -43053, -43287, -34276, -17344, 5082, 27428, 46577, 54421]
2115E4421m140j6336k1280k6197k5987j8872q228N201J8576K5304K9753K6124
2127C8339K0352R938n693j6044k6472k9037k7743k0488r229K122J7022K4607K8162
2140E836K5936J6112R709k323j4417k1695k4414j9233j4927l743K329J1341J9300
2153a0189J9007J2880Q597j864p621j2621j7347j3513n285J11J0282J4322J5633
2166A2392J7085R495K10r282j6394k1065k0877j7683o559J619J6814K3278K7523
2179A6556K4003J8199P377p060j6111l1114k7792k6288j7396q893Q102J9524K8020
2192a2873L1090K5888J6320O233o218j5345k7367k7373k5039j5293l235L132J6523
2205c3557K0579K4893J8665J0987j419l695j3748j7453j8434j3250l763K711R776
$$ y = [54421, 50281, 33945, 12665, -13532, -39519, -58391, -66619, -61418, -42842, -17538, 12215, 38339, 58691, 68629, 62936, 46892, 20420, -8617, -36360, -56848, -66077, -63955, -46933, -22326, 5836, 31772, 47884, 57593, 55270, 40853, 19158, -5256, -24489, -39416, -43159, -40830, -29489, -10189, 8818, 21698, 30295, 28431, 20810, 8189, -9158, -22671, -27956, -27845, -17563, -3241, 12392, 29477, 38972, 39182, 29900, 13506, -7559, -28436, -46119, -52678, -51059, -34245, -10967, 16556, 40559, 58758, 66135, 59075, 42964, 11850, -15942, -42230, -59626, -68519, -60417, -40893, -12873, 18217, 44105, 60425, 66658, 60440, 45095, 17728, -9645, -34684, -49977, -53212, -50080, -33557, -12978, 11915, 30580, 41567, 40148, 36453, 22705, 5252, -13182, -26432, -30195, -27484, -17708]
2218a7708J1657J4576J3339O110j882o453j3479j2636j4095q923k738P674J2536
2231a2022J8300J4998J0859N644j429j3474j7378k1011j9980j1292n332O543J6587
2244b8987K1237K6383K3306J4169L694o733j8774k7270k8402k5077j4452m581
2256f5487Q511J7553K6992K8378K5805J5534K129n915j8174k3998k6576k2993
2268c8241j3332k949Q973J8619K0189K2682J6956P459k241q841j5787j6204j5690
2281a8407r031k796M979J3864J6295J3463P490K119n983j2647j9234j4502j2622
2294c7012k145M500J3616K0309K2513J8480R119j434j0579j6832k4784k2927k1500
2307d8676r859J236J0832K0924K4957K7462K1113J2656j421j2656k0025k4075
$$ y = [-17708, -6051, 8525, 21864, 27974, 26092, 19639, 6160, -6476, -20571, -29494, -32232, -24558, -12022, 6278, 21276, 32135, 37779, 36350, 22876, 5498, -15513, -35493, -46785, -52117, -45574, -28987, -7750, 18633, 41939, 56108, 59802, 53069, 34295, 7025, -21377, -46454, -60906, -65487, -56976, -39423, -12431, 15947, 41752, 57286, 59415, 53500, 35326, 11328, -15248, -38241, -51573, -54522, -45549, -26930, -6741, 15941, 32897, 40356, 38115, 29274, 13487, -2717, -18407, -27438, -30234, -25255, -11391, 4904, 18367, 25857, 27976, 21993, 9346, -9888, -24390, -37012, -39157, -34657, -21041, -732, 21781, 40261, 49380, 47946, 37367, 20535, -4249, -27176, -48676, -58535, -57299, -46467, -25543, -586, 26876, 47989, 60645, 59224, 46568, 26543, 2468]
2319B468k6594j8013j2856O2J0386J7918K3494K2170J8852J1055p77r354j5944
2332B2867j9789j7848j5119p354K444J0006J3500J7041J2324R269L434n310j2132
2345A3333j2088j4788q148n165K786R727J4412J5310J2496O936k444q163j5112
2358I092j9127j7118j2864k384O473J3384K1555K3184J9258J0626J800j2068k0799
2371B1012k2777k2947k1213j1772K317J2597K4568K6104K4737J8866J0372l259
2383E8605j6930k4609k5880k4114j8208o061M349J8141J9643K4785K0876J1702
2395D2299N094q572j2820k0931j7794j6297o993K204Q150J4243J6274J3655P285
2408B5797j76p100q845j3636j4446q256k145N425J1489J1561J5327J2503M905
$$ y = [2468, -24126, -42139, -54995, -54933, -44547, -26629, -3135, 19035, 37887, 48942, 48165, 38811, 22867, 3078, -14770, -29889, -37243, -34799, -24793, -11293, 5748, 18072, 27341, 30775, 25465, 13333, 1245, -13543, -21691, -26856, -24070, -14343, 69, 15379, 27875, 34811, 32367, 24204, 9092, -10035, -27153, -40017, -42401, -35928, -22544, -989, 22195, 41453, 52079, 53879, 41811, 21012, -1765, -24712, -45925, -57697, -55380, -42783, -18215, 7889, 32626, 51492, 61864, 58605, 41675, 17066, -8814, -32928, -51136, -57197, -52848, -34707, -15064, 9721, 30597, 42299, 47393, 38821, 26001, 5070, -12724, -29021, -36014, -33810, -25660, -11417, 4857, 18512, 25797, 25621, 18521, 9676, -3960, -18406, -26662, -28807, -23382, -11893, -332, 14995, 27498, 32403]
2421C2403j473q367j6548j6363j6497j1577m831L813J2126J8106K0700J6744J2207
2434D0443O749k089j3336k0383j9943k0859j4787o797K401J2761J8131K2524J9704
2447B4519J4921Q423l544r936j9322k0912j7750j2506o305L257J1366J6566J9107
2460G884J4768J1090K217o681j4075j5349j5826j2632n946N937J0397J4714J6641
2473A3139J3565P210k029j0097j5523j7332j4415r585l799P196J3985K1476J8234
2486B2025J4495Q535k955j1282j8942k0769j9860j3388n381N545J3239K2031K2589
2499A5882J6838J3498J946o882j5794j9626k1518j6181j0708n80Q041J4548K0621
2512H5J8378J5207Q299j312r996j4047j8690j5333j2761n665M315P305J4905J2383
$$ y = [32403, 30930, 22563, 6015, -10348, -26845, -38422, -43253, -39440, -27314, -9208, 11492, 28236, 40443, 47192, 45103, 31767, 11384, -8559, -29418, -44205, -51002, -48601, -35840, -17709, 4815, 24519, 39440, 47863, 44319, 34383, 15061, -5851, -23601, -36107, -42412, -39155, -27789, -11223, 7884, 22652, 33742, 35959, 29278, 15203, -146, -15972, -28604, -34550, -28613, -18216, -3502, 13139, 26704, 33914, 31885, 21788, 6265, -11067, -25482, -35067, -38866, -31670, -17685, 3791, 22025, 36520, 45055, 42100, 30818, 11876, -8893, -28753, -42141, -47522, -41977, -28738, -6707, 15882, 32720, 46218, 48164, 41282, 25488, 5862, -15656, -31837, -42545, -43125, -35084, -20536, 85, 18463, 33670, 41969, 40657, 30661, 16614, -2076, -17409, -30170, -35835, -31520, -24215, -9310, 3073]
2526C073J5878R538K931l522j1717j1823j2627j1735q206J632P917Q946J4238
2539D523J3329Q539J086k002r910j4321j5110j1867n794j385O633J5210J7598
2552F529J5074J2613N796l657j0209j6532j9551j8828j2089n742O335J2448K0194
2565g619K0042K0244J3518J03o509j5636j8749k2770j6989j2738L99J0524J6038
2578b0142J8480K1476J5036N390j734j2805j6793j7334j6238r880k346Q288J2806
2591a5796J6579J5793J0408M799k554j0535j3896j7072j4043o530o99P196J3833
2604a2517J6369J6227R914N346l175j0174j4565j6625j4982j0402k331M034J2659
2617b0222J5253J6620J3718R771K648q404j2319j6104j5713j3868q072J246N653
$$ y = [3073, 18951, 28489, 31420, 27898, 16181, 4358, -8269, -20004, -28210, -26578, -18661, -9715, 4523, 17852, 26391, 27477, 25475, 15565, 1244, -13866, -25733, -31527, -32912, -26279, -11069, 6529, 21603, 34216, 40012, 36355, 26146, 9614, -9937, -28765, -40854, -46596, -40261, -27813, -7619, 12423, 32667, 46185, 46288, 39779, 24143, 5394, -17376, -34365, -47103, -46704, -36180, -20142, -1662, 19814, 34850, 40240, 38506, 25701, 8908, -8426, -24664, -34544, -36890, -28602, -15796, 783, 16576, 26984, 31783, 29229, 18694, 4798, -12274, -26317, -32847, -33546, -26350, -12517, 3852, 20079, 29993, 35339, 32164, 21990, 7425, -9200, -24182, -34584, -36915, -32881, -20222, -4969, 11651, 25369, 35140, 37788, 29384, 17065, 961, -14752, -28620, -36692, -35446, -29793]
2630b9793J4833J3819J8024J2294O033j014r016j1962j6849j5420j2431j746K362
2643c0866Q931J5237J7045J2809R669K157n483j3272j2544j6769j3188o550r65
2656c3789Q901J3150J7522J5374J1321K697k761j1595j5734j7065j2854j0831
2668c5664K184R112J2532J6969J8277R909L251l656j1072j5927j7653j5987r128
2681c6853j15O664J5859J7605J6948J2584P427k010j0538j6581j7664j6592j1750
2694c5016m268N206J3273J5196J6556J5932P121J206n059j1979j6579j5652j0130
2707b4193n834j314Q408J1411J3869J5465Q530M896m648r827j3187j1947j3815
2720b2186o019m57P601J0133J1374J3102J1962M612l987q453j1779j4577j1834
$$ y = [-29793, -14960, -1141, 16883, 29177, 35210, 34196, 25180, 13218, -3631, -19051, -31482, -33228, -30866, -21935, -6698, 10347, 23156, 32825, 34982, 29499, 16227, 3683, -13086, -26274, -32824, -33789, -24888, -11738, 5784, 21158, 32479, 35176, 32415, 20820, 5086, -11979, -24833, -35664, -33480, -24368, -11836, 5133, 23410, 33319, 36570, 32914, 21842, 5915, -11738, -27725, -36853, -36968, -30304, -14445, 3160, 20108, 32692, 40119, 38109, 27571, 10990, -6674, -23266, -35016, -39284, -34078, -20805, -5609, 10947, 26879, 34000, 35206, 30147, 18168, 1589, -14063, -24193, -30027, -31341, -22933, -11522, 2347, 17812, 26342, 31238, 26590, 16763, 3576, -8371, -22186, -28205, -28662, -21061, -10928, 446, 13548, 25510, 30122, 26135, 17682, 5903, -8674, -20508]
2733b0508r676k692M373J0018J4179J4576J3045Q342J238n463j0865j6009j5895
2746a5337j1127p404r43O457J1303J8064J5389J1017N582j681r734j3850j4323
2759f587j5529q578l033M181J2201J4093J4839J2080P195l54p996j2335j3840
2772c663j5428r949m661K189J1421J6180J3489J4559Q125R39p370j3088j6202
2785c459j3487j0917o321K823R502J4377J6902J1538R603J399m258j1048j5095
2798A559j5264j0869p237L53P642J3995J5403J3819J0015K097k730q538j4795
2811E450j2455j3319q136j840N333J1259J1763J4256J1439Q377j938o806r754
2824A3629j2794j4012j0959m347l55Q721J1268J2967J2890P817L387k280r417
$$ y = [-20508, -30184, -32876, -28503, -18485, -4306, 10270, 23315, 31657, 32895, 27432, 16567, 558, -15337, -26464, -33868, -34811, -28354, -17051, 1013, 16402, 27419, 33001, 31320, 21586, 7736, -6587, -22116, -30694, -33727, -29546, -17345, -3252, 11587, 23667, 30862, 30508, 22512, 10177, -3663, -19091, -29040, -33701, -31512, -20091, -3911, 9578, 24137, 32262, 33201, 25831, 12743, -3459, -16946, -27863, -34184, -31361, -21859, -7482, 9420, 20958, 30561, 31960, 27702, 16654, 1559, -13705, -24574, -31811, -31458, -23816, -9821, 5582, 19401, 29416, 31513, 28783, 20245, 5450, -7005, -20324, -28460, -30300, -24967, -13708, -1945, 12311, 23750, 32127, 30189, 23383, 13629, 835, -13177, -24136, -28483, -28838, -20117, -8849, 4118, 17008, 24825, 28212, 25932, 16515]
2837A6515j0114j2041j1838o565j424O367R295J1864J1984P897O021j279q978
2850A7704j1702j2897j0967q734j939M613J0874J2484J4914R948N435K255p879
2863B4109j1401j7411j4393j1463l333K028R453J3154J7489J4749Q933L346n719
2876B9541j1098j4696j6500j2275q714K330N101J2749J1967J6292J0168M244r74
2889B8135o129j3586j5688r326j0132l392O606J0459J0709J2590J0586N453j752
2902B4533o595j2153j0605j4850n369k407L055R347J2645J2483R876N355L94o766
2916A8943j0002j3520j2618q471k714J535P467J2878J1566J2797P910L444m511
2929B4704q767j2925j1770j2790o860k359N842J0898J2546J5671R816N736m74
$$ y = [16515, 6401, -5640, -17478, -24043, -25467, -19100, -9805, 2059, 14043, 21940, 27961, 26682, 17704, 6002, -6895, -17862, -26596, -28535, -23922, -13048, -564, 14350, 24298, 29733, 31988, 24109, 12708, -4703, -19096, -30559, -33892, -31864, -22411, -9257, 8232, 22981, 31914, 35260, 29541, 18443, 3747, -12753, -25028, -33742, -31412, -26311, -13562, -1595, 14697, 24865, 29109, 28135, 22006, 8420, -7268, -16594, -26726, -30118, -23512, -13053, -2344, 10246, 20832, 26285, 24533, 17938, 5785, -4820, -19670, -25039, -27446, -24391, -15044, -2399, 10084, 19960, 25315, 25709, 18943, 8941, -4579, -17197, -25668, -28382, -26847, -19380, -6502, 5064, 17861, 25771, 29215, 24704, 15937, 3012, -8758, -21548, -28408, -30767, -24925, -14027, -1481, 14190, 24006, 29742, 29268]
2942B9268o176j0716j4171j3450q622n434R91Q195J1405J3030J4148Q544K514
2955B9526k659r079j3589j2923j0498p353N97N649J0141J2861R835Q264M931k736
2969B2967p276j1489j1806j0796n673j86N739J0191J3086J1715P374L986k329
2982B5503r038j4345j2311j2744n782k64O081J0625J4422J4869J0186O558r26
2995C2834n979j4245j4387j5661j0706m276M65R421J2913J5570J3480Q176N246
3008C2851l057p852j3860j3686j1384q221r1J556P940J2690J1682R837M856j017
3022B2244o320p897q821j1318p470r22L324P850Q315Q408Q924L779j507m390r801
3037D398q372j0476o198l049K522Q361J0359J2753Q876O317J607o883r482j2474
$$ y = [29268, 23092, 12376, -1795, -15245, -23867, -29301, -28310, -20115, -8710, 4320, 18468, 27012, 29526, 26867, 17788, 4199, -8724, -19222, -26575, -25978, -20329, -10188, 2673, 12508, 20772, 25703, 22967, 15691, 4202, -7604, -18400, -24073, -24259, -18520, -8329, 4757, 16472, 23846, 27832, 25503, 16465, 2120, -10191, -22935, -28717, -28981, -22900, -12275, 2147, 17016, 27202, 33760, 32834, 26855, 12610, -1777, -17438, -28144, -32420, -31955, -22534, -9621, 5949, 19429, 27605, 32851, 29794, 21942, 8082, -5604, -16988, -25209, -25300, -23744, -15804, -3114, 8568, 18405, 23261, 22244, 15924, 8027, -794, -12112, -19582, -20504, -17180, -9330, -1015, 7393, 16317, 20096, 18589, 14199, 4398, -3974, -14450, -20648, -23697, -21175, -12814, -2455, 10298, 19174, 25491, 27098, 20215, 10733, -1741]
3051a741j3079q980n946M76N507J3200J3364J2179R907N284j447o171j3081j5250
3065e778j3780r850m069N342Q379J3848J3545J2749O903J226m442q828j2474j4144
3079a1373r871o579K74L314J2526J0570J3642O657M743j774q768r083j0593q625
3093a4940p559K083K957R896R300J0515N550J274q88q661j1653r026r299k977
3107b3428N3P265Q906J4386J1419P361K176j906q589j3947j3362j1667q158q72
3121c0363M099R164J3959J4514J1628P789J909m186r294j4996j3236j1630p869
3134b8512m83L677J0178J2396J1785J0057P217J43m554q252j1180j0579r117k325
3148a9549P5N414Q126Q671Q861M404K853l890p196q455q646n127m355M062N826
$$ y = [-1741, -14820, -23800, -29746, -29270, -23763, -10563, 2801, 14980, 24887, 30171, 28724, 22553, 9472, -5778, -19558, -29408, -33477, -28135, -19756, -5908, 7637, 20386, 27289, 28515, 24073, 15245, 2771, -11373, -21244, -27823, -27549, -24235, -11709, -1139, 12503, 19160, 23903, 22129, 13361, 4278, -6315, -14940, -22499, -20416, -17459, -7563, 1737, 12252, 17802, 19076, 18188, 9527, -2126, -11152, -20451, -23428, -23375, -16110, -7204, 7182, 18601, 25962, 28138, 26232, 17643, 3696, -9666, -21333, -29491, -30363, -26264, -17100, -3141, 11373, 23001, 30790, 32699, 28513, 19219, 4223, -9013, -20643, -28512, -28995, -25318, -15140, -2744, 9041, 19098, 26315, 26458, 21904, 13652, 2472, -8107, -17224, -19549, -19474, -14060, -5934, 2737, 11598, 16002, 18855, 14965, 7769, -686, -9332, -14459, -18814, -14752, -8926]
3163h926Q642R938Q561L281P20o979p785j1916j0543q848l203L626P732J2048
3177c652J4661J0934P182K380m161j0209j4895j3390j3371p556n87N650J2371
3190a4643J2687J4522J2835M866J204o357j0837j4697j3002j0165m119J743M801
3203b1162J2192J0731J1846O592L145k261o286j2225r371q496k956j470M856O195
3217h670Q445R245O136J641l926p561n316p445q957j832L142N527N569R651Q615
3232A4264M955M08l701o819j0221j2035q135n130k38O092J0085J2412J1322R140
3246B2399O198m99o382j0396j3358j3297j0087n820K090N426J0862J1542J5151
3259A3829R993N393p10n550j1112j3066j1426q444m740J729Q649P690J0918Q936
$$ y = [-8926, -284, 9654, 18215, 21496, 22216, 15237, 7452, -4464, -15007, -23855, -27058, -23432, -15700, -3652, 11009, 21943, 29125, 31505, 27344, 17135, 2240, -11150, -24521, -32077, -32664, -27014, -14643, -1956, 12566, 25401, 30267, 31471, 25114, 14277, -420, -13422, -23587, -27706, -25963, -21162, -8970, 1761, 13607, 20199, 23344, 21083, 14797, 2572, -6799, -15295, -18251, -19721, -14865, -8670, -225, 9020, 15156, 16797, 12871, 5310, -6, -7451, -16408, -18240, -15098, -9571, -4002, 5649, 14264, 19219, 19627, 15926, 9107, -1114, -13149, -21284, -26414, -26652, -20560, -10475, 1937, 13259, 22399, 28597, 28098, 21716, 11320, -2038, -15335, -25422, -31242, -29152, -23726, -12864, -1322, 13829, 23822, 29215, 28505, 22955, 11843, -1223, -12649, -21093, -25833, -24104, -15455, -7765, 3153, 12089]
3273A2089O424J983l565m358r914r191p278k540K973N283P319P995O072M650j293
3288A6649o807p270j0094p640o039K436L130P641J1650J2445O575M119j576o490
3302A8729q999j4113j2219q094k856J640R144J1219J3889R559R247L383m673o701
3316A9155j0215j4760r999q040k464K066P754R027J1435J2217M780J578j636p148
3330A3750q314r931q513m323l62K268O771P840Q456N576J929m20n534o632n216
3345b655o997k580j618L826O819O665N681O211J13k035n522q177q676p078n239
3360b1262J987L952Q315J2198R288N237N341k711p073j0727j1159j1274r530j487
3374b8905K337P441J2244J3186J0977Q683L352l153r460j1604j1979j3213o409
$$ y = [12089, 18513, 20496, 16931, 12573, 2659, -6532, -13810, -16350, -13377, -8094, -775, 7220, 13292, 17942, 16649, 9842, 2572, -7522, -15162, -21201, -18765, -15635, -7994, 3656, 16101, 22676, 26795, 25219, 18729, 9730, -4383, -16602, -24696, -27552, -25912, -16768, -5549, 8340, 17899, 27146, 30529, 25856, 19155, 8940, -5820, -15819, -23859, -26323, -24257, -16503, -7476, 3959, 16176, 20956, 22534, 20898, 13750, 5436, -4495, -13008, -17331, -17693, -15425, -8654, -814, 7642, 13218, 15147, 14727, 9193, 2561, -2655, -9652, -12232, -13850, -10024, -3205, 3460, 9141, 15352, 15465, 13430, 7908, -269, -8945, -16023, -21262, -19275, -15323, -7008, 5190, 14478, 19715, 25056, 22345, 15272, 4545, -6614, -17888, -27418, -28905, -26568, -19127, -6883, 6303, 17280, 25963, 29315, 26162, 16702, 5098, -6881, -20094, -26503]
3387b6503j367L717P486J1755J0792J0009M962K496o066r161q314q863n484l126
3401a7667J059O093P818N442P890J334J312n244m762o678p540m888J131L555O717
3416d428P658O939O001J606k201n655r583p438r416n463q45M548O816R977J1062
3431I578P946M162M362n172p560j1008j0388j0004o007m96M098N306J2406J0732
3445G955R690N515K471n088p197r853j0006p835n316o89L530P210Q774J0456P044
3460A6661K777j535o326q301o799q322k217o13K821P567P099N896O139J276j540
3475A4583n933p836q552p272m171J308N951Q210Q520R503P666K28k552p347j0824
3490A482j0847r190m624j131N373R216J1452J1730P370N574j416p544q416j2115
$$ y = [-26503, -27870, -24153, -16667, -4912, 5880, 15889, 20851, 23347, 17281, 8120, -194, -9057, -14541, -17667, -16608, -10515, -2697, 2745, 10635, 11969, 13281, 8037, 3275, -3403, -10943, -15831, -14700, -11145, -4428, 3230, 10169, 16170, 17776, 15575, 9920, 337, -7101, -16517, -21980, -22825, -18277, -11461, -1484, 9578, 17524, 21686, 26048, 20876, 13316, 2308, -8080, -18084, -24091, -24587, -20489, -15183, -2777, 7955, 17645, 23160, 25631, 20543, 13346, 3493, -6513, -14348, -19664, -20353, -16823, -9613, -839, 9617, 16661, 19438, 17903, 11577, 3276, -3523, -11845, -14062, -14675, -11854, -4287, 2812, 8708, 14847, 16123, 14583, 8650, 814, -7738, -15010, -19181, -17873, -11922, -3712, 4808, 14311, 21977, 22205, 19653, 12306, 1482, -9365, -18555, -23179, -24310, -18937, -9721, 1731, 13461, 20831, 26405, 24989, 17445, 9029, -3086]
3504c086r000q346m417J989O668J0505R739R075P166J924l068o162q396q097p669
3519a1175o438P9K493N315P688Q180N734J291L54l778o311n532n927n264j453
3534a4744M494L867P286O002L545J520O84l280q765o534o558m336p54K944N295
3549i334Q165Q758O793M525q0l869o748j0295r714n748n074P37L769R460R789
3564A134R075R743K142j62m529q839r889j1457o748j820J184O402R123J0335Q116
3579A3810M174J840k677o875r400p441p267n663K908M724P944P983N732M302J842
3594A5936l225o102o399q752p774k55J966L542Q776O561Q519N179R90m636o800
3609G526r221p623o099l633K693K282J0547P910P649O242J869j778l752q127q505
$$ y = [-3086, -12086, -20432, -24849, -22860, -16192, -5687, 4052, 13127, 20293, 22217, 19149, 12987, 4591, -3506, -11175, -17613, -17534, -15041, -9726, -2038, 6142, 11876, 13167, 13521, 9743, 3432, -2100, -8027, -13291, -14744, -10250, -6383, 903, 6905, 10450, 11970, 12654, 9374, 609, -5925, -12483, -16819, -17573, -14629, -9334, -1169, 7589, 14382, 18907, 18827, 14958, 8210, -2085, -11799, -17547, -22621, -21884, -18115, -8655, 1134, 10209, 19952, 22094, 21932, 17403, 8564, -1325, -12782, -19530, -21350, -20166, -13764, -4641, 5694, 13810, 17984, 19824, 17147, 10272, 872, -6569, -13836, -19499, -16591, -11867, -3923, 4060, 9792, 14094, 15936, 12711, 6609, 210, -8542, -16316, -16571, -14605, -11063, -2287, 4274, 12793, 17972, 18962, 14326, 7526, -1695, -9318, -15417, -19050, -16357, -14075, -3528, 4382, 12031, 18273, 20142, 18364, 14612, 6485, -2020]
3624b020j0037n638j353L150O114O167J0350O186O341P1j884n242r260q631o953
3639a2639l940l75K554N344Q253P650O340L104K10m780o765p003n933o575j840
3654a6395L807M374N918N630P563L530j100j750o049q798m980p262k401L830M372
3669i711O796R561P883L125J87l656p163j0209o621q059k114R20M886R423J0254
3684E502P805N008K909k883p184q254j0367r092j840j262K623P464Q427R534P392
3699A5782K159j600l201o921r171o001n687k883J944M077Q863O915O599J737L17
$$ y = [-2020, -12057, -17695, -19048, -15898, -9784, -3617, 6733, 12919, 19260, 19331, 17447, 12205, 2945, -5686, -12639, -16579, -16954, -14400, -9056, -803, 6847, 13187, 16291, 16501, 11721, 4956, -2047, -7980, -14555, -16395, -12588, -8214, -2296, 3334, 10897, 14427, 13327, 11577, 5528, -3270, -8250, -15512, -17913, -14083, -9711, -2915, 6646, 14529, 17654, 17841, 14185, 7022, -3187, -9808, -17867, -19981, -19061, -14175, -4752, 5502, 13307, 18315, 21224, 18341, 11157, 2903, -7464, -16556, -18396, -19658, -17035, -9571, -1144, 8390, 15782, 17941, 16341, 13140, 6219, -2952, -8953, -14640, -17523, -15579, -11502, -2639, 4276, 10875, 12612, 12929]
$$ [...]
8191d85
##END NTUPLES=NMR FID
##END=
