##TITLE=1H_SAM_20.105
 CDCl3, 56 sc, 
 6.3.2019
##JCAMPDX= 6.0         $$ Bruker NMR JCAMP-DX V2.0
##DATA TYPE= NMR FID
##DATA CLASS= NTUPLES
##ORIGIN= UXNMR, Bruker Analytische Messtechnik GmbH
##OWNER= root
$$ XWIN-NMR		Version 3.5
$$ Wed Mar  6 15:32:55 2019 Russian Standard Time (UT+4h)  she@DPX200
##.OBSERVE FREQUENCY= 200.1316
##.OBSERVE NUCLEUS= ^1H
##.DELAY= (6, 6)
##.ACQUISITION MODE= SIMULTANEOUS
##.ACQUISITION SCHEME= undefined
##.AVERAGES= 72
##.DIGITISER RES= 18
##SPECTROMETER/DATA SYSTEM= spect
##.PULSE SEQUENCE= zg30
##.SOLVENT NAME= CDCl3
##.SHIFT REFERENCE= (INTERNAL, CDCl3, 0, 15.7039)
##AUDIT TRAIL= $$ (NUMBER, WHEN, WHO, WHERE, WHAT)
$$ ##TITLE= Audit trail, XWIN-NMR		Version 3.5
$$ ##JCAMPDX= 5.01
$$ ##ORIGIN= Bruker BioSpin GmbH
$$ ##OWNER= she
$$ F:/spectra/data/she/nmr/H-F/1/audita.txt
$$ ##AUDIT TRAIL=  $$ (NUMBER, WHEN, WHO, WHERE, WHAT)
(   1,<2019-03-06 15:28:38.56 +0400>,<she>,<DPX200>,
      <continue with go, POWCHK disabled, PULCHK disabled
       configuration hash MD5:
       00 E9 B6 7A A2 85 ED C7 34 08 36 98 17 FE 4E 26
       data hash MD5: 16K
       D2 F4 31 E0 D7 51 D5 77 CC 41 10 16 AA 62 8E 2A>)
$$ ##END=
$$ 
$$ hash MD5
$$ BA CE CA 8C 74 2C 6B B6 97 E2 F0 9A 16 E1 86 0B
##$RELAX= 
##$RELAX= 
##$RELAX= 
##$RELAX= 
##$RELAX= 
##$RELAX= 
$$ Bruker specific parameters
$$ --------------------------
##$DU= <F:/spectra>
##$EXPNO= 1
##$NAME= <H-F>
##$PROCNO= 1
##$TYPE= <nmr>
##$USER= <she>
##$AMP= (0..31)
100 100 100 100 100 100 100 100 100 100 100 100 100 100 100 100 100 100 
100 100 100 100 100 100 100 100 100 100 100 100 100 100 
##$AQSEQ= 0
##$AQ_mod= 1
##$AUNM= <au_zg>
##$AUTOPOS= <>
##$BF1= 200.13
##$BF2= 200.13
##$BF3= 200.13
##$BF4= 200.13
##$BF5= 200.13
##$BF6= 200.13
##$BF7= 200.13
##$BF8= 200.13
##$BYTORDA= 1
##$CFDGTYP= 0
##$CFRGTYP= 5
##$CHEMSTR= <none>
##$CNST= (0..31)
1 1 145 1 1 1 1 1 1 1 1 1 1 1 1 1 1 1 1 1 1 1 1 1 1 1 1 1 1 1 1 1 
##$CPDPRG= <>
##$CPDPRG1= <>
##$CPDPRG2= <>
##$CPDPRG3= <>
##$CPDPRG4= <mlev>
##$CPDPRG5= <mlev>
##$CPDPRG6= <mlev>
##$CPDPRG7= <mlev>
##$CPDPRG8= <mlev>
##$CPDPRGB= <>
##$CPDPRGT= <>
##$D= (0..31)
0 1.2 0 0 0 0 0 0 0 0 0 0.03 0 0 0 0 0 0 0 0 0 0 0 0 0 0 0 0 0 0 0 0 
##$DATE= 1551871518
##$DBL= (0..7)
120 120 120 120 120 120 120 120 
##$DBP= (0..7)
150 150 150 150 150 150 150 150 
##$DBP07= 0
##$DBPNAM0= <>
##$DBPNAM1= <>
##$DBPNAM2= <>
##$DBPNAM3= <>
##$DBPNAM4= <>
##$DBPNAM5= <>
##$DBPNAM6= <>
##$DBPNAM7= <>
##$DBPOAL= (0..7)
0.5 0.5 0.5 0.5 0.5 0.5 0.5 0.5 
##$DBPOFFS= (0..7)
0 0 0 0 0 0 0 0 
##$DE= 6
##$DECBNUC= <off>
##$DECIM= 24
##$DECNUC= <off>
##$DECSTAT= 4
##$DIGMOD= 1
##$DIGTYP= 9
##$DL= (0..7)
0 120 120 120 120 120 120 120 
##$DP= (0..7)
150 150 150 150 150 150 150 150 
##$DP07= 0
##$DPNAME0= <>
##$DPNAME1= <>
##$DPNAME2= <>
##$DPNAME3= <>
##$DPNAME4= <>
##$DPNAME5= <>
##$DPNAME6= <>
##$DPNAME7= <>
##$DPOAL= (0..7)
0.5 0.5 0.5 0.5 0.5 0.5 0.5 0.5 
##$DPOFFS= (0..7)
0 0 0 0 0 0 0 0 
##$DQDMODE= 0
##$DR= 18
##$DS= 0
##$DSLIST= <SSSSSSSSSSSSSSS>
$$ [...]
##$SUBNAM2= <"">
##$SUBNAM3= <"">
##$SUBNAM4= <"">
##$SUBNAM5= <"">
##$SUBNAM6= <"">
##$SUBNAM7= <"">
##$SUBNAM8= <"">
##$SUBNAM9= <"">
##$SW= 24.9336934301222
##$SWIBOX= (0..15)
0 0 2 0 0 0 0 0 0 0 0 0 0 0 0 0 
##$SW_h= 4990.01996007984
##$TD= 16384
##$TD0= 1
##$TE= 0
##$TE2= 300
##$TE3= 300
##$TEG= 300
##$TL= (0..7)
0 120 120 120 120 120 120 120 
##$TP= (0..7)
150 150 150 150 150 150 150 150 
##$TP07= 0
##$TPNAME0= <>
##$TPNAME1= <>
##$TPNAME2= <>
##$TPNAME3= <>
##$TPNAME4= <>
##$TPNAME5= <>
##$TPNAME6= <>
##$TPNAME7= <>
##$TPOAL= (0..7)
0.5 0.5 0.5 0.5 0.5 0.5 0.5 0.5 
##$TPOFFS= (0..7)
0 0 0 0 0 0 0 0 
##$TUNHIN= 0
##$TUNHOUT= 0
##$TUNXOUT= 0
##$USERA1= <user>
##$USERA2= <user>
##$USERA3= <user>
##$USERA4= <user>
##$USERA5= <user>
##$V9= 5
##$VALIST= <valist>
##$VCLIST= <CCCCCCCCCCCCCCC>
##$VD= 0
##$VDLIST= <DDDDDDDDDDDDDDD>
##$VPLIST= <PPPPPPPPPPPPPPP>
##$VTLIST= <TTTTTTTTTTTTTTT>
##$WBST= 1024
##$WBSW= 4
##$XGAIN= (0..3)
0 0 0 0 
##$XL= 0
##$YL= 0
##$YMAX_a= 587639
##$YMIN_a= -789531
##$ZGOPTNS= <>
##$ZL1= 120
##$ZL2= 120
##$ZL3= 120
##$ZL4= 120
##$ABSF1= 10
##$ABSF2= 0
##$ABSG= 5
##$ABSL= 3
##$ALPHA= 0
##$AQORDER= 0
##$ASSFAC= 0
##$ASSFACI= 0
##$ASSFACX= 0
##$ASSWID= 0
##$AUNMP= <proc_1d>
##$AZFE= 0.1
##$AZFW= 0.1
##$BCFW= 1
##$BC_mod= 2
##$BYTORDP= 1
##$COROFFS= 0
##$CY= 11.3945322036743
##$DATMOD= 1
##$DC= 2
##$DFILT= <>
##$DTYPP= 0
##$F1P= 18.9103706918063
##$F2P= -1.10871071338519
##$FCOR= 0.5
##$FTSIZE= 0
##$FT_mod= 4
##$GAMMA= 1
##$GB= 0.15
##$INTBC= 1
##$INTSCL= 1
##$ISEN= 128
##$LB= 0.24
##$LEV0= 0
##$LPBIN= 0
##$MAXI= 10000
##$MC2= 0
##$MEAN= 0
##$ME_mod= 0
##$MI= 1.114404
##$NCOEF= 0
##$NC_proc= 0
##$NLEV= 6
##$NOISF1= 3.799351
##$NOISF2= 2.8
##$NSP= 1
##$NTH_PI= 0
##$NZP= 0
##$OFFSET= 15.70392
##$PC= 1
##$PHC0= -8862.592
##$PHC1= 19.00014
##$PH_mod= 1
##$PKNL= yes
##$PPARMOD= 0
##$PSCAL= 0
##$PSIGN= 0
##$REVERSE= no
##$SF= 200.130013532006
##$SI= 16384
##$SIGF1= 3
##$SIGF2= 2
##$SINO= 400
##$SIOLD= 16384
##$SREGLST= <1H.CDCl3>
##$SSB= 0
##$STSI= 0
##$STSR= 0
##$SW_p= 3612.71676300578
##$SYMM= 0
##$S_DEV= 0
##$TDeff= 0
##$TDoff= 0
##$TI= <>
##$TILT= no
##$TM1= 0
##$TM2= 0
##$TOPLEV= 0
##$USERP1= <user>
##$USERP2= <user>
##$USERP3= <user>
##$USERP4= <user>
##$USERP5= <user>
##$WDW= 1
##$XDIM= 8192
##$YMAX_p= 0
##$YMIN_p= 0
$$ End of Bruker specific parameters
$$ ---------------------------------
##NTUPLES= NMR FID
##VAR_NAME=  TIME,          FID/REAL,        FID/IMAG
##SYMBOL=    X,             R,               I
##VAR_TYPE=  INDEPENDENT,   DEPENDENT,       DEPENDENT
##VAR_FORM=  AFFN,          ASDF,            ASDF
##VAR_DIM=   8192,          8192,            8192
##UNITS=     SECONDS,       ARBITRARY UNITS, ARBITRARY UNITS
##FACTOR=    0.0002004,     1,               1
##FIRST=     0,             0,               0
##LAST=      1.6414764,     0,               0
##MIN=       0,             -789531,         0
##MAX=       1.6414764,     587639,          0
$$ Real data points
##PAGE= N=1
##DATA TABLE= (X++(R..R)), XYDATA
0@%%%%%%%%%j8R0j44J44j44J78k50K88l60M32n04N77o49P92r28J060j210J368
$$ 0 0 0 0 0 0 0 0 0 0 -18 72 -72 72 -72 106 -144 144 -216 216 -288 289 -360 432 -496 564 -646 722
27G22j536J752j981K223k507K816l159L534l943M384m870N415o008O658p370Q156
$$ 722 -814 938 -1043 1180 -1327 1489 -1670 1864 -2079 2305 -2565 2850 -3158 3500 -3870 4286
43D286r034J0007j1090J2310j3691J5266j7085J9217k1745K4805k8605L3463l9931
$$ 4286 -4748 5259 -5831 6479 -7212 8054 -9031 10186 -11559 13246 -15359 18104 -21827
56b1827M9042o2928Q6896j39926M93755m13539p81004Q72343N04827n01883n05549
$$ -21827 27215 -35713 51183 -88743 405012 -8527 -789531 82812 587639 85756 -419793
67d19793L60368K37397j49126j00103R7812j11108m6110J59717Q8017j83779p8815
$$ -419793 -59425 177972 28846 -71257 26555 -84553 -130663 29054 117071 -66708 -145523
78a45523Q8995Q4199J2242j28j26003p3089J93033J99998k04580k71623J60982
$$ -145523 -56528 27671 39913 39785 -86218 -159307 33726 233724 29144 -242479 -81497
89h1497L40021q3187l34797o070L10530P8663k53820j26182J94107J33202j50394
$$ -81497 258524 175337 -159460 -165530 145000 223663 -30157 -156339 37768 170970 20576
100B0576j29795J11132J00414r8452r4516O9605O9182m8003o5431J207M4394M0386
$$ 20576 -109219 1913 102327 3875 -90641 -21036 48146 143 -65288 -64081 -19687 20699
112B0699k4124q6451O382J29152J3778j51717n856J82163n36j91066L9704K18505
$$ 20699 -3425 -89876 -83494 45658 59436 -92281 -98137 84026 83490 -107576 -67872 150633
124A50633o3804k32481R3620K57707r4593k62727P3295K52745l0788k22496k9551
$$ 150633 86829 -145652 -52032 205675 111082 -151645 -78350 174395 143607 -78889 -108440
135a08440J57492P6141q5183j17607q168J17448P2674j10811j30854P7108J39212
$$ -108440 49052 125193 40010 -77597 -85765 31683 104357 -6454 -137308 -60200 79012
146G9012n3164j28371M1192R4656m8670o0389P8154N1389j03920n0459J38063
$$ 79012 25848 -102523 -61331 33325 -15345 -75734 2420 53809 -50111 -100570 37493
157C7493Q8208j38652j17751J30289J60877q6613j72911M0874J65760J1922j30895
$$ 37493 125701 -12951 -130702 -413 160464 73851 -99060 -58186 107574 119496 -11399
168a1399n4956P4785O9795k3721p8083l0882N9226N5772n2879p6713L6374P0884
$$ -11399 -66355 8430 78225 54504 -23579 -54461 4765 60537 7658 -69055 -32681 38203
180C8203m5646o9655N8258O1551q0773o3380J03768P0212j13064p1294J18481
$$ 38203 -7443 -77098 -18840 42711 -38062 -101442 2326 72538 -40526 -111820 6661
191F661Q2516r7927p6548Q6241P8866n0678o1741K8778N1237K413l2998k4362
$$ 6661 89177 -8750 -85298 943 79809 29131 -32610 -3832 47405 49818 16820 -7542
203g542J6087M2674n074o3008j2214P0525J4729q9093l1230Q9965L2163r8893
$$ -7542 8545 51219 46145 -16863 -29077 41448 56177 -32916 -64146 25819 57982 -40911
215d0911m3752R0420M2778q6997m6072P9533M4436p2868l5896P1106L4827o1499
$$ -40911 -84663 5757 48535 -38462 -84534 -5001 39435 -33433 -69329 1777 36604 -24895
227b4895k3739O1484K6727m2660j8562L4725K2404j0303j4218p388J1804L0007
$$ -24895 -48634 12850 39577 -3083 -21645 13080 35484 25181 10963 3575 15379 45386
239D5386n390n1640m241O3406Q019q1404k0146P9868J6400q7619k2785P6568J1423
$$ 45386 39996 -11644 -15885 47521 55540 -25864 -46010 33858 50258 -37361 -60146 16422 27845
252B7845p3765o973O2190l359n3783R060M8335j0075l4091J2081K8861j825j0125
$$ 27845 -45920 -52893 9297 5938 -47845 -38785 9550 -525 -34616 -22535 6326 4501 -5624
265e624L913J257O500J9753l978l1595J1421M6868j1089n3558J1657N6621j3535
$$ -5624 -1711 -454 6046 25799 21821 -9774 1647 48515 37426 -16132 -4475 52146 38611
278C8611o1926Q590N6457j4071n8284Q777M6178j6792m6761J2566L6897j7963
$$ 38611 -23315 -14725 41732 27661 -30623 -21846 24332 7540 -39221 -26655 10242 -7721
290g721l3813J5500K5334j1944j3967J2443N224m306R897O735j4160L390K8695
$$ -7721 -41534 -26034 -700 -12644 -26611 -14168 -8944 -13250 -3353 3382 -10778 -7388 21307
303B1307k289k8326J0927L7318j0650l9335J6379M2967k1466m4186K3158L8264
$$ 21307 19018 -9308 1619 38937 28287 -11048 5331 48298 26832 -17354 5804 44068
315D4068k9773l7459K6860K3889l1105k2614K3642J0110k6360n893J7083l998
$$ 44068 14295 -23164 3696 27585 -3520 -26134 -2492 7618 -18742 -24635 -7552 -11550
327a1550j4510J0999R252j6663j780K5509j068k3151J2461L0970j3223k4417K2509
$$ -11550 -26060 -15061 -5809 -22472 -24252 1257 189 -22962 -10501 20469 7246 -17171 5338
340E338K8955k2481k1901K7438K2681k8046j8252K6420J2823k9034j0272K4910
$$ 5338 34293 11812 -10089 17349 40030 11984 -6268 20152 32975 3941 -6331 18579
352A8579o93k6198K69J7121r534j8674J1204P518j8685n721J9438l378j9299O882
$$ 18579 17886 -8312 -8043 9078 -456 -19130 -7926 -408 -19093 -24814 -5376 -8754 -28053 -21171
366b1171K1822q692j9796J8332K2252j8146j4463K5769J6922k2917p341K9091
$$ -21171 651 -8041 -27837 -9505 12747 -5399 -19862 5907 22829 -88 -7429 21662
378B1662N606k4112Q72K3455n389k0564P303J5880j2884j7538J3460O995k0120
$$ 21662 27268 3156 4028 27483 22094 1530 8833 24713 11829 -5709 7751 14746 -5374
391e374p197J6625k064k3103M861J7923j2532j8478J5352J5811j8913j0462K4351
$$ -5374 -12571 4054 1990 -21113 -16252 1671 -10861 -29339 -13987 1824 -17089 -27551 -3200
404c200P080k0835L56K5018P92j8980Q071K1294o609j6159J4365J5200j4587r531
$$ -3200 3880 -16955 -16599 8419 9211 -9769 -1698 19596 12987 -3172 11193 26393 11806 2275
418B275J7700M309j9521j971J6347n196k0023N752J4296j5460j5773J2604P223
$$ 2275 19975 24284 4763 2792 19139 13943 -6080 -328 13968 -1492 -17265 -4661 2562
431B562j8547p576J7121L007j9791J348K0473l404j7944R627J9431j0082j2167
$$ 2562 -15985 -23561 -6440 -3433 -23224 -21876 -1403 -4807 -22751 -13124 6307 -3775 -15942
444a5942J7286J2427j3627m891J8306M891j4926J503J6999m222j5363P721J2665
$$ -15942 1344 13771 144 -4747 13559 18450 3524 5027 22026 17804 2441 10162 22827
457B2827j2482j1455J0945M666j9085m404J6588m515k0687L244J6987r714j7351
$$ 22827 10345 -1110 9835 14501 -4584 -8988 7600 3085 -17602 -14358 2629 -7085 -24436
470b4436J0563J3522j2186j1198J6072J0778j5532m027J9569M208j4576M533J5421
$$ -24436 -13873 -351 -12537 -23735 -7663 3115 -12417 -16444 3125 7333 -7243 -2710 12711
483A2711l950r675J0976R873j1347m672J4380j69j3581J745J1813o789j6075P911
$$ 12711 8761 -914 10062 19935 8588 3916 18296 18127 4546 6291 18104 11315 -4760 3151
497C151J1549j3500j5242J0856J0358j7720j0896J5617N581j7389n261J7686K057
$$ 3151 14700 1200 -14042 -3186 7172 -10548 -21444 -5827 -246 -17635 -22896 -5210 -3153
510c153j3701J636J3037Q61q853P534Q493m280k405R225L112r235M637J1516o895
$$ -3153 -16854 -15218 -2181 -1320 -10173 -2639 5854 1574 -831 8394 11506 2271 6908 18424 11529
525A1529j0034J2234Q284j6038j0195J6177N975k0672p922J7388L410k2169m615
$$ 11529 1495 13729 22013 5975 -4220 11957 17932 -2740 -10662 6726 10136 -12033 -16648
538a6648J7792r94j7565n15J4949k601j2777M795Q600l900r66O218Q36l711O681
$$ -16648 1144 150 -17415 -17930 -2981 -5582 -18359 -13564 -4964 -8864 -9830 -3612 -2776 -6487 194
553A94P684o885k700J2589O688j4091k286J7798J447j9398o71K0338k170k3811
$$ 194 7878 993 -1707 10882 17570 3479 1193 18991 20438 1040 369 20707 18537 -5274
567e274J161J9262n013k2089L243J4621m774j5821K536R855n047n906K539K577
$$ -5274 -4113 15149 10136 -11953 -8710 5911 1137 -14684 -12148 -2293 -7340 -13246 -10707 -8130
581h130l364K639M902n871K84J1949P44j2390M609J9783k958j8901Q362K1355
$$ -8130 -11494 -8855 -3953 -9824 -9540 2409 3153 -9237 -4628 15155 12197 -6704 1658 23013
595B3013p321j9449Q885J9241q241k1520Q571J6575j0262j7739O187J1523q662
$$ 23013 15692 -3757 5128 24369 16128 -5392 3179 19754 9492 -8247 -2060 9463 801
608H01j0262K497K263l035O06l320m583M658Q408o576r843Q956J5545r657j2918
$$ 801 -9461 -6964 -4701 -7736 -7130 -10450 -15033 -10375 -1967 -8543 -18386 -9430 6115 -3542 -16460
623a6460J2933J8116j1094j5933J4641K0301j3926j6223J6384J7217j5157j6796
$$ -16460 -3527 14589 3495 -12438 2203 22504 8578 -7645 8739 25956 10799 -5997
635e997J4397J1448j2082j1048O103O671n076p230j482J330N71m76o464p012J0239
$$ -5997 8400 19848 7766 -3282 2821 9492 4416 -2814 -4296 -2966 -2395 -2871 -9335 -16347 -6108
650f108Q835j5275r295J7250J2642j8125j3023K2811J4958j9487j1208K2461J1839
$$ -6108 2727 -12548 -21843 -4593 8049 -10076 -23099 -288 14670 -4817 -16025 6436 18275
663A8275j7825q567J9126R589j4924p057J2888N887q709o764K769K972J630n506
$$ 18275 450 -8117 11009 20598 5674 -1383 11505 17392 8683 1919 4688 7660 9290 3784
677C784q818J149R974k888j7023j426J7744P6k0710l698K1424M338k0372m603
$$ 3784 -5034 -3885 6089 3201 -13822 -15248 2496 2572 -18138 -21836 -412 3926 -16446 -21049
691b1049K2144O133j8427m160K0930N184j4385k364J4031N488q661l988P514N998
$$ -21049 1095 7228 -11199 -15359 5571 10755 -3630 -5994 8037 13525 4864 876 8390 14388
705A4388m558n447n37N366K673n510j0471M547J1101o304j8726K761J8770l651
$$ 14388 9830 4383 3846 9212 11885 6375 -4096 451 11552 5248 -13478 -10717 8053 4402
719D402k4301K267K3120k220k2253q35K1634J235j8873J567J7621O43j1927K752
$$ 4402 -19899 -17632 5488 3268 -18985 -19820 1814 3049 -15824 -14257 3364 4007 -7920 -5168
733e168J0286K708n285n64L480M347J052n531m148Q141P490j0595j1492R755J2476
$$ -5168 5118 7826 2541 1977 5457 9804 10856 5325 1177 9318 16808 6213 -5279 4476 16952
748A6952j3568j5680R492J5353j2789j7487R435J4333p737j6775N491J3830l354
$$ 16952 3384 -12296 -2804 12549 -240 -17727 -8292 6041 -1696 -18471 -12980 850 -2504
761b504j1115K109J0112J222o328l75O045N152k513k123K734O774K42n822k003
$$ -2504 -13619 -11510 -1398 -176 -6504 -6879 -834 4318 1805 -318 2416 9190 9432 3610 1607
776A607R047N406j0604q688J1805R627j4329j3471J2047J1534j3175j5863J0803
$$ 1607 10654 16060 5456 -3232 8573 18200 3871 -9600 2447 13981 806 -15057 -4254
789d254J2608j1529j3688P581J2328o203j1113M071P936j351l915M10K559M600
$$ -4254 8354 -3175 -16863 -9282 3046 -3157 -14270 -10199 -2263 -3614 -7529 -7119 -4560 40
803D0J297m901P54R793K008q838r75J2480L736j2680n666J4382M979j4381o747
$$ 40 1337 -3564 -2810 6983 8991 153 -822 11658 15394 2714 -2952 11430 16409 2028 -4719
818d719J2455N877j4356p692R852O189r739q958N333N000l150p251J451M413J880
$$ -4719 7736 13613 -743 -8435 1417 7606 -2133 -11091 -5758 -758 -3908 -11159 -9708 -5295 -3415
833c415l444k151L249M560R50n215L87R330J912p078k547J2817L327j2485j726
$$ -3415 -6859 -9010 -5761 -1201 -251 -5466 -5079 4251 6163 -915 -3462 9355 12682 197 -1529
848a529J3279K946j5234k430J3898K776j4888m271J1527J656j0668l195N691L63
$$ -1529 11750 14696 -538 -2968 10930 13706 -1182 -5453 6074 7730 -2938 -6133 -442 -79
862g9m820j968K19N64K043q43n928K206Q161j763p792L280J0773r16j0443M018
$$ -79 -4899 -6867 -6648 -6084 -4041 -4884 -10812 -8606 -445 -2208 -10000 -6720 4053 3137 -7306 -3288
878c288J2189j648j0092L499J1970k568j0307K066J0367k512q632N96N542j627
$$ -3288 8901 7253 -2839 660 12630 10062 -245 1821 12188 9676 1044 1640 7182 5555
892E555o253j346K423n50j664j356k509M35K289j592n391J410P055j842o569K390
$$ 5555 -698 -2044 379 -171 -1835 -3191 -5700 -5265 -2976 -4568 -9959 -8549 -1494 -3336 -9905 -7515
908g515R391j968p700M405J0781l620q333O373R294l567q668O267N913m468m758
$$ -7515 1876 -92 -7792 -3387 7394 3774 -4559 1814 11108 7541 -1127 5140 11053 6585 1827
923A827L713K130m394k81N80k277k71J997m112n340K439N358n283p399N830O348
$$ 1827 5540 7670 3276 2995 3575 1298 1027 3024 -1088 -6428 -3989 1369 -3914 -11313 -5483 865
939H65o607o585O867O163n772m348P655N763n591k941O405L378k790j399M078
$$ 865 -5742 -12327 -5460 703 -5069 -9417 -1762 4001 -1590 -4531 1874 5252 2462 1063 5141
954E141K503k035j130J788p91M78p39j555j895K015J86m447k834K712L283n951
$$ 5141 7644 5609 4479 6267 5476 5954 5215 3660 1765 3780 3966 -481 -3315 -603 2680 -3271
970c271n560N717K389n865l945N439M539n618l131O312M046n411j035O738J332
$$ -3271 -8831 -3114 -725 -6590 -10535 -5096 -557 -6175 -9306 -2994 1052 -4359 -5394 1344 2676
985B676l413J460L638j433m46K922P18k423K805J856l792k862M396J53n815k222
$$ 2676 -737 723 4361 2928 2482 5404 6122 3699 6504 8360 4568 1706 6102 6255 440 -1782
1001a782M866n44o519k311N808O58q144J54N113m69m501Q70M010n02k327J929
$$ -1782 3084 2540 -3979 -6290 -482 176 -7968 -7814 -2701 -3170 -7671 -6801 -2791 -3293 -5620 -3691
1017c691K817n26L37J375R32k81J717J173K45j614L882M41l313n5L571r94l985
$$ -3691 -874 -1400 -1063 312 1244 963 2680 3853 4098 2484 6366 6807 3494 3439 7010 6016 2031
1034B031j689M040p57o006l99M832j602n923O91M617l336l474J874K260l272j094
$$ 2031 342 4382 3625 -2381 -2780 2052 450 -5473 -4782 -165 -3501 -6975 -5101 -2841 -6113 -7207
1050g207L187J808j818P72L593k784P19M175K595l522o13M775P38m334J653L412
$$ -7207 -4020 -2212 -4030 -3258 335 -2449 -1730 2445 5040 1518 905 5680 6418 2084 3737 7149
1066G149j077m345K013K323k924m229K709J455m177k267K104O23l443j007J921
$$ 7149 6072 1727 3740 6063 3139 -1090 1619 3074 -1103 -3370 -1266 -643 -4086 -5093 -3172
1081c172m10k083j5J874j440m95L888p62j513J788L040N51k190J423L797l00k976
$$ -3172 -3582 -5665 -5680 -3806 -5246 -5741 -1853 -2615 -4128 -2340 700 1251 -939 484 4281 3981 1005
1098A005K866J974l33k716K653J286l867k550L409R53m421r07R63O27l104j54
$$ 1005 3871 5845 5512 2796 5449 6735 2868 318 3727 4680 259 -648 315 942 -2162 -2316
1114b316L96j794j898J907j41l215J103L522j427k391K749M450k743k410M766
$$ -2316 -1920 -3714 -5612 -3705 -3846 -7061 -5958 -2436 -3863 -6254 -3505 945 -1798 -4208 558
1129E58K579j983k048N088J832l988J111K073O19k660o1J911j312k279J053K1
$$ 558 3137 1154 -894 4194 6026 2038 3149 5222 5841 3181 3120 5031 3719 1440 2493 2514
1145B514j448j728R63r86k540p21K037k423k219K532J15j521j893M150J583k131
$$ 2514 1066 -662 301 -685 -3225 -3946 -1909 -4332 -6551 -4019 -3904 -5425 -7318 -3168 -1585 -3716
1161c716j017N532Q06k204p23M724L76j501K03L281k18k127L58P12j067p81M14
$$ -3716 -4733 799 1605 -599 -1322 3402 3778 2277 2480 5761 5543 3416 3774 4486 3419 2638 3052
1178C052N3j438j357J241k421j698J019J376l375j458K658L33l353L3L086o13
$$ 3052 3105 1667 310 1551 -870 -2568 -1549 -173 -3548 -5006 -2348 -2015 -5368 -5335 -2249 -2862
1194b862l295K165L829j028k595L282K845m69j462J550J223k80m91J913l31j064
$$ -2862 -6157 -3992 -163 -1191 -3786 -504 2341 1872 410 1960 3183 2903 2412 4325 3994 2930
1210B930R42J078k112m17J342k43l936J26J704q81m239OK695j937k530J731K598
$$ 2930 3872 4950 2838 2421 3763 3520 -416 -290 1414 533 -3706 -3700 -1005 -2942 -5472 -3741 -1143
1227a143k754j999J708K922j342j806K547K368n05j065K273Q96p70J057J519j130
$$ -1143 -3897 -5896 -4188 -1266 -2608 -4414 -1867 501 -4 -1069 1204 2100 1330 2387 3906 2776
1243B776K19J465K41j621K70J702j541k931P26J925k651k832K117M34k566l028
$$ 2776 2995 4460 4701 3080 3350 5052 3511 580 1306 3231 580 -2252 -135 299 -2267 -5295
1259e295K919J476l378j618K143K718l811j67K617P93o97J485M18J14P38K129
$$ -5295 -2376 -900 -4278 -5896 -3753 -1035 -4846 -5013 -2396 -1603 -2300 -815 -397 -283 455 2584
1275B584J30j506K454J737k527j113K203J622k503k228K978%l188j975K922k6
$$ 2584 2714 1208 3662 5399 2872 1759 3962 5584 3081 853 3831 3831 643 -1332 1590 1564
1291A564k921j434K542m13k337j595J787Q78k230j24J782n46P75p11M21R56K685
$$ 1564 -1357 -2791 -249 -662 -2999 -4594 -2807 -1929 -4159 -4283 -2501 -3047 -2272 -2983 -2562 -1606 1079
1308A079n64j269j42L579R08j024o05K043R23l100j23L013R7l615j249L204Q8
$$ 1079 515 -754 -896 2683 3591 2567 1962 4005 4928 1828 1705 4718 4815 1200 -49 3155 3243
1325C243m907L3J723J07l588m0J019j04j683J117P13m34L39O29k265J625K380
$$ 3243 -1664 -1631 92 199 -3389 -3429 -2410 -2514 -4197 -3080 -2367 -2801 -2462 -1833 -4098 -2473 -93
1342i3R79k909R56L801R6k292L20M611j902k728N48M021q34k437R6K107j782k384
$$ -93 886 -2023 -1067 2734 2830 538 858 5469 3567 839 1387 5408 4574 2137 2233 4340 2558 174
1360A74J59J909j818j781j73k86l10p14j693J284o47J525p20k430K746K065j044
$$ 174 333 2242 424 -1357 -1530 -1816 -2126 -2840 -4533 -3249 -3896 -2371 -3091 -5521 -2775 -710 -1754
1377a754j726J969L027j414j417J879L890j823k335K441K685j925j737P73J767
$$ -1754 -3480 -1511 1516 102 -1315 564 4454 2631 296 2737 5422 3497 1760 2533 4300
1392D300j485j860o03J845o23j334q45P7L7p38m74j992J364J482k602j327J635
$$ 4300 2815 955 352 2197 1574 240 -605 -528 -491 -1229 -1703 -3695 -2331 -849 -3451 -4778 -3143
1409c143K280j521j767K606K131k002q92L273J922j263j272J362L434j766j729
$$ -3143 -863 -2384 -4151 -1545 586 -1416 -2308 965 2887 1624 352 1714 5148 3382 1653
1424A653J008K663j268j549r59J436n72o86j765L51k09m00r68j832J753l41j915
$$ 1653 2661 5324 4056 2507 1548 2984 2412 1726 -39 312 103 -297 -1265 -3097 -1344 -1685 -3600
1441c600k241L468J399k178j494K764K224k740j159K683K184j562n68L989j006
$$ -3600 -5841 -2373 -974 -3152 -4646 -1882 342 -2398 -3557 -874 1310 -252 -820 3169 2163
1456B163j335Q28K072j35q67J76r12Q23r5O58j845k35K45o97j772j295K105q55
$$ 2163 828 1656 3728 3593 2726 2902 1990 2813 2718 3376 1531 1296 1541 844 -928 -2223 -118 -973
1474i73k710J09L044m84l727o1K971N49j623m6J985M83r02L02K097K91k75P92
$$ -973 -3683 -3574 -530 -1014 -4741 -4802 -1831 -1282 -2905 -2951 -966 -483 -1385 -1083 1014 1305 1030 1822
1492A822M90L2n64N32O7l56J132j34r50n69J066p05k704m29K726k147k784J292
$$ 1822 2312 2344 1780 2312 2379 2023 3155 3021 2071 1502 2568 1863 -841 -1270 1456 -691 -3475 -2183
1510b183J465n18k874N89K726r20k522J842K743k109r0P35Q57J135l63L44k90
$$ -2183 -718 -1236 -4110 -3521 -795 -1715 -4237 -2395 348 -1761 -1851 -1116 -259 876 513 857 567
1527E67J332R22r57r22R28J816r81j866K714j064l76j804J616J075l970j132J350
$$ 567 1899 2821 1864 942 1870 3686 2705 839 3553 2489 2113 309 1925 3000 -970 -2102 -752
1544g52O35j632j668J883M63j172o34M84J68N07r62R71M08l92J657lQ3P89J384
$$ -752 -117 -1749 -3417 -1534 -1071 -2243 -2877 -2393 -2225 -1718 -2680 -1709 -1301 -1693 -36 -39 44 833 2217
1563B217j16j362K298N17j254m41Q96J643k896j347J919L18k229j145K164n89
$$ 2217 2101 739 3037 3554 2300 1859 2755 4398 1502 155 2074 2392 163 -982 1182 593
1579E93j684j242K99O32k98j142M46l31n90P27O08N91j7N51j15q27J295K113q03
$$ 593 -1091 -2333 -2034 -1402 -1700 -2842 -2396 -2727 -3317 -2590 -1982 -1391 -1408 -857 -972 -1799 -504 1609 806
1598H06q31K045J310k406Q64J951l98k252L78K155j505j188M21N94n19j158r80
$$ 806 -25 2020 3330 924 1788 3739 3341 1089 1467 3622 2117 929 1350 1944 1425 267 -713
1615g13R05j235n71r20J431j138P32q2j674M0J372k30p2J89K322M00j698P83J977
$$ -713 192 -1043 -1614 -2534 -1103 -2241 -1509 -1591 -3265 -3225 -1853 -2083 -2155 -1966 356 756 -942 -159 1818
1634A818l64m41P16Q48P4r33j64R75n0j079m74J208q20p13m63R28j163m54k96
$$ 1818 1454 1013 1729 2577 2651 1718 1554 2529 2479 1400 926 2134 1314 601 138 1066 -97 -551 -847
1653h47r79J10O89j108m46m35J80J257q11Q4J802N26j779J459J756j243N80J31
$$ -847 -1826 -1716 -1027 -2135 -2581 -3016 -2836 -1579 -2390 -2306 -504 22 -1757 -298 1458 215 795 926
1671I26J547q04p5M12J41j73K48m96N55j151p4q39O42m64P24j034j395n3J119
$$ 926 2473 1669 1594 2006 2147 1974 2222 1726 2281 1130 1056 217 859 395 1119 85 -1310 -1363 -244
1690b44j228o20l70P83l21j719J704J368j671o36N06K401n28j05J313J170j118
$$ -244 -1472 -2092 -2462 -1679 -2000 -3719 -2015 -647 -2318 -2954 -2448 -47 -575 -680 633 1803 685
1707F85L93K86Q13n86M18k09J81K45l87n32m45j09L04O3j928L95K70j991q17K197
$$ 685 1078 1364 2177 1591 2009 1800 1981 2226 1839 1307 862 753 1057 1120 -808 -413 -143 -2134 -2951 -754
1727g54K44j339j850K299j2m15m34J783j500O97L60L87L97M18R59N6L03k36K82
$$ -754 -510 -1849 -3699 -1400 -1412 -1827 -2261 -478 -1978 -1281 -921 -534 -137 281 1240 1296 1599 1363 1645
1746A645K15R2J085j60j144n82P06k21q90o14L41M00j748K65j78k93q18j210J867
$$ 1645 1860 1952 3037 2877 1733 1151 1857 1636 746 132 473 873 -875 -610 -788 -1081 -1899 -3109 -1242
1765a242p77o74P89O55o95q79J492J092q99K75J454n0k83J106K41mq0m3J559r90
$$ -1242 -2019 -2693 -1904 -1249 -1944 -2823 -1331 -239 -1138 -863 591 541 258 1364 1605 1601 1521 1478 3037 2047
1785B047q45Q22Q10k238K12N70P30k902Q61L39n22j202N0N45p53j939J795k21
$$ 2047 1202 2024 2834 596 808 1378 2108 -794 67 406 -116 -1318 -1268 -723 -1476 -3415 -1620 -1841
1803a841l76N62p69J556J02k38Q46q57Q47K86K52o27J931P07j017K21j82J363
$$ -1841 -2217 -1655 -2424 -868 -766 -1004 -158 -1015 -168 118 370 -257 1674 2381 1364 1585 1403 2766
1821B766m60j133o44J220k54j324J065o60P6j345N31o03p21l33J61J196j607n91
$$ 2766 2306 1173 529 1749 1495 171 1236 576 652 -693 -162 -765 -1486 -1819 -1658 -462 -2069 -2660
1839b660Q16j15R51J89j6m19N21O10P53p74k61J559l36J009n68J184M12j971J754
$$ -2660 -1844 -1959 -1008 -819 -835 -1254 -733 -123 630 -144 -405 1154 818 1827 1259 2443 2855 884 2638
1858B638m73j238k69m7p0k52m1ml49q23J062j090o68l10R27l20j695P76K57O31
$$ 2638 2165 927 658 611 541 289 248 244 -105 -928 134 -956 -1624 -1934 -1007 -1327 -3022 -2246 -1989 -1358
1878a358q8R23p3J53P61j87J516r22l68J122Q68n65p92J29M04M98j960J181l61
$$ -1358 -1446 -523 -596 -443 318 131 1647 725 357 1479 2347 1782 990 1119 1523 2021 61 1242 881
1897H81N47p91P72j029p36L49o61r07L52M55m19l40n47O27j042Q51K99J917j497
$$ 881 1428 637 1409 380 -356 -7 -668 -1575 -1223 -768 -1187 -1527 -2074 -1447 -2489 -1638 -1339 578 -919
1916i19o36J790l32j76P99J14K81K59Q63n47K11n39K62O58q10M34m76j89p7q29
$$ -919 -1555 235 -97 -273 526 640 921 1180 2043 1496 1707 1168 1430 2088 1278 1712 1236 1047 970 141
1936A41J41l85o06P44k97j419O26l87M63j525K044j021M02j058L46L82J304o35
$$ 141 282 -103 -709 35 -262 -1681 -1055 -1442 -979 -2504 -460 -1481 -1079 -2137 -1791 -1409 -105 -740
1954g40j02J144J57J28o8J165j12p39L96K45k37J90j65M29o92k59m44j6l32K16
$$ -740 -842 302 459 587 519 1684 1572 833 1229 1474 1237 1427 1262 1691 999 740 296 280 -52 164
1974A64q71j8k54k95J0m98O1J248k693Q34O66J709j075n73N60J073J77m10J207
$$ 164 -707 -725 -979 -1274 -1264 -1762 -1701 -453 -3146 -2312 -1646 63 -1012 -1585 -1025 48 225 -185 1022
1993A022l67M0L60l61Q94o80J253p04l59K47k2J60j179P76k48q85j121J242l61
$$ 1022 655 695 1055 694 1588 908 2161 1457 1098 1345 1323 1483 304 1080 832 -53 -1174 68 -293
2012b93p06q04K71K01l32k16k07J719j771J95J494m20l40J022N57n35N24M05K8
$$ -293 -999 -1803 -1532 -1331 -1663 -1879 -2086 -367 -2138 -1943 -449 -869 -1209 -187 370 -165 359 764 792
2031G92J86M67M25n75L0j27J049j014l94j120K572j777p50O03M18j701K9o7J47
$$ 792 978 1445 1870 1295 1325 1198 2247 1233 839 -281 2291 514 -236 367 785 -916 -887 -954 -807
2050h07n31Q2R32j118K40q09J275m89M75m03K29L94L82R79o81l33N67J584p22
$$ -807 -1338 -1256 -324 -1442 -1202 -2011 -736 -1225 -750 -1153 -924 -530 -148 831 150 -183 384 1968 1246
2069A246L47J21J19j352K0J039K87j124o38R09N5o63j017P46l96j183l1K89p29
$$ 1246 1593 1714 1833 481 501 1540 1827 703 65 974 1029 366 -651 95 -301 -1484 -1515 -1226 -1955
2088a955R96N27k096J617M70j028K83L63O45r85J047M44k26J627k023O27J221
$$ -1955 -959 -432 -2528 -911 -441 -1469 -1186 -823 -178 -1163 -116 328 102 1729 -294 333 1554
2105A554l1p50K70M69j44r05R24n18j74r44K69O4r7n0k03J90j076p0P57j099M05
$$ 1554 1523 773 1043 1512 1368 463 1387 869 695 -249 20 84 -13 -63 -266 -76 -1152 -1222 -465 -1564 -1159
2126a159l13m97N81l77R24M25p27J358L75L66m82m3Q61n74m07R54O22l20m55K21
$$ -1159 -1472 -1969 -1388 -1765 -841 -416 -1143 215 590 956 474 431 1292 718 311 1265 1887 1567 1112 1333
2146A333L80m09N27r94j6j069j25M44o31L31jj458K91M7L44q30N4K53J794j263
$$ 1333 1713 1304 1831 837 821 -248 -373 71 -560 -229 -230 -1688 -1397 -1350 -1006 -1836 -1782 -1529 265 -998
2166i98j43M89l04J114j672J280J479r74o89J009Q7j21l98J592m61O84j295P15
$$ -998 -1141 -652 -956 158 -1514 -234 1245 271 -418 591 678 557 159 1751 1290 1974 679 1394
2184A394l85j179P84P9m15q44K83o28k73J8J137j539M80P9Q05j931M78J268q66
$$ 1394 1009 -170 614 693 278 -566 -283 -911 -1184 -1166 -29 -1568 -1088 -1009 -204 -2135 -1657 -389 -1255
2203a255M7j43K244r00J24l1M74K83j09M50J83o83k97Q23m23p6k63O98j218J031
$$ -1255 -1208 -1351 893 -7 117 86 560 843 734 1184 1367 684 387 1210 787 711 448 1146 -72 959
2223I59o44J70n34o37J074j159k56p95P10n09RN12j26Q1m19J746l04O46m64L21
$$ 959 315 485 -49 -686 388 -771 -1027 -1822 -1112 -1621 -1612 -1100 -1226 -1145 -1564 182 -122 524 60 381
2243C81o00O31m2K87O29q1K65p08P98j556J096l75j9j6O41j534N56Q10j264m1
$$ 381 -219 412 370 657 1286 1205 1470 762 1560 4 1100 725 706 690 1331 -203 353 1163 -101 -142
2263a42o55n24K68k33l41R8K00n77J308k3O24j220r0j24M16J367L13K01j078Q49
$$ -142 -797 -1321 -1053 -1286 -1627 -1529 -1329 -1906 -598 -621 3 -1217 -1307 -1431 -1015 352 665 866 -212 637
2283F37J80N89q91N52N64L4p93l05l94M10p55L69j23O40j337k74Q85j058N92K60
$$ 637 817 1406 515 1067 1631 1665 872 567 173 583 -172 197 74 714 -623 -897 -12 -1070 -478 -218
2303b18j006j87k27J293j044k28J606j175J002K05l41k62o08J248M95k1J34K59
$$ -218 -1224 -1411 -1638 -345 -1389 -1617 -11 -1186 -184 21 -320 -582 -1190 58 553 532 666 925
2321I25q62K41L22n2R75j357K70l23M43r3J8p46L15o76K8L51n17j06l96K24l77
$$ 925 63 304 626 574 1549 192 462 139 582 489 507 -239 76 -600 -572 -221 -738 -844 -1240 -1016 -1393
2342a393K53N44k88j63j77N99K72k26Q18j15l47O40j74k83P24j27Q67k26J53p67
$$ -1393 -1140 -596 -884 -1047 -1224 -625 -353 -579 239 124 -223 417 243 -40 684 557 1424 1198 1351 584
2362E84P94j52l57k68k90M28p89K85k26l70l99j63p17O77N03l04k08K05P97m77
$$ 584 1378 1226 869 601 311 739 -50 235 9 -361 -760 -923 -1640 -963 -460 -764 -972 -767 30 -447
2382d47m35q8Q42O75j332J316p5o20O02J080o79P8M43q98J023o23k37O55J86j576
$$ -447 -882 -970 -128 547 -785 531 456 -164 438 1518 839 917 1360 462 1485 862 625 1280 1466 -110
2402a10N88N37l80j102Q44m64j259Q17k78o20J041q88P35r07N7M52N10O15j197
$$ -110 478 1015 635 -467 377 -87 -1346 -529 -807 -1427 -386 -1274 -539 -1446 -1389 -937 -427 188 -1009
2421a009J69J973r37m83M82J31J87m64J189l03L33j397O01m54J703n44k94j407
$$ -1009 -840 1133 196 -287 195 326 513 49 1238 935 1268 -129 472 18 1721 1177 883 -524
2439e24L3K32J73N48r61R97j149m57O13m30o7J113j836Q85L70l13P41K83k61M5
$$ -524 -491 -259 -86 462 -499 498 -651 -1108 -495 -925 -992 121 -1715 -830 -460 -773 -32 251 -10 35
2459C5O73K27k20o18M76m89R25n37M36m23r2J60P76j507K26O70m51j32n28o69
$$ 35 708 935 715 97 573 84 1009 472 908 485 393 553 1329 -178 48 718 267 135 -393 -1062
2479a062J40M54p15R32q95J071m85k74P1K31K68r5q98P25N43O29j261m58K731
$$ -1062 -922 -468 -1183 -251 -1146 -75 -560 -834 -763 -532 -264 -359 -1257 -532 11 640 -621 -1079 1652
2498A652j357L83L6l76O03L56o70J0P39q25J19l26N54r12J6M23r49L9q33M05O7
$$ 1652 295 678 714 338 941 1297 627 637 1376 551 670 344 898 -14 2 425 -524 -485 -1318 -913 -846
2519h46K07n12K59P02j136O09l19o2J36P71j305J586N61j340Q41R29j114J074
$$ -846 -639 -1151 -892 -190 -1326 -717 -1036 -1098 -962 -191 -1496 90 651 -689 152 1081 -33 1041
2537A041l91O57q87jN94p33K57l99M06M76m75l56M75j186L89K1j59j41L94j043
$$ 1041 650 1307 420 419 1013 280 537 138 544 1020 545 189 664 -522 -133 -112 -271 -412 -18 -1061
2557a061L15l46l41Q38N37l89K94p11J390j666Q41Q16l40o4k70J746j351J51N04
$$ -1061 -746 -1092 -1433 -595 -58 -447 -153 -864 526 -1140 -299 517 177 113 -157 1589 238 389 893
2576H93j436R04J620j001n95O17j257J23L68m92J14K95j125k77P19j250Q29l38
$$ 893 -543 361 1981 980 385 1002 -255 -132 236 -256 -142 153 -972 -1249 -530 -1780 -951 -1289
2594a289O35j204R25K69O25m68K09p6oO0J3J025j91k50N85O34j295m5JJ540l83
$$ -1289 -654 -1858 -933 -664 -39 -507 -298 -374 -380 -320 -307 718 527 277 862 1496 201 156 157 1697 1314
2615A314m61o22m42M76J23p30K09j95k15K77p9J63o57K14p3r25J271L6J85q74
$$ 1314 853 231 -211 265 388 -342 -133 -328 -543 -266 -345 -182 -839 -625 -698 -1623 -352 -316 -131 -1005
2635a005K17J079j50m59R88j192J51J050j00M76k72ro26N93l23K69l15p38R63
$$ -1005 -788 291 141 -318 670 -522 -371 679 579 1055 783 774 148 741 418 687 372 -366 597
2654E97M56n50m39q94K82R4m02K86j36J5J49l66k64L65o17O42J102q66j21J467
$$ 597 1053 503 64 -830 -548 -454 -856 -570 -706 -691 -542 -908 -1172 -807 -1424 -782 320 -546 -667 800
2674H00l68m69L39m9O48n05L41l10L77m68L78PM20j296L1O54o4l64p29N40j225
$$ 800 432 -37 302 253 901 396 737 427 804 336 714 721 1141 -155 -124 530 466 102 -627 -87 -1312
2695a312J275p02Q88n67j071P56p29L74J90l40J082k34M06m3m61N93N35n79j9
$$ -1312 -37 -739 149 -418 -1489 -733 -1462 -1088 -898 -1238 -156 -390 16 -27 -488 105 640 61 42
2714D2J238j109P97j44K06n47o41J176L18j187O14q71K41m6n4p98o3N04o6j57
$$ 42 1280 171 968 824 1030 483 -158 1018 1336 149 763 -108 133 87 33 -765 -828 -324 -390 -547
2734e47L49p05J087j355k69J348j115J199o23j41J130j207Q78O99p39L71m67J49
$$ -547 -198 -903 184 -1171 -1440 -92 -1207 -8 -631 -772 358 -849 29 728 -11 360 -107 42
2752D2M76n4O80k96q4j055N55K99O0K14m01j179P45p5N64o59k71n13J043m10m25
$$ 42 518 464 1144 848 764 -291 264 563 623 837 436 -743 2 -73 491 -168 -439 -952 91 -319 -744
2773g44m18P47m06Q51j25l49R5k97R75r49J055m64M85L08o41O49k48q50P16J11
$$ -744 -1162 -415 -821 30 -95 -444 -349 -646 329 -620 435 -29 456 764 123 772 524 -326 390 501
2793E01K07q00J000n17n02M43j69r85Q91N93q31j132J144m58J36J37O55r54j66
$$ 501 708 -92 908 391 -111 332 163 -822 69 662 -169 -1301 -157 -615 -479 -342 313 -641 -807
2812h07M81m99N16Q21j317L88p8J16q0Q9J281J3J48K9p41K48n7O38j094q8M24
$$ -807 -326 -825 -309 512 -805 -417 -495 -379 -459 -370 911 924 1072 1101 360 608 551 1189 95 7 431
2833D31m93N09k98m96L22n3m73J73k20L30L9n82j36n28N98J64m40L78L22M74o7
$$ 431 -62 447 149 -347 -25 -78 -551 -378 -598 -268 -229 -811 -947 -1475 -877 -713 -1153 -775 -453 21 -46
2854d6L50M62k00K37M25J94p39k37k83O54n17L84m22R10j517J007l86L80j71M6
$$ -46 304 766 566 803 1228 1422 683 446 163 817 300 684 262 1172 -345 662 276 656 485 531
2874E31l99j138R35J002j920n03J480j27j288Q22j95M93O32p49K59Q8j60R67L9
$$ 531 132 -1006 -71 931 -989 -1492 -12 -139 -1427 -605 -800 -307 325 -424 -165 -77 -237 730 769
2893G69p21O90k12R4K07j24N98q59J77k38O65j228R08n12n44O4j35j85R49k77
$$ 769 48 738 526 620 827 703 1301 442 619 381 1046 -182 726 214 -330 -266 -401 -586 363 86
2913H6o73J03o26Q61k24J02j41l33L05n71J60j34M46P06n98R46K70L78m48m1M77
$$ 86 -587 -484 -1110 -249 -473 -371 -512 -845 -540 -1111 -951 -1085 -639 67 -531 415 685 1063 615 574 1051
2934A051k49L51p77L66L8l43o10K26M35j308J546p10M84n42j056K02J428j162
$$ 1051 802 1153 376 742 780 437 -173 53 488 -820 726 16 500 -42 -1098 -896 532 -630
2952f30N97o20k0N41p57Q12k18Q84j036N48jJ03Q72r84l46M08L24k20Q89q09k49
$$ -630 -33 -653 -673 -132 -889 -77 -295 589 -447 101 100 203 1075 91 -255 153 477 257 1146 337 88
2973H8j12N03J171j632L88o85K23k61O24N58r53j75K90j6r16K88m06J918j375
$$ 88 -24 479 1650 18 406 -279 -56 -317 307 865 -88 -263 27 11 -905 -617 -1023 895 -480
2992d80J25M9M45O40p11k52M26J39j58N27j47P17j065K52p58J121k84n6p82J53
$$ -480 -355 -306 139 779 68 -184 242 381 223 750 603 1320 255 507 -251 870 586 530 -252 -99
3012i9O22j96o46P70l77K47p84j58R47p85K84p44P20n48k14J32J21Q82J3k75P07
$$ -99 523 327 -319 451 74 321 -463 -621 326 -459 -175 -919 -199 -747 -961 -829 -708 174 187 -88 619
3033F19j158j34J545l40J68q83Q73n08q6J43M28m54o58J525q58k31J72j00j21
$$ 619 -539 -673 872 532 700 -183 690 182 96 239 667 213 -445 1080 222 -9 163 63 -58
3052e8J04o9m50M2j37K19J47m09M16j89J36l10O03k02N43j319J258p82J36L0J023
$$ -58 46 -23 -473 -431 -568 -349 -202 -611 -195 -384 -248 -558 45 -157 386 -933 325 -457 -321 -291 732
3073G32K12k41n27O97O5o30J61L22o92J27J79L46q19L41j86n23J83N0K06O36j524
$$ 732 944 703 176 873 938 308 469 791 99 226 405 751 -68 273 87 -436 -253 -203 3 639 -885
3094h85K13J91r64J132K31n58o55Q38n19Q48n73O4J097r7l53K71j18R6p45P9n77
$$ -885 -672 -481 -1445 -313 -82 -640 -1295 -457 -976 -128 -701 -637 460 363 10 281 163 259 -486 -407 -984
3115i84K227j137P13m95k45K31l45R7J15j54l61J74k53l03Q25o73j66J194l13
$$ -984 1243 106 819 324 79 310 -35 62 177 23 -338 -164 -417 -720 105 -568 -734 460 147
3134A47j002L77K03K10L1J08m6J54K9k05L31k14Q4N77M6m64l55O6M50K97M42j447
$$ 147 -855 -478 -275 -65 -34 74 28 182 211 6 337 123 207 784 830 366 11 77 527 824 1266 -181
3156a81j79J531r6j161m56M90K77J57N95j461p60L91N2J23N57n63L74N80j30k64
$$ -181 -360 1171 1075 -86 -542 -52 225 382 977 -484 -1244 -853 -801 -678 -121 -684 -310 270 140 -124
3176a24N9J008L37j475O3k86O48K99J11p66O59m60O13n39j7K76n87P5p5J048j541
$$ -124 -65 943 1280 -195 -132 -418 230 529 640 -126 533 73 686 147 130 406 -181 -106 -181 867 -674
3197f74O15J34L96n43J39n91K99J92j93r00M2P38M62q41M77k30o1P75o38O86J36
$$ -674 -59 75 471 -72 67 -524 -225 -33 -226 -1126 -1084 -346 116 -725 -248 -478 -539 236 -402 284 420
3218D20J76j96Qk66l85L34j77n52J177m62l10O96j040k03P97n10L83p03J177l86
$$ 420 596 400 408 142 -243 91 -86 -638 539 77 -233 463 -577 -780 17 -493 -110 -813 364 -22
3238b2j60k01l8L54k40J04N3m89Q82R5k76l61J29O0n21J640o86l20Q21J95j278
$$ -22 -182 -383 -421 -67 -307 -203 -150 -639 243 338 62 -299 -170 -110 -631 1009 323 3 824 1019 -259
3259b59N08l22r77J215O02m14j04N62j393P93J05k74n26N77r67k67Q76q71J69
$$ -259 249 -73 -1050 165 767 353 249 811 -582 211 316 42 -484 93 -874 -1141 -265 -1136 -967
3278i67J546O87j603L18p32n47J625n00N74n23K09K37k51J92O19K79q47O32j037
$$ -967 579 1266 -337 -19 -751 -1298 327 -173 401 -122 87 324 73 265 884 1163 316 948 -89
3297h9M29m08K92J363j731L3L5m5P2m71N52J19j077J819j544M99j81o52L1M42
$$ -89 340 -68 224 1587 -144 -111 -76 -121 -49 -520 32 151 -926 893 -651 -152 -333 -985 -954 -512
3317e12L29R1O04O7j279O03l08O08m2K54L87q23J266j437L73N9k29j47m07M19
$$ -512 -183 -92 512 579 -700 -97 -405 203 161 415 802 -21 1245 -192 181 240 11 -136 -543 -124
3337a24N29q64J823o36r75M81o41j89M00p63O41o0K46o77O32k10M73J34l87Qp80
$$ -124 405 -459 1364 728 -247 234 -407 -596 -196 -959 -318 -378 -132 -809 -177 -387 86 220 -167 -159 -939
3358i39J619q87L62K42p82M00L69M70n99L6k71O27j31o62%j84o8N30J17o30rL61
$$ -939 680 -207 155 397 -385 15 384 854 255 291 20 647 516 -146 -146 -330 -398 132 249 -381 -390 -29
3380b9M4n50J69qJ08j008J749j226K57O00o01Q3N84k22O00m03l79O42k91k77K0
$$ -29 15 -535 -366 -374 -266 -1274 475 -751 -494 106 -495 -412 172 -50 550 147 -232 410 119 -158 -138
3401a38P23N7l99j9K49K13o40R76j322k13R03l24J56p24O93n03k21J18J106k05
$$ -138 585 642 243 224 473 686 46 1022 -300 -513 390 66 222 -502 191 -312 -533 -415 691 486
3421D86r91K27O10r31R38l76r5m3o59R06N93l15M9m73J49K93q22K06J293j173
$$ 486 -505 -278 332 -599 339 -37 -132 -175 -834 72 665 350 399 -74 75 368 -454 -248 1045 -128
3441a28L52pk55K64L43r83P09r81R46k04K73j017Q42o0k43o13l38O81L9l35L61
$$ -128 224 217 -38 226 569 -414 295 -686 260 56 329 -688 154 94 -149 -762 -1100 -419 -380 -715 -354
3462c54J5j84N63j187P07J045K31p63l54J009K31n94l8l14j81K97Q2o42O05R34
$$ -354 -339 -523 40 -1147 -440 605 836 73 -281 728 959 365 327 13 -168 129 211 -431 174 1108
3482A108j023R47j093r05l43N5J280j85k03K12n79M08K77L04l53l77M15M65k49
$$ 1108 85 1032 -61 -966 -1309 -1254 26 -159 -362 -150 -729 -321 -44 260 -93 -470 -55 410 161
3501A61m50O31q69R46j39L7M35M54q33M2L79l27q15M56o76J093l9j11r08J043
$$ 161 -289 342 -527 419 280 317 752 1206 373 415 794 467 -348 108 -568 525 486 375 -533 510
3521E10l78n88N80O05o71M05r51J406r46l83k63O07k70K91J7R1m02J65m98JJ107
$$ 510 132 -456 124 729 58 463 -488 918 -28 -411 -674 -67 -337 -46 -29 62 -340 -175 -673 -672 435
3542D35n62J025o76K6k42R21m69q32R92j13m59r0o78M35Q39r88N92n85M88K87
$$ 435 -127 898 222 248 6 927 458 -374 618 505 46 -44 -722 -287 552 -436 156 -429 59 346
3562C46n90q53J051o85Q94p43L01k27j34J047q26O0Q25n22l24j66O95J55k47O24
$$ 346 -244 -1097 -46 -731 163 -580 -279 -506 -640 407 -419 -359 466 -56 -380 -546 149 304 57 681
3582F81p55K29L98k77L63k75m59M42o62j82m61J721n14m07m06l50Q80m71O43j25
$$ 681 -74 155 553 276 639 364 -95 347 -315 -497 -958 763 249 -158 -564 -914 -34 -505 138 13
3602A3m88m85L29O84J57p01L36J96j13P98n78K32r3O9m99Q71L75L26p40J48M56
$$ 13 -475 -960 -631 53 210 -491 -155 41 -72 726 148 380 287 356 -143 728 1103 1429 689 837 1293
3623A293l96p42o14L63J66j42M94j229J023N47j462O38P02j191n01J235n13p95
$$ 1293 897 155 -459 -96 70 -72 422 -807 216 763 -699 -61 641 -550 -1051 184 -329 -1124
3641a124O41r10O68R95kJ84n50K15l06K98P02K00j428J103j29O65Qj372K01n36
$$ -1124 -483 -1393 -725 270 268 452 -98 117 -189 109 811 1011 -417 686 557 1222 1230 -142 59 -477
3661d77K59k28L90K62k62O7j32l71l87R93j935J389j3M29l21J16j22J245n58j190
$$ -477 -218 -446 -56 206 -56 11 -121 -492 -879 114 -1821 -432 -445 -16 -337 -221 -343 902 344 -846
3681h46J316l04k96N92n16J51J11p69J670r89Q7M81l14l3J89p31Q75r75k70R17
$$ -846 470 166 -130 462 -54 97 208 -561 1109 120 207 688 374 341 530 -201 674 -301 -571 346
3701C46r54J508j446k43N47l29J056j17j432J086l78K08j03j44P58j42q99K0P87
$$ 346 -608 900 -546 -789 -242 -571 485 368 -1064 22 -356 -148 -251 -395 363 221 -678 -658 129
3720A29K8k34N8Q26K00n11n06k57R80r35l25Q95j05L71K16m37j60n05n66O04l45
$$ 129 157 -77 -19 807 1007 496 -10 -267 713 -222 -547 348 243 614 830 393 233 -272 -838 -234 -579
3741e79K21m34J441j438P93j159R93k25J12J009m18J58q15K0J042o62q05M06N54
$$ -579 -358 -792 649 -789 4 -1155 -162 -387 -275 734 316 474 -341 -321 721 59 -746 -340 214
3760B14m79J044j138R06O4l69K1L37Q0m12R8n98j5K74N4n84J345j408J26j33M73
$$ 214 -265 779 -359 547 611 242 263 600 680 268 366 -232 -247 27 81 -503 842 -566 -440 -573 -100
3781a00p57J288o36L28j10O09O5l14j244O30K64n99J837j066J30M22j40j88o5
$$ -100 -857 431 -205 123 13 622 687 373 -871 -241 23 -576 1261 195 325 747 607 419 354
3800C54j01N86j599J100q3J57O4p71J90j38Q83p84L81o86R4p3Q96M8l88m00M41
$$ 354 253 839 -760 340 257 414 478 -293 -103 -241 642 -142 239 -447 -353 -426 470 518 130 -270 171
3821A71m8n70Q14K48q81Q04m12j68K09k70P55n40J17j95L76j46j9k01L11k42k13
$$ 171 123 -447 367 615 -266 538 126 -42 167 -103 652 112 229 34 410 264 245 44 355 113 -100
3842a00L82n03L23l43j251J036k91R33p31N62p3j88L58j12lj77p5J59K06j48N70
$$ -100 282 -221 102 -241 -1492 -456 -747 186 -545 17 -56 -244 114 2 -1 -178 -253 -94 112 -36 534
3863E34l0p3o75J38O77L16m74M39r84O05q27j05J248L8j16m56n67O68r40J138
$$ 534 504 431 -244 -106 571 887 413 852 -132 473 -354 -459 789 827 711 255 -312 356 -584 554
3883E54o64p9J38l55o36J063J9q91j62N35K6N43k64m53Q02q50l23P37K8L79l8
$$ 554 -110 -189 -51 -406 -1042 21 40 -851 -1013 -478 -452 91 -173 -626 176 -674 -997 -260 -232 147 109
3904A09k87m9J78n11N92n35O80k18O33n89M59m33P5o07N68q71Q96l22M34L31j069
$$ 109 -178 -227 -49 -560 32 -503 177 -41 592 3 462 29 104 -503 65 -806 90 -232 202 533 -536
3925e36O51k44M52j224Q79m93Q33n78J65O90p55L95l48J368j353L51K83m39M47
$$ -536 115 -129 323 -901 -22 -515 318 -260 -95 595 -160 235 -113 1255 -98 253 536 97 544
3944E44l27l44l5N93m3P1j515J098J074o95r43M53O79p74n09N42k77J77L28M47
$$ 544 217 -127 -162 431 388 459 -1056 42 1116 421 -522 -69 610 -164 -673 -131 -408 -231 97 544
3964E44n84J83n2M95m38m41n89J398J28j205P90j66J291j324P09l34n69P26j08
$$ 544 -40 143 91 586 148 -293 -882 516 644 -561 229 63 1354 30 739 405 -164 562 454
3983D54j66p4m48j38k83K81P6J040n31j07m62O07p48Q24n23l05j39P59m71k79
$$ 454 288 214 -234 -372 -655 -374 -298 742 211 104 -358 249 -499 325 -198 -503 -642 117 -354 -633
4003f33P69q15R74K42r46Q27p23J87J175j31n50l74j74K96J28m06k67P05p03P41
$$ -633 136 -679 295 537 -409 418 -305 -118 1057 926 376 2 -172 124 252 -154 -421 284 -419 322
4023C22o56o44J604p21N50N65j040M29q92l78Q91j36n9K24j96q5k9JJ88K10k28
$$ 322 -334 -978 626 -95 455 1020 -20 409 -483 -861 30 -106 -165 59 -137 -222 -251 -250 -62 148 -80
4044h0L98k85l77J106r35k04J565p93k60k63K84kK89o76O04o54K04l22o9O99J15
$$ -80 318 33 -344 762 -173 -377 1188 395 135 -128 156 154 443 -233 371 -283 -79 -401 -470 229 344
4065C44l73p21O80kK87l38Q50r25j05l89J167j87k39J45K11r16J539j560P14N70
$$ 344 -29 -750 -70 -72 215 -123 727 -198 -303 -692 475 288 49 194 405 -511 1028 -532 182 752
4085G52k37p36P77Q59j674O81j73m51N69m44o83O24P7K02j017K2P21j032N75M96
$$ 752 515 -221 556 1415 -259 422 249 -202 367 -77 -760 -136 -59 143 -874 -852 -131 -1163 -588 -92
4105i2n9L76j168L73L85K31L76l10P86p15j77k00P31p14J96P25q71M03m64l98
$$ -92 -151 225 -943 -570 -185 46 422 112 898 183 6 -194 537 -177 19 744 -127 276 -188 -586
4125e86L40K64l49M60K63l34L01j212K23M51K97N22k04M54j512O50k95m28J07
$$ -586 -246 18 -331 129 392 58 359 -853 -630 -179 118 640 436 890 -622 28 -267 -695 -588
4144e88L38K17l05jj74P33M54j408J597n36r17L79m00J003k35k12O53n91j1N79
$$ -588 -250 -33 -338 -339 -513 220 674 -734 863 327 -590 -211 -611 392 157 -55 598 7 -4 575
4164E75K54r90M01R9k96j83J51m46N3N23j689K126o31M33l75o04n3N77k32L58
$$ 575 829 -161 240 339 43 -140 11 -435 -382 141 -1548 578 -53 380 5 -599 -652 -75 -307 51
4184E1j47L23N1N02l93Q1J54l81j57j3P40j021R06p94N14O26j591P60Q68o83n41
$$ 51 -96 227 278 780 387 468 622 241 84 71 811 -210 696 -98 416 1042 -549 211 1079 396 -145
4205a45R99o92p42M61Q1n71L4N47p25Ln92J062M59l24no57N88J43L87N63j0J98
$$ -145 854 162 -580 -119 -38 -609 -575 -28 -753 -750 -1342 -280 179 -145 -150 -807 -219 -76 311 874 864 1062
4227A062q89n71P60L29R6j130L50N8K23mN28j678J334p96m12J150L25q23M74q11
$$ 1062 173 -398 362 691 787 -343 7 65 288 284 812 -866 468 -328 -740 410 735 -88 386 -425
4247d25j97R75j049O16kl39M47K82j415J182K06j124J035m42O66o66O80m29P10
$$ -425 -622 353 -696 -80 -82 -421 26 308 -1107 75 281 -843 192 -250 416 -250 430 1 711
4266G11q37J231n87j66Qm13O96j019J64j99O68k42l89R72j005L02k51J60k99Q80
$$ 711 -126 1105 518 352 360 -53 643 -376 -212 -411 257 15 -374 598 -407 -105 -356 -196 -495 385
4286C85J47r45M43q86J325j076P15j71K38J04k32P35Q9r16N76R2L65j460J28Q70
$$ 385 532 -413 30 -856 469 -607 108 -63 175 279 47 782 871 -45 531 623 988 -472 -344 526
4306E26p93O66r50R56Q5k14L17n70N00J04M8q30n04K37l98N27o0P84J65j320j69
$$ 526 -267 399 -551 405 490 276 593 23 523 627 675 -155 -659 -422 -820 -293 -353 431 596 -724 -893
4327h93J035r48L39K58q9k15M07L78k01K74O5r88J430j498J075k03q53J410r93
$$ -893 142 -806 -467 -209 -298 -513 -106 272 71 345 410 -578 852 -646 429 226 -627 783 -210
4346b10N33n22LJ117j466L13L61L24r52M65N21p65p07Q25q32J048m73J12L97M69
$$ -210 323 -199 -196 921 -545 -232 129 453 -499 -34 487 -278 -985 -160 -992 56 -417 -305 92 561
4366E61r88m31P76K38L48j93N07l04q49J078p30L00K13j100N72m32O05r0l11j34
$$ 561 -427 -858 -82 156 504 311 818 514 -335 743 13 313 526 -574 -2 -434 171 81 -230 -364
4386c64n4M15j08N5o08k61k67J060J203r96q11O75K24j43M95k76k98P56N86n68
$$ -364 -418 -3 -111 -56 -664 -925 -1192 -132 1071 75 -736 -61 163 20 515 239 -59 697 1283 715
4406G15j891j81J884m37q71Q53J110o25p93J4j09J145q41n12k59J518j332L71
$$ 715 -1176 -1357 527 90 -781 72 1182 557 -236 -222 -331 814 -27 -539 -798 720 -612 -241
4424b41j51k69O4L46k60N86O15N9o11j54m25P95q53N9J307j194P24R2j09k33l74
$$ -241 -392 -661 -597 -251 -511 75 690 749 138 -16 -441 354 -499 -440 867 -327 397 489 380 147 -227
4445b27P13L35p14N67K46L69l95j056P6J33J8Q7n71L31l64N29J38K20k75l28k09
$$ -227 486 821 107 674 920 1289 894 -162 -86 47 65 152 -419 -88 -452 77 215 435 160 -168 -377
4466c77L54K25l39N18j30j884J545O04j057M26M57N48l66o95R12q89J41L26l1
$$ -377 -23 202 -137 381 251 -1633 -88 516 -541 -115 342 890 524 -171 741 -148 -7 319 288
4485B88K8P0l51k10J28p89P45J47k79p4K90k31L45j429J454k38o03K38K54Q68
$$ 288 316 386 35 -175 -47 -836 -91 56 -223 -297 -7 -238 107 -1322 132 -106 -709 -471 -217 651
4505F51m38m29N59m94L9k58N91n12O46M0r02Q46L24j106O26q1Q21r33Q86o49q30
$$ 651 213 -216 343 -151 -112 -370 221 -291 355 395 -507 339 663 -443 183 102 923 -10 876 227 -603
4526f03J127l62q22J54j66P74J142j257o10P86q52N87l56P21K4j014R51k43N93
$$ -603 524 162 -660 -506 -672 102 1244 -13 -623 163 -689 -102 -458 263 287 -727 224 -19 574
4545E74j822P68J644q15j65N77j062M04l66O15q44Q76n14M63n5j47o0l09j53K88
$$ 574 -1248 -480 1164 349 184 761 -301 103 -263 352 -492 384 -130 333 278 131 71 -238 -391 -103
4565a03K35j67j75N0k89J297k92j221L13K93L34n27j39L40p36M04M45J151p13
$$ -103 132 -35 -210 -160 -449 848 556 -665 -352 -59 275 -252 -391 -51 -787 -383 62 1213 500
4584E00r5r20J079p01J89n04N87K83j62J05N43q51J53Q24j098P26p54R89n76k85
$$ 500 405 -515 564 -137 52 -452 135 418 256 361 904 53 206 1030 -68 658 -96 893 317 32
4604C2l6O41k87n65k10J09J80R8L75J73j114Q65m17l62l84Q72K13p0mj01L72o36
$$ 32 -4 637 350 -215 -425 -316 -136 -38 337 510 -604 261 -156 -518 -902 -30 183 113 109 8 380 -256
4626b56m18R21M27r29l83O9M12J756j548J53J18l60m38j6P24n88O59q35J92O38
$$ -256 -674 247 674 -255 -638 -569 -157 1599 51 204 322 -38 -476 -492 232 -356 303 -532 -340 298
4646B98l97K4k6O06j084P57o82L40j74n43kJ805L59j000p6m0l13L4m61P85m08
$$ 298 -99 -75 -101 505 -579 178 -504 -164 -338 -881 -883 922 1281 281 205 165 -148 -114 -575 210 -198
4667a98L70J22j83k27l48n01L87J75R44l18K09l96n25Q60n09O77q67N83m27L96
$$ -198 172 294 111 -116 -464 -965 -578 -403 541 223 432 36 -489 371 -138 539 -328 255 -172 224
4687B24n3Qj46O13M8p2n85N91o46k3M34k65J70J91o27J42L61q9L07p59j21L29
$$ 224 171 179 33 646 694 622 37 628 -18 -41 393 128 298 489 -138 4 365 276 583 -176 -297 32
4709C2m36j57J313o35l07p7K12J37K68n40l06K42k15K96j06M92n03P17j31j316
$$ 32 -404 -561 752 117 -190 -267 -55 82 350 -190 -496 -254 -469 -173 -279 213 -290 427 296 -1020
4729a020R60O32r60O73J84m77P79r40r2J30Q86m91M59j417K17P20P0p63j96J57
$$ -1020 -60 572 -388 285 469 -8 771 -169 -261 -131 755 264 723 -694 -477 243 313 -450 -646 -489
4749d89L92o59J443j228J366k06o77N49q60J03K39L66o60l99R58j96j149J560
$$ -489 -97 -756 687 -541 825 619 -58 491 -369 -266 -27 339 -321 -720 238 42 -1107 453
4767D53P71j291M03K43m94N70j163Q83l15q7L99o15k67L89l72O87j95m99J52L90
$$ 453 1224 -67 336 579 85 655 -508 375 60 -27 372 -243 -510 -121 -493 194 -1 -500 -348 42
4787D2M15j426Q66P0m41K47M97l60n19P56o88N18j052K06L53J107j89L24P0p69
$$ 42 457 -969 -103 -33 -474 -227 270 -90 -609 147 -541 -23 -1075 -869 -516 591 402 726 796 27
4807B7j64j73Q52k249K199l25o7m34j09O83O4k78K51j05n77R00k30q18J258p35
$$ 27 -137 -310 542 -1707 492 167 100 -334 -443 240 304 26 277 172 -405 495 265 -553 705 -30
4827c0M39l39Q76j566P28O97r57J57K58J05j66l51M70l11K93l88L73M41p11k17
$$ -30 409 70 946 -620 108 805 -152 5 263 368 202 -149 321 10 303 -85 288 729 18 -199
4847a99M22L09k70o8j18q76L92j6R6m01Q01P73p19m58j74LR11M2mn06L55l23l54
$$ -199 223 532 262 194 76 -800 -408 -424 -328 -729 72 845 126 -332 -506 -503 408 450 446 -60 295 -28 -382
4870c82M02n90R40k07k0M50j166L36p9R21j685N90P22J009j125l28J92j40O5N84
$$ -382 20 -570 370 163 143 593 -573 -237 -316 605 -1080 -490 232 1241 116 -212 -20 -160 -95 489
4890D89p10l57k89K29M84n55Q60l26N76o60R37l2j297J092j068P22l55P54j90
$$ 489 -221 -578 -867 -638 -154 -709 151 -175 401 -259 678 646 -651 441 -627 95 -260 494 304
4909C04n60N15q00j79P95j089M04P27k34K75K38j28K24q03p17J139j77R02j261
$$ 304 -256 259 -541 -720 75 -1014 -610 117 -117 158 396 268 492 -311 -1028 111 -66 836 -425
4928d25R5k01J62N07K0l76k97K36M94o03l23M29k9Q4J15M63r75J268j107N68j02
$$ -425 -330 -531 -369 138 158 -218 -515 -279 215 -388 -711 -282 -311 -227 -112 351 -624 644 -463 105 3
4949Cj2p11J246j2p58M26j0L92J9o15O08n70R31j120R9R6j29L22l88j25J77Nj93
$$ 3 -9 -720 526 514 -244 182 172 564 583 -32 576 6 937 -183 -84 12 -117 205 -183 -308 -131 -126 -319
4972c19K18L66n54K15k66q00N17J182K17j600Q25O7k39K17j114J444k12j48J85
$$ -319 -101 265 -289 -74 -340 -1140 -623 559 776 -824 1 68 -171 46 -1068 376 164 16 201
4991B01q9j70k18J9k07N86o25M42m47P27N52o94j00l11L11L0o72O53L1J95K19
$$ 201 112 -58 -276 -257 -464 122 -503 -61 -508 219 771 77 -23 -334 -23 7 -665 -12 19 214 433
5012D33m16j57O72K79p68k43M05K21k99j54J76m21J34M38j016R31j68O6l37m59
$$ 433 17 -140 532 811 43 -200 205 426 127 -27 149 -272 -138 300 -716 215 47 113 -224 -683
5032f83j00O30n31o1J533r92r6J333l15l58q57M15k64O15J222j672O74m8k78l57
$$ -683 -783 -153 -684 -745 788 -204 -300 1033 718 360 -497 -82 -346 269 1491 -181 493 445 167 -190
5052a90P37n39n85O54jP14q01L39q00O59j30P7l02O3J016p32k50J34q8J52j12
$$ -190 547 8 -577 77 76 790 -11 328 -472 187 57 134 -168 -105 911 179 -71 63 -25 127 15
5073A5n70O58n0m11N19j46j40L44K27j226M18N57L25j068J053o66O0J34k87k84
$$ 15 -555 103 53 -358 161 15 -125 219 446 -780 -362 195 520 -548 505 -161 -101 33 -254 -538
5093e38J19L63r65J961j510M06N65j112R64N23r42k76P33O2q20M94O11j416J267
$$ -538 -419 -56 -1021 940 -570 -164 401 -711 253 776 -166 -442 291 353 -467 27 638 -778 489
5112D89k75q00J017p1k85k7n7p86L87J214r83P7K22K81j6J81p13J081p79k43j3
$$ 489 214 -586 431 360 75 48 -9 -795 -408 806 -177 -100 122 403 387 568 -145 936 157 -86 -99
5133i9M97M81j301M43k5o73K69Q91m67K24p93Q91q8J37l4j075M23M1q15O89O97
$$ -99 398 879 -422 21 -4 -677 -408 483 16 240 -553 338 250 387 353 -722 -299 -258 -1073 -384 313
5154C13p86J24M90L99k05m30N93p09M55O6l24J29j78O04j88R9j445Q17L33P8j11
$$ 313 -473 -349 141 540 335 -95 498 -211 244 310 -14 115 -63 541 353 452 -993 -176 157 235 124
5175A24k17L21j86l51k47P59J28j28n36l41j18J088p78K73K50j77Q5n21J59J400
$$ 124 -93 228 42 -309 -556 203 331 203 -333 -674 -792 296 -482 -209 41 -136 -51 -572 -413 987
5195I87k12l38m74M84L2j57K32J80q28j02M85p58O49q89Q60J09n72p6J31k70M88
$$ 987 775 437 -37 447 479 322 554 734 -94 -196 289 -469 180 -709 151 260 -312 -388 -257 -527 -39
5216c9J42k54n56Q11L78j626J090P06J39p74Q63j138K04m62o29J317k22j065J552
$$ -39 103 -151 -707 104 482 -1144 -54 652 791 17 880 -258 -54 -516 -1145 172 -50 -1115 437
5235D37K62P6r26N34k08l82M91K60k16o82K30o03Q71r90K12j39J021m74L70j073
$$ 437 699 775 -151 383 175 -207 284 544 328 -354 -124 -727 144 -846 -634 -773 248 -226 144 -929
5255i29O70K17p22K48L33K21P88m96j054N86K42l39N54n47L68l53N14j13q71K29
$$ -929 -259 -42 -764 -516 -183 38 826 330 -724 -138 104 -235 319 -228 140 -213 301 188 -683 -454
5275d54J011l70p55N37N95n57J81L43j309J336l96P35j265K38j83N35j316P82
$$ -454 557 187 -568 -31 564 7 188 531 -778 558 162 897 -368 -130 -313 222 -1094 -312
5293c12j89o9R99N62j140j47j80L33Q4l12M56n7N4k23l75L02K58q80J567p56M68
$$ -312 -501 -570 429 991 -149 -296 -476 -143 -59 -371 85 28 82 -141 -516 -214 44 -836 731 -25 443
5314D43n09l9n99J180Q3k40j234J667K4j91r09O92q65o32R74j84r25J434O6M16
$$ 443 -66 -105 -704 476 559 319 -915 752 776 585 -324 368 -497 -1129 -155 -339 -1264 170 236 652
5334F52l54m74j80K74L22J01j02r0j61k7O95R4j255P16k64j13K8Q67n18o00M08
$$ 652 298 -176 -356 -82 240 341 239 149 -12 -39 656 750 -505 211 -53 -166 -138 729 211 -389 19
5355A9j58JL26o61L58M88j15J93k42p6q6Rm8m65Q57M11j160M29J94j029N93K45
$$ 19 -139 -138 188 -473 -115 373 258 451 209 133 47 56 8 -457 400 811 -349 80 274 -755 -162 83
5377H3o34J169k50O36q44M36j253Q13J39n38Q87j653J033n30M36M77j16j029J211
$$ 83 -551 618 368 1004 160 596 -657 156 295 -243 644 -1009 24 -506 -70 407 291 -738 473
5396D73q03n0J26N25K58j152N75K3R01q35j82N76L5n68J3j241J768k93l50J086
$$ 473 -330 -380 -254 271 529 -623 -48 -25 876 41 -141 435 470 -98 -85 -1326 442 149 -201 885
5416H85l44m13J64p96N82j68j71J12N64m55L05n62O43m36n24R15j9r98P15N6j16
$$ 885 541 128 292 -504 78 -90 -261 -149 415 -40 265 -297 346 -90 -614 301 282 -716 -1 55 -61
5437f1N66j0n82p38N11M61l82P9j13J82l32J38N1L16j68k66L39l72L31L09l8P2
$$ -61 505 495 -87 -825 -314 147 -235 -156 -269 -87 -419 -281 -230 86 -82 -348 -9 -381 -50 259 221 293
5459B93l91N58M1K86r25l35R59r08J291j381J196k61j53L79o62K27J18q54L90
$$ 293 -98 460 501 787 -138 -473 486 -422 869 -512 684 423 270 649 -13 214 332 -522 -132
5478a32J69N55r77R99J30o48k52j70j14N39N95j120R62j151O18o31M60j05OQ23
$$ -132 37 592 -385 614 744 96 -156 -326 -440 99 694 -426 536 -615 3 -628 -168 -273 -267 556
5498E56o81N54q79R80m71K10l85L02M20j78K52J68l86l22K53m10K6k09k14J86
$$ 556 -125 429 -450 530 59 269 -116 186 606 428 680 848 462 140 393 -17 9 -200 -414 -228
5518b28O45l07Q6r64J064l27L11m22K52o94O64J36o49J076o40K43l32p53L12L91
$$ -228 417 110 196 -768 296 -31 280 -142 110 -584 80 216 -433 643 3 246 -86 -839 -527 -136
5538a36L20J18P0m2o11K82M78J20o00q36O84O3o74K22N75l46R9j58P98l58N19
$$ -136 184 302 372 330 -281 1 479 599 -1 -837 -153 -90 -764 -542 33 -313 -214 -372 426 68 587
5559E87j069M97L22o3l03L2M76q74O20o89R46m58k80N66K69p21O5O59n07L59j308
$$ 587 -482 15 337 274 -29 3 479 -395 225 -464 482 24 -256 310 579 -142 -77 582 75 434 -874
5580h74N70J81L52p59O72M05j108Q09r99J251n23k3J039q68J79J12m83j65R01
$$ -874 -304 -123 229 -530 142 547 -561 248 -751 500 -23 -46 993 125 304 416 -67 -232 669
5599F69l98p19L08J427j64k199N93K68O46J45j274J137m96j000P89N46n78j31
$$ 669 271 -448 -140 1287 1123 -1076 -483 -215 431 576 -698 439 -57 -1057 -268 278 -300 -431
5617d31M61K81m85q7R56o33J83j65n88J046j117J169j98q67Q31q04N25l03J47
$$ -431 30 311 -174 -261 695 62 245 80 -508 538 -579 590 392 -475 356 -448 77 -226 -79
5636g9O0q07J101n08l07J031n11K09k62J07q85M38L51M29p27q75J214n84P14m00
$$ -79 -19 -826 275 -233 -540 491 -20 189 -73 34 -851 -413 -62 367 -360 -1235 -21 -605 109 -291
5656b91M99M02N42j871P28j78l78J128N54j478J120r20o65Q58L51n23O95o76M74
$$ -291 208 610 1152 -719 9 -169 -547 581 1135 -343 777 -143 -808 50 401 -122 573 -103 371
5675C71k45p25K93Q72k29j139N55O57l89R7K72p7R6m20M04p48R94j18l87m96K29
$$ 371 126 -599 -306 566 337 -802 -247 410 21 118 390 313 409 -11 393 -355 639 521 134 -362 -133
5696a33l29o13J085K40n09o55K034r84M0m12K90p1R6J64K67o11J64n80J073J14
$$ -133 -462 -1075 10 250 -259 -914 1120 136 176 -236 54 -17 79 243 510 -101 63 -517 556 670
5716F70o50j60P84j2m32J46k31P6j02P75j929J66M02M15M82j529K126m46k5r22
$$ 670 20 -140 644 632 200 346 115 191 89 864 -1065 -899 -497 -82 400 -1129 997 551 526 -396
5736c96J78m59P78M59l29p67P23l83Q31r84L44k23O88k7r12M74n98M2O29N02L11
$$ -396 -218 -677 101 560 231 -536 187 -196 635 -349 -5 -228 460 433 -479 -5 -603 -561 68 570 881
5757H81q14m4N67j135N38n10N81J02J36k77P93K63q97n8L71J00r87K10l4J10Q26
$$ 881 67 23 590 -545 -7 -517 64 166 302 25 818 1081 184 126 497 597 -390 -180 -214 -104 722
5778G22o79m79P29J42k25m58N78P51j641M49k74M00j095O72N34j23l22P87j121
$$ 722 43 -436 293 435 210 -248 330 1081 -560 -111 -385 15 -1080 -408 126 3 -319 468 -653
5797f53O75j00K56j01r45J449p46q1k58J049k36j54m00l70O20P55o52l1L06m98
$$ -653 22 -78 178 77 -868 581 -165 -246 -504 545 309 155 -245 -615 5 760 108 77 383 -115
5817a15K60m18r8L19j03m88J071k78K15J90L3j8p50R4o7j68N93j20l67L20K77
$$ -115 145 -273 -371 -52 -155 -643 428 150 365 555 588 570 -180 -86 -153 -321 272 152 -215 105 382
5838C82n72K08J366j615N44L53m8o18m93R8K13J264j108j99J92o1k16K39k5M37
$$ 382 -190 18 1384 -231 313 666 618 0 -493 -395 -182 1082 -26 -225 -33 -94 -310 -71 -96 341
5858C41o52j16N95m12l9l67N75l65L45j59l3m12J119l16J78l28N9o55J812p36
$$ 341 -311 -427 168 -244 -283 -650 -75 -440 -95 -254 -287 -699 420 104 282 -46 13 -642 1170 434
5878D34o9j598k05Q15Q97L30j335P80K17k73P1N1j51k25M87K90r09M37M46o7K25
$$ 434 365 -1233 -1438 -623 274 604 -731 49 266 -7 64 115 -36 -261 226 516 -393 44 490 423 648
5899F48o20j41j02o3O44l11J7l6k93m38J457m89q89Q89n68P83o33p6P20m15J12
$$ 648 28 -113 -215 -278 366 55 72 36 -257 -695 762 273 -616 273 -295 488 -145 -221 499 84 196
5920A96O94r71J80k43J45O78k86M1j180l90J956l07o02N78Q4K19m69l05m82P92
$$ 196 890 -81 99 -144 1 679 393 434 -746 -1136 820 513 -89 489 573 792 323 18 -464 328
5940C28J53j038K96N87m00L27o17J87N27K16J9k87l41l82J95L42J4l42J256o57
$$ 328 481 -557 -261 326 -74 253 -364 -177 350 566 585 298 -43 -425 -230 112 126 -216 1040 383
5960C83o95M66N31j302k14J356j76m49k16N5P69k20L58n94N43r74J000j306P79
$$ 383 -312 154 685 -617 -831 525 349 -100 -316 -261 508 288 646 52 595 -379 621 -685 94
5979I4M88Q15o16j077k7P67p79J52q00J337j175L83Q33n19k62O37J16r82M77K32
$$ 94 582 1397 781 -296 -323 444 -335 -183 -983 354 -821 -438 395 -124 -386 251 367 -615 -138 94
5999I4Q22m84J9m12l77Q75n68k28o2m66J591j89K55p38J39j061R81n22j431K489
$$ 94 916 432 451 39 -338 537 -31 -259 -321 -787 804 615 870 132 271 -790 191 -331 -1762 727
6019G27j188m18J318q82Q7M46q04rK46Q0J41K52K99K52k45k77n59J158o75q25
$$ 727 -461 -879 439 -443 -356 90 -714 -723 -477 -397 -256 -4 295 547 302 25 -534 624 -51 -876
6039h76M97P52K18o04J51k06m35M36K45j7N54q37K71r28J535j23L25j064n17M15
$$ -876 -379 373 591 -13 138 -68 -503 -67 178 161 715 -122 149 -779 756 633 958 -106 -623 -208
6059b08k22N77O6l20N11Q3r54P24L21p07N20l03K70p29L15j42L85K51On47K1M58
$$ -208 -430 147 213 -107 404 487 -467 257 578 -129 391 88 358 -371 -56 -198 187 438 444 -103 -82 376
6081C76o47P77o27J49L70r84N82o91j92J301j191N25K71j09O03o49L99L84p74
$$ 376 -271 506 -121 28 398 -586 -4 -695 -887 414 -777 -252 19 -90 513 -136 263 647 -127
6100a27J406r00L69j399M77J68j50K54k05p62J97J164k12j17M4q9n95L61K41l85
$$ -127 1279 379 748 -651 -174 -6 -156 98 -107 -869 -672 492 280 163 207 118 -477 -116 125 -260
6120b60j57J130k80r42K1N75m28N65o19M62k58j49M65m31R93p08q7l51L22K97
$$ -260 -417 713 433 -509 -488 87 -341 224 -395 67 -191 -340 125 -306 687 -21 -108 -459 -137 160
6140A60K00p31M12P9q60l4M43m45J478q34K02M6J92m49m46N27P65k66k39M00o24
$$ 160 360 -371 41 120 -740 -774 -331 -776 702 -132 70 116 308 -141 -587 -60 705 439 200 600 -24
6161b4N93n63L39o51M29p12J97J056j109M68M64m62m70J200q39M92n35L88n65
$$ -24 569 6 345 -306 123 -589 -392 664 -445 23 487 25 -445 755 -84 408 -127 261 -304
6180c04k10j95O22J052j584O30j93o88r2J345o04q0Q51j76M84j090J25n03J427
$$ -304 -514 -709 -87 965 -619 11 -182 -870 -962 383 -221 -301 550 374 858 -232 -107 -610 817
6199H17r90nL94j063L04P15K97j7M5L74l79J33n22m20K5l35J353q12K28M28j32
$$ 817 -173 -178 216 -847 -543 172 469 452 497 871 492 625 103 -317 -292 -627 726 -86 142 570 438
6220D38Q15j791J507n89l61L2M76q50j41J268r69M21l3K65p06J221j299j83K49
$$ 438 1253 -538 969 380 19 51 527 -323 -464 804 -165 256 223 488 -218 1003 -296 -479 -230
6239b30o94j79J770j003n31Q70o17r6R08n90R31n87P12j208Q49N42O02k074P27
$$ -230 -924 -1103 667 -336 -867 3 -614 -710 198 -392 539 -48 664 -544 305 847 1449 -625 102
6258A02n52P12k97m59P62o93J88n58J112O78n74k93K04l45J59M09L92j257l2n46
$$ 102 -450 262 -35 -494 268 -425 -237 -795 317 995 421 128 332 -13 146 555 947 -310 -342 -888
6278h88K92M34N95j172J401j413R38N73j147K08M0j10n49J102m46k01J41PJ21
$$ -888 -596 -162 433 -739 662 -751 187 760 -387 -179 -139 -249 -798 304 -142 -343 -202 -195 -74
6297g4K25l89N21J6o15o25N61j51R80j478J191n55M20l21k27J115j95m70O63o63
$$ -74 151 -238 283 299 -316 -941 -380 -531 449 -1029 162 -393 27 -294 -521 594 399 -71 592 -71
6317g1L78j096J668o54q15J075m82R51r11n80P3O81o78J21K15L81o91j86Q91n93
$$ -71 307 -789 879 225 -590 485 3 954 43 -537 -464 217 -461 -340 -125 256 -435 -621 270 -323
6337c23n51J397r69M67M02p78L60n4O76k76n98N54l77k00L34n14Q59q38Q72j350
$$ -323 -874 523 -446 21 423 -355 5 -49 627 351 -247 307 -70 -270 64 -450 409 -429 443 -907
6357i07J95J368n86j79k29n3M19O61n74o90N13m49Q71l0l48l34k99J463j97o37
$$ -907 -712 656 70 -109 -338 -391 28 689 115 -575 -62 -511 360 330 -18 -352 -651 812 615 -22
6377b2n91P76K4K09o94n62P32M75r77O22L29N0M03p10K64o12j64K85J10L42P94
$$ -22 -613 163 187 396 -298 -860 -128 347 -630 -8 321 371 774 64 328 -284 -448 -163 -53 289 1083
6398A083j175m62K50k8K7P66j79M36j759R95M38j129K18M68j05J73j26L51l40
$$ 1083 -92 -554 -304 -332 -305 461 282 718 -1041 -46 392 -737 -519 -51 -156 17 -109 242 -98
6417i8l13R18l19l17K95m99j26J37J014o96k32Q92r74O60o83J49l31N93l09J459
$$ -98 -411 507 188 -129 166 -333 -459 -322 692 -4 -236 656 -318 342 -341 -192 -523 70 -239 1220
6437A220j137oN85n5n66q17P50n93K49j046J417M10n71k7L27j221J580K5j004
$$ 1220 83 77 662 607 41 -776 -26 -619 -370 -1416 1 411 -160 -187 140 -1081 499 524 -480
6456d80J268j88j246N85M6J14M07q68J171O9j050J460j661P4N41K43q74J14q32
$$ -480 788 600 -646 -61 -15 99 506 -362 809 878 -172 1288 -373 -299 242 485 -389 -275 -1107
6475a107J346l45Q7m39L20j83R57r04Q52p7l83k4q65O12Q56j202L56M2K27p38
$$ -1107 239 -106 -19 -458 -138 -321 636 -268 584 507 124 100 -765 -153 703 -499 -143 -101 126 -612
6495f12N35R7k21j96J150r42J95r26Q75N66l03r8j39J116j178L00o08O05J69j102
$$ -612 -77 20 -201 -397 753 -189 6 -920 -45 521 218 120 -19 1097 -81 219 -389 216 385 -717
6515g17M11L03n44j15J116j363R24J4P4L31j93M24j017n1J432n26o22Q01o34J00
$$ -717 -306 -3 -547 -662 454 -909 15 29 103 434 241 665 -352 -403 1029 503 -119 682 48 148
6535A48M08j52p10O72P6m45o5N15j312R39J3J26k23m15J89M65n37j21K90l13J170
$$ 148 556 404 -306 366 442 -3 -68 447 -865 74 87 213 -10 -425 -236 229 -308 -429 -139 -452 718
6556G18l04n18k72J95k79J60K09K70k43J48L57P31j864Q04o03O71j149O23M47
$$ 718 414 -104 -376 -181 -460 -300 -91 179 -64 84 441 1172 -692 112 -491 180 -969 -346 101
6575A01K94n18K2l70N50N12J7k38J83j067nM61J19j054J261l68Q44n81J99k79
$$ 101 395 -123 -101 -471 79 591 608 370 553 -514 -519 -58 61 -993 268 -100 744 163 362 83
6595H3l60N9o29J130n34J326j140k92J124p99J21j78j80r7N34K36l58M39R33o63
$$ 83 -277 -218 -847 283 -251 1075 -65 -357 767 -32 89 -89 -269 -366 168 404 46 485 1418 755
6615G55o82q0P48k81o04N57l21j63N6Q69n62M25m61k08l48P7L89Q8J04o89M80
$$ 755 73 -7 741 460 -144 413 92 -71 -15 854 292 717 256 48 -300 -223 166 254 358 -331 149
6636A49K00m94j39M59r2K61n06J184o75k02L62n0M90o93j08n11j52n0P9m9l78
$$ 149 349 -145 -284 175 83 344 -162 1022 347 145 507 457 947 254 146 -365 -517 -567 -488 -537 -915
6657i15O31k7J084j061O73p26J60L92o30K18n43R29N1j249L85N59q6m71J356j324
$$ -915 -284 -311 773 -288 385 -341 -181 211 -419 -201 -744 185 236 -1013 -628 -69 -155 -626 730 -594
6677e94Q58k44j44K72N3J55r47Q85o7J40l94L00m29M99j79O01L95j057m50K01
$$ -594 264 20 -124 148 201 356 -591 294 227 367 -27 273 -156 343 164 765 1160 103 -347 -146
6697a46k26L80l23l78Q22M33Q1n84P31K43p42L58m19K4L3l2m16N57K78j177J168
$$ -146 -372 8 -315 -693 129 562 643 59 790 1033 291 649 230 254 287 255 -161 396 674 -503 665
6718F65l06m16o75L66K74q64Q83J73j09N77r46M03q69M23Q57m20j16k67M71M81
$$ 665 359 -57 -732 -366 -92 -956 -73 100 -9 568 -378 25 -844 -421 436 16 -100 -367 104 585
6738E85m41o40M8P94k55l56L83n12K67M95j69n80L32p2J0N68j30o87R67q34k43
$$ 585 144 -496 -448 346 91 -265 118 -394 -127 368 199 -381 -49 -121 -111 457 327 -360 607 -227 -470
6759d70P20n17O26j92p53R86n40J0l49J023j221L44J9K78M13L27j090P70J24k51
$$ -470 250 -267 359 167 -586 400 -140 -130 -479 544 -677 -333 -314 -36 377 704 -386 384 508 257
6779B57q0m06N53l48j177M53Q84R0M4k30M43j220R17p96R14M29q70m40N64j56
$$ 257 177 -229 324 -24 -1201 -748 136 226 270 40 483 -737 180 -616 298 727 -143 -583 -19 -175
6799a75N68j197O21P75l42l21k54M53j18l90O98K56o02r30J554p11m87J936P6
$$ -175 393 -804 -183 592 250 -71 -325 128 10 -380 318 574 -28 -958 596 -115 -602 1334 1410
6818A410k228P15L22L23L98J80n44J09q72L52m04N56m43M28k95L68l74O63j027
$$ 1410 -818 -103 219 542 940 1120 576 685 -187 165 -239 317 -126 302 7 375 1 664 -363
6837c63N38n42J91m81N34K09l54N73l49J61n12N56N37o53J10r39K92O77l21q8
$$ -363 175 -367 -176 -657 -123 86 -268 305 -44 117 -395 161 698 45 155 -784 -492 185 -136 -224
6857b24N48L00l69j231R25k02K59N8K86l90k38J82k62P26q35o51J254J40kl19
$$ -224 324 624 255 -976 -51 -253 6 64 350 -40 -278 -96 -358 368 -467 -1118 136 276 274 -45
6877d5K41k51J33k38q0O82n56N66o96J08Q83k74k36l24J213r35M12p59k20J89
$$ -45 196 -55 78 -160 -240 442 -114 452 -244 -136 747 473 237 -87 1126 191 603 -156 -376 -187
6897a87N34j071J397l39p24N10k43l1K31j018J666q18K51l8jO71r85p17J716r75
$$ -187 347 -724 673 334 -390 120 -123 -154 77 -941 725 -93 158 120 119 790 -195 -912 804 -171
6917a71j74R62r37P79K06m94j143J118k64l26M79m85l8J149p42O04j4q03M59J45
$$ -171 -345 617 -320 459 665 171 -972 146 -118 -444 35 -450 -488 661 -81 523 509 -294 165 310
6937C10p55M63o47M83j47O89l09Q7j1M42n66O7o43O77m7k1L30o44M19j281K16
$$ 310 -445 18 -629 -146 -293 396 87 174 163 605 39 106 -537 140 93 72 402 -242 177 -1104 -888
6958h88R64j83P55l91o88o04J211k7m81J79K43k02N25j094J199k48j57m56l27
$$ -888 76 -107 648 257 -431 -1035 176 149 -332 -153 90 -112 413 -681 518 270 113 -343 -670
6977f70J89l69j45J166n2N00k77r98J039K95k088J530J98j116O63J90k18L02l91
$$ -670 -481 -850 -995 171 119 619 342 -656 383 678 -1410 120 318 -798 -135 55 -163 139 -252
6996b52j1P83O2q11P09r20O02N0j27j71J24j48j9n25K03M66L8k44P26Kj243P93
$$ -252 -263 520 582 -229 480 -440 162 212 85 -86 38 -110 -129 -654 -451 15 53 -191 535 537 -706 87
7018H7M19p75L66%L9J3l98M66J29L8J7J62l87j55k8P54k93l24m52O23m55N31r15
$$ 87 506 -269 97 97 136 149 -249 217 346 384 401 563 176 21 -7 747 454 130 -322 301 -154 377 -538
7041e38Q92m18N16l84k99N05p63P83J53j558Q97l22J739n09o10L48l68L48l32
$$ -538 354 -64 452 68 -231 274 -489 294 447 -1111 -214 -536 1203 694 84 432 64 412 80
7060H0o38P64p98K99mN31p6k78Q77m92n39O72n45o23P90L00n66p68J582J12j087
$$ 80 -558 206 -592 -293 -297 234 158 -120 757 265 -274 398 -147 -770 20 320 -246 -1014 568 680 -407
7081d07k10J51N54p35P33k53O6M58r15N5k8M52J13j9N5O0k03q7L85p97L97J45
$$ -407 -617 -466 88 -647 86 -167 -101 357 -558 -503 -531 -79 34 15 70 130 -73 -160 225 -572 -175 -30
7103c0O06j75q53J139j343K32K81r2l04J245m00p02l85M79J216j454N66n55j9
$$ -30 576 401 -452 687 -656 -424 -143 -235 -539 706 306 -396 -781 -302 914 -540 26 -529 -548
7122e48N22K59K17j05K14j092R73j146P82n67P90J8k55r80J57J344l20j59j387
$$ -548 -26 233 450 345 559 -533 440 -706 76 -491 299 317 62 -918 -761 583 263 104 -1283
7141a283J391M6n42P35j142P60l43K55l3Q42l38J67m33j25n17N41l49N90J24k48
$$ -1283 108 154 -388 347 -795 -35 -378 -123 -156 686 348 515 82 -43 -560 -19 -368 222 346 98
7161I8N24r74n83j57J351m92k09Q33j223M70P03j001J550m34l11l42O68j244J312
$$ 98 622 -352 -935 -1092 259 -233 -442 391 -832 -362 341 -660 890 456 145 -197 471 -773 539
7180E39j29J77m09j60l59P90p95M75L74K8j565R64M60m37K57L76l43o25K80o55
$$ 539 410 587 178 18 -341 449 -346 129 503 531 -1034 -70 390 -47 210 586 243 -382 -102 -757
7200g57J097n34M44O5j48k23l68L06k92P8N22n37K25O7k29L66l5r9J20L3p43M60
$$ -757 340 -194 250 315 167 -56 -424 -118 -410 -332 190 -347 -122 -55 -284 82 47 -52 68 101 -642 -182
7222a82M51M65r95Q7N40l4q50J069r14n10Q70k35L24p45J37J296n46m93K95q9
$$ -182 269 734 -261 -174 366 332 -518 551 -363 -873 -3 -238 86 -659 -522 774 228 -265 30 -59
7242e9M85p12R36m02K87r46M64K52k32L83M18m81j035J51M20O37o04j89j18J286
$$ -59 426 -286 650 248 535 -411 53 305 73 456 874 393 -642 -491 -71 566 -38 -227 -345 941
7262I41j342N57n1P10j069k06j26P66J01p97L58K35n57J287o55j132J269M37j380
$$ 941 -401 156 105 815 -254 -460 -586 180 281 -516 -158 77 -480 807 152 -980 289 726 -654
7281f54J028j79n69J322j237P42o49L39l33M83l83L08j169K35M49M07j015R98
$$ -654 374 195 -374 948 -289 453 -196 143 -190 293 -90 218 -951 -716 -267 140 -875 123
7299A23P89j489K31l09O14N90j129O63M77n00k41L77l0n3j152Q96L96R73p28r08
$$ 123 912 -577 -346 -655 -41 549 -580 83 560 60 -181 196 166 113 -1039 -143 253 1226 498 -410
7319d10J67J88l4L32l69m00P19K96m63l64M41k61R25j27m52K16k66k67p1Q79k77
$$ -410 -243 -55 -89 243 -126 -526 193 489 26 -338 103 -158 767 640 188 404 138 -129 -200 679 402
7340D02K20r42l70Q56j82K11m53K51j306J000M66N88n60o77j50r0J494l36j15
$$ 402 622 -320 -690 166 -16 195 -258 -7 -1313 -313 153 741 181 -496 -646 -736 758 422 307
7359C07m76M13j158J056r09Q61K47L07n69N2l7l16L37o78J487p96o17P46j623
$$ 307 -169 244 -914 142 -767 94 341 648 79 131 94 -222 115 -563 924 128 -489 257 -1366
7378a366P51R1k79K47K49k36J187p98L5K19M9r72K66N11N54m43q7m04K79L48o41
$$ -1366 -615 -524 -803 -556 -307 -543 644 -154 -119 100 149 -823 -557 -46 508 65 -22 -426 -147 201 -440
7399d40O24o40M11n9O1Q0N41r70R00n80K64o10N35K75j331N34L16K26l22Q02j35
$$ -440 184 -456 -45 -104 -43 37 578 -392 508 -72 192 -418 117 392 -939 -405 -89 137 -185 617 482
7420D82j502J948j326M94n77J14k7M24J93j60r2o07K70J53M77m19j97L08j91n6
$$ 482 -1020 928 -398 96 -481 -367 -394 30 223 63 -29 -636 -366 -213 264 -155 -352 -44 -235 -291
7440b91K53o71P99l71Q0L79m28O68o42J23Q51r84o78J023M03j134Q73K47r38Q48
$$ -291 -38 -709 90 -281 -201 178 -250 418 -224 -101 750 -234 -912 111 514 -620 253 500 -438 410
7460D10j91o39l38O51j08L32L03l25p03K30N68pK22J03j079K40N58k31l84P77
$$ 410 219 -420 -758 -107 -215 117 420 95 -608 -378 190 183 405 508 -571 -331 227 -4 -388 389
7480C89j200N64l07N65N28m97L82K25l96j202p1Q41r11J498L20m88l3K12k65k17
$$ 389 -811 -247 -554 11 539 42 424 649 253 -949 -1020 -179 -1090 408 728 240 207 419 154 -63
7500f3M76p30L5N19j066Q3P07l07L96j66j4K83k11N80m33j042J229m26o11P15
$$ -63 413 -317 -282 237 -829 -746 -39 -346 50 -116 -130 153 -58 522 89 -953 276 -150 -761 -46
7520d6P3o65M89Q29r33q1Q70o81K08l86J4m02O66m21K87L63m56N70p9L19k30o14
$$ -46 27 -638 -149 680 -253 -334 536 -145 63 -323 -309 -711 -45 -466 -179 184 -272 298 219 538 308 -306
7542c06k02Q95N20r43o56Q04k73n27O21J49q21O97N20j123O56J16L24j2j61k92
$$ -306 -508 387 907 -36 -692 112 -161 -688 -67 82 -739 -42 478 -645 11 127 451 439 278 -14
7562a4N25m44M37j105J233l51k5L46j264K9Q17K06l74p36N0N10K39j31L94m45
$$ -14 511 67 504 -601 632 281 256 602 -662 -633 184 390 16 -720 -670 -160 79 -52 342 -103
7582a03m3J93r89J377j81K79j65j22L31l65k74p85J070o42l48P04n28k22K81O43
$$ -103 -146 47 -942 435 254 533 368 246 577 212 -62 -847 223 -419 -767 -63 -591 -813 -532 111
7602A11R0j174O48O15N5l73J42OP94k3j010j076J345K76k99M75M63j278M71j437
$$ 111 201 -973 -325 290 345 -28 114 120 914 891 -119 -1195 150 426 127 602 1065 -213 258 -1179
7622a179J411l75J60j45J36O9q14J121j324J548p95L5NJ40N79j229J381j095o35
$$ -1179 232 -143 17 -128 8 77 -737 384 -940 608 -187 -152 -147 -7 572 -657 724 -371 -1006
7641a006M03K34N66k01k97k97O84p17Q4R16m12j00r2j53N0J158j049l49J139k81
$$ -1006 -603 -369 197 -4 -301 -598 86 -631 -547 369 -43 -143 -235 -388 -338 820 -229 -578 561 280
7661B80N06l64j92l25j98J103j189K24J26j62K48m54J06l57K70l58O27m96L62
$$ 280 786 422 230 -95 -293 810 -379 -155 -29 -191 57 -397 -291 -648 -378 -736 -109 -605 -243
7680b43K11p89J644p35J81l40J99L74o02J49k75J345p73m82K89k01p3k14R56j217
$$ -243 -32 -821 823 88 269 -71 128 502 -100 49 -226 1119 346 -136 153 -48 -121 -335 621 -596
7700e96O5P36O9l14M97q95L20P2K18m59P61R82j822K2O09l42N93l03j81j50J35
$$ -596 -531 205 274 -40 457 -438 -118 -46 172 -287 474 1456 -366 -344 265 -77 516 213 32 -118 17
7721A7m12M44JJ52m07p3n88P35L42p15Q49k82j44J011m86K19j282P21o65J046
$$ 17 -395 49 50 202 -205 -278 -866 -131 211 -504 345 63 -81 930 444 663 -619 102 -563 483
7741D83o10p77O34M72m00mK43K68q28Q75n1q17J058l40m79L8O72k35o87P91j02
$$ 483 -127 -904 -270 202 -198 -202 41 309 -519 356 305 -512 546 206 -273 -235 437 202 -485 306 204
7762B04j73L01j38P89j451J298o51l96N10Q95k032O26Q93m11J93P54n83n12l43
$$ 204 31 332 194 983 -468 830 179 -217 293 1188 -844 -218 675 264 457 1211 628 116 -227
7781b27K78m61L83j08M25l27j5J40m48L38J224j776K54O46J12q31M17l25k44k29
$$ -227 51 -410 -27 -135 290 -37 -52 88 -360 -22 1202 -574 -320 326 438 -393 24 -301 -545 -774
7801g74m68J380m16J243o33o04L63m01j03M1L71j84M35r7k71n23K66J154k23r53
$$ -774 -1242 138 -278 965 332 -272 91 -310 -413 -372 -1 -185 250 153 -118 -641 -375 779 556 -397
7821c97L06j67J162r44m61J75K7Q49l59n20J13M5M79r53R74k76K86p14l36P69
$$ -397 -91 -258 904 -40 -501 -326 -299 550 191 -329 -216 -171 308 -645 329 53 339 -375 -711 58
7841E8R9Q89j891J152n30N80j57k12O86p31r82J25J306j441P19M40K56K27r50
$$ 58 157 1046 -845 307 -223 357 200 -12 674 -57 -1039 -914 392 -1049 -330 110 366 593 -357
7860c57K96P67l18k79n61J180o55k7M18m70K39Rj115L00J66J48L63J0j055P28
$$ -357 -61 706 388 109 -452 728 73 46 464 -6 233 242 -873 -573 -407 -259 104 114 -941 -213
7880b13l34J97O15r32M79Q0j97P69j484J024O48p85k32Q30j39j06M51k78m6l87
$$ -213 -547 -350 265 -667 -188 -108 -305 464 -1020 4 652 -133 -365 465 326 220 671 393 347 -40
7900d0K23O0N63o97k54n80L88R15j390L29N49m40J139r30n37J082j54q14O49m52
$$ -40 183 243 806 109 -145 -725 -337 578 -812 -483 66 -374 765 -165 -702 380 226 -588 61 -391
7920c91P43o41P17L4k88p9K89j155M82L42m44k10Q75j149M13O42p0o3P6n7P72
$$ -391 352 -289 428 462 174 95 384 -771 -289 53 -391 -601 274 -875 -462 180 110 47 123 66 838
7941H38o78q33M50k06P09j03m93M86K61r02M59K31J31j417J140R32j281Q92j44
$$ 838 160 -673 -223 -429 280 177 -316 170 431 -471 -12 219 350 -1067 73 1005 -276 616 472
7960D72l0J19l01q55M85K52o00m32K01k50Q44l46K65P13M03j086J01n44J68Q77
$$ 472 442 561 260 -595 -110 142 -458 -890 -689 -939 -95 -441 -176 537 940 -146 -45 -589 -421 456
7980D56j837Q66Q3J216r70N18l05m1J023l45o00L18o87R3P58P3j435Q82k94M57
$$ 456 -1381 -515 -432 784 -186 332 27 -14 1009 664 64 382 -305 -212 546 619 -816 66 -228 229
8000B29j096O35M13o59K2kO00l45k61J530l35n26L57l40k0p90K58K33q76Q25M42
$$ 229 -867 -232 181 -478 -456 -458 142 -203 -464 1066 731 205 562 222 202 -588 -330 -97 -973 -148 294
8021B94n81O90l93m14M56k83j03m67Q00l11M05J6l37M03p2j5p0R09j259l17K14
$$ 294 -287 403 10 -404 52 -231 -334 -801 -1 -312 93 109 -228 175 103 88 18 927 -332 -649 -435
8042d35K51n64O95k45N76j84L27q77J216o34m2l47k23J279j144M25l57J32J42
$$ -435 -184 -748 -53 -298 278 94 421 -456 760 126 84 -263 -486 793 -351 74 -283 -151 -9
8061iP40j03n23n80R96r59M27Q8J66K49l37L97k42l64J58q84J403j563J112M2
$$ -9 731 628 105 -475 521 -438 -11 77 243 492 155 552 310 -54 104 -780 623 -940 172 214
8081B14m15O99m15M4m94Q99l2l10j99j15O15m76J5o63M22O38j044O32L60j3K52
$$ 214 -201 498 83 127 -367 532 500 190 -9 -124 491 15 30 -633 -211 427 -617 15 375 362 614
8102F14J07n06l96P24q3J44j496M66M57o60O34N13j074J89M68m75O35J36kN19
$$ 614 721 215 -181 543 460 604 -892 -426 31 -629 5 518 -556 -367 101 -374 261 397 395 914
8122I14j245O92k75m58P09j84j44%qJ01J56k14o22L8M4Q45m0m7m07l49M51M43
$$ 914 -331 361 86 -372 337 153 9 9 1 102 258 44 -578 -540 -496 349 309 262 -145 -494 -43 400
8144D00r46J65J43J045j50o65K3q7l8J86k63R23n9k36k56K45n17J79j15k14n95
$$ 400 -546 -381 -238 807 657 -8 15 -72 -110 76 -187 736 677 441 185 430 -87 92 -23 -237 -832
8165h32M76R41j141J599p33j106L57J201j194J208p60Q3N15k19l78L51L54r07
$$ -832 -356 585 -556 1043 310 -796 -439 762 -432 776 16 99 614 395 17 368 722 -185
8183a85J050l71j247N81J146j262L33m35
$$ -185 865 494 -753 -172 974 -288 45 -390
8191c90
$$ Imaginary data points
##PAGE= N=2
##DATA TABLE= (X++(I..I)), XYDATA
0@%%%%%%%%%%%K3r5J44j44J44j44J99k71K88l19L91m44N14n98O72p80Q93j003
$$ 0 0 0 0 0 0 0 0 0 0 0 0 23 -72 72 -72 72 -72 127 -144 144 -175 216 -228 286 -312 360 -420 473 -530
29e30J128j274J436j609J800k020K243k484K767l075L405l773M186m638N132n683
$$ -530 598 -676 760 -849 951 -1069 1174 -1310 1457 -1618 1787 -1986 2200 -2438 2694 -2989
45b989O302o992P787q701R761j1015J2511j4335J6638j9641K3714k9617L8988
$$ -2989 3313 -3679 4108 -4593 5168 -5847 6664 -7671 8967 -10674 13040 -16577 22411
58B2411n6156R7665l82626l57092Q11313L20250m40901m04109K39216K83854j1588
$$ 22411 -33745 63920 -318706 -675798 135515 455765 14864 -389245 -150029 133825 122237
69A22237j84600n9395L4130R7012M9888k0761q2516k0094L5579P7835N2203m8698
$$ 122237 -62363 -121758 -87628 9384 59272 38511 -44005 -64099 -28520 49315 101518 52820
81E2820j43886J253K09151J09020k30194k12988J93604K96436j29999l47244L3443
$$ 52820 -91066 -89813 119338 228358 -1836 -214824 -21220 275216 145217 -202027 -168584
92a68584L37851K9350l05830q7788K36612R3701j82905q9425J23020O4591q3924
$$ -168584 169267 198617 -107213 -195001 41611 135312 -47593 -137018 -13998 50593 -33331
103c3331m9134N0213M4343o253m2960k8739N3617Q2021m3898j15776M6946J58333
$$ -33331 -82465 -32252 12091 5838 -37122 -65861 -12244 69777 25879 -89897 -42951 115382
115A15382l3925j69039L9854J84449m6965j83672O8715J86748r3280j99682J08356
$$ 115382 81457 -87582 -47728 136721 89756 -93916 -25201 161547 68267 -131415 -23059
126b3059K06749j16026k28928Q5881K24530n3259k18270j4529J70375O7929j13949
$$ -23059 183690 67664 -161264 -75383 149147 95888 -122382 -136911 33464 101393 -12556
137a2556j16979L2309J35447M4961j25241j02368J05252J38646o4186j31170N1358
$$ -12556 -129535 -97226 38221 83182 -42059 -144427 -39175 99471 35285 -95885 -44527
148d4527J14536m0068p3711O6204N7898r3455m9137J27904P0688j47030j05121
$$ -44527 70009 29941 -43770 22434 80332 -13123 -62260 65644 136332 -10698 -115819
159a15819J44780J38428j21429j68728O9576J64330k3807j45884l5458R1597O1353
$$ -115819 28961 167389 45960 -122768 -53192 111138 87331 -58553 -94011 -2414 58939
170E8939m4366p9369j5009P2520N0668o1839p0080N0129P8338m2936o7182N9115
$$ 58939 14573 -64796 -79805 -7285 43383 -18456 -88536 -38407 39931 -3005 -70187 -11072
182a1072O6972o9261n5927R9089O6370j08311o4729J18766P4672j07653p7071
$$ -11072 55900 -13361 -69288 29801 96171 -12140 -76869 41897 116569 8916 -68155
193f8155R1733P5129o8095p1677L6422N4356j5929m4416j6693K1908K9793j2654
$$ -68155 23578 98707 30612 -41065 -4643 49713 33784 -10632 -27325 -5417 24376 11722
205A1722n5501o558O5962J2866q3412k3373Q9671L2197r4358l5518R7455M5767
$$ 11722 -43779 -50337 15625 28491 -54921 -78294 11377 43574 -50784 -86302 11153 56920
217E6920q6997m1961Q8279M7075p2317l7603P5278L7234o4417k7627O2672K3985
$$ 56920 -30077 -72038 16241 63316 -9001 -46604 28674 65908 1491 -26136 36536 60521
229F0521n1318k3494L7838J8622k3718k2314j846J1098J7618j3052m4229j625
$$ 60521 9203 -14291 23547 42169 18451 -3863 -5709 5389 23007 9955 -34274 -35899
241c5899N5422M723p4482j5538Q0531J9093q5678j9586Q3628J8280p3695o712
$$ -35899 19523 24246 -50236 -65774 14757 33850 -51828 -71414 12214 30494 -43201 -49913
253d9913P0608M660n6208J0316N3224p607l7681J3582L3222n390j9807M741M888
$$ -49913 20695 25355 -30853 -20537 32687 25080 -12601 981 34203 28813 9006 13747 18635
266A8635J066Q129o449k7962M105L6484j2430n3404P309N3990j5080o2454J0223
$$ 18635 19701 27830 21381 -6581 -2476 34008 21578 -31826 -24517 29473 14393 -48061 -37838
279c7838N6337j1690n6308J0486N2648j1765m6673J6904M3963j3966l3750K0221
$$ -37838 18499 6809 -49499 -39013 13635 1870 -44803 -27899 16064 2098 -31652 -11431
291a1431L0974j2579j6312J5293J0996o092M356O664j1474r25K0706k605k8618
$$ -11431 19543 6964 -9348 5945 16941 10849 15205 21869 10395 9470 30176 27571 -1047
304a047L868L2276j1572m3428J2548L9539k3240m7435K1119L9736k9676l8534
$$ -1047 2821 35097 23525 -19903 -7355 32184 8944 -38491 -17372 22364 -7312 -45846
316d5846K6898L0672l0158k2026K8088J6388k2914n675K3179L926j4600J0661
$$ -45846 -18948 11724 -18434 -40460 -12372 4016 -18898 -24573 -1394 2532 -12068 -1407
328a407J3754j2398l053K3507J381k3184O911K8863j1665k9533J8677K6615k3687
$$ -1407 12347 -51 -3104 20403 21784 -1400 5511 34374 22709 -6824 11853 38468 14781
341A4781k9202K4630K0746l0533k2129K4993J2118l0175j2879K4296K937k5130
$$ 14781 -14421 10209 30955 422 -21707 3286 15404 -14771 -27650 -3354 -417 -25547
353b5547j092K2044o126j6618J2323J3909j2945m641K1110L715j7459O436K3956
$$ -25547 -26639 -4595 -10721 -27339 -15016 -1107 -14052 -18693 2417 6132 -11327 -4891 19065
366A9065p420j7172J4614K1333j6541j7873K2295J4583k4627j3073K5200O144
$$ 19065 11645 -5527 9087 30420 13879 -3994 18301 32884 8257 -4816 20384 26528
378B6528k9404m034K2918n862k5371N056J6679j2629j7715J1922J0134j6983p372
$$ 26528 -2876 -6910 16008 10146 -15225 -10169 6510 -6119 -23834 -11912 -1778 -18761 -26133
391b6133J8976K369j9354N806K1411o307j6925J6032J9376j5452j0485K4345R473
$$ -26133 -7157 -4788 -24142 -18336 3075 -3232 -20157 -4125 15251 -201 -10686 13659 23132
404B3132j9747k706K3730o41k2120M589K0073q722k0592R521J4320j6621j5081
$$ 23132 3385 679 24409 23768 1648 6237 26310 17588 -3004 6517 20837 4216 -10865
417a0865J4686N047k0720m888J7421l662j8657M508J5745j0082j4207J3318J2557
$$ -10865 3821 8868 -11852 -16740 681 -2981 -21638 -17130 -1385 -11467 -25674 -12356 201
430B01j5110o454J9600P177j6126J217K1290P0j7235Q419K0054q646j3875J3537
$$ 201 -14909 -21363 -1763 5414 -10712 -9495 11795 11865 -5370 3049 23103 14457 582 14119
444A4119J2198j6568q358J4916L888j8499l507J4324m626j7966M163J2406j2745
$$ 14119 26317 9749 1391 16307 20195 1696 -1811 12513 7887 -10079 -5916 6490 -6255
457f255j2959J1287P432j6653n610J7812J054j7132L551J9919m924j6829J1543
$$ -6255 -19214 -7927 -495 -17148 -22758 -4946 -3892 -21024 -17473 2446 -2478 -19307 -7764
470g764J8273j0616j1306J7140J3112j3881n867J7444N046j6682O91J5624m541
$$ -7764 10509 -107 -11413 5727 18839 4958 -909 16535 21581 4899 5590 21214 16673
483A6673j4771P002P685j1624r099J1002k13j5266j939J1800n427j5255O137J3744
$$ 16673 1902 8904 16589 4965 -4134 6868 6655 -8611 -10550 1250 -4177 -19432 -13295 449
497D49j1508j4232J3147J4076j4594r270J7464J0264j5955l189J9218N306j3714
$$ 449 -11059 -25291 -12144 1932 -12662 -21932 -4468 5796 -10159 -13348 5870 11176 -2538
510b538J65J5791l69r673M561Q527n003n526P005J946j0009J19P821p245j2282
$$ -2538 -2373 13418 13049 3376 7937 16464 11461 5935 12940 14886 4877 4996 12817 5572 -6710
525f710P486Q712j7101r954J4431P073k0539o603J8734L539j8178k859K0763K241
$$ -6710 776 9488 -7613 -17567 -3136 3937 -16602 -23205 -4471 -932 -19110 -21969 -1206 1035
539A035j6834J063J9749r11j0788N258J1266k929l161P048J499m926K409O759
$$ 1035 -15799 -14736 5013 4102 -6686 -1428 9838 6909 3748 10796 12295 7369 9778 16537
553A6537q167n675J0163L854j5329m285J3577J114k0406l791K0291k519k3743
$$ 16537 8370 2695 12858 16712 1383 -2902 10675 11789 -8617 -12408 7883 5364 -18379
566a8379j48K0637l482k0584K795J9485l575j5502N022J3983j430p875O011N954
$$ -18379 -18527 2110 -1372 -21956 -19161 324 -3251 -18753 -13731 252 -1178 -9053 -3042 2912
580B912j700K167N376l165r95R381J182j3279K784J4899l153k0106L879J9135
$$ 2912 1212 3379 8755 5590 4595 13976 15158 1879 4663 19562 16409 -3697 182 19317
594A9317p909k2266O762J8456j0954k0624O802J7138j0393j8653Q965J4268q817
$$ 19317 11408 -10858 -4096 14360 3406 -17218 -10416 6722 -3671 -22324 -13359 909 -7908
607g908j0309N980P448j742K63m52M89M944P206l859p847R292J3093o666j4438
$$ -7908 -18217 -12237 -4789 -6531 -6268 -6720 -6231 -1287 5919 2060 -5787 3505 16598 9932 -4506
622d506J1656J7439j2492j7265J2594J6639j5413j9594J4239J5662j6063j7996
$$ -4506 7150 24589 12097 -5168 7426 24065 8652 -10942 3297 18959 2896 -15100
634a5100J2068J2932j3568j3376Q200R269p125q040L428L644J256J38l020k347
$$ -15100 -3032 9900 -3668 -17044 -8844 425 -6700 -14740 -11312 -7668 -6412 -6274 -9294 -11641
648a1641R802P606j0836p357J6356J4536j7168j1961K0562J5983k1043j2265J9633
$$ -11641 -1839 5767 -5069 -12426 3930 18466 1298 -10663 9899 25882 4839 -7426 12207
661A2207J2180k0582j0867J8436P792j8530r226J2610M568j1560p234M201L280
$$ 12207 24387 3805 -7062 11374 19166 636 -8590 4020 8588 -2972 -10206 -6005 -2725
674b725j697l457m485J004Q263o23j3054M40J9651J158j8862M01K2931L669j9222
$$ -2725 -4422 -7879 -12364 -11360 -3097 -3720 -16774 -16334 3317 4475 -14387 -13986 8945 12614 -6608
689f608m027K3367O086j9618l219J8809N072j7785l480J4343L188j1846p405Q478
$$ -6608 -10635 12732 18818 -800 -4019 14790 19862 2077 -1403 12940 16128 4282 -3123 5355
703E355L508o344p252L86L750J312p650o169M738R328n824j4831M085K0767k912
$$ 5355 8863 2519 -4733 -4347 -597 715 -6935 -13104 -8366 962 -4862 -19693 -15608 5159 2247
718B247k1752L753K5003j270k0337J311K3770Q65j9180J742J8599J771j5659R90
$$ 2247 -19505 -15752 9251 7981 -12356 -11045 12725 13590 -5590 -3848 14751 16522 863 1853
732A853J1437L5r441m39M114O74k677o091l553O107M114j0921q951R593J0539
$$ 1853 13290 13325 3884 3445 7559 8233 5556 -535 -4088 2019 6133 -4788 -13739 -4146 6393
747F393j2758j4964J1455J5848j0610j6705J0537J7463o811j5618Q165J6196k674
$$ 6393 -6365 -21329 -9874 5974 -4636 -21341 -10804 6659 -152 -15770 -7605 8591 5917
760E917j2447L561J2954l86o618K89O418J243l915l169K003L804j368p219k255
$$ 5917 -6530 -2969 9985 9599 2981 3270 9688 10931 7016 3847 5850 9654 8286 1067 -1188
775a188P618J870j0823q000R609Q083j3388j2219J1512J2522j2123j4851J3168
$$ -1188 6430 8300 -2523 -10523 -914 7169 -6219 -18438 -6926 5596 -6527 -21378 -8210
788h210J4761j1341j2637Q916J5214o059j0242N803J0772j428m033J302M486J662
$$ -8210 6551 -4790 -17427 -8511 6703 644 -9598 -3795 6977 5549 1516 2818 7304 8966
802H966j03m326k79O920j68q186l038R371K402j4114n210J1466N109j5100p362
$$ 8966 8863 4537 4258 11178 11010 2824 -214 9157 11559 -2555 -7765 3701 8810 -6290 -13652
817a3652J2951N728j4937o877J1299Q955j0886q157Q964Q013m312n604M602N441
$$ -13652 -701 5027 -9910 -16787 -5488 3467 -7419 -15576 -6612 1401 -2911 -8515 -3913 1528
831A528Q06k481L05L906K799K70m674J232P178M20q633k579J0234K013j3329l368
$$ 1528 2334 -147 158 4064 6863 7133 2459 3691 10869 11289 2656 77 10311 12324 -1005 -4373
847d373J2377K20j3630n026J3347K230j4763l403J1411K838j1486k003R032J102
$$ -4373 8004 8224 -5406 -10432 2915 5145 -9618 -13021 -1610 1228 -10258 -12261 -3229 -2127
861b127m351j026L322J995K494k83l745L955O856k87q295K740R796j166j0625
$$ -2127 -6478 -7504 -4182 -2187 307 24 -3721 234 7090 6803 -1492 1248 11044 9878 -747
876g47K966J1503l672j1297J955J0160k917j2071J231Q276k902j0113Q99N744
$$ -747 2219 13722 10050 -1247 708 10868 7951 -4120 -2889 5387 2485 -7628 -6729 -985
890i85j1p114r10L902J060j495k145P11K875J402L45k953K750P539j206o865K829
$$ -985 -996 -8110 -9020 -5118 -4058 -5553 -7698 -6987 -4112 -2710 -2365 -5318 -2568 4971 3765 -3100 -271
907b71R688j576q807M149R108l844r665M078R860p049q291M128N648n761o302
$$ -271 9417 7841 -966 3183 12291 8447 -1218 2860 12720 5671 -2620 1508 7156 1395 -4907
922d907L118K604m215k370K320j841q49J628j26m611L408N424l058n753O768O138
$$ -4907 -1789 815 -3400 -5770 -3450 -5291 -6140 -4512 -4638 -9249 -5841 -417 -3475 -9228 -2460 3678
938C678m878m670P345P695p125m244Q031N478p349l508N591M140n653k794K429
$$ 3678 -1200 -5870 1475 9170 2045 -2199 5832 11310 3961 453 6044 10184 4531 1737 4166
953D166K297l786k380M03j61r99r00j715o86N1M47j695m213M259K928l870k863
$$ 4166 6463 2677 297 700 539 -460 -1360 -3075 -3761 -3710 -3263 -4958 -9171 -4912 -1984 -5854 -8717
970h717N436M612n057l796P278N827o011j775P288K878n314j612N775J671m748
$$ -8717 -3281 1331 -3726 -7522 -244 5583 -428 -2203 5085 7963 2649 1037 6812 8483 3735
985C735m22L750k339k382J557j033l165L52J158k328l815K790J232m472l505N733
$$ 3735 3313 7063 4724 2342 3899 2866 -299 53 1211 -1117 -4932 -2142 -910 -5382 -8887 -3154
1001c154J007n331j342O467J296n794O38O950N55m230J197N521l85k043Q36K808
$$ -3154 -2147 -7478 -8820 -2353 -1057 -6851 -6213 737 1292 -2938 -1741 3780 3395 1352 2188 4996
1017D996L70q02N93O14q83Q9Q0j409j208J93L08l591j692K533P11o532J00L782
$$ 4996 5366 4564 5157 5771 4888 4977 5057 3648 2440 2633 2941 -650 -2342 191 902 -5630 -5530 -1748
1035a748p7n319o53N169r31m254J468N681j150k911J327M922j535j394M092J107
$$ -1748 -1825 -7144 -7797 -2628 -3559 -7813 -6345 -664 -1814 -4725 -3398 1524 -11 -1405 2687 3794
1051C794j819P76L334j757j092K489J423l157k167L953r97n184O7M111j539n714
$$ 3794 1975 2751 6085 4328 3236 5725 7148 3991 1824 5777 4780 -404 -337 3774 2235 -3479
1067c479j9L979k460n921K850L197k840k237K964J498j928l13K030J475j529J740
$$ -3479 -3498 481 -1979 -7900 -5050 -1853 -4693 -6930 -3966 -2468 -4396 -4709 -2679 -1204 -2733 -993
1083i93K293n62N36K086L25q26M80K579N43l781J086K748j486m959K211K584k976
$$ -993 1300 738 1274 3360 3685 2859 3339 5918 6461 2680 3766 6514 5028 69 2280 4864 1888
1100A888l314R21K105l896j605J747N21l805p02K747N51l305Q74K151o75J73K305
$$ 1888 -1426 -505 1600 -2296 -3901 -2154 -1633 -5438 -6140 -3393 -2842 -6147 -5273 -3122 -3797 -3624 -1319
1117a319O81r64Q4L137N88k161L319L063k044k183L213J503k769l376L663J117
$$ -1319 -638 -1602 -1518 1619 2207 46 3365 6428 4384 2201 5414 6917 4148 772 4435 5552
1133E552m818q38K406l14l244r10K057j297k604M16J212j517j415J176J167j422
$$ 5552 734 -104 2302 1988 -1256 -2166 -109 -1406 -4010 -3594 -2382 -3899 -5314 -4138 -2971 -4393
1149d393O85J051l69j402L231K276j353l46K543K228k473p22M703O13k793r31
$$ -4393 -3708 -2657 -3026 -4428 -1197 1079 -274 -620 1923 4151 1678 956 5659 6272 3479 2548
1165B548K994L57m487J111J927p50l729l77R77j414j922K78L12k120J23Q88o1
$$ 2548 5542 5899 1412 2523 4450 3700 -29 -406 571 -843 -2765 -2487 -2175 -4295 -4172 -3284 -3345
1182c345k147J488J632j116j079K372J050k249J592L657M77l225J313M753o53
$$ -3345 -5492 -4004 -2372 -3488 -4567 -2195 -1145 -3394 -1802 1855 2332 -893 420 5173 4520
1197D520k910J429L534j668k291Q67N58r99k207Q61L24k150p9n2j136j908R46
$$ 4520 1610 3039 6573 4905 2614 3481 4039 3040 833 1694 2018 -132 -211 -263 -1399 -3307 -2361
1214b361K39k719j60K811l35l451J116L233p46j805J808L433j322j518K671K799
$$ -2361 -2122 -4841 -5001 -2190 -2525 -5976 -4860 -1627 -2373 -4178 -2370 1063 -259 -1777 894 3693
1230C693j431p55J662K082j594r13J133R12j717p47J005j453j134J289r07k151
$$ 3693 2262 1507 3169 5251 3657 2744 3877 4789 3072 2325 3330 1877 743 2032 1125 -1026
1246a026l7M12j183k472J268P87j510j877J375L580l170j970L286K934k630k047
$$ -1026 -1063 -651 -1834 -4306 -3038 -2251 -3761 -5638 -4263 -683 -3853 -5823 -2537 397 -2233 -4280
1262d280M071K421j532m69K971n0r13O60J78P7k48M22R02k692O96J624l154j417
$$ -4280 -209 2212 680 211 3182 3132 2219 2879 3057 3134 2886 3308 4210 1518 2214 3838 684 -733
1280g33J797N42k858k590L498j92l819j602M192R96l882j351L594N86k198M78
$$ -733 1064 1606 -1252 -3842 -344 -536 -4355 -5957 -1765 -769 -4651 -6002 -2408 -1822 -4020 -3542
1296c542K678J167j903J574K176K5k67P44L99m44J462r30oo31J241P42l347l26
$$ -3542 -864 303 -1600 -26 2150 2175 1908 2652 3051 2607 4069 3139 3133 2502 3743 4485 1138 812
1314H12K482q34l059j152K257J83l777j500L252J91m786J149K960L17k331k72
$$ 812 3294 2460 -599 -1751 506 689 -3088 -4588 -1336 -1145 -5931 -4782 -1822 -1505 -3836 -4108
1330d108K706k89r47Q92J619M11R71m37O52N00J782m0j300o23L391j355l007J079
$$ -4108 -1402 -1691 -2638 -1746 -127 284 1255 818 1470 1970 3752 3712 2412 1789 5180 3825 818 1897
1348A897J671o15l794J184P44K29l541L49J788k046j875K26J038N86k132N5J123
$$ 1897 3568 2953 -841 343 1087 1316 -2225 -1876 -88 -2134 -4009 -3783 -2745 -2159 -4291 -4236 -3113
1365c113J471p09o97J100J967R49n01o44J027K432j483j395K392J987j899j130
$$ -3113 -1642 -2351 -3048 -1948 19 968 467 -177 850 3282 1799 404 2796 4783 2884 1754
1381A754Q35J891o43m521K010K518k961j912OK222k530j692O25J175j677j356
$$ 1754 2589 4480 3837 -684 1326 3844 883 -1029 -1023 1199 -1331 -3023 -2398 -1223 -2900 -4256
1397d256M53M48N55P68q06o79K429N25R6p25J829K168k349m89L057J398j543j908
$$ -4256 -3803 -3355 -2800 -2032 -2838 -3517 -1088 -563 -467 -1192 637 2805 456 -33 3024 4422 2879 971
1415I71K095K135j882k063K277k90j355k412Q55J429j961j618Q22M8j226j440
$$ 971 3066 5201 3319 1256 3533 3243 1888 -524 331 1760 -201 -1819 -997 -949 -2175 -3615
1431c615J717q87k50L63j513K49K114J381k698J91L112K367k731l56J841K818
$$ -3615 -1898 -2785 -3035 -2672 -4185 -3936 -1822 -441 -3139 -2948 164 2531 -200 -556 1285 4103
1447D103l006j316L388K352l684o10L116n67k731k9J349j77n16j212n45q72p35
$$ 4103 1097 -219 3169 5521 1837 1227 4343 3776 1045 1016 2365 2188 1672 460 -85 -957 -1692
1464a692K49j364j429J875o3j810O1L342l09k369k77L767M9j645O27K684P60k032
$$ -1692 -1443 -2807 -4236 -2361 -2424 -4234 -4173 -831 -1140 -3509 -3786 -19 30 -1615 -988 1696 2456 424
1482D24l13L850q91j639J292M53R16j889o83J091k66j335l39q59J028j16r61j542
$$ 424 111 3961 3070 1431 2723 3176 4092 2203 1520 2611 2345 1010 671 -188 840 724 -237 -1779
1500a779n07O14K83k440K98K735j350k014Q89K726m6k563J217K943q43j620J815
$$ -1779 -2286 -1672 -1389 -3829 -3531 -796 -2146 -4160 -3271 -545 -591 -3154 -1937 1006 163 -1457 358
1517C58K967j231j582J846P78k11n27K80n73J159K31q46j685J38M99j813j088
$$ 358 3325 2094 512 2358 3136 2925 2398 2678 2105 3264 3495 2649 964 1102 1601 -212 -1300
1534a300n41K107j459k618K020J175j980k563K049J745j240q41K267L10P82q79
$$ -1300 -1841 266 -1193 -3811 -1791 -616 -2596 -5159 -3110 -1365 -2605 -3446 -1179 -869 -87 -966
1550i66O01J333M1l63J167J10J83J579j438p3Q02Rk68k300K407n07j965o40O64
$$ -966 -365 968 1009 646 1813 1923 2106 3685 2247 2174 2976 2985 2717 417 2824 2317 352 -288 376
1569C76J34j456j214L86J598k583k007J980J547j339j111J728O32r53K46J405
$$ 376 510 -946 -2160 -1774 -176 -2759 -4766 -2786 -1239 -2578 -3689 -1961 -1329 -2282 -2036 -631
1585f31K46L48L12N46p40J356P84O93j075J390M15j048j737J973N01k922n16J532
$$ -631 -385 -37 275 821 81 1437 2221 2914 1839 3229 3644 2596 859 2832 3333 411 -105 1427
1603A427Jk519j077J703Q3j781j52O34r31m86J029P7R58j187J21N10l1P30Q73
$$ 1427 1428 -1091 -2168 -465 -382 -2163 -2315 -1681 -2612 -3098 -2069 -1992 -1034 -2221 -2100 -1590 -1621 -891 -18
1622a8N5k3J231R10k40n59K115j15j885M34R21p06j123M30J96M87k224p51J768
$$ -18 37 14 1245 2155 1915 1356 3471 3356 1471 1905 2826 2120 997 1427 1623 2110 -114 -865 903
1641I03p93k129N85O72j121q94L94J286j542j09M92K79m9N53n13O51M75J004L31
$$ 903 110 -2019 -1434 -762 -1883 -2777 -2383 -1097 -2639 -2748 -2256 -1977 -2026 -1473 -1986 -1335 -860 144 475
1660D75p7O58J566j015n18N08J177o65k67p0J569j658j236O53M44n33j234O78
$$ 475 398 1056 2622 1607 1089 1597 2774 2109 1842 1772 3341 1683 447 1100 1544 1011 -223 455
1678D55j020O71k340N93k03L47l83q66Q77l20J46K11l14L82K347n07r67O62J746
$$ 455 -565 106 -2234 -1641 -1844 -1497 -1880 -2746 -1869 -2189 -2043 -1832 -2146 -1764 583 76 -891 -229 1517
1697A517n86l41R36J973j874K73m3J420k076p50J870m9j477M75r44p2q66J3r40
$$ 1517 931 590 1526 3499 1625 1898 1855 3275 1199 449 2319 2270 793 1268 324 252 -614 -601 -1541
1716a541p1L38O42j874k91R56P07j392k34J634J22J62l11P53M23p04k75K560K03
$$ -1541 -1612 -1274 -632 -2506 -2797 -1841 -1134 -2526 -2760 -1126 -1004 -842 -1153 -400 23 -681 -956 1604 1807
1735A807l2l44J90N85n70k9P07m71N0j03j175K85m61K5k37j168k69J132k029Q96
$$ 1807 1775 1431 1621 2206 1636 1607 2314 1843 1893 1790 615 900 439 464 227 -941 -1210 -78 -2107 -1211
1755a211K06m71j618R26J394l60l16r95J997k1qr4J084M6o94R86j61Q74o41J452
$$ -1211 -1005 -1476 -3094 -2168 -774 -1134 -1450 -2445 -448 -469 -477 -571 513 559 -135 851 690 1564 923 2375
1775B375J81k57m75K58p19k02n99J133j632k34P6m36K31p28k30j52j524K6J100
$$ 2375 2556 2299 1824 2082 1363 1161 562 1695 63 -171 -95 -531 -300 -1028 -1258 -1410 -2934 -2908 -1808
1794a808j46l96N94J284o13K20K33O55j009J574l45Q74R83p45O1N11m08N83J57
$$ -1808 -1954 -2350 -1756 -472 -1085 -865 -632 23 -986 588 243 1117 2100 1355 1416 1927 1519 2102 2259
1813B259n92k74J236q39j668M5J152j202j262J071m10o36m73k06R19p71n82O87
$$ 2259 1667 1393 2629 1790 122 167 1319 117 -1145 -74 -484 -1120 -1593 -1799 -880 -1651 -2233 -1546
1831a546M28k25L59K50ok16M94N10Mk35N06M35m62Q90J008L36j374O21N78q97
$$ -1546 -1118 -1343 -984 -734 -740 -956 -462 48 52 -183 323 758 296 1186 2194 2530 1156 1777 2355 1458
1851A458n90N60K14r78m24o23R33j042j067N60j97m21m88j38J859j260l68J220
$$ 1458 868 1428 1642 664 240 -383 550 -492 -1559 -999 -1196 -1617 -2105 -2243 -384 -1644 -2012 -792
1869g92q27J35J298k24n96J656k65M72r31J390K28K46l90J63O90j100RJ570p48
$$ -792 -1619 -1484 -186 -410 -1006 650 385 857 -74 1316 1544 1790 1400 1563 2253 1153 1162 2732 1984
1888A984j628oQ79o96p32n53L97n86j62L83j159J20l1p33N26Q56k40O17r0k43
$$ 1984 356 350 1229 533 -199 -752 -355 -941 -1103 -720 -1879 -1759 -1790 -2523 -1997 -1141 -1381 -764 -854 -1097
1908a097Q89J023j087R30r95K309p24l05J014l40k92r3J329k22j424N14l04o6
$$ -1097 -208 815 -272 658 -337 1972 1248 943 1957 1617 1325 1232 2561 2339 915 1429 1125 1059
1926A059p13J45j063R63p66j150O47k98j42j36K65p98J007n41N48n74J192o84
$$ 1059 346 491 -572 391 -375 -1525 -878 -1176 -1318 -1454 -1189 -1987 -980 -1521 -973 -1547 -355 -1039
1944a039k55Q77J050o41K64Q16Q79n10k8O49K3n93l26nk18M91j015L44o5l90q20
$$ -1039 -1294 -417 633 -8 256 1072 1951 1441 1413 2062 2085 1492 1166 1161 943 1434 419 763 698 308 -512
1965e12L52Q0m49K03q23m52k79n27J620p50q62P98l6l59J721n27N27n81L16J665
$$ -512 -160 -80 -529 -326 -1149 -1601 -1880 -2407 -787 -1537 -2399 -1601 -1637 -1996 -275 -802 -275 -856 -540 1125
1985A125r48J87P87R23p89o49J268o46k83O89j043K19r9n21J61j663N15o1N97
$$ 1125 177 364 1151 2074 1285 636 1904 1258 975 1664 621 840 741 220 381 -1282 -767 -828 -231
$$ [...]
8191b44
##END NTUPLES=NMR FID
##END=
