##TITLE=1H_SAM_20.108''-THF+Na
 THF, 64 sc, 
 10.6.2019
##JCAMPDX= 6.0         $$ Bruker NMR JCAMP-DX V2.0
##DATA TYPE= NMR FID
##DATA CLASS= NTUPLES
##ORIGIN= UXNMR, Bruker Analytische Messtechnik GmbH
##OWNER= root
$$ XWIN-NMR		Version 3.5
$$ Tue Jun 11 16:00:24 2019 Russian Standard Time (UT+4h)  she@DPX200
##.OBSERVE FREQUENCY= 200.13155
##.OBSERVE NUCLEUS= ^1H
##.DELAY= (6, 6)
##.ACQUISITION MODE= SIMULTANEOUS
##.ACQUISITION SCHEME= undefined
##.AVERAGES= 64
##.DIGITISER RES= 18
##SPECTROMETER/DATA SYSTEM= spect
##.PULSE SEQUENCE= zg30
##.SOLVENT NAME= THF
##.SHIFT REFERENCE= (INTERNAL, THF, 0, 15.7039)
##AUDIT TRAIL= $$ (NUMBER, WHEN, WHO, WHERE, WHAT)
$$ ##TITLE= Audit trail, XWIN-NMR		Version 3.5
$$ ##JCAMPDX= 5.01
$$ ##ORIGIN= Bruker BioSpin GmbH
$$ ##OWNER= she
$$ F:/spectra/data/she/nmr/H-F/1/audita.txt
$$ ##AUDIT TRAIL=  $$ (NUMBER, WHEN, WHO, WHERE, WHAT)
(   1,<2019-06-11 15:58:55.17 +0400>,<she>,<DPX200>,
      <continue with go, POWCHK disabled, PULCHK disabled
       configuration hash MD5:
       00 E9 B6 7A A2 85 ED C7 34 08 36 98 17 FE 4E 26
       data hash MD5: 16K
       21 AF 24 7C 43 AD 8E BD 65 30 18 58 09 CE DB A0>)
$$ ##END=
$$ 
$$ hash MD5
$$ 49 99 A3 CE 18 D3 1F 45 73 F9 5D 27 13 BC A9 2B
##$RELAX= 
##$RELAX= 
##$RELAX= 
##$RELAX= 
##$RELAX= 
##$RELAX= 
$$ Bruker specific parameters
$$ --------------------------
##$DU= <F:/spectra>
##$EXPNO= 1
##$NAME= <H-F>
##$PROCNO= 1
##$TYPE= <nmr>
##$USER= <she>
##$AMP= (0..31)
100 100 100 100 100 100 100 100 100 100 100 100 100 100 100 100 100 100 
100 100 100 100 100 100 100 100 100 100 100 100 100 100 
##$AQSEQ= 0
##$AQ_mod= 1
##$AUNM= <au_zg>
##$AUTOPOS= <>
##$BF1= 200.13
##$BF2= 200.13
##$BF3= 200.13
##$BF4= 200.13
##$BF5= 200.13
##$BF6= 200.13
##$BF7= 200.13
##$BF8= 200.13
##$BYTORDA= 1
##$CFDGTYP= 0
##$CFRGTYP= 5
##$CHEMSTR= <none>
##$CNST= (0..31)
1 1 145 1 1 1 1 1 1 1 1 1 1 1 1 1 1 1 1 1 1 1 1 1 1 1 1 1 1 1 1 1 
##$CPDPRG= <>
##$CPDPRG1= <>
##$CPDPRG2= <>
##$CPDPRG3= <>
##$CPDPRG4= <mlev>
##$CPDPRG5= <mlev>
##$CPDPRG6= <mlev>
##$CPDPRG7= <mlev>
##$CPDPRG8= <mlev>
##$CPDPRGB= <>
##$CPDPRGT= <>
##$D= (0..31)
0 1.2 0 0 0 0 0 0 0 0 0 0.03 0 0 0 0 0 0 0 0 0 0 0 0 0 0 0 0 0 0 0 0 
##$DATE= 1560254173
##$DBL= (0..7)
120 120 120 120 120 120 120 120 
##$DBP= (0..7)
150 150 150 150 150 150 150 150 
##$DBP07= 0
##$DBPNAM0= <>
##$DBPNAM1= <>
##$DBPNAM2= <>
##$DBPNAM3= <>
##$DBPNAM4= <>
##$DBPNAM5= <>
##$DBPNAM6= <>
##$DBPNAM7= <>
##$DBPOAL= (0..7)
0.5 0.5 0.5 0.5 0.5 0.5 0.5 0.5 
##$DBPOFFS= (0..7)
0 0 0 0 0 0 0 0 
##$DE= 6
##$DECBNUC= <off>
##$DECIM= 16
##$DECNUC= <off>
##$DECSTAT= 4
##$DIGMOD= 1
##$DIGTYP= 9
##$DL= (0..7)
0 120 120 120 120 120 120 120 
##$DP= (0..7)
150 150 150 150 150 150 150 150 
##$DP07= 0
##$DPNAME0= <>
##$DPNAME1= <>
##$DPNAME2= <>
##$DPNAME3= <>
##$DPNAME4= <>
##$DPNAME5= <>
##$DPNAME6= <>
##$DPNAME7= <>
##$DPOAL= (0..7)
0.5 0.5 0.5 0.5 0.5 0.5 0.5 0.5 
##$DPOFFS= (0..7)
0 0 0 0 0 0 0 0 
##$DQDMODE= 0
##$DR= 18
##$DS= 0
##$DSLIST= <SSSSSSSSSSSSSSS>
$$ [...]
##$SUBNAM2= <"">
##$SUBNAM3= <"">
##$SUBNAM4= <"">
##$SUBNAM5= <"">
##$SUBNAM6= <"">
##$SUBNAM7= <"">
##$SUBNAM8= <"">
##$SUBNAM9= <"">
##$SW= 44.9344731272789
##$SWIBOX= (0..15)
0 0 2 0 0 0 0 0 0 0 0 0 0 0 0 0 
##$SW_h= 8992.80575539568
##$TD= 16384
##$TD0= 1
##$TE= 0
##$TE2= 300
##$TE3= 300
##$TEG= 300
##$TL= (0..7)
0 120 120 120 120 120 120 120 
##$TP= (0..7)
150 150 150 150 150 150 150 150 
##$TP07= 0
##$TPNAME0= <>
##$TPNAME1= <>
##$TPNAME2= <>
##$TPNAME3= <>
##$TPNAME4= <>
##$TPNAME5= <>
##$TPNAME6= <>
##$TPNAME7= <>
##$TPOAL= (0..7)
0.5 0.5 0.5 0.5 0.5 0.5 0.5 0.5 
##$TPOFFS= (0..7)
0 0 0 0 0 0 0 0 
##$TUNHIN= 0
##$TUNHOUT= 0
##$TUNXOUT= 0
##$USERA1= <user>
##$USERA2= <user>
##$USERA3= <user>
##$USERA4= <user>
##$USERA5= <user>
##$V9= 5
##$VALIST= <valist>
##$VCLIST= <CCCCCCCCCCCCCCC>
##$VD= 0
##$VDLIST= <DDDDDDDDDDDDDDD>
##$VPLIST= <PPPPPPPPPPPPPPP>
##$VTLIST= <TTTTTTTTTTTTTTT>
##$WBST= 1024
##$WBSW= 4
##$XGAIN= (0..3)
0 0 0 0 
##$XL= 0
##$YL= 0
##$YMAX_a= 1391473
##$YMIN_a= -1821742
##$ZGOPTNS= <>
##$ZL1= 120
##$ZL2= 120
##$ZL3= 120
##$ZL4= 120
##$ABSF1= 10
##$ABSF2= 0
##$ABSG= 5
##$ABSL= 3
##$ALPHA= 0
##$AQORDER= 0
##$ASSFAC= 0
##$ASSFACI= 0
##$ASSFACX= 0
##$ASSWID= 0
##$AUNMP= <proc_1d>
##$AZFE= 0.1
##$AZFW= 0.1
##$BCFW= 1
##$BC_mod= 2
##$BYTORDP= 1
##$COROFFS= 0
##$CY= 11.3945322036743
##$DATMOD= 1
##$DC= 2
##$DFILT= <>
##$DTYPP= 0
##$F1P= 18.9103706918063
##$F2P= -1.10871071338519
##$FCOR= 0.5
##$FTSIZE= 0
##$FT_mod= 4
##$GAMMA= 1
##$GB= 0.15
##$INTBC= 1
##$INTSCL= 1
##$ISEN= 128
##$LB= 0.24
##$LEV0= 0
##$LPBIN= 0
##$MAXI= 10000
##$MC2= 0
##$MEAN= 0
##$ME_mod= 0
##$MI= 1.114404
##$NCOEF= 0
##$NC_proc= 0
##$NLEV= 6
##$NOISF1= 3.799351
##$NOISF2= 2.8
##$NSP= 1
##$NTH_PI= 0
##$NZP= 0
##$OFFSET= 15.70392
##$PC= 1
##$PHC0= -8595.785
##$PHC1= 20.00097
##$PH_mod= 1
##$PKNL= yes
##$PPARMOD= 0
##$PSCAL= 0
##$PSIGN= 0
##$REVERSE= no
##$SF= 200.130013532006
##$SI= 16384
##$SIGF1= 3
##$SIGF2= 2
##$SINO= 400
##$SIOLD= 16384
##$SREGLST= <1H.CDCl3>
##$SSB= 0
##$STSI= 0
##$STSR= 0
##$SW_p= 3612.71676300578
##$SYMM= 0
##$S_DEV= 0
##$TDeff= 0
##$TDoff= 0
##$TI= <>
##$TILT= no
##$TM1= 0
##$TM2= 0
##$TOPLEV= 0
##$USERP1= <user>
##$USERP2= <user>
##$USERP3= <user>
##$USERP4= <user>
##$USERP5= <user>
##$WDW= 1
##$XDIM= 8192
##$YMAX_p= 0
##$YMIN_p= 0
$$ End of Bruker specific parameters
$$ ---------------------------------
##NTUPLES= NMR FID
##VAR_NAME=  TIME,          FID/REAL,        FID/IMAG
##SYMBOL=    X,             R,               I
##VAR_TYPE=  INDEPENDENT,   DEPENDENT,       DEPENDENT
##VAR_FORM=  AFFN,          ASDF,            ASDF
##VAR_DIM=   8192,          8192,            8192
##UNITS=     SECONDS,       ARBITRARY UNITS, ARBITRARY UNITS
##FACTOR=    0.0001112,     1,               1
##FIRST=     0,             0,               0
##LAST=      0.9108392,     0,               0
##MIN=       0,             -1821742,        0
##MAX=       0.9108392,     1391473,         0
$$ Real data points
##PAGE= N=1
##DATA TABLE= (X++(R..R)), XYDATA
0@%%%%%%%%%%%%%%%%%%%%%JnJ1j6K6l9M4n4P2q3R5j13J25j40J62j85K15k48K82
$$ 0 0 0 0 0 0 0 0 0 0 0 0 0 0 0 0 0 0 0 0 0 0 1 -4 7 -9 17 -22 22 -32 40 -43 52 -61 64 -76 86 -99 116 -132 150
40A50l16L47l89M39m89N49o09O70p36Q14r06R92j088J196j303J421j545J675j817
$$ 150 -166 181 -208 231 -258 291 -318 352 -384 430 -476 516 -572 624 -679 742 -803 872 -945
59i45J954k080K184k226K129j720N64K723j3830P9777J048574j584861j126330
$$ -945 1009 -1071 1113 -1113 1016 -704 -140 2583 -11247 68530 1117104 -467757 -1594087
72a594087N92353J348908P38625n13474r44037l28786N16328N68612n9317n42053
$$ -1594087 -1001734 347174 1085799 572325 -371712 -700498 -184170 384442 325125 -216928
82b16928k80430L34980N54585J14358m19678m39116O2196M64925L10946k23867
$$ -216928 -497358 -162378 392207 506565 86887 -352229 -290033 174892 485838 261971
92B61971n44833l42098J58605M64008L66380M8323j79563k17135j39369o0859
$$ 261971 -282862 -624960 -466355 -2347 364033 412356 232793 15658 -123711 -184570
102a84570J6102J02042J42868Q6627k9315j01013q0928m1442n2586o6954K4557
$$ -184570 -168468 -66426 76442 163069 133754 32741 -48187 -89629 -142215 -209169 -184612
113a84612K07698K92023J14594k25159m02682k13522J92282M12749K11588k21821
$$ -184612 23086 315109 429703 204544 -198138 -411660 -219378 193371 404959 183138
123A83138m61694k66369J87546M88930L79377k4726l80119m06244j27665K10409
$$ 183138 -278556 -544925 -357379 131551 510928 486202 106083 -300161 -427826 -217417
133b17417L40480J93356o4796k13741j66909l6183K4414j969N466J23099K34898
$$ -217417 123063 316419 251623 37882 -129027 -165210 -140796 -142765 -137299 -14200 220698
144B20698J47591j35044l56318k39715J40015L97637K27783k16607m62353k27393
$$ 220698 368289 233245 -123073 -362788 -222773 174864 402647 186040 -276313 -503706
154e03706K52109M61967K03784k19379l41245p4543K20683J93497q7597k38945
$$ -503706 -251597 210370 414154 194775 -146470 -221013 -330 193167 105570 -133375
164a33375n2789K34944K43117p8254l66627k76890J06429L68574K51703o7523
$$ -133375 -186164 48780 291897 213643 -152984 -429874 -323445 45129 296832 229309
174B29309k06088n9917J08693M1533j64032j91412O9671L16366J98894k13956
$$ 229309 23221 -36696 71997 113530 -50502 -241914 -172243 144123 343017 129061
184A29061m52978j89455L34492N49854J97274l61045n22924j40009L47289M19307
$$ 129061 -323917 -513372 -178880 370974 568248 207203 -315721 -455730 -108441 310866
194C10866N5399l01335k75488J8723J83697M4633j58475j09361J69918L34200
$$ 310866 366265 64930 -210558 -191835 -8138 36495 -121980 -231341 -61423 272777
204B72777J40944k40553m07091j65057K33640L92347J57588k17888l66339j73991
$$ 272777 413721 173168 -233923 -398980 -165340 227007 384595 166707 -199632 -373623
214c73623J45819K91929J64227p2745j84758r7615P2958J42975N8153q1655j28665
$$ -373623 -227804 64125 228352 155607 -29151 -126766 -53808 89167 147320 65665 -63000
225f3000m8794O9918R7532P036j09550j17653M926J52000J83436N9379j19654
$$ -63000 -111794 -41876 55656 62692 -46858 -164511 -159585 -7585 175851 235230 115576
236A15576j95832j09927O5012J75237J31107k9212j65712j72069m7142J11032
$$ 115576 -80256 -190183 -125171 50066 181173 151961 -13751 -185820 -232962 -121930
246a21930J77629J15279j8125j14917r6025K277P2575L9597m6033o8727J4508
$$ -121930 55699 170978 152853 37936 -58089 -55812 16763 56360 10327 -58400 -43892
257d3892J05858N4778j20362k22416o7776K35090L64617J23098k89271m30940
$$ -43892 61966 116744 -3618 -226034 -293810 -58720 305897 428995 139724 -291216
267b91216j18111L42638M42056M5140m25265m41837J5142M50811L78170j00808
$$ -291216 -409327 -66689 375367 420507 -4758 -446595 -431453 19358 397528 296720
277B96720m33047k40257K36544M37640J19728l43513m18033j6680L96887L57316
$$ 296720 -136327 -376584 -140040 297600 417328 73815 -344218 -360898 35989 393305
287C93305r2084m40738l11180J38068M14549K46714j34856k97944j05131J73825
$$ 393305 301221 -139517 -450697 -312629 101920 348634 213778 -84166 -189297 -15472
297a5472K00864l0076k24205j45931J03746K16881P2928j60340k11976k6141J86183
$$ -15472 185392 155316 -68889 -214820 -111074 105807 178735 18395 -193581 -219722 -33539
308c3539K08428M1554j26802j49433m7842N0700P4344M6017N408l9119q2832r0657
$$ -33539 174889 216443 89641 -59792 -107634 -56934 17410 63427 68835 29716 -53116 -143773
320a43773j9336J00382J51685Q0169n8790j27842o4535N2348Q8390J4729p4636
$$ -143773 -163109 -62727 88958 169127 110337 -17505 -82040 -29692 58698 73427 -1209
331a209p3928J0287P1447L3432n8526q5999m086J19798J44966K8477j25968j69101
$$ -1209 -75137 -64850 6597 40029 -18497 -104496 -108582 11216 156182 184659 58691 -110410
343a10410n1782J19142J63693L8466j32305j70930m3000J21671J40322J6434r5225
$$ -110410 -162192 -43050 120643 159109 26804 -144126 -187126 -65455 74867 91301 -3924
354c924n6072P5822J26246O705j61164j72772J2477K02628J74945n1173k38704
$$ -3924 -59996 15826 142072 148777 -12387 -185159 -172682 29946 204891 153718 -84986
365h4986j78103P2535K50736J70524o6164j96587r6471R2733J37465K524j32575
$$ -84986 -263089 -190554 60182 230706 164542 -32045 -128516 -35783 101682 104206 -28369
376b8369r0790P0521J36219M392j68046j47418P9454K63293J79206j09232k78839
$$ -28369 -119159 -48638 87581 91973 -76073 -223491 -144037 119256 298462 189230 -89609
387h9609j50723J31385K39662O7424j69704j86969J9041J80141R4945j28002j92428
$$ -89609 -240332 -108947 130715 198139 28435 -158534 -139493 40648 135593 7591 -184837
398a84837N201K42662K27794m7687k83846k20937P0330K68306J59946j14653k50361
$$ -184837 -179636 63026 290820 243133 -40713 -261650 -191320 76986 236932 122279 -128082
409a28082j10270J27927K02405N6534j16565j15513L6267J35434N8490j09357
$$ -128082 -238352 -110425 91980 148514 31949 -83564 -47297 88137 146627 37270
419C7270j60841l1272J40570J58008m31j70241j69160j410J61683J71165M2837
$$ 37270 -123571 -154843 -14273 143735 143304 -26937 -196097 -197507 -35824 135341 178178
430A78178q7987j12294m6840J7492L3421K5589J9550J1351j9930n7080n5289K776
$$ 178178 90191 -22103 -68943 -51451 -18030 7559 27109 38460 18530 -38550 -93839 -91063
442i1063O7900Q2333L1815k7782m3519k1537m635j3140k1060M054N0688N2964
$$ -91063 -23163 59170 90985 63203 19684 -1853 -6488 -19628 -40688 -36634 14054 67018
454F7018j7654j00657r9282J6124J49803J62750K0936j51426j81594l5413J42213
$$ 67018 49364 -51293 -150575 -134451 15352 178102 199038 47612 -133982 -169395 -27182
465b7182J64815R025j53894j43096K2728J47430Q7405p9910j35238K646J79661
$$ -27182 137633 146658 -7236 -150332 -127604 19826 107231 27321 -107917 -105271 74390
476G4390J61218o5931k60180j87703J01847K96725J74921j42123l14551j56930
$$ 74390 235608 169677 -90503 -278206 -176359 120366 295287 153164 -161387 -318317
486c18317J58581K92491J21237j44950k11299k9786J64071J33334p7829k03466
$$ -318317 -159736 132755 253992 109042 -102257 -132043 32028 165362 87533 -115933
496a15933q3443J50106K17072K5364k14538k27922J9059K56816K31619k4593k35099
$$ -115933 -199376 -49270 167802 193166 -21372 -249294 -230235 26581 258200 233607 -1492
507a492j85411M3035J86747J08978p5439j45262m6451P9474P8764k8264q6179
$$ -1492 -186903 -143868 42879 151857 76418 -68844 -115295 -35821 42943 14679 -71500
518g1500p436J10883J18916r141j38065j30327M0J14985J01052J014p8995p2109
$$ -71500 -78936 31947 150863 141722 3657 -126670 -126630 -11645 89407 90421 11426 -60683
530f0683j4576K1208K3267K4220M5395N2303P019o8171r5810l8937N8966R8754
$$ -60683 -75259 -54051 -30784 -6564 38831 91134 98153 29982 -65828 -104765 -45799 52955
542E2955L6000o2878r4365l2750N0670P0246K2503k3307o942L3453K1734m4359
$$ 52955 88955 26077 -68288 -101038 -50368 19878 42381 19074 12132 45585 67319 22960
554B2960r0684l9237P6274J21373L5698j11653j56480m0639J24349J69965N3898
$$ 22960 -67724 -106961 -30687 90686 126384 14731 -141749 -182388 -58039 111926 165824
565A65824r5039j21515k2154P4970N5002l9899p7890j492R3449P3957n6539j53191
$$ 165824 70785 -50730 -72884 2086 57088 17189 -60701 -62193 31256 105213 48674 -104517
577a04517q4387J01025K09824J10386j00863k13060j03927R9787J77769N5332
$$ -104517 -188904 -87879 121945 232331 131468 -81592 -185519 -85732 92037 147369
587A47369j17183j45867m716J27026Q9211o1824j28608j6990J48422J56679k6414
$$ 147369 30186 -115681 -120397 6629 95840 34016 -94592 -111582 36840 193519 167105
598A67105k04600j69642N2092K19658J48310q4123k23823j26895R3914J93733
$$ 167105 -37495 -207137 -155045 64613 212923 128800 -95023 -221918 -128004 65729
608F5729Q9950p9344j25170j4768R5507O4371o2951j22666l2036J13011J34378
$$ 65729 155679 76335 -48835 -63603 31904 96275 33324 -89342 -121378 -8367 126011
619A26011k074j52370j50225J3411J66762J54758L197j27006j10923M678P6528
$$ 126011 123937 -28433 -178658 -165247 1515 156273 159470 32464 -78459 -73781 2747
630B747M2559l1451m5536N877M8441P091o0069n9461K3672J01990Q0921k2698
$$ 2747 45306 13855 -31681 -25804 22637 29728 -30341 -89802 -66130 35860 116781 94083
642I4083r8020p3694J4647O9157M1322j8423l9519j2329O511r801k6865N0O5160
$$ 94083 -3937 -77631 -62984 6173 47495 29072 -10447 -22776 -16265 -26066 -52931 -52881 12279
655A2279Q5590K2416q4177j16733l9255P6430J15176L1094p5405r8727j6344N9146
$$ 12279 97869 120285 36108 -80625 -119880 -43450 71726 102820 27415 -71312 -87656 -28510
667b8510N5349j3063m4429J3233Q4856N6438o0562j42633p7008Q3941J67257P0672
$$ -28510 26839 13776 -30653 -17420 67436 123874 63312 -79321 -156329 -72388 94869 165541
679A65541j10603j78077n9599J21090J69231M0630j09033j18738R219J09263N9475
$$ 165541 54938 -123139 -182738 -61648 107583 148213 39180 -79558 -70339 38924 98399
690I8399p1376j17302j4565J17180J17288l6659j66467j18199P2828K04409J33066
$$ 98399 27023 -90279 -104844 12336 129624 92965 -73502 -191701 -118873 85536 218602
701B18602p4297j97931j17230P2773J61124O7382q3753j22982j8883R1356P2855
$$ 218602 144305 -53626 -170856 -98083 63041 130423 46670 -76312 -95195 -3839 69016
712F9016m3479j03206j7762J12438J32756k442j47917j46133P344J44843J24801
$$ 69016 25537 -77669 -95431 17007 149763 147321 -596 -146729 -139385 5458 130259
723A30259k2075j31465r4912K8193R9521N2644k7787m9770Q718N0481J5278n8101
$$ 130259 108184 -23281 -118193 -90000 9521 62165 34378 -15392 -6674 43807 59085 984
735I84p3626p25P9580P5821j7365r7965p7402K2257R6219P7011q232n7261l9653
$$ 984 -72642 -73367 6213 82034 64669 -33296 -110698 -88441 7778 84789 76557 19296 -20357
748b0357R200J2885j5997k3554J4862N7770L4283m6645r4782m6195O2267J17472
$$ -20357 -11157 1728 -14269 -37823 -22961 34809 69092 22447 -72335 -118530 -56263 61209
760F1209N8213n0120r3346l6936L9943N0467j1643m7068j2849N1873M8116l0143
$$ 61209 119422 69302 -24044 -60980 -21037 29430 17787 -29281 -42130 9743 57859 27716
772B7716r2985m7699P0324J33783N9970q2848j41943n7285Q2831J21240L2800
$$ 27716 -65269 -112968 -42644 91139 151109 68261 -73682 -130967 -48136 73104 105904
783A05904q9239r9415k959Q3598O1154l4467p1411m485R3182Q3524l8833j40684
$$ 105904 16665 -82750 -85709 -2111 59043 24576 -46835 -51320 41862 125386 86553 -54131
795e4131r6430N9049J56386R0183p5411j62743p7125P9587J44117N4238p0414
$$ -54131 -150561 -91512 64874 155057 79646 -83097 -160222 -80635 63482 117720 47306
806D7306q8035J825P4287L4896o3527r1765k964J04151R8875k5597j35495j03800
$$ 47306 -40729 -38904 35383 70279 6752 -85013 -87977 16174 115049 89452 -46043 -149843
818a49843M2089J47836J06299l9959j26327p4628M2790R4815K7495o3697p1000
$$ -149843 -107754 40082 146381 106422 -19905 -94533 -51743 43072 70567 6870 -64130
829f4130J0975P3781L7062n2070p9664j384J00427R8782j5225j22253j07409J8571
$$ -64130 -53155 20626 57688 5618 -74046 -75430 24997 123779 108554 -13699 -121108 -102537
841a02537J15369R3118k3543r8407o6798J8568N8190K4332j8612j0793L4745M6498
$$ -102537 12832 105950 82407 -16000 -82798 -64230 -6040 18292 -320 -11113 23632 70130
853G0130q275p3378o8335N795P2799O4735j0398o3507n1065J4149M7477K6181
$$ 70130 61855 -11523 -79858 -74063 -1264 63471 53073 -10434 -61499 -47350 127 26308
865B6308p333j1917J1585J3715j8315m9130k2690M3440P2917J6789p2395r7605
$$ 26308 18975 7058 18643 32358 14043 -35087 -57777 -14337 58580 75369 2974 -94631
877i4631j7996Q7805J08397J9970p5755p8014N276O6899K8744n4849o8755J3697
$$ -94631 -112627 -24822 83575 103545 27790 -50224 -44948 21951 50695 -4154 -72909 -59212
889e9212R8833P0695n2973j38140p3365Q1120J65093P8403q8409j56331o1455
$$ -59212 39621 110316 57343 -80797 -154162 -73042 92051 170454 82045 -74286 -135741
900a35741Q9971J31138K7101j00480j07552M470J00707P1507m0528r7372k6073
$$ -135741 -45770 85368 112469 11989 -95563 -91093 9614 81121 40593 -56779 -82852
911h2852Q9944J08955k597j24935j18139J4429J34651J10752k7700j31622r5252
$$ -82852 7092 116047 113450 -11485 -129624 -115195 19456 130208 102508 -29114 -124366
922a24366L2852J09562O6051l1912p2382j8409M7354M0523k4043o1936k4219N0403
$$ -124366 -91514 18048 84099 52187 -20195 -38604 8750 49273 25230 -36706 -60925 -10522
934a0522O6071J83o9827o6483Q643P7078O9722j837n6381m7075k557K2012Q626
$$ -10522 55549 55732 -14095 -80578 -71935 5143 74865 73028 16647 -30428 -32985 -10973 -2347
947b347q190N265K7381J9530k9392o1392l2077M6044Q3802M1356m2906q0918k8115
$$ -2347 -10537 -5272 22109 41639 12247 -49145 -81222 -35178 48624 89980 47074 -33844 -61959
960f1959M7240O0144m167o2501m3553L1746O7815J7214n8796o3927K0891R3831
$$ -61959 -14719 45425 41258 -21243 -64796 -33050 34765 51979 -6817 -70744 -49853 43978
972D3978O5872m5833j18717o4921N7914J21845N5536o8085j13081l9092O3389
$$ 43978 109850 64017 -54700 -119621 -61707 60138 115674 47589 -65492 -104584 -41195
983d1195Q5515J1601n6250m1034L5809O8105R913p8031q5166K526R2639Q2927
$$ -41195 44320 55921 -329 -41363 -5554 62551 72464 -5567 -90733 -88207 4432 87359
995H7359j2258r2285p1841K4128Q3502M8992k5415n5046j7236L4481K7367k2661
$$ 87359 75101 -17184 -89025 -64897 18605 67597 42182 -12864 -30100 4381 31748 9087
1007I087m1402k172M7282L5671l0850p1585k6054N9469R0178K6589o5282q4138
$$ 9087 -32315 -34487 12795 48466 17616 -53969 -80023 -20554 69624 96213 30931 -53207
1019e3207j3262O3618N7417j7061o8463k8773M8022P0171j990q2723p0971L0033
$$ -53207 -66469 -2851 54566 37505 -30958 -59731 -11709 58462 56472 -26251 -97222 -67189
1031f7189J16325Q0133m3315j26924p8060M8924J20115N5827o6756j09192l0370
$$ -67189 49136 129269 85954 -40970 -119030 -70106 50009 105836 39080 -70112 -100482
1042a00482Q1307R1926o42q6532o3810L8745J01274M4155p1632j14598l2613Q6185
$$ -100482 -19175 72751 72109 -14423 -78233 -39488 61786 105941 34309 -80289 -112902 -26717
1054b6717J11497J6894r0920j02003r389Q5234Q7898Q287o1375n5966p37L6063
$$ -26717 84780 101674 10754 -91249 -100638 -15404 72494 80781 19406 -36560 -37297 -1234
1066a234K2587j6007k0290L607K1188L398k5568k1324Q599L7779K5215r539k7628
$$ -1234 21353 5346 -14944 -11337 9851 13249 -12319 -33643 -25044 12735 37950 28411 783
1079G83j1543Q222N188j8299j7458J8377M7399K1990m4976p5210k2112O7250R7273
$$ 783 -10760 -2538 2650 -15649 -33107 -14730 32669 54659 9683 -65527 -87639 -20389 76884
1092G6884K5404p6401r3765q512Q2136P0818k7866r6901n0791O2534J09177K8308
$$ 76884 102288 25887 -67878 -76390 5746 76564 48698 -48203 -98994 -36460 72717 101025
1104A01025r2964j10613J777J23907J13772k6173j44548j11718M2419J52363R8773
$$ 101025 8061 -102552 -100775 23132 136904 110731 -33817 -145535 -103116 49247 148020
1115A48020n7857j49483q5565O1221J29597O1424n3752r0061j6319O4444N2289
$$ 148020 90163 -59320 -144885 -83664 45933 107357 53605 -36456 -52775 11669 63958
1126F3958l1933q5428l6562O2726R5272K5985p2877r2776j8978O9492Q0121J6196
$$ 63958 32025 -53403 -89965 -27239 68033 94018 21141 -71635 -90613 -21121 59000 75196
1138G5196n2951n4668m939L2998K6484j920k1905j1876J439J682m092K352K0038
$$ 75196 22245 -32423 -37362 -4364 22120 20200 -1705 -13581 -12142 -10460 -14552 -12200 7838
1151G838K4050J231k7171k5549K3K1581J2176j7463k3493R665M4593K6793l5601
$$ 7838 31888 33119 5948 -19601 -19578 2003 14179 -3284 -26777 -17112 27481 54274 18673
1164A8673p6432l8194N5787J09582N8533o2020j23974o4083N7904J15906N3504
$$ 18673 -57759 -95953 -40166 69416 127949 65929 -58045 -122128 -64224 51682 105186
1175A05186o3810j04738l0705P0053Q3772N877p1902n4936L3170P7847K6963p0286
$$ 105186 41376 -63362 -94067 -24014 59758 65635 -6267 -61203 -28033 49814 76777 6491
1187F491r1446q933R7009J00996n658j12828j03297J1586J13994R6783j0967r4291
$$ 6491 -84955 -93888 3121 104117 98459 -14369 -117666 -106080 7914 104697 93730 -561
1199e61p3331J6308P0540L8812k8833n1132j2123L4953L0927j1644l2768j0007
$$ -561 -73892 -57584 12956 51768 22935 -28197 -40320 -5367 25560 13916 -18852 -28859
1211b8859L0514L4329j476l2568k2343L522J2384K71r289J2245L1648J3246m0659
$$ -28859 1655 35984 34508 1940 -20403 -16881 -4497 -4226 -13515 -1270 30378 43624 2965
1224B965o4277j9142O2361R4251L2331o7281j01379l5350O2190Q6994J5995o3224
$$ 2965 -61312 -80454 -18093 76158 108489 41208 -60171 -95521 -33331 53663 69658 6434
1236F434o5626P930O8651M1278l5380o6377j2534O8100P1944j6187j02484p7615
$$ 6434 -59192 -51262 17389 58667 23287 -43090 -55624 12476 84420 68233 -34251 -111866
1248a11866L6657J24066Q0676n2434j37147q5247N7199J37651Q2492m8486j13466
$$ -111866 -75209 48857 129533 77099 -60048 -145295 -88096 49555 132047 83561 -29905
1259b9905o1255M2381Q4397K8347n3412o1771K360O1411M6385k4029o7214l8183
$$ -29905 -91160 -48779 35618 63965 10553 -51218 -48858 12553 58938 34909 -32305 -70488
1271g0488L5421P1812L5490l1891o1817l0504K1706M0269J9086j5283k2182p379
$$ -70488 -35067 36745 72235 40344 -21473 -51977 -30271 9998 29084 13801 -8381 -15760
1283a5760K027K484J283J4483K0483P995k1095l4437j4575K3346L3507O674k4365
$$ -15760 -13733 -11249 -9966 4517 25000 32995 11900 -22537 -37112 -13766 19741 26415 2050
1296B050k3903P829K4055j518l3504j9957L6750P4573K6401o7307j09506l9476
$$ 2050 -21853 -14024 10031 8513 -24991 -44948 -8198 66375 92776 25469 -84037 -123513
1308a23513Q3547J27563M3285r2801j32854l5583R4706J25104K0987r5138r7106
$$ -123513 -39966 87597 130882 38081 -94773 -130356 -35650 89454 110441 15303 -81803
1319h1803O334R9357O9761l8711j06352m7418O2583J00457K3618q2215r2483N472
$$ -81803 -75469 23888 93649 54938 -51414 -98832 -36249 64208 87826 5611 -86872 -81400
1331h1400R6854Q6553j9929j01550p1643K7345Q6511N0579l0056o7545k6638L1894
$$ -81400 15454 102007 82078 -19472 -91115 -63770 22741 73320 43264 -24281 -50919 -19025
1343a9025L8555j74l2649j6346K4938M0355J0854l0053m0395j4659J5624K6420
$$ -19025 19530 19356 -13293 -29639 -4701 35654 46508 16455 -23940 -38599 -22975 3445
1355C445J4722J9o889j2725j9027j4224J3068M0714L7845r004n8310n5633O431
$$ 3445 18167 18186 11297 -1428 -20455 -34679 -21611 19103 56948 47944 -10366 -65999 -59568
1368e9568P1383O2555p981p8888o9711J0773Q0353O2525j7667p3468m0728L6845
$$ -59568 11815 74370 66389 -12499 -82210 -71437 8916 71441 53774 -19694 -60422 -23577
1380b3577P1511J4792o2213p0049M253Q0782O7069k5041r5515o0854M2175J04188
$$ -23577 47934 62726 513 -69536 -65283 15499 82568 57527 -37988 -98842 -56667 47521
1392D7521N3896m9571j01360m1643N7246Q9679K2944o6093p3144k604O9207N3734
$$ 47521 101417 51846 -49514 -91157 -33911 55768 78712 12619 -60525 -63129 6078 59812
1404E9812k3203p0627l5020M5354P6549K6707n5860p4149j8488M8804N6388Q994
$$ 59812 36609 -34018 -69038 -23684 52865 79572 23712 -50437 -68925 -20121 36267 45261
1416D5261l6137l4072K691K0935Q459o288l785J2711J0592j3678k8112p509K8884
$$ 45261 9124 -24948 -22257 -1322 7137 849 -2936 9775 20367 6689 -21423 -28932 -48
1429d8L8326l070m4422m1653J1537M9504L2268j7949m0648j0082L6722L2905j7646
$$ -48 38278 35208 -9214 -50867 -39330 10174 42442 24493 -16155 -26237 10485 43390 25744
1442B5744o0817l2867M0008P9478L1556n5685q7753k6829O6993Q3699J2698p0454
$$ 25744 -35073 -67940 -27932 51546 83102 27417 -60336 -87165 -20172 63527 76225 5771
1454E771p0683J0630P9574N3814l4859q7417m3017N0832Q7195K4214o0435p7124
$$ 5771 -64912 -54282 25292 79106 44247 -43170 -86187 -35355 51840 76054 15619 -61505
1466f1505m152P1504O7608q863p6151o0040J6296P0075M7080j8335n8844l4665
$$ -61505 -65657 5847 73455 64592 -11559 -71599 -55303 14772 61852 43517 -15327 -49992
1478d9992J9036M1550J7767j8948k2723L240K3458J3695j7578l1338q979J9819
$$ -49992 -30956 10594 28361 9413 -13310 -10070 13388 27083 9505 -21833 -30812 -10993
1490a0993K6211P014j7545j9301J574R079N271k798K938J2708Q233j6471k8577
$$ -10993 15218 22232 4687 -14614 -13040 -3961 1310 -1488 1450 14158 22391 5920 -22657
1503b2657r552K4673L9606L572l8661m4192N009N1041M4151j3340n5359l7073
$$ -22657 -32209 -7536 32070 35642 -3019 -47211 -42202 8839 52990 39650 -15709 -52782
1515e2782K7056O0736K1707m3966o3915r273N9231O3187p476p2387n9110K3552
$$ -52782 -25726 35010 56717 12751 -51164 -60437 -1206 61981 54505 -17882 -76992 -53440
1527e3440Q5299N5736l4501q7974m6636M5229P8562K6229n2906o6160l854N7812
$$ -53440 31859 87595 53094 -34880 -81516 -36287 42275 68504 15598 -50562 -54416 3396
1539C396M9885j9819o0351k9498L9065O4886J5162n1102n9600m819N0299M3173
$$ 3396 53281 33462 -26889 -56387 -17322 47564 62726 11624 -47976 -52795 -2496 40677
1551D0677o592m3051k7034J6774L3298R769j7456j8923M465J9244M929j7704j6821
$$ 40677 34085 -8966 -36000 -19226 14072 23841 6385 -12538 -8073 11171 16100 -1604 -18425
1564a8425N548K5731J1694k2037k9008m511K8024K9320j426k9651j6396J6438
$$ -18425 -12877 12854 24548 2511 -26497 -31008 -2984 26336 24910 -4741 -21137 -4699
1576d699K8507n4l4593l1255J4321M9489L0950k7522n8685k7523L6196O3035K1250
$$ -4699 23808 23754 -10839 -42094 -27773 21716 52666 25144 -33541 -61064 -24868 38167 59417
1589E9417m0333n6016p114M4719M1745r642n1875l0424K4623N3641K2159l8680
$$ 59417 19084 -36932 -44046 673 42418 32776 -19099 -49523 -24900 28741 50900 12220
1601A2220n2760q785M7504N2586l061n5065m6140J1991N7446L7255k3489n4291
$$ 12220 -40540 -49325 -1821 50765 47704 -7361 -53501 -41510 15936 53191 29702 -24589
1613b4589k7914K6115N0459J4988l0908l3329L247L6617J8782k3657l7921q413
$$ -24589 -52503 -26388 24071 39059 8151 -25178 -21931 14686 33468 9811 -28110 -36523
1625c6523L1787L7184j906l4602k7901O970L1732J7224j5547j9178L629J9871
$$ -36523 -4736 32448 30542 -4060 -31961 -24991 6741 23965 8418 -10760 -7131 12740
1637A2740N578j9977k4704K644L1455K3494j2719l8243j8383K6024M1903J0652
$$ 12740 18318 -1659 -26363 -23719 7736 31230 18511 -19732 -38115 -12091 29812 40464
1649D0464l5285m0375K387M2371L4003j8321n0051k0980L2592M7744O842m5685
$$ 40464 5179 -35196 -32809 9562 43565 25244 -24807 -45787 -13195 34549 41391 -4294
1661d294m6910J3049O1627M1170k6146o7733l3980L4184O3298J9322m0508n0057
$$ -4294 -51204 -38155 23472 64642 38496 -29237 -63217 -29033 34265 53587 13079 -36978
1673c6978m108M3091L6552j2834m5149k0344K9156M5326Q453l8248m3573q25M0376
$$ -36978 -41086 2005 38557 25723 -19426 -39770 -10614 34712 43165 4917 -38656 -39481 895
1686H95L3866q153l5840k4378J7249L2811J0159k1547k4753K826K5114J4091j5929
$$ 895 34761 26608 -9232 -33610 -16361 16450 26609 5062 -19691 -16865 8249 22340 6411
1699F411k5210l374K4484K1267j0132l0383j5953K1154L7201J0135k7467l2296
$$ 6411 -18799 -22173 2311 23578 13446 -16937 -32890 -11736 25465 35600 8133 -24163
1711b4163j344K9538K0199j3948l0420o913K7763L0636n565m0400k9043J5989
$$ -24163 -25507 4031 24230 10282 -20138 -27051 712 31348 25783 -14617 -43660 -27671
1723b7671M8498K6729k0320m6862k1522K6104L9848P416l4110l3769O168M0897
$$ -27671 20827 47556 27236 -19626 -41148 -15044 24804 32220 -1890 -35659 -29491 11406
1735A1406K7913j7594m5993j4847L1005M4088L540m2770l8750Q365M8119K8773
$$ 11406 39319 21725 -24268 -39115 -8110 35978 39518 -3252 -42002 -33637 14482 43255
1747D3255k1721m8474j7775K9558M4794O115l2740l1268R747L4686J4034k3934
$$ 43255 21534 -26940 -44715 -15157 29637 35752 3012 -28256 -18509 16177 30211 6277
1759F277l5352k837L5594L1627p786l9099k6621J6647L8289J7660j9414l2214
$$ 6277 -29075 -31912 3682 35309 27523 -11576 -38197 -21550 16739 34399 14985 -17229
1771a7229l879K5742K0479j2467l1029j3207K6095L2095N51l3639k6619J1354
$$ -17229 -21108 4634 25113 12646 -18383 -31590 -5495 26600 27151 -6488 -33107 -21753
1783b1753L9096K0143k2808l7653j0752L2337L2834n019l6196k6485J6212L8333
$$ -21753 17343 37486 14678 -22975 -33727 -1390 31444 26425 -9771 -36256 -20044 18289
1795A8289J4263k7561l4157J728L7825K9061j3314m4881k4465K0959M5207J6665
$$ 18289 32552 4991 -29166 -27438 10387 39448 26134 -18747 -43212 -22253 22954 39619
1807C9619k7394l9905q283K8826L4080m224l0317k0376J6008L5797R833k7998
$$ 39619 12225 -27680 -35963 -7137 26943 22719 -7598 -27974 -11966 23831 33664 5666
1819E666l8552k806L5048L2723n677l6271k4739J7155L5057J2443k4470l0086
$$ 5666 -32886 -35692 -644 32079 26402 -9869 -34608 -17453 17604 30047 5577 -24509
1831b4509J125K9245K2559j0698l2992j2622K0484K7488n45k7459k2035J2694
$$ -24509 -23384 5861 28420 17722 -15270 -27892 -7408 20080 19535 -7924 -29959 -17265
1843a7265L6251J7014k1627l5643j0340K5761K9676o50k8532k1017J1932K9660
$$ -17265 18986 36000 14373 -21270 -31610 -5849 23827 23177 -5355 -26372 -14440 15220
1855A5220J2503k5494l1979K56L7340L2185q665m2339k7814J6701M1003J5112
$$ 15220 27723 2229 -29750 -29494 7846 40031 31366 -10973 -38787 -22086 18917 34029
1867C4029k6920l4959k451L5311K9544j1407l9334j7850K4395L5852P787l1984
$$ 34029 7109 -27850 -30301 5010 34554 23147 -16187 -34037 -9642 26210 33997 2013
1879B013l1246K790L4877K3593j6817l7085j4347K7198L6236O346k8911k9866
$$ 2013 -29233 -26443 8434 32027 15210 -21875 -36222 -9024 27212 33558 4647 -25219
1891b5219L048L1085J7628j5669l0484o172K5696K9441m496l5311k5515J2491
$$ -25219 -22171 8914 26542 10873 -19611 -25783 -87 29354 24858 -10453 -35968 -23477
1903b3477L9832J8291j8601l4554q487K5255K7455q373l2516j7471K1291L4133
$$ -23477 16355 34646 16045 -18509 -26996 -1741 25714 17341 -15175 -32646 -11355 22778
1915B2778P530k6876l1658J276L3523K4518j0924l5091j4792K1122L2322L232
$$ 22778 30308 3432 -28226 -26950 6573 31091 20167 -14924 -29716 -8594 23728 26960
1927B6960k9439k8275N641L1096K2409j2690l0521j1064K2285K9328j76l1943
$$ 26960 -2479 -30754 -25113 5983 28392 15702 -14819 -25883 -3598 25730 25554 -6389
1939f389k6243Q920L5012K4108j7365l7099j5049K3714L4156L022k9153k4873
$$ -6389 -32632 -23712 11300 35408 18043 -19056 -34105 -10391 23765 26787 -2366 -27239
1951b7239R129L5176J7203k1900l7694q059K7383L3504m55l1848k5499J1787L3235
$$ -27239 -18110 17066 34269 12369 -25325 -33384 -6001 27503 27048 -4800 -30299 -18512 14723
1964A4723J6655k0037l0208o409K5272K3452l938k7364j8721J2198K8930R819
$$ 14723 31378 11341 -18867 -25276 -4 23448 19510 -7854 -26575 -14377 14553 24372
1976B4372k0235k6403J905K6958K2563j1575l1425j3151J7781L1265M745k7647
$$ 24372 4137 -22266 -20361 6597 29160 17585 -13840 -26991 -9210 22055 26800 -847
1988h47k5765P279L0594J6454j8406l0711l970K9517K9957o675l9132k5529J5106
$$ -847 -26612 -19333 11261 27715 9309 -21402 -25372 4145 34102 27427 -11705 -37234 -22128
2001b2128L8512J6834k1882l4508o025L0469K8502o117l6238k1711J9977L7277
$$ -22128 16384 33218 11336 -23172 -29197 1272 29774 23657 -12581 -34292 -14315 22962
2013B2962J2279k4983l6362p435L0608K9917k526l3981k2440J5043L6322J5194
$$ 22962 35241 10258 -26104 -33539 -2931 26986 24460 -9521 -31961 -16918 19404 34598
2025C4598k4227l3873o221K7063K6497l675k8462j6675J4956K8007M073k5505
$$ 34598 10371 -23502 -29723 -2660 23837 20162 -8300 -24975 -10019 17988 22061 -3444
2037c444k4040N064L1876K0481j1405k9026j3419J3367K3944J585k1001j6115
$$ -3444 -27484 -22420 9456 29937 18532 -10494 -23913 -10546 13398 14983 -6018 -22133
2049b2133J2087K3717R160j7270k4946l275K2393K2594m752k2673j7271J2478
$$ -22133 -10046 13671 22831 5561 -19385 -22660 -267 22327 17575 -5098 -22369 -9891
2061i891K6299P324k2563k7642R11K8293K5888p206l2709j5620J8413L1028M539
$$ -9891 16408 23732 1169 -26473 -25562 2731 28619 21413 -11296 -26916 -8503 22525 27064
2074B7064k9224k8306N324L6505K5805j4954m0861j8772K1894L9303R562k7191
$$ 27064 -2160 -30466 -25142 11363 37168 22214 -18647 -37419 -15525 23778 33340 6149
2086F149k9798P9L0977K2404j3245l3606j5362K0818L5125Q238k6803l1998k41
$$ 6149 -23649 -23570 7407 29811 16566 -17040 -32402 -11584 23541 31779 4976 -27022 -27263
2099b7263L0249K7648q726l1572j7465J6967K8393P636k4578k5854L491K4763
$$ -27263 2986 30634 21908 -9664 -27129 -10162 18231 25867 1289 -24565 -21074 3689
2111C689J8437r125k3329q270J7630J9591n201k2238j1908J2792K3742M472k0313
$$ 3689 22126 13001 -10328 -18598 -968 18623 13422 -8816 -20724 -7932 15810 20282 -31
2124c1j8464K171K2438J2281j4371k0862j372K3468K0243o607l0692j8788J3248
$$ -31 -18495 -16324 6114 18395 4024 -16838 -18210 5258 25501 18894 -11798 -30586 -17338
2137a7338L2999J3830j9857l1795p269K9062K9183l996l4405k4240J3567L6879
$$ -17338 15661 29491 9634 -22161 -29430 -368 28815 24819 -9586 -33826 -20259 16620
2149A6620K1156k3691m0313j0297K9449L5427K470l7064k8619J2745L6765K2965
$$ 16620 37776 14085 -26228 -36525 -7076 28351 30821 -6243 -34862 -22117 14648 37613
2161C7613j8848l8289j6284K4233L4564O513k5676k6554P58K4748J9121q761k3528
$$ 37613 18765 -19524 -35808 -11575 22989 29502 3826 -22728 -21970 2778 21899 13138 -10390
2174a0390j0716J6108K1261L693j8574j6602o47J7674J0992n705j5540k982J2638
$$ -10390 -21106 -4998 16263 19956 1382 -15220 -15867 1807 12799 7094 -8446 -11428 1210
2187A210J1602p002j3378o047J3043J6667q96j9643j3070Q342K1339N998j8916
$$ 1210 12812 5810 -7568 -13615 -572 16095 15199 -4444 -17514 -9172 12167 18165 -751
2200g51k0598L460K8699J6783j0328l1731j4474J8911L0195O424k5716k7094K739
$$ -751 -21349 -17889 10810 27593 17265 -14466 -28940 -10029 20166 26590 874 -26220 -23481
2213b3481L3071K3316j4621l6776j9910K2375M1658J4427k8094l7049p825L0688
$$ -23481 9590 32906 18285 -18491 -38401 -16026 25632 40059 11965 -25084 -32909 -2221
2225b221L1958l352l7321k6288J4499M1625J9050k3046l9189j0926K7121L3822
$$ -2221 29737 26385 -10936 -37224 -22725 18900 37950 14904 -24285 -35211 -8090 25732
2237B5732K252k9297k3055P921K7274J3437j6459k6501o952K1064K3281O38j8359
$$ 25732 27984 -1313 -24368 -16447 10827 24264 7805 -18696 -25648 -4584 18697 19335 976
2250I76j4472K848J5302N130q458j0199K435J0543M813n776j1706q44J2105O749
$$ 976 -13496 -10648 4654 9784 1326 -8873 -6438 4105 8918 3142 -8564 -9408 2697 9446
2264I446o553j1654k323J6827J4050o535k3590j5335J2823K8337J1473j9184k9788
$$ 9446 2893 -8761 -11084 5743 19793 13258 -10332 -25667 -12844 15493 26966 7782 -22006
2277b2006l792K6626K7121l530l2191k5597J3420L8600J9325k1948m1323j3392
$$ -22006 -25798 828 27949 24419 -7772 -33369 -19949 18651 37976 16028 -25295 -38687
2289c8687K8384L9265O886l3751l2979J744L7780K7538j2790l7755k2344J8054
$$ -38687 -10303 28962 35848 2097 -30882 -29138 8642 36180 23390 -14365 -36709 -18655
2301a8655L8808J6634k5284l6850q061K7671L2123J160k9020k4095P062K8063
$$ -18655 20153 36787 11503 -25347 -33408 -5737 26386 27546 -1474 -25569 -18507 9556
2313I556J6612j3495k7314r494J6230K1459L377j3990j2459K695J1206N39p071
$$ 9556 26168 12673 -14641 -24135 -7905 13554 16931 2941 -9518 -6823 4383 4922 -2149
2326b149n399O887R974m13j0201j0133O188J1708K869j1927j4019M873K1031J4257
$$ -2149 -7548 -661 9313 8900 -1301 -11434 -5246 6462 9331 -2596 -16615 -11742 9289 23546
2340B3546j3036k6112j1116J8797K8852N431k5594k7690L132L1147K6565j4301
$$ 23546 10510 -15602 -26718 -7921 20931 26362 768 -26922 -23790 7357 33922 19621
2352A9621l7958k1299K2094M4057J4207k8270m3246o240L5117L5498m158l7287
$$ 19621 -18337 -39636 -17542 26515 40722 12452 -30794 -37034 -1917 33581 29423 -7864
2364g864l0143J4284M1278K2363k3871l9979j4122K4839L8065J0339k7289l0680
$$ -7864 -38007 -23723 17555 39918 16047 -23932 -38054 -13215 24850 35189 7900 -22780
2376b2780k943K6040K2610o730k4530j4799J1636K2942J0689j4548k0444l646
$$ -22780 -25723 317 22927 16197 -8333 -23132 -11496 11446 22135 7587 -12857 -16503
2388a6503J3128J4408o29j2053o445M929Q306R89p732m190L400O243j315m793
$$ -16503 -3375 11033 10404 -1649 -8094 -3165 5141 6130 -1602 -5792 -2392 3851 2536 -2257
2402b257j072Q292O166o909j6639o706J2787K2115P100j8583k4073k602K4356
$$ -2257 -3329 4963 11129 4220 -12419 -19125 -6338 15777 22877 4294 -19779 -22381 1975
2415A975K3059m724k8127k2277J4678L2731J6384k1516l6670j3266K7906L8604
$$ 1975 25034 20310 -7817 -30094 -15416 17315 33699 12183 -24487 -37753 -9847 28757
2427B8757Q259l2178l6548Q38L5219L2016r792m0317k5007J8037M2210J8048k5516
$$ 28757 37016 4838 -31710 -30872 4347 36363 26571 -13746 -38753 -20716 21494 39542 14026
2440A4026m0876r783K9073L4687J749k9995k5624O227K9545J7977j3462k8792
$$ 14026 -26850 -36633 -7560 27127 28876 -1119 -26743 -20516 9029 27006 13544 -15248
2452a5248j1531J7232K4165N223j3991j6993k800J2310R719m52p146l007M552
$$ -15248 -26779 -9547 14618 19841 5850 -11143 -13943 -1633 8086 7634 488 -2519 2033
2465B033J80k857n404L928P126J194r008q397N556J5428Q550j2612k1837n773
$$ 2033 2213 -644 -6048 -2120 5006 6200 -2808 -11205 -5649 9779 18329 5717 -16120 -21893
2479b1893J8281K4981K495k4716k4676M576K9428K0676j1933l4644j5098K1271
$$ -21893 -3612 21369 23864 -852 -25528 -20952 8476 29152 17219 -17425 -32523 -11252
2491a1252L5747J1480k6999l8076o153L0996L4121J79l3763k7309P555L5425K2235
$$ -11252 24495 35975 8976 -29100 -35253 -4257 29864 30043 -3720 -31029 -23474 11951 34186
2504C4186j5844l7224j7308K3176L6902J2142k4715l5467o558K6366K8258m67
$$ 34186 18342 -18882 -36190 -13014 23888 36030 11315 -24152 -30710 -4344 23914 23447
2516B3447k6348k0992O149K6817J6123r950k5787j1790J3591J8564N211j0769
$$ 23447 -2901 -23893 -17744 9073 25196 15246 -10541 -22331 -8740 9824 15035 4266
2528D266j2170l98Q432N047l625o048J338N041L372l364l362J996L764j091q991
$$ 4266 -7904 -8302 130 5177 1552 -4496 -3158 1883 5255 1891 -1471 525 4289 3198 -5793
2543e793n196O781J4105O634j1866j7728m628J4256K1300j13k0305j8853M981
$$ -5793 -10989 -4208 9897 16531 4665 -13063 -17691 -3435 17865 17752 -2553 -21406 -16425
2556a6425K7706J7017j4472l3432j4564K2034L6796R700k8588l4184k056L2199
$$ -16425 11281 28298 13826 -19606 -34170 -12136 24660 34360 5772 -28412 -30468 1731
2568A731L1179o974l7829k3893J6412L6760J7809k1690l6694j1110K5497L3589
$$ 1731 32910 25936 -11893 -35786 -19374 17386 35195 13505 -23189 -34299 -8802 24787
2580B4787N108k6648k7454R12K7776J9366p612k6175j4798J3792K5206P577j5922
$$ 24787 29895 3247 -24207 -23295 4481 23847 16235 -9940 -24738 -10946 14260 21837 5915
2593E915j9655m811J6024J5080j373j1314q523N043Q031O46o895n368M753M698
$$ 5915 -13740 -18551 -2527 12553 11180 -134 -8657 -3614 4417 5063 -1832 -7200 -2447 2251
2607B251q8l023l00M442M951m111j3563m453J1900J6883K680j6145j6981j547
$$ 2251 2163 -860 -1160 3282 8233 4122 -9441 -13894 -1994 14889 17569 1424 -15557 -17104
2621a7104J9623J7271o861k0877j5550J2732K6310J2773j8233l0902j0543K4115
$$ -17104 2519 19790 12929 -7948 -23498 -10766 15544 28317 10084 -20818 -31361 -7246
2633g246L1040N368k6479l0260J525L1731K4649j0315l2400j9332J6817L4678
$$ -7246 23794 29162 2683 -27577 -26052 5679 30328 20013 -12387 -31719 -14902 19776
2645A9776J4534k2721l4474p690K4078K8775K768k6439k2589N908K7507J4506
$$ 19776 34310 11589 -22885 -30575 -6497 22278 25046 -1393 -23982 -18074 9433 23939
2657B3939j1573k7419r144J7563K2100L852j6205j7403J686J2898J1267o563j0765
$$ 23939 12366 -15053 -24197 -6634 15466 19318 3113 -14290 -12604 294 11561 4998 -5767
2670e767k603J0125P848l664r578m085O560O168k759q939j994J0820J1238m841
$$ -5767 -8370 1755 9603 5939 -3639 -7724 -1164 5004 2245 -6694 -8688 2132 13370 8529
2684H529j5512j0266Q250K2039O735j5615k2789k40K2484J8983r126k6369j3193
$$ 8529 -6983 -17249 -8999 13040 19775 4160 -18629 -18869 3615 22598 13472 -12897 -26090
2697b6090J4551L0504R189k1493k9855l869K5968K5871l188k6303k2457J0868
$$ -26090 -11539 18965 28154 6661 -23194 -27063 -1095 24776 21588 -4715 -27172 -16304
2709a6304K8915J6276j9375k8816r270K1596K8599M869k3102k5401J265K4764
$$ -16304 12611 28887 9512 -19304 -28574 -6978 21621 26490 3388 -22013 -20748 4016
2721D016J8247p331k3927j2646J2363K2847Q383j6003k1124j111J3800J6254j836
$$ 4016 22263 14932 -8995 -21641 -9278 13569 21952 5949 -15175 -16286 -2486 13768 11932
2734A1932j3131p968L941R403K916q384o293K867P897M382o025n993J185O454
$$ 11932 -1199 -9167 -5226 4177 7093 -1291 -7584 -4717 3180 7562 1537 -4456 -3271 3183
2748C183K436n356o985N99J1505O173n643j3511o421Q495J5621L041j3858j2903
$$ 3183 5619 263 -6722 -6123 5382 11555 5912 -7599 -14020 -5525 10096 13137 -721 -13624
2762a3624L31J9530J2930r021k3734j1566J5566K7079P879k1425k4481k024K3632
$$ -13624 -13293 6237 19167 10146 -13588 -25154 -9588 17491 25370 3945 -20536 -22560 1072
2775A072K2502m508k7286j7956J2194K9616J3621j9945k9179p531K2193K5665
$$ 1072 23574 19066 -8220 -26176 -13982 15634 29255 9310 -19869 -27400 -5207 20458
2787B0458K932k2947k2032O313K1818J2855q341k2300q164J5240K0417J3j5414
$$ 20458 23390 443 -21589 -15276 6542 19397 11056 -11244 -19408 -4168 16249 16262 848
2800H48j6079L162J4865J0138p543j1304k484J0105J0212n457j2374n680Q651
$$ 848 -15231 -12069 2796 12934 5391 -5913 -8397 1708 11920 6463 -5911 -11591 -2940
2813b940J1752j846r747m673M390J1009n21j1699q662O435J5040O997j0189j5431
$$ -2940 8812 6966 -2781 -7454 -3064 7945 7424 -4275 -12937 -6502 8538 15535 5346 -10085
2827a0085k662J1765J3282j827j5406j1219O483K0009Q746j0955k1523p050J5307
$$ -10085 -12747 -982 12300 10473 -4933 -16152 -9669 10340 19086 8131 -13392 -20442 -5135
2840e135K0273L500j6307k0327L522J8338J4768o895k1701j1470J4190K1942N877
$$ -5135 15138 18638 2331 -17996 -14474 3864 18632 11737 -9964 -21434 -7244 14698 20575
2853B0575j5811k1157j170J8229J5777l421j8769j1310R414J8579N569j4121j7339
$$ 20575 4764 -16393 -17563 666 16443 13022 -5747 -17057 -7643 10936 16505 2384 -14955
2866a4955j121J5554J4664j431j3935j1464L738J4525N487r949j1694J694J2375
$$ -14955 -16076 -522 14142 12711 -1224 -12688 -8950 5575 11062 1113 -10581 -8887 3488
2879C488Q767n257j2214o825R524J0817j39r532p954N695J2090K798j2534j2090
$$ 3488 12255 6998 -5216 -12041 -2517 8300 8161 -1371 -9325 -3630 8460 11258 -1276 -13366
2893a3366K523J5206J1380p448j6891m475J1696J5872k296j7306j3016P917K0474
$$ -13366 -10843 4363 15743 8295 -8596 -13071 -1375 14497 12201 -5105 -18121 -10204 10270
2906A0270Q736j2072k1284m063J5303J8950r51j8043j5029Q556K0099R350j4615
$$ 10270 19006 6934 -14350 -18413 -3110 15840 14889 -3154 -18183 -9627 10472 19822 5207
2919E207j9419n060J6057J9368K562j7833j8212N090J8175J1045r910j8022o367
$$ 5207 -14212 -19272 -3215 16153 18715 882 -17330 -12240 5935 16980 7070 -10952 -17319
2932a7319J5994J6692l11j6067j4959L666J6186R685q220j2330j962R306J0573
$$ -17319 -1325 15367 15056 -1011 -15970 -12304 3882 13567 5347 -6983 -8945 361 10934
2945A0934l098j3926o289P069J3646R15p552r147R60R945N261n699r526j581R551
$$ 10934 7836 -6090 -12379 -5310 8336 9251 1699 -7448 -6488 3457 8718 3019 -6507 -8088 1463
2960A463R599j718j2339r311L501J4084O536p431j3952j492J2062J2644l040j6496
$$ 1463 11062 9344 -2995 -12306 -8805 5279 11815 4384 -9568 -11060 1002 13646 10606 -5890
2974e890j0627P463J8192P093r634j7946m730J4825J4535j965j5526j2363Q647
$$ -5890 -16517 -9054 9138 16231 6597 -11349 -16079 -1254 13281 11316 -4210 -16573 -7926
2987g926J7041R034j3126j7534n152J4953J5878K52j5300j1876M863J5259P429
$$ -7926 9115 18149 5023 -12511 -17663 -2710 13168 13420 -1880 -13756 -8893 6366 13795
3000A3795r741j6171l082J5963J3908l671j4346j0607N805J6243M043j0926j3324
$$ 13795 4054 -12117 -15199 764 14672 11001 -3345 -13952 -8147 8096 12139 1213 -12111
3013a2111K267J4743R347p390j4846o859J2352J3774O55j3837j0331M862J4409
$$ -12111 -9844 4899 14246 6856 -7990 -14849 -2497 11277 11932 -1905 -12236 -7374 7035
3026G035N725j1734j4245Q26J5930J0598l839j5383q306Q326J3255L815j1819
$$ 7035 12760 1026 -13219 -12393 3537 14135 10296 -5087 -13393 -5067 8188 12003 184
3039A84j0941J531J4746R627o503j8131o161R581J6353M160j1711j4560J361J5538
$$ 184 -10757 -9226 5520 15147 8644 -9487 -15648 -6067 10286 14446 2735 -11825 -10464 5074
3053E074Q556p077j6065o019J2436J5262L127j4932j4325K529J4617J0063n342
$$ 5074 13630 6553 -9512 -15531 -3095 12167 15294 362 -13963 -11434 3183 13246 7904
3066G904j4823n067R852J3420P23j4242j0622K816J2637R794m478j2352m466M827
$$ 7904 -6919 -11986 -2134 11286 12009 -2233 -12855 -10039 2598 12392 7914 -4438 -8904 -4077
3080d077J1975%r906q528L642J2842O322p461j2038m251R118J1130m41j1656o727
$$ -4077 7898 7898 -2008 -10536 -6894 5948 12270 4809 -7229 -11480 -2362 8768 8327 -3329 -10056
3095a0056P695J1157L438j2988j2984K564J4200J0875n313j4581o585R426J4039
$$ -10056 -2361 8796 12234 -754 -13738 -11174 3026 13901 8588 -5993 -12578 -3152 10887
3108A0887J21j4936j1586M433J7667J1027q748j9112n728J0268J7002J005j4258
$$ 10887 11008 -3928 -15514 -11081 6586 17613 8865 -10247 -15975 -5707 11295 12300 -1958
3121a958j1069M146J5894P029q605j6234n618J2150J6529J641j3571j3348K671
$$ -1958 -13027 -8881 7013 14042 5437 -10797 -16415 -4265 12264 13905 334 -13014 -10343
3134a0343J6239P687r675j3901j449J1615J2817j549j4637j0827P452J2914N162
$$ -10343 5896 13583 3908 -9993 -11442 173 12990 11441 -3196 -14023 -6571 6343 11505
3147A1505j0122r525J917J0092P549n908j3123m994Q946J2599J232j0725r695
$$ 11505 1383 -8142 -6225 3867 11416 5508 -7615 -12609 -3663 8936 10168 -557 -10252
3160a0252L215J0160O155o654j1316j870J1744J1209j575j3480r994N286J3181
$$ -10252 -7037 3123 9278 2624 -8692 -10562 1182 12391 10816 -2664 -12658 -7372 5809
3173E809O133p496j3597k542J3058J1076l712j3861r640P232J5887O844j1532
$$ 5809 11942 4446 -9151 -11693 1365 12441 8729 -5132 -14772 -7540 8347 15191 3659
3186C659j2954l084J2344J0883j276j5600p738P810J5919M185j1674j2653k269
$$ 3659 -9295 -12379 -35 10848 9572 -6028 -13766 -5956 9963 14148 2474 -10179 -12448
3199a2448J1746J2613l170j1795q835O288J2322M439r417j1591j912J0954J3317
$$ -12448 -702 11911 8741 -3054 -11889 -5601 6721 11160 1743 -9848 -11760 -806 12511
3212A2511l291j1924r627N890J2236M234q493j1794K272J1724P809n509j2859
$$ 12511 9220 -2704 -12331 -6441 5795 10029 1536 -10258 -7986 3738 11547 6038 -6821
3225f821m278P213J1788J100j0400p627N394R730L566q495j1657P74J1654R710
$$ -6821 -11099 -3886 7902 9002 -1398 -9025 -3631 6099 9665 1170 -10487 -9713 1941 11651
3239A1651m474j1469n904O170J2303J990j0143j1732L260J2788J0061p324j6752
$$ 11651 7177 -4292 -10196 -4026 8277 10267 124 -11608 -8348 4440 14501 7177 -9575
3252i575o605J1051J6470L848j4441j3472J783J6271J0015q356j7049o275J1043
$$ -9575 -16180 -5129 11341 15189 748 -12724 -10941 5330 15345 6989 -10060 -16335 -5292
3265e292J8116L370j4751j5382J356J4612J1396n880j5068l624Q476J3254J956
$$ -5292 12824 16194 1443 -13939 -12583 2029 13425 7545 -7523 -11147 -2671 10583 12539
3278A2539j2340j1054J73J2697Q938m116j0782n312O418Q122J619q779p415L382
$$ 12539 199 -10855 -10682 2015 10953 6837 -3945 -9257 -2839 5283 6902 -1877 -9292 -5910
3292e910J0777M988o176j0365k661R169O153j032r067l338O783R879k21j0443
$$ -5910 4867 9855 3679 -6686 -9347 -178 5975 4943 -4124 -7462 -679 9200 8979 -1464
3306a464j0096L208J3666N195n837j2126j817R775R935k185j3452r125O273J7258
$$ -1464 -11560 -8352 5314 10509 4672 -7454 -9271 504 10439 8254 -5198 -14323 -8050 9208
3320I208M576p718j4554n456J0176J4341M33j3294j0607M236J5860Q756r693j7306
$$ 9208 13784 6066 -8488 -13944 -3768 10573 11006 -2288 -12895 -8659 7201 15957 6264 -11042
3334a1042o161J2941J6970J504j3961j4173L447J4409R922p375j5725m758J1129
$$ -11042 -17203 -4262 12708 14212 251 -13922 -10475 3934 13856 6481 -9244 -14002 -2873
3347b873J5739j293j2544j2027L146J3886O769p399r378k577R209P682k620q790
$$ -2873 12866 11573 -971 -12998 -9852 4034 10803 3404 -5974 -8551 658 8340 5720 -3070
3361c070n871N517Q364L240n249r065P19O984N783n384q462J00Q060O808j473
$$ -3070 -8941 -3424 4940 8180 2931 -6134 -5415 1569 7352 1968 -6494 -6394 1666 8474 7001
3376G001j0796o672N234J1683L329q831j0222J544J3219Q037o929j5017o370J0156
$$ 7001 -3795 -10467 -5233 6450 9779 948 -9274 -7730 5489 13526 6597 -8420 -14790 -4634
3390d634J5931L891j3575j4086J460J4856J0903p383j5852o785R800J8015K828
$$ -4634 11297 15188 1613 -12473 -11013 3843 14746 7363 -8489 -15274 -5474 12541 15369
3403A5369j1690j7507j973J5389J3652j682j4321r483M476J5125O137r580j3746
$$ 15369 3679 -13828 -15801 -412 13240 11558 -2763 -12246 -7770 7355 13492 3912 -9834
3416i834l825J0733J2404K215j2162r499J333J0623O492m610j0651P7P921P119
$$ -9834 -13659 -2926 9478 11693 -469 -9968 -8635 1988 8480 3870 -6781 -6704 1217 8336
3430H336p95j0762l667K006Q173J232n344k389J639O249M94o606m817P09Q284
$$ 8336 7541 -3221 -6888 -4882 3291 4523 -821 -3210 -1571 4678 5172 -1434 -6251 -5542 2742
3445B742M790m118q364k745P598Q345k444r354q500N161J4027P621r878j4573
$$ 2742 7532 3414 -4950 -7695 -97 8248 5804 -3550 -12050 -6889 7138 14759 4881 -9692
3459i692n459J1791J5806L73j4577j2066M008J7197R299r329j8486o347J2311
$$ -9692 -15151 -3360 12446 12819 -1758 -13824 -9816 7381 16680 7351 -11135 -17482 -5171
3472e171J9198J338j5042j3725m77J5727J2243m528j6277p014R176J3536N137
$$ -5171 14027 15365 323 -13402 -13879 1848 14091 9563 -6714 -13728 -4552 8984 14121
3485A4121j1576j3085j773J0987J1788o50j0958q675M568R752M207p599q560L85
$$ 14121 2545 -10540 -12313 -1326 10462 9812 -1146 -9821 -5253 4499 8706 1107 -7453 -7068
3499g068P456O563j018q346l530L278N734j691m254j255M555N431l418n431m629
$$ -7068 388 6951 5933 -2413 -5943 -2665 3069 1378 -2876 -4131 424 5855 2437 -2994 -7623
3514g623N422O982J689p720o245L010Q476O298o655j2179l520R217J1887L280
$$ -7623 -2201 4781 6470 -1250 -7495 -4485 3991 10289 3634 -8545 -12065 -2848 9039 12319
3528A2319j0547j3219N08J2612J0520l000j4159q976P040J6016O018r029j7868
$$ 12319 1772 -11447 -10939 1673 12193 9193 -4966 -13942 -6902 9114 15132 6103 -11765
3541a1765l192J2002J8045j003j6093j1786K524J6463R607q109j7293n733J1734
$$ -11765 -14957 -2955 15090 14087 -2006 -13792 -11268 5195 14802 6693 -10600 -16333 -4599
3554d599J5459L953j2864j3655o94J2696J0645k567j0015p218M361R446K919o729
$$ -4599 10860 14813 1949 -11706 -12400 296 10941 8374 -1641 -8859 -4498 4948 7867 1138
3568A138o266j570O201O396r77o292k083K553L162j580k765m22L840M498k926
$$ 1138 -5128 -6698 -497 5899 4922 -1370 -3453 -900 2262 682 -2083 -2505 1335 5833 2907
3583B907o695k855L526R016K36r327n097M434J0498N309p784j4647k687J0782
$$ 2907 -3788 -6643 -3117 5899 6135 -3192 -8289 -3855 6643 11952 4168 -10479 -13166 -2384
3597b384J4245o59j1988j2165L951J4947Q470p775j6988o541J1829J8475L741
$$ -2384 11861 11202 -786 -12951 -9000 5947 14417 6642 -10346 -16887 -5058 13417 17158
3610A7158j4356j6964q93J4475J4881k381j5844j0239N897J4773Q334q589j8055
$$ 17158 2802 -14162 -15055 -580 14301 11920 -3924 -14163 -8266 6507 14841 6252 -11803
3623a1803k897J1492J5428R84j3583r943L048Q787O962m276r670j540N718P071
$$ -11803 -14700 -3208 12220 13204 -379 -10322 -7274 1513 8475 4199 -5471 -7011 -1293 5778
3637E778N41o681o154K376M500L071k117r51j262K307Q6k784l407K941L981K420
$$ 5778 6319 -362 -6516 -4140 360 3431 1314 363 -899 1408 1494 -1290 -4697 -1756 2225 4645
3653D645l528m353J648L104M551m203p138m528P953J0108M013j0054j3376m88
$$ 4645 1117 -3236 -1588 1516 6067 1864 -5274 -9802 -1849 8259 12272 2218 -11158 -11646
3667a1646J1391J2389j255j5095r307O530J5846N491r340j7345k696J1885J7488
$$ -11646 -255 12134 10879 -4216 -13523 -6993 8853 14344 5004 -12341 -15037 -3152 14336
3680A4336J072j5266j4203J601J6217J0582o267j6156o263R035J4888O229j2407
$$ 14336 15408 142 -14061 -12460 3757 14339 8072 -8084 -14347 -5312 9576 15805 3398
3693C398j5094j323J2203J3288o81j3203r177L711J1897M607p462j0056p83P763
$$ 3398 -11696 -13019 -816 12472 11791 -1412 -10589 -6878 5019 9626 2164 -7892 -8675 -912
3707i12Q522n17p119m838l2N962O49k081k501M653J761j47p088j587M305N498
$$ -912 7610 7093 -26 -4864 -4896 1066 1715 -366 -2867 1786 3547 3400 -3688 -5275 -970 4528
3723D528k61o250l624L484P636L201p178j0521j568R575J1911j871r453j0723
$$ 4528 4267 -1983 -5607 -2123 5513 8714 1536 -8985 -10553 -978 10933 9062 -391 -11114
3737a1114K176J3025Q062o030j3976n486Q910J5562M306j3648j4313k404J5057
$$ -11114 -8938 4087 12149 6119 -7857 -13343 -4433 11129 15435 1787 -12526 -14930 127
3750A27J3467r94j5596j1366N332J5211O713q560j3658l680J1305J2433J853j1823
$$ 127 13594 12600 -2996 -14362 -9030 6181 12894 4334 -9324 -13004 -1699 10734 12587 764
3764G64j1514k17J1359Q908k352r427n714L465J0604J494n519p353j057M956N338
$$ 764 -10750 -10967 392 9300 6948 -2479 -8193 -4728 5876 7370 1851 -5502 -6559 -1603 3735
3779C735O9l572m162K615K811j80l043j650L261N014k620m562k293K813O894j346
$$ 3735 3804 232 -3930 -1315 1496 1316 -1727 -3377 -116 4898 2278 -2284 -4577 -1764 5130 3784
3795C784o626l847M692Q283K875p261j0602l211J1020J0877m28j1461q062M147
$$ 3784 -2842 -6689 -1997 6286 9161 1900 -8702 -11913 -893 9984 9556 -1905 -9967 -5820
3809e820J2564N023p509j3885l730R469J5729K912j3767j4347p9J4854J2292l826
$$ -5820 6744 11767 4258 -9627 -13357 -3888 11841 14753 986 -13361 -13440 1414 13706 9880
3823I880j5631q189O703J6614M011j0977j3614k533J2558J2069L19j2450q504
$$ 9880 -5751 -13940 -7237 9377 13388 2411 -11203 -13736 -1178 10891 11210 -1240 -9744
3836i744L060J0986M591o664q228k066Q451O768j079o437n622P88O029L548l330
$$ -9744 -6684 4302 8893 2229 -5999 -8065 386 7154 6075 -362 -5984 -5196 833 4381 1051
3851A051j709o79K418O38k255k754K70M844P62j124m691L22L853L567k741o289
$$ 1051 -658 -1337 1081 1719 -536 -3290 -3020 1824 2586 1462 -3229 -2907 946 4513 1772 -4517
3867d517j672M410Q367J986o597j0297l13R096Q590j898j1134o521N709J3066
$$ -4517 -6189 -1779 6588 8574 1977 -8320 -8633 463 9053 7155 -3979 -10500 -4791 8275
3881H275M143r155j4666k567J2290J2826R36j1511j1662J594J2037R503o029j2393
$$ 8275 12418 3263 -11403 -13970 -1680 11146 12082 571 -11091 -9497 2540 12043 6014 -6379
3895f379o537Q323J2933L651r227j4453%J1307J0379j65j2590p391M717J0474
$$ -6379 -12916 -4593 8340 11991 2764 -11689 -11689 -382 9997 9832 -2758 -10149 -5432 5042
3909E042M359o876j0298q5Q723P601j784q899l712J936O095Q90k515l680K049
$$ 5042 9401 2525 -7773 -7858 865 8466 6682 -2217 -5929 -3993 2102 2992 477 -3203 -1154
3924a154M728J062o258k369k43N881J668k960l723r51P258L574l476r474k457
$$ -1154 3574 4636 -1622 -3991 -4234 1647 3315 355 -3368 -4319 2939 6513 3037 -6437 -8894
3939h894O967Q906K444q769q520j69R748Q218m501j0084o255O140J3736K033r284
$$ -8894 -1927 6979 9423 654 -7866 -8035 1713 9931 5430 -4654 -10909 -4769 8967 11000 1716
3954A716j2681R3J1644J0013k555j2033p434N516J2665M105q452j1927j232J0534
$$ 1716 -10965 -10872 772 10785 8230 -3803 -11237 -5721 6944 11049 2597 -9330 -10562 -28
3968b8J0545j526r869q640J993R477N555l158r376j598N233P321J650q715n874
$$ -28 10517 8991 -878 -9518 -7525 1952 7507 4349 -5027 -6625 -1392 5929 7579 -1136 -7010
3983g010R30P733M942l770m364l327L533N094j327n074k546M545M304R04m716
$$ -7010 -6080 1653 6595 2825 -1539 -4866 -1333 3761 2434 -2640 -5186 -641 3663 4567 -149
3998a49m459J478M788K865l908n720J452O013M702l998q475k681O202O945K211
$$ -149 -4608 -3130 1658 4523 615 -5105 -3653 2360 7062 3064 -5411 -8092 -1890 5055 7266
4013G266o506p719J048R910N083n714r532m607Q229J1027K518r555j1392L61J1087
$$ 7266 760 -6959 -5911 3999 9082 3368 -6164 -10771 -2542 8485 11003 1448 -9944 -9583 1504
4028A504P392j521j2536n925P990J1419L280j1077j1132l15J1736R517j921j0833
$$ 1504 8896 7375 -5161 -11086 -3096 8323 11603 526 -10606 -10921 815 10332 8411 -2422
4042b422p372N608R692J855o690q503J690Q749N275l753p134m884M610O845M51
$$ -2422 -9794 -4186 5506 7361 671 -7832 -6142 2607 7882 4129 -3005 -7889 -3279 3566 4017
4057D017l614l882L72N390K820m167o182R91N054M526j536o110l001M060O678
$$ 4017 403 -3479 -3107 2283 5103 936 -5246 -4255 799 5325 3789 -2321 -5322 -1262 5416
4072E416k551m581m730L744Q719K732o574q787j213O550P790J57q513n991L491
$$ 5416 2865 -1716 -6446 -2702 6017 8749 2175 -6612 -7825 -1275 6515 6672 -1841 -7832 -4341
4087d341R611L180o460r602j181Q442Q448l6q346o843J039Q679N003m607q190
$$ -4341 5270 8450 1990 -7612 -8793 -351 8097 8061 -285 -7128 -6089 2590 7593 2986 -5204
4102e204l182P054R104J739p217j0315j08Q967O874k472r087k785N093Q813j352
$$ -5204 -8386 -1332 7772 9511 2294 -8021 -8129 838 7712 5240 -3847 -6632 -1539 7274 5922
4117E922q566n294K881Q387L469l145p068k661N381N280J16o867l310L553O497
$$ 5922 -2644 -7938 -5057 3330 6799 3654 -3414 -6075 -694 4586 4702 -2165 -5475 -1922 4575
4132D575R64n426n970m15P171N048l337n917k341N523N388N7p654n302L251P989
$$ 4575 5539 113 -5857 -6272 899 5947 2610 -3307 -5648 -125 5263 5320 -2334 -7636 -4385 3604
4148C604M044m739p258k925O751P226k249p977m828M368R516L679o943j0230l50
$$ 3604 7648 2909 -4349 -7274 -523 6703 4454 -3523 -8351 -3983 5533 9212 2269 -7961 -8311
4163h311R181N923l48r220n011M272P716L450o716q812M66Q559O494r26q941n892
$$ -8311 870 6793 6445 -2775 -7786 -3514 4202 7652 936 -7876 -7410 1149 7643 6717 -2224 -8116
4179h116K323R249J303m085o668R52O041N390k031o358m978L350O906J350l553
$$ -8116 -5793 3456 4759 674 -5994 -5042 999 6389 4358 -2000 -6978 -3628 3278 4628 1075
4194A075m646J05N571K380k865n971j264M800N988k26m679m808J321N071K897
$$ 1075 -3571 -3466 2105 4485 1620 -4351 -5615 -815 5173 4947 268 -4540 -3219 1852 4749
4209D749l631n053O07N750L462k256p282l085L787O900K168l967p179J77N206
$$ 4749 1118 -3935 -3328 2422 5884 3628 -3654 -6739 -2952 3948 6116 2149 -5030 -4853 353
4224C53O078k409p851l352L964Q838J715o491p368j555Q136O959j974p293n365
$$ 353 6431 4022 -3829 -7181 -3217 5621 7336 845 -6523 -8078 58 7017 5043 -2250 -7615
4239g615N010P804K807o842r598Q83R363N576j863p992l639L583P109J358n428
$$ -7615 -2605 5199 8006 1164 -8434 -7551 1812 7388 5525 -2467 -6106 -2523 4586 5944 516
4254E16o750J651O202O031l316q009k165L550O681K09n812l409K146N733K414
$$ 516 -6234 -4583 1619 7650 4334 -3675 -5840 -2290 4391 4600 -1212 -4621 -2475 3258 5672
4269E672n656n590j81N647O773j895p061l413K857P863kn872n398J036P346M958
$$ 5672 16 -5574 -5755 -108 6665 4770 -2291 -5704 -2847 5016 5014 -858 -6256 -5220 2126 7084
4285G084l404q413j298M062N900O47n524o145L802P758L514n868p324l131P177
$$ 7084 3680 -4733 -6031 -1969 3931 4578 -946 -7091 -3289 4469 7983 2115 -5209 -8340 -1163
4300a163P662p22n039n831J026N523N026m870o348j483N919O700K57o856o004
$$ -1163 6499 5777 738 -5093 -4067 1456 6482 1612 -4736 -6219 -300 6400 6657 -199 -6203
4315f203O27P441M462k950o258j785M903N066j561n786l545K353N420L010l805
$$ -6203 -5576 1865 6327 3377 -2881 -4666 237 5303 3742 -2044 -5589 -3236 2184 5194 1389
4330A389m219j416N092L609k101m653k908L764N505K270n708n031n37O560L498
$$ 1389 -2830 -4246 846 4455 2354 -2299 -5207 -1443 4062 6332 624 -4407 -4944 1616 5114
4345E114l121m582o78K775M782n6n844n909L112P158M983m752p140j958N087O220
$$ 5114 1993 -2589 -3267 -492 4290 4234 -1610 -7519 -4407 2751 7734 2982 -4158 -6116 -1029 5191
4361E191j121o070m850L712Q043L081o248p227k166P785N660q46o548n316L501
$$ 5191 4070 -2000 -6850 -3138 4905 7986 1738 -5489 -7655 130 5790 4944 -1604 -6920 -3419
4376c419Q127K396m872q663j961P070R062k341p260m908K761O020L189m195m910
$$ -3419 4708 7104 2232 -6431 -8392 -1322 7740 5399 -1861 -6769 -4008 2012 5201 1006 -3904
4391c904l77N848M771k637n324n255L274O524J348m390l194J366L310L975m599
$$ -3904 -4281 1567 6338 3701 -1623 -6878 -3604 2920 4268 -122 -3316 -1950 1360 5335 736
4406G36n183n33M979N899j681n169m105J405O688P48m228m665J235O176N378l399
$$ 736 -4447 -4980 -1 5898 4217 -952 -5057 -3652 3036 3784 -444 -5109 -3874 2302 7680 4281
4422D281p112l681M802N485J309n554m246P17N433M333l910o265l356M425Q430
$$ 4281 -2831 -6512 -1710 3775 5084 -470 -4716 -3999 1434 5767 1857 -4408 -7764 -3339 5091
4437E091J243m196o127k303P325M962k982n565l487L322O787K915o339p342K92
$$ 5091 6334 2138 -3989 -6292 1033 5995 3013 -2552 -6039 -2717 4070 6985 646 -6696 -6404
4452f404P278M791r79p023l777L901O021Q48m041n032J46N669L941j651o923j906
$$ -6404 874 5665 4686 -2337 -6114 -2213 3808 4656 615 -4417 -4271 1398 5339 3688 -3235 -5141
4468e141L353M829J14l761l187J457O498J308n313m918j020O349L746j207l793
$$ -5141 -1788 3041 3155 -606 -3793 -2336 4162 5470 157 -4761 -5781 568 4314 3107 -686
4483f86l482L422N182L8o356l674J335O929M406m402q143k123P175N476J7p401
$$ -686 -4168 -746 4436 4474 -1882 -5556 -4221 2708 7114 2712 -5431 -7554 -379 5097 5114 -2287
4499b287m649K943P590L014m706o832j591N768P184k66p042n298J596P362L245
$$ -2287 -6936 -3993 3597 6611 1905 -4927 -6518 -750 6434 6168 -874 -6172 -4576 2786 6031
4514F031k321r300l83N565O923j217n106o014k01P807L697k224n599k750M570
$$ 6031 3710 -5590 -5973 -408 6515 5298 192 -5822 -6023 1784 5481 3257 -2342 -5092 -522
4529e22M816r49m658m475K547N748L197l377m874J14K094L453j073l635k369L806
$$ -522 4294 3345 -1313 -5788 -3241 2507 5704 2327 -2547 -2433 -339 3114 2041 -1594 -3963 -157
4545a57K527K094m819l747M84M143K603j422m918J69L883L363j144m376m762L559
$$ -157 2370 4464 -355 -4102 -3618 525 3128 1706 -3212 -3043 840 4203 3059 -1317 -6079 -2520
4561b520O430M98l341n314j026N179M869j047o240m762M529Q692K383p952p108
$$ -2520 3910 4408 1067 -4247 -5273 -94 4775 3728 -2512 -7274 -2745 5947 8330 378 -6730
4576f730j77O557O424q5o568p584M692P420K843m958p620k213P722P048Q46p743
$$ -6730 -6907 -350 6074 5989 -579 -8163 -3471 3949 6792 1834 -5786 -7999 -277 6771 7617 -126
4592a26n836O95O908M046l514o007j814N761N374r05n949m143J624N927L617l960
$$ -126 -5962 -5267 1641 5687 2173 -3834 -5648 113 5487 4582 -1367 -5510 -3886 2041 5658 1698
4608A698m019j099L984J865j443l883j732L310N385J19l423m299M59N593J528
$$ 1698 -2321 -3420 564 2429 986 -2897 -4629 -1319 4066 4185 762 -3537 -3078 2515 4043
4623D043m772l067J036N078K234j252p803l15L684N537J103n237n234K032O104
$$ 4043 -729 -3796 -2760 2318 4552 3300 -4503 -4818 -1134 4403 5506 269 -4965 -2933 3171
4638C171L087l514q279j600P090N964J47n726o257N27O721L846j841n421m231
$$ 3171 6258 2744 -5535 -7135 -45 5919 6066 340 -5917 -5390 1331 5177 3336 -2085 -6316
4653f316M620P591J315o165o933n53O481N821n61p084l537L443N634J389m010
$$ -6316 -1696 5895 7210 1045 -5888 -6441 40 5861 5300 -1784 -5321 -1878 3756 5145 1135
4668A135o481j17N598N391m50m957m873J904M204J195j379l897J301R86M207k829
$$ 1135 -5346 -5463 135 5526 5076 119 -4754 -2850 1354 2549 1170 -2727 -1426 -440 3767 938
4684I38l170j508L447K784J09k822j400J579K392L7l673l014K530N368K238l649
$$ 938 -2232 -3740 -293 2491 2600 -222 -1622 -43 2349 2386 -1287 -4301 -1771 3597 5835 2186
4700B186n176k497N682M503j548o603l213M474P064K670n880p340j035N736P893
$$ 2186 -2990 -5487 195 4698 3150 -3453 -6666 -2192 4872 7542 1662 -5678 -6713 -977 6916
4715F916m98q475m410L464P341L285m389r857q21N408Q815k34o438p303K011O379
$$ 6916 6418 -2057 -6467 -3003 4338 7623 3234 -6623 -7444 -2036 6779 6545 107 -7196 -5185 1194
4731A194N238l059o124l241L731O638Q13m920n937J60N419N628j180n998j467
$$ 1194 6432 3373 -2751 -5992 -2261 4377 5190 270 -5667 -5507 -88 5540 4360 -1638 -3105
4746c105J867M047j97m920l27J943K064J533j593l815M20L144O43j393k739K183
$$ -3105 -1238 2809 2612 -2308 -2635 -692 1372 2905 1312 -2503 -2083 1061 1704 311 -2428 -245
4762b45K163J215j978l785m00K189M560m99k109m712J317M437K840l515n340k226
$$ -245 1918 3133 1155 -2630 -3030 -841 3719 3220 1111 -3601 -2284 2153 4993 1478 -3862 -6088
4778f088M151P399J087n080p297J072O970L083j147p613k849L893N707L406o218
$$ -6088 -1937 5462 6549 1469 -5828 -4756 2214 5297 4150 -3463 -6312 -2419 3288 6694 476
4793D76p134L89N852O574J229q295n169J572P324K782k661n542l893N405N504
$$ 476 -6658 -6269 -417 6157 7386 -909 -6078 -4506 2818 5600 2939 -2603 -6496 -1091 4413
4808D413J179n767n375m5O278M717l258l888q33K728K904o35l335k001J335L408
$$ 4413 5592 -175 -5550 -5595 683 5400 2142 -1746 -2579 149 3053 2418 -917 -2918 -1583 1825
4824A825J123k515j835J67K706K44k440k240K559J831J490k463l498j129M526
$$ 1825 2948 433 -1402 -1235 1471 1715 -725 -2965 -406 1425 2915 452 -3046 -4175 351
4839C51M041j631l759l090K816N209Q34m315o304j80N835O957k89o766m797l46
$$ 351 4392 2761 -998 -4088 -1272 3937 4771 456 -5848 -6028 -193 6764 6475 -291 -5088 -5434
4855e434P524L787l519o535k954N662Q417M48p008o784l97P499N307j006n515
$$ -5434 2090 5877 2358 -4177 -7131 -1469 6948 7396 388 -6396 -6793 706 6013 5007 -508
4870e08n613M330M675L035o366m903K34M744O124j538m902n065K469M170J558
$$ -508 -6121 -1791 2884 5919 -447 -5350 -5116 -372 5752 4214 -688 -5753 -3284 886 2444
4885B444j742j904r72J877L614j940k474j367J92L069J929l026q97J309Q40n70
$$ 2444 702 -1202 -2174 -297 3317 1377 -1097 -2464 -2272 797 2726 -300 -1197 112 952 382
4901C82j670j457J490L921J425k351n107P33K048L603j157m478j442K605O661
$$ 382 -1288 -2745 -1255 2666 4091 1740 -3367 -2634 -586 3017 1860 -2618 -4060 -1455 5206
4916E206O01n380o628Q44N541N045j196m663n089K944N895L403n618n873j467
$$ 5206 5807 427 -6201 -5357 184 5229 4033 -630 -5719 -2775 3120 6523 905 -4968 -6435
4931f435N412P201j92o240n682J009N748N283j907o679l660M737N994N30m501
$$ -6435 -1023 6178 5986 -254 -5936 -4927 821 6104 4197 -2482 -6142 -1405 4589 5119 618
4946F18n498k69O656M913k964n866k334L637M067n34l068k352P04M093Q12j249
$$ 618 -4880 -5149 1507 6420 3456 -2410 -4744 -1107 2960 2426 -642 -2994 -2290 1803 2615 1366
4962A366k432n69J053P56N92j872M62J279K388j459k679k027J768L540N60j898
$$ 1366 -1066 -1635 -582 174 766 -1106 -644 635 3023 1564 -1115 -3142 -1374 2166 2726 828
4978H28l624O29M399J319k634n337j022M644O183k99m028n686K91N488M033j864
$$ 828 -2796 -2167 2232 3551 917 -4420 -5442 -798 5385 5086 1058 -4628 -4337 1151 5184 3320
4994C320p724k037M876O734m4m816p411R86P491M220j141n403n619L574M591K341
$$ 3320 -4404 -6441 -1565 5169 5125 309 -7102 -6116 1375 5595 4454 -949 -6568 -2994 1597 3938
5010C938k590m909j388N612N014k47o132l402M34M024L598k522k831k484L074
$$ 3938 1348 -3561 -4949 663 5677 5430 -702 -4104 -3670 354 3952 1430 -1401 -3885 -811
5025h11L654p82k734l379M247J189J030p85k688o21K200R62k310r74L45L407J725
$$ -811 2843 2061 -673 -4052 195 1384 2414 1629 -1059 -1680 520 1482 -828 -1802 -1457 1950 3675
5042C675k289m017o48K402L754q6m279j736J943M934P52l895m626l08M539M428
$$ 3675 1386 -2631 -3279 -877 2877 2791 -1488 -3224 -1281 3653 4405 510 -4116 -4424 115 4543
5058D543O61n938l819J190N570M360n488n413j800O860N608k54o668o424J116
$$ 4543 5204 -734 -4553 -3363 2207 6567 1079 -4334 -6134 726 6334 6080 -588 -7012 -5896
5073e896P518M371k590n133l027L219O301K46n174m836J179M346M896k616l941
$$ -5896 1622 5993 3403 -1730 -4757 -1538 4763 5009 -165 -5001 -3822 524 5420 2804 -1137
5088a137k863K375K435K165k251k804O40K175J731j536k404k018K408L220o36
$$ -1137 -4000 -1625 810 2975 724 -2080 -1440 735 2466 930 -1474 -3492 -1084 2136 1500
5103A500j054k857K760R78K6r02l155o9M621J040k619k286k70K361K567k238k634
$$ 1500 446 -2411 349 1327 1353 451 -2704 -2773 1848 2888 269 -2017 -2287 74 2641 403 -2231
5120b231j834N313K334O1m007m439J77N290L367j514l522k449J833M784K09k524
$$ -2231 -4065 1248 3582 3643 -364 -4803 -4626 664 4031 2517 -1005 -3454 -1621 3163 3372 848
5136H48m875j456O020M359lo071m268K529M815L829l399n053l036N297N585j054
$$ 848 -4027 -5483 537 4896 4893 -1178 -5446 -2917 1898 5727 2328 -2725 -5761 -464 5121 4067
5152D067m076o420K678N481K485j692l780k022L785K911j144k560l007K521K917
$$ 4067 -9 -6429 -3751 1730 4215 2523 -1257 -3279 506 3417 2273 -287 -3294 -773 2144
5167B144K62p49k620j357J213K556K51j616j713L243R55M8l748j794J645K604
$$ 2144 2406 1657 -963 -2320 -1107 1449 1700 84 -1629 1614 2569 2617 -1131 -2925 -1280 1324
5183A324K166k508l593O92L018J718k026l982j499M028M693J253l423n389q46
$$ 1324 3490 982 -2611 -1919 1099 2817 791 -3191 -4690 -662 4031 5284 1861 -3528 -4374
5198d374N283L921k282o089j550M626M191N62m869l548K43M314N158j764n667
$$ -4374 909 4830 2548 -3541 -5091 -465 3726 4288 -581 -4129 -3886 428 5586 3822 -1845
5213a845j847J464N507m4l675j947m54M578L230j315k885n047J240L835L007l077
$$ -1845 -3692 -2228 3279 3235 -440 -2387 -2841 1737 4967 3652 767 -4280 -3040 795 3802 725
5229G25l304P12J864L073k355k222j600J935K725J676j980l107J075J579J249
$$ 725 -2579 -1867 -3 3070 715 -1507 -3107 -1172 1553 3229 1249 -1858 -783 796 2045
5244B045k858j510j066L661K529j344k630k141K250K268Q19k473j609J438L494
$$ 2045 -813 -2323 -3389 272 2801 1457 -1173 -3314 -1064 1204 2023 -450 -2059 -621 2873
5259B873j55j758l888q02J735M606J808m044l059k18M832K594k795n161l60K701
$$ 2873 2718 960 -2928 -3730 -1995 2611 4419 375 -2684 -2902 1930 4524 1729 -3432 -3792 -1091
5275a091N568R60n559n703J758N452M077k321n973j132L793L865n39m343l033
$$ -1091 4477 5437 -122 -5825 -4067 1385 5462 3141 -2832 -3964 -171 3694 3155 -1188 -4221
5290d221O05M527L193j474k979l374K669K349O82k106k914N64M377J685j045l966
$$ -4221 -3616 911 4104 2630 -349 -3723 -1054 1295 1977 -129 -3043 -2479 1898 3583 2538 -1428
5306a428k053J994M201N19l090k066j04L978J087l535m070K869L063J965j296
$$ -1428 -3481 -1487 2714 3233 143 -1923 -2027 1951 3038 -497 -4567 -1698 1365 3330 2034
5321B034l292p52K889K068m61m527j560K169M510M58k243m571p6L808K763j223
$$ 2034 -1258 -2010 879 2947 2486 -2041 -3601 -1432 3078 3536 1293 -3278 -3354 454 3217 1994
5337A994k570k833J128M601P87k304m578M54M346L654m69m268m283J279M499J778
$$ 1994 -576 -3409 -2281 2320 3107 803 -3775 -3321 1025 4679 4210 -58 -4341 -3062 1437 3215
5353C215j683l668k386N322K630k99m615l791K556N687K95j788l452l6K933J958
$$ 3215 1532 -2136 -4522 800 3430 3131 -1484 -5275 -2719 2968 3263 1475 -1977 -2013 920 2878
5369B878j222l810q04J852K702R67k573j224j245K104K419j073k222n45K253K641
$$ 2878 1656 -2154 -2958 -1106 1596 2563 -10 -1234 -2479 -375 2044 971 -1251 -1796 457 3098
5385C098p39l238k487J687L392J271k356k934j544L399L140o78m495p95K336M786
$$ 3098 2359 -879 -3366 -1679 1713 2984 628 -2306 -3850 -451 2689 2011 -2484 -3279 -943 3843
5401C843Q30l390m914Q67L572K798k369l288j062K495L805j06k232m084j334M971
$$ 3843 4673 1283 -3631 -2764 808 3606 1237 -2051 -3113 -618 3187 3081 849 -3235 -4569 402
5417D02L221j385l395k402K272M652j6l622k966RL393L419j217l426l331J903
$$ 402 3623 2238 -1157 -3559 -1287 3365 3349 -273 -3239 -3230 163 3582 2365 -1061 -4392 -2489
5433b489M429O0j963j976L90K295K973l368j977j759L231K780m23k732j749J951
$$ -2489 1940 2000 37 -1939 -1549 746 3719 351 -1626 -3385 -154 2626 2203 -529 -2278 -327
5449c27J682K06j806j810L42K092J844p44j776j598J205P93J566j255k207L85
$$ -327 1355 1561 -245 -2055 -1713 379 2223 1479 -297 -1895 -690 103 1669 414 -1793 -1408
5465a408J745K801j643k733k274J870L892J012k094m389k86M808K471k610k748
$$ -1408 337 3138 1495 -1238 -3512 -1642 2250 3262 1168 -3221 -3507 1301 3772 1162 -1586
5480a586l806N733L487m5m027l565J617K839K518j919k695p88K859L084m66l954
$$ -1586 -5392 341 3828 3783 -244 -3809 -2192 647 3165 1246 -1449 -2237 622 3706 3240 -714
5496g14k661J291L267J195j08k585k235J701K764J2j949k425J240K778K003k113
$$ -714 -3375 -2084 1183 2378 2270 -315 -2550 -849 1915 1927 -22 -2447 -1207 1571 3574 1461
5512A461l836l50L317K517j313l187Q0Q52K371J370l782k714J36L889L010j957
$$ 1461 -2375 -2725 592 3109 1796 -1391 -1311 -459 1912 3282 -500 -3214 -3078 811 3821 1864
5528A864l783M17J359K477k07l242k809K633L603J098j822l392r98J848L188l33
$$ 1864 -1919 -1502 -143 2334 2127 -1115 -3924 -1291 2312 3410 1588 -1804 -2802 -954 2234 1901
5544A901k261j904N21L391R70j855k431j229J022N748k71n541j730J163L443O70
$$ 1901 -360 -2264 -1743 1648 2618 763 -1668 -2897 -1875 3873 3602 -1939 -3669 -2506 937 1607
5560A607j348k601o43L878K313m64m862j149K329K057P52p13k720J25J899J397
$$ 1607 259 -2342 -2985 893 3206 2742 -2120 -3269 -940 1117 1869 1156 -1564 -1439 460 1857
5576A857l02k685j693K415J279K161j037l153p07J633J674p19k294O7J180L025
$$ 1857 1555 -1130 -2823 -408 871 3032 1995 -1158 -1865 -232 1442 723 -1571 -1504 -324 2701
5592B701M87l994j769P92K277J837p30k822q49K035J754Q79m533r92K030K529
$$ 2701 3188 -806 -2575 -1783 494 2331 1601 -1221 -2070 -35 1719 2598 -1935 -2927 -897 1632
5608A632R75k268k492j417M511K548j789l581k55K342K610J24k520l186m14L519
$$ 1632 2607 339 -2153 -3570 941 3489 1700 -1881 -2136 206 2816 2940 420 -2766 -3180 339
5624C39K301J80j229m011J30L758J305j612n341J644M105J317J3l210k451Q03
$$ 339 2640 2820 1591 -2420 -2290 1468 2773 1161 -4180 -2536 1569 2886 2899 -311 -2762 -1959
5640a959L425N73j751k124j47L497J675l328k282K09J497K707K00k720r37l47
$$ -1959 1466 2039 288 -1836 -1983 1514 3189 -139 -2421 -2212 -715 1992 2192 -528 -1465 -1812
5656a812K143J265j516k766J176K594O87q68j300k192J730J664M17j009k034p19
$$ -1812 331 1596 80 -2686 -1510 1084 1771 903 -397 -2589 -859 805 1222 213 -1821 -2540
5672b540M433R07j058l698j71J488K850J134l099m096K180K657J891k223l064
$$ -2540 1893 2800 1742 -1956 -2127 -639 2211 3345 246 -3850 -1670 987 2878 655 -2409
5687b409k28K364L940Pl956j675j07K666J926j873j173j689K705K63J348j250
$$ -2409 -2637 -273 3667 3674 -282 -1957 -2064 602 2528 655 -518 -2207 498 761 2109 859
5703H59m466K270J207L312j175k156k056L74L249j27j427j821J378R67K786l018
$$ 859 -3607 -1337 -130 3182 2007 -149 -2205 -1831 1418 1291 -136 -1957 -579 388 3174 156
5719A56j654j200K191K545p78j832j441M11K672J21j718k244O25K682K005j528
$$ 156 -1498 -2698 -507 2038 1260 -572 -2013 -1602 1070 1191 -527 -2771 -2146 536 2541 1013
5735A013k981P81J170L124k625j661p86J307K844J366l093k259M71O72K959O10
$$ 1013 -1968 -1187 -17 3107 482 -1179 -1965 -658 2186 3552 459 -1800 -1329 -657 2302 2912
5751B912m680k028K137L441J025j814n316M61L304L141N54m811j615K458K593
$$ 2912 -1768 -3796 -1659 1782 2807 993 -4323 -3862 -558 2583 3137 -1674 -3289 -831 1762
5766A762J47k344k422J104L283Q11N86m118j169R84K863K03k113O27k145K467
$$ 1762 1909 -435 -2857 -1753 1530 2341 2927 -1191 -2360 -1376 1487 1690 -423 204 -1941 526
5782E26J752j967j451n29Q44J517J629k069j422j81R08J502j138r60r19K665J129
$$ 526 2278 311 -1140 -1669 -825 692 2321 252 -1170 -1351 -443 1059 -79 -1039 -1958 707 1836
5799A836j799N58k160R0L045q75o80j363k31K223Q35n83k562j805J964L450J352
$$ 1836 37 595 -1565 -1475 1570 695 15 -1348 -1579 644 1479 896 -1666 -3471 -1507 1943 3295
5816C295l809k124Q09J928K050j182k733p57K805K069J373m159j943n36K975M109
$$ 3295 -514 -2638 -1829 99 2149 967 -1766 -2523 282 2351 3724 -435 -2378 -2914 61 4170
5832D170j818l437j851Q19L952K081k678l891p15M289L096j239k734j827K96L076
$$ 4170 2352 -1085 -2936 -2117 1835 3916 1238 -2653 -3368 921 4017 2778 44 -1783 -1487 1589
5848A589O04j059l727Q71K417K074n51l719L49K25K126J45p02k197L62J280J104
$$ 1589 2193 1134 -2593 -1722 695 2769 2218 -1501 -1152 -927 1199 1344 642 -1555 -1193 87 1191
5865A191j250k368J153J372J400o0k623m22j49L715l40k363j586J025K236J780
$$ 1191 -59 -2427 -1274 98 1498 1438 -1185 -1607 -1756 1959 1619 -744 -2330 -1305 931 2711
5881B711j444k818j552J995L136K33l546j893K324K126J993k178m416M3L728L539
$$ 2711 1267 -1551 -3103 -1108 2028 2261 -1285 -3178 -854 1272 3265 1087 -3329 -3286 442 3981
5897C981k049k724k565J778K118K145k936o54j763K224K728L81k904j887j257
$$ 3981 1932 -792 -3357 -1579 539 2684 -252 -906 -2669 -445 2283 2664 -240 -2127 -3384
5912c384L666L255j873j923j591O45M249q00k208l092J53L339K080j083k037j357
$$ -3384 282 3537 1664 -259 -1850 -1205 3044 2244 36 -3056 -2903 436 2516 1433 -604 -1961
5928a961O13K070J216k710o51O28J351R63k222n1j053K791J627j981j570j25J714
$$ -1961 -1348 722 1938 -772 -1423 -795 556 1519 -703 -754 -1807 984 2611 630 -940 -1065 649
5945F49J070j933l00j446J344K220J88k029j034j642J978K536o31k534j718K791
$$ 649 1719 -214 -514 -1960 -616 1604 1792 -237 -1271 -2913 -935 1601 970 -1564 -3282 -491
5961d91K274J069j949n236K41M260L571M38n945r15Q08K382K855l650j340j833
$$ -491 1783 2852 903 -4333 -4092 168 3739 4177 -1768 -2683 -1875 507 3362 -288 -1628 -3461
5977c461L610L400j591k368k264R3L421K095j696k141j274K831R17l03k141k324
$$ -3461 149 3549 1958 -410 -2674 -2581 840 2935 1239 -902 -2176 655 1572 1269 -872 -3196
5993c196J167J684K480j048j559o20K233j150O55j428j58M0J278M08j103j348
$$ -3196 -2029 -345 2135 1087 -472 -1092 1141 -9 646 -782 -940 -900 378 786 -317 -1665
6009a665R68J360O62j440p28n59K184J232r63k689p08J958K091p2k771p41R58
$$ -1665 -697 663 1325 -115 -843 -1402 782 2014 1051 -1638 -2346 -388 1703 1631 -1140 -1881 -923
6026i23J935K154k046k537j512K152L784n04k484k899o39M523J851l86l789p96
$$ -923 1012 3166 1120 -1417 -2929 -777 3007 2503 19 -2880 -3519 1004 2855 2469 -1320 -2116
6042b116R38L638m28j082l151j296M182K693j373k237k048Q75K782O98k989n94
$$ -2116 -1178 2460 2032 950 -2201 -3497 685 3378 2005 -232 -2280 -1405 1377 2075 -914 -1508
6058a508j171L675J258j061k189q67J462M16K724k353j552K17P80Q83R6j891J35
$$ -1508 -2679 996 2254 1193 -996 -1863 -401 15 2739 386 -1166 -949 -169 714 810 -1081 -946
6075i46R31M16j5l77n10MK303k02k373l11o7K308N80q16k307q12K660J314q30
$$ -946 -15 401 386 9 -501 -497 1806 1604 -769 -1080 -1147 1161 1741 925 -1382 -2194 466 1780 950
6094I50k616j301J569L054o20o00l209n39K555L560o21k908j585O84K810Q07j756
$$ 950 -1666 -2967 -1398 1656 1036 436 -2773 -3312 -757 2803 2182 -726 -2311 -1627 1183 1990 234
6111B34j788o71J641K670P60l903j122n18K734K582n04l063k449K548L030p00
$$ 234 -1554 -2225 -584 2086 2846 -1057 -2179 -2697 37 2619 2115 -948 -3397 -849 2181 1481
6127A481k062j564Q53J840K337k189j752m88O86P45J512j047j310J384J081M20
$$ 1481 -581 -2145 -1292 548 2885 696 -1056 -1544 -858 -113 1399 352 -958 426 1507 1927
6143A927k482m49p34N33K594j084m96K94j92J391p03j818j206J967J663N33r98
$$ 1927 -555 -1004 -1738 -1205 1389 305 -191 103 -89 1302 599 -1219 -2425 -458 1205 1738 740
6160G40k308j17K108Q65m54k901l41K133J914R91l252j654P85J990K112m99k557
$$ 740 -1568 -1685 423 1288 834 -2067 -2408 -275 1639 2630 -622 -2276 -1491 499 2611 2112 -445
6177d45l227K886J784N12k063k130M17K325K669jl361k592L88L814k70q8q65k333
$$ -445 -3672 -786 998 1510 -553 -2683 -2266 59 2728 2727 -634 -3226 -2838 976 706 618 -247 -2580
6195b580L018K229j022q88j864l96K510J194k094M61j989J540R96K9j736o18Q89
$$ -2580 438 2667 1645 757 -1107 -1503 1007 2201 107 568 -1421 119 1115 1144 -592 -1210 -321
6212c21J071q1p97j680P36J454O98j182J8p02K097j009Q8k081j225L141J987l05
$$ -321 750 669 -128 -1808 -1072 382 1080 -102 -84 -786 1311 302 390 -1691 -2916 225 2212 1907
6230A907j004k489K50K516L43j670j583Q75J686K326j340j029k492J62K636R15
$$ 1907 903 -1586 -1336 1180 1523 -147 -1730 -855 831 3157 1817 788 -1704 -1542 1094 2009
6246B009j547j966r29K259J242P46j418k533M93J843L489q06l394j494J968J446
$$ 2009 462 -1504 -2433 -174 1068 1814 396 -2137 -1644 199 3688 2882 -512 -2006 -38 1408
6262A408N96k463n69Q2J321J596j634p64k821K314J560J128K40k813n77J435J112
$$ 1408 2004 -459 -1028 -946 375 1971 337 -427 -3248 -934 626 1754 1994 -819 -1396 39 1151
6279A151m41j802o08J341J144O46j465o53M53Q85O49n64k124N17Q19K189k543
$$ 1151 710 -1092 -1700 -359 785 1431 -34 -687 -234 651 1300 736 -1388 -871 -52 2137 -406
6296d06q32n99J142K059J07j528k348K489P22J192j925k495k47K897K035Q44l483
$$ -406 -1238 -1837 -695 1364 1471 -57 -2405 84 806 1998 73 -2422 -2669 228 2263 3107 -376
6313c76k354J644K694Q87k069j779m33J475K904n32l481j148J183J890J171M24
$$ -376 -2730 -1086 1608 2495 426 -1353 -1786 -311 2593 2061 -1420 -2568 -1385 505 1676 2100
6329B100l269j386K417J795j399r99j669J890J463K114j296l471J32J298J998
$$ 2100 -1169 -2555 -138 1657 258 -741 -2410 -520 943 3057 1761 -1710 -1578 -280 1718
6344A718l53j869K62j86J407n20p59p24q74K689k25m98J052n14k51L07M3l25j308
$$ 1718 1365 -504 -242 -428 979 459 -300 -1024 -1898 791 566 68 1120 606 355 662 705 380 -928
6363i28p86K868O68k084k71j502K851J069j735n91j530J799J830l15j791j175
$$ -928 -1714 1154 1822 -262 -533 -2035 816 1885 150 -441 -1971 -172 1658 1343 -448 -1623
6379a623J3K082J730n66k682j931L019L02J448k120k307O98K343J714o53k051
$$ -1623 -1610 472 2202 1636 -1046 -2977 42 344 1792 -328 -2635 -1937 406 2120 1467 -584
6395e84r86M48K503J70j436j483M43J682O95j522n7j242K75K530J006j866j457
$$ -584 -1570 -1122 1381 1551 115 -1368 -925 757 1452 -70 -127 -1369 -1094 1436 2442 576 -881
6412h81m5J701q3L37j142j284J227J331L87j328n80j334K637Q86r57k134J091
$$ -881 -926 775 692 1029 -113 -1397 -170 1161 1548 220 -360 -1694 943 1829 872 -1262 -171
6429a71n5l96R78j172J87P4J296p18k05n97j22K484q50j027N81r99J028R38n45
$$ -171 -226 -622 356 -816 -629 -555 741 23 -182 -779 -901 1583 733 -294 287 -712 316 1254 709
6448G09j96k072k28K395K224j605l033q57K647J779M60k442k777K091J293K009
$$ 709 513 -1559 -1787 608 2832 1227 -1806 -2663 -16 1763 2223 -219 -2996 -905 388 2397
6464B397l65l029j496J839K035k38j010j865M93J979J599j643j968o63J966K179
$$ 2397 2032 -997 -2493 -654 1381 1143 133 -1732 -1239 740 2339 696 -1272 -1935 31 2210
6480B210k022K25j844J79K610%j202j574k74K070K39P18j466r87L01M28P08l18
$$ 2210 188 413 -1431 -1252 1358 1358 156 -1418 -1692 378 617 1335 -131 -1118 -817 -389 319 1
6498Ak182Q10Q57J657J74k310j312J700J074j28k00j617Q49L75J112k79k544j14
$$ 1 -2181 -1371 -514 1143 1317 -993 -2305 -605 469 341 141 -1476 -627 -252 860 581 -1963 -2077
6516b077K309R52n96m61j385K31J316J321j212j165r34P50L172j008r25k566o56
$$ -2077 232 1184 588 127 -1258 -1027 289 1610 398 -767 -1701 -951 2221 1213 288 -2278 -2934
6533b934L850M91q29k438N74Q80J178l16o49j991K269L33J875k366r50j15J083
$$ -2934 916 1407 578 -1860 -1286 -406 772 456 -193 -2184 85 418 2293 -73 -1023 -1138 -55
6550e5J708j334n4j876J290Q17N84j102r49Q36o99Q16J770p08j661j092K804K90
$$ -55 1653 319 265 -1611 -321 496 1080 -22 -971 -135 -834 -18 1752 1044 -617 -1709 1095 1385
6568A385k443L21j07K661n69j087n53p15J202O71L58k014O10k99K131j101M87
$$ 1385 -1058 -737 -844 1817 1248 161 -392 -1107 95 766 1124 -890 -280 -579 1552 451 938
6585I38k585P24O27K919j415j630K63k74J505L12l56k083J72J605O71j71k510
$$ 938 -1647 -923 -296 2623 1208 -422 -159 -433 1072 1384 1028 -1055 -883 722 1393 1222 -1288
6602a288j340K572J185k15P9k066n15L193j883K131j900j455N85J463J469J05
$$ -1288 -2628 -56 1129 914 993 -1073 -1588 1605 -278 1853 -47 -1502 -917 546 2015 2120
6618B120k168j185J036J272j926K26mJ160O8Q02j548j535J737P76l7o41o83n4
$$ 2120 -48 -1233 -197 1075 -851 -625 -629 531 599 1401 -147 -1682 55 831 794 153 -530 -584
6636e84J275J009n89j314q78P82J076K41k56k873J484O78J863k381q31r6N89J476
$$ -584 691 1700 1111 -203 -1081 -299 777 1018 762 -2111 -627 51 1914 -467 -1298 -1394 -805 671
6654F71J346j116k493j14J768K100j109q86j864J667J947o24j595j125K51J062
$$ 671 2017 901 -1592 -1706 62 2162 1053 167 -1697 -30 1917 1293 -302 -1427 -1176 -114
6670a14K156j462k175M75P91N79P73j962N12R90L74l02M86j793nj085K972N06
$$ -114 2042 580 -1595 -1120 -329 250 1023 -939 -427 563 937 635 1121 -672 -677 -1762 1210 1716
6688A716j796r97O92Q12o8K9j877L92J347M73J449k738k58J32R52M44o67j546
$$ 1716 -80 -1077 -385 427 359 388 -1489 -1097 250 723 2172 -566 -824 -692 260 704 37 -1509
6706a509M77J373R62j03j543p54P59J422j62q01r01k74K254R3j321r02j000J714
$$ -1509 -1032 341 1303 1200 -343 -1097 -338 1084 922 121 -780 -1054 1200 1293 -28 -930 -1930 -216
6724b16J704l10j152j281J021J044l73p05O52j494O97Q53J424j988k225P09J266
$$ -216 1488 1178 26 -1255 -234 810 437 -268 384 -1110 -413 440 1864 -124 -2349 -1640 -374
6741c74K127j059r11j0l71R38L10j651n29O74J212l35n73k13q03J345J889j767
$$ -374 1753 694 -217 -227 -598 340 650 -1001 -1530 -856 356 21 -552 -765 -1568 -223 1666 -101
6759a01p26n26j27K155M82j482j382J444J70J147n36q93L62k86N81L77N37l570
$$ -101 -827 -1353 -1480 675 1157 -325 -1707 -263 -93 1054 518 -375 -13 -299 282 659 1196 -2374
6777b374J766Q19J316j409j420Q13o92K338k37j998O27m87K434M15j488k148Q25
$$ -2374 -608 211 1527 118 -1302 -489 -1181 1157 920 -1078 -451 -938 1496 1911 423 -1725 -900
6794i00Q02J238N43k107q23N35J397q4p62k006Q37J876J73Q12j741o84K16k3J622
$$ -900 -98 1140 1683 -424 -1247 -712 685 601 -161 -2167 -1330 546 719 1531 -210 -894 -678 -701 921
6813I21j342n39J45J259P08j227n91p77m67J847J028j339p16L00J115M48q76k79
$$ 921 -421 -960 -815 444 1152 -75 -666 -1443 -1910 -63 965 -374 -1090 -790 325 773 -103 -382
6831c82j316K592j8j90p79M2q4Q10k34q82N83r72J243P28j017j443J048J84Q60
$$ -382 -1698 894 876 686 -93 -51 -135 675 441 -441 142 -830 413 1141 124 -1319 -271 -87 773
6850G73m44M63j346l29n7K159K3k195P83j077K402O80k212O35j846K128K88j98
$$ 773 329 792 -554 -883 -940 1219 1242 -953 -170 -1247 1155 1835 -377 258 -1588 540 828 630
6868F30n80j534J251J038R06j320k307J164J728P19r68j142q32J245J536j120
$$ 630 50 -1484 -233 805 1711 391 -1916 -752 976 1695 727 -415 -1247 -2 1534 414
6884D14l40j751J70J955J53J007k396p10K036M26m49k23j305N30l98J853r92m01
$$ 414 74 -1677 -1507 448 601 1608 -788 -1498 538 964 515 292 -1013 -483 -881 972 -20 -421
6902d21q92P95J967j670L12o1kJ019j338K15m76j88J746M36o8k176o27J191J255
$$ -421 -1313 -518 1449 -221 91 30 28 1047 -291 -76 -552 -740 1006 1442 1374 -802 -1429 -238 1017
6921A017l88r28l23O3P70J260j394p81j394J606J339o50j6j229J344j694J952
$$ 1017 629 -299 -622 -559 211 1471 77 -704 -2098 -492 847 197 181 -1048 296 -1398 554
6938E54P62j761l31R82J090N42k462o80K60J123J941j833o39n13R72R90p36j821
$$ 554 1316 -445 -776 206 1296 1838 -624 -1304 -1044 79 2020 187 -452 -965 7 997 261 -1560
6956a560j19K650r88J747q43j246J43j05k8Q32j174l14L40J370k60o34j249L09
$$ -1560 -1679 971 -17 1730 887 -359 -216 -321 -349 483 -691 -1005 -665 705 445 -189 -1438 -1129
6974a129R66J002n4n78p45J07O10J68L45k272M93J656Q94j618n60o51P48J738
$$ -1129 -163 839 785 207 -538 -431 179 347 692 -1580 -1087 569 1463 -155 -715 -1366 -618 1120
6992A120j649P4q51J884R34n20j875j644K717J204P76j368j906N77K54J905j041
$$ 1120 -529 -455 -1306 578 1512 992 -883 -2527 190 1394 2170 802 -1104 -527 -273 1632 591
7009E91j215N98j198K079M56j494l40n35Q79L69J112r21j640l18K124R48k96j328
$$ 591 -624 -26 -1224 855 1311 -183 -523 -1058 -179 190 1302 381 -1259 -1577 547 1495 1199 -129
7027a29j900J321L260j190R6j819O71o60J585r04k44q42K21K550j125j700m41
$$ -129 -2029 -708 2552 1362 1458 -361 310 -350 1235 331 87 -755 -534 2016 891 -809 -1250
7044a250R70l9k56r40J042N7J279m10k87r69l36R29J429j340n74m19R55J056j33
$$ -1250 -280 -319 -575 -1515 -473 -416 863 453 166 -803 -1139 -210 1219 -121 -695 -1114 -159 897 764
7063G64p91j709O93J176J096k8n79k692Q99J570R83M6k010p30J620Q70n9j18k942
$$ 764 -27 -1736 -1043 133 1229 1201 622 -2070 -1171 399 1382 1428 -582 -1312 308 1178 1119 1001 -1941
7082a941L24K394L92q18j522N42J194O93r06p9j719J568q00J698l27p20j040P72
$$ -1941 -1617 777 1169 351 -1171 -629 565 1258 352 273 -1446 122 -678 1020 693 -27 -1067 -295
7100b95Q06o15L41o58M85o2J670j474j004p71K588R5k70l19p86P7J497j388j06
$$ -295 511 -104 237 -421 64 2 1672 198 -806 -1577 1011 1106 836 517 -269 -192 1305 -83 -189
7119a89o70R78M81J340q01j656l05K50J175O85j981q29M67J333K7j74q35J94P75
$$ -189 -859 119 600 1940 1139 -517 -822 -572 603 1288 -693 -1522 -1055 278 305 131 -704 -510 265
7138B65l07J412j998n23K74J170n30Q72k639Q81N03J191J218k781l25r57K948
$$ 265 -42 1370 -628 -1151 -877 293 -237 635 -2004 -1123 -620 571 1789 -992 -1317 -2274 674
7155F74J013k84j951K71n0N34N98j269r32K91J800J177j856n92n32Q60J097n86
$$ 674 1687 1403 -548 -277 -327 207 805 -464 -1396 -1105 695 1872 16 -576 -1108 -248 849 263
7173B63j82OJ1j60J051j674Q63j235j40K073l0q11r41K73J383Mq88k63k48J314
$$ 263 81 87 98 -62 989 -685 178 -1057 -1197 876 846 35 -906 -633 750 754 -134 -397 -645 669
7193F69MJ33j008o20R73O4o73J59r66J297K032r84j463N72q39J132O45j179j076
$$ 669 673 806 -202 -822 151 215 -458 -299 -1265 32 2064 1080 -383 189 -650 482 1127 -52 -1128
7212a128O14j21K206n95q99j457L00J101o78J563j030r64Q91k54J917r62j116
$$ -1128 -514 -635 1571 976 77 -1380 -1080 21 -657 906 -124 -1088 -197 -451 1466 504 -612
7229f12l5J09R37R69j220l71q63O24J747K05k089m9K603j603J6j207n05J396J022
$$ -612 -647 -538 399 1368 148 -223 -1086 -462 1285 1490 -599 -648 1955 352 368 -839 -1344 52 1074
7248A074L78p15j945O16k89J378n16q36P06P27K03m53Q7L41m07q03R33Qj86k85
$$ 1074 1452 737 -1208 -592 -881 497 -19 -855 -149 578 781 328 415 756 349 -454 479 487 301 16
7268A6M25l11o27m56O58K48N68R24k293k79o50J918J618j948j008k00P52K488
$$ 16 441 130 -497 -953 -295 -47 521 1445 -848 -1127 -1777 141 1759 -189 -1197 -1397 -645 1843
7286A843q0j763j358Q35J119O7j398R20r34J432o46O68r99j667R76Q88P35N14
$$ 1843 1763 0 -1358 -523 596 663 -735 185 -749 683 37 705 -294 -1961 -985 -97 638 1152
7304A152j024j341J235K68O30q60n10O83l39J407j080n99q6Q26L35m0o36r13M57
$$ 1152 128 -1213 22 290 920 60 -450 233 -106 1301 221 -378 -464 362 697 657 21 -892 -435
7323d35Q00K26o70j223J116K41k54P25q62P7K79L8q49N6k14K038j327K48P21j786
$$ -435 365 591 -79 -1302 -186 55 -199 526 -336 -259 20 58 -791 -735 -949 1089 -238 10 731 -1055
7343a055L71N51J418l24j452n79R95J009M26k598j067J05K375J330p12j159j518
$$ -1055 -684 -133 1285 961 -491 -1070 -75 934 1360 -1238 -2305 -2200 175 1505 793 -366 -1884
7360a884J128J672m38j05j212q61K852r40J344k201n02J010J446j434N00n26q93
$$ -1884 -756 916 478 373 -839 -1700 1152 212 1556 -645 -1147 -137 1309 -125 375 -151 -1044
7377a044O15R77k62j227N8M55M02P21K43p09p97M90p30J659J96j001M39p66P86
$$ -1044 -429 548 286 -941 -883 -428 -26 695 938 229 -568 -78 -808 851 1047 46 485 -281 505
7396E05j860J007O37K78N19j544m26J0R31M34q0n87j102J921n30Q00j136j97k15
$$ 505 -1355 -348 289 567 1086 -458 -884 -874 57 491 411 -176 -1278 643 113 913 -223 -420 -635
7415f35J592J092k696O03j226J731K11J27m33k229M26J719R10j76j063l61n88
$$ -635 957 2049 -647 -44 -1270 461 672 799 366 -1863 -1437 282 1192 1016 -47 -408 -996
7432i96J173k8m25n57J56R09J542j148j451K6J91J849j231J123k058M67K9R20
$$ -996 177 149 -276 -833 -677 232 1774 626 -825 -799 -608 1241 10 1133 -925 -458 -429 491
7450D91L94j511l75M74J492p3p55n71L03J923q09j072j52J31q24J455k76l89N05
$$ 491 885 -626 -1001 -527 965 892 137 -434 -131 1792 983 -89 -241 -110 -934 521 245 -144 361
7469C61L39j70p17L92m1p8o08J188o90k52r92J223O56M24r98j49L84J68m34o16
$$ 361 700 530 -187 205 164 86 -522 666 -24 -276 -1268 -45 611 1035 37 -112 272 440 6 -610
7489f10k09k3J093J252J70k925R01m54L07O99j42p36O51j72J203l31j488Q2L94
$$ -610 -819 -842 251 1503 1673 -1252 -351 -805 -498 201 59 -677 -26 -198 1005 674 -814 -732 -338
7508c38P26Q85M46j590l24J80M36O41r53j94O24l01O40j018j435l05O49J441l87
$$ -338 388 1273 1719 129 -195 -15 421 1062 109 -85 539 238 878 -140 -1575 -1880 -1231 210 -177
7527a77Q1J1R70j475J084j182j88J005J035r80J37N4j726J811r90Q34j441J015
$$ -177 -96 -85 885 -590 494 -688 -876 129 1164 184 321 375 -1351 460 -530 304 -1137 -122
7545a22k61Q60j97j096P60n75m13J501O46k103N54n7J261n7rj791j32J083J158
$$ -122 -383 477 280 -816 -56 -631 -1044 457 1103 -1000 -446 -503 758 701 692 -1099 -1231 -148 1010
7564A010J89k155K55N73J205p61o7j451j59J978O6k89m17l24k44J704j52l24m77
$$ 1010 1199 -956 -701 -128 1077 316 249 -1202 -1361 617 683 394 -23 -347 -591 1113 961 637 160
7583A60j438O67L60K265l257J184p04J686M39j033j997J108J326O43r51j56j114
$$ 160 -1278 -611 -251 2014 -1243 -59 -763 923 1362 329 -1668 -560 766 1409 458 302 -812
7600h12J98M71J326r76p26l90R49o13J109l85P70O24j046k35o83p1K22O0J530
$$ -812 -614 -143 1183 207 -519 -909 40 -573 536 151 921 1545 499 264 -419 -490 -268 -208 1322
7619A322j429l29m01J401o32J322j995J424j000M0J413j757L99p42J163R10J102
$$ 1322 -107 -436 -837 564 -68 1254 -741 683 -317 -277 1136 -621 -222 -964 199 1109 2211
7636B211k428q45P29K74J144n46j809N46j79J864j171n44k01K13Q83m48P51j822
$$ 2211 -217 -1062 -333 -59 1085 539 -1270 -724 -903 961 -210 -754 -955 -742 141 -307 444 -1378
7654a378l13L097j166Q02k182M20q84K039J054j367j318P07k75J311m34l67l34
$$ -1378 -1691 1406 240 1042 -1140 -720 -1604 435 1489 122 -1196 -489 -764 547 113 -254 -588
7671e88J352O87j418n2j194p4Q28L99L24q0K77j486J699q77N93j610J328J56j62
$$ -588 764 1451 33 -19 -1213 -1287 -459 -60 264 184 461 -1025 674 -203 390 -1220 108 264 102
7690A02N74k483K690J18M57j448k35m48P92J83M71r16o29J066O39k41J003k121
$$ 102 676 -1807 883 1001 1458 10 -225 -673 119 302 773 -143 -772 294 933 692 1695 -426
7708d26J35M95K75K45j299k28j074K765j96R97k148K02n88l37J780j073n12R57
$$ -426 -291 204 479 724 -575 -803 -1877 888 692 1689 -459 -257 -845 -1182 598 -475 -987 -30
7726c0l98J794L89j968m07R60O70k39j53j739J106P46k3j566R50k03K199j808
$$ -30 -428 1366 1755 -213 -620 340 1010 771 618 -1121 -15 731 708 -858 92 -111 2088 280
7744B80j0j45O77K97j926J576j812M65P44L16ro02J03JK30N13j104j7k45J892
$$ 280 270 125 802 1099 -827 749 -1063 -598 146 462 453 -149 -46 -45 185 698 -406 -423 -668 1224
7764A224k53k55n25j617J383M16O14M0j302l2j013K089k51r59n23k36Q63J767
$$ 1224 971 716 191 -1426 -43 373 987 1027 -275 -307 -1320 769 518 -441 -964 -1200 -337 1430
7782A430q77J69j397J737j13k07q57k068K052N70l0l08p05k56J033j64R67l21
$$ 1430 553 722 -675 1062 949 742 -115 -2183 -131 439 409 101 -604 -860 173 9 976 655
7800F55k46q30k90R35Q8J5j575K01J908o21j239N75Q1J32J145L10j859k59J76
$$ 655 409 -421 -711 224 312 327 -1248 -1047 861 240 -999 -424 -343 -211 934 1244 -615 -874 -698
7819f98J161O00k1j398L05Q8J18o47N82j2j012J845j48K33j391K40J195j525P72
$$ -698 463 1063 1042 -356 -51 37 155 -492 90 78 -934 911 763 996 -395 -155 1040 -485 287
7838B87n12n35k76J900ol70j099J583j090L16m81j384J335K19O63m85j77j93k47
$$ 287 -225 -760 -1036 864 858 488 -611 972 -118 198 -283 -1667 -332 -113 550 65 -112 -305 -552
7857e52J768k10j926L37K18q26J609j07j495J073M18Q47j061N25r10k18J369m6
$$ -552 1216 1006 -920 -583 -365 -1191 418 311 -1184 -111 307 1154 93 618 -292 -510 859 813
7875H13j002P20q88M80N87l91j046Q08k18j10P56j85n07J03J36J761j259j619
$$ 813 -189 531 -357 123 710 319 -727 81 -137 -247 509 324 -183 -80 56 1817 558 -1061
7893a061K61N15J26k85Q21n7n56Q0L01L43q57N67o86P69O23j766j184K322N1L16
$$ -1061 -800 -285 -159 -444 377 320 -236 -156 145 488 -369 198 -488 281 904 -862 -2046 276 327 643
7913F43p77q9p08J66J200l71M33K79j247K51J278m19q42o98Q26l35J160j095K9
$$ 643 -134 -223 -931 -765 435 64 497 776 -471 -220 1058 639 -203 -901 -75 -410 750 -345 -316
7932c16k22m9J111j06k46l46N24p33P16n44j29l00J259k28k53n30K4J370j06n82
$$ -316 -538 -587 524 418 172 -174 350 -383 333 -211 -340 -640 619 391 138 -392 -368 1002 896 314
7952C14m86q21J400J7n45j2N28O45k702J467J045q5o97Q30L14m27j133R0J132
$$ 314 -172 -993 407 424 -121 -133 395 1040 -1662 -195 850 765 68 898 1212 785 -348 -258 874
7971H74K16M19j547P16p69L91O22O07j444J73m74Q04M21j92j254M63Q65Q64o21
$$ 874 1090 1509 -38 678 -91 300 922 1529 85 258 -216 588 1009 817 -437 26 891 1755 1134
7990A134j257n49M31O7j22J130k00j165K10N46L15L59j368M32Q37j18j261J52
$$ 1134 -123 -672 -241 -174 -296 834 634 -531 -321 225 540 899 -469 -37 800 682 -579 -427
8008d27j40J576j06p99k26j515L85K091m65r22J067r81p52J595j016n06j17J753
$$ -427 -567 1009 903 104 -122 -1637 -1252 839 374 -548 519 -462 -1214 381 -635 -1141 -1258 495
8026D95q5n82J01n7l13P61J048j456o31K78j37J954n46j067k90L58J194o63m46
$$ 495 410 -172 -71 -128 -441 320 1368 -88 -719 -441 -578 1376 830 -237 -527 -169 1025 362 -84
8045h4r8l59L57J693r73j177q21L96J327P65o78k165J149J55L04O18m29L52J3
$$ -84 -182 -541 -184 1509 536 -641 -1462 -1066 261 1026 348 -1817 -668 -513 -209 409 -20 332 345
8064C45J074q68m73Q00m49K77j049q7J70k2K67P9m53m22J252l61k007L398j527
$$ 345 1419 551 78 878 429 706 -343 -430 -260 -282 -15 64 -389 -811 441 80 -1927 1471 -56
8083e6K45q36R47j00N30j166MN09Q40L79j171q52P04L70m32P63j458k49N59K589
$$ -56 189 -647 300 200 730 -436 -432 77 917 1296 125 -727 -23 347 -85 678 -780 -1029 -470 2119
8103B119j078o57j006r63J684J69L64l45j570J367k52R74k73j904P41J087j70
$$ 2119 1041 384 -622 -1585 99 268 632 287 -1283 84 -168 806 533 -1371 -630 457 287
8120B87J31j41j307J198N37j114M08j431J041J136K37O87j173j858J109L43J35
$$ 287 418 277 -1030 168 705 -409 -1 -1432 -391 745 982 1669 496 -1362 -253 90 225
8137B25J70j543L98J833r15l85l68o68K169o96j9l39J59m37m28J893j374O5Q41
$$ 225 395 -1148 -750 1083 168 -217 -585 -1253 916 220 201 -138 21 -416 -844 1049 -325 -260 581
8156E81L77m50r10J019o8j815R97J721j339l65K47N19N86k25m73r39O14J06Q31
$$ 581 958 508 -402 617 549 -1266 -269 1452 113 -252 -5 514 1100 875 402 -537 77 183 1014
8175A014j495P35o93p58J390j02j218O92j30R66Q39o63j269M75P80J26
$$ 1014 -481 254 -439 -1197 193 91 -1127 -435 -565 401 1240 577 -692 -217 563 689
8191F89
$$ Imaginary data points
##PAGE= N=2
##DATA TABLE= (X++(I..I)), XYDATA
0@%%%%%%%%%%%%%%%m4J08j28J28j28J44j98K46k74L22l83M41n08N91o78P71q81
$$ 0 0 0 0 0 0 0 0 0 0 0 0 0 0 0 0 -44 64 -64 64 -64 80 -118 128 -146 176 -207 234 -274 317 -361 410 -471
32d71J008j146J299j463J641j838K052k292K557k843L154l494L869m278M721n207
$$ -471 537 -609 690 -773 868 -970 1082 -1210 1347 -1496 1658 -1836 2033 -2245 2476 -2731
48b731N741o321O964p675Q458r326J0293j1392J2633j4055J5703j7623J9913k2708
$$ -2731 3010 -3311 3653 -4022 4436 -4890 5403 -5989 6644 -7411 8292 -9331 10582 -12126
62a2126K6190l0668L6667m5118N7963p9357J12831j484338m03786J524334J413081
$$ -12126 14064 -16604 20063 -25055 32908 -46449 66382 -1417956 -1821742 -297408 1115673
73A115673K75800j044063r61505n0419P32671M24991k99191o24184j06912M69307
$$ 1115673 1391473 347410 -614095 -664514 68157 493148 193957 -430227 -537139 -67832
83f7832M92180q8733m74471k73138K97138M94674J30869m17315n08830j05054
$$ -67832 424348 335615 -138856 -411994 -114856 379818 510687 93372 -415458 -520512
93e20512L87361M57780J34386k51068l47474j96688J8732J33904J71812J69956
$$ -520512 -133151 324629 459015 207947 -139527 -336215 -317483 -183579 -11767 158189
103A58189J19978n508j28930j65599r9349k8021j2135k759P9819J86699J62951
$$ 158189 278167 272659 143729 -21870 -121219 -149240 -161375 -164134 -84315 102384 265335
114B65335n6118k85114k70341M5845L74033L64728p899l97949m21990n2489L61459
$$ 265335 209217 -75897 -346238 -300393 73640 438368 430469 32520 -389470 -441959 -80500
125h0500M30399J03694l13300m56855k19278J81290M24803L40741L4810k37252
$$ -80500 349899 453593 140293 -316562 -535840 -354550 70253 410994 445804 208552
135B08552k83410j27863M0357Q1698K7372J4193Q7221J23556R54k12670k60660
$$ 208552 -74858 -202721 -162364 -80666 -53294 -39101 48120 171676 172630 -40040 -300700
146c00700j0369L22868L78100M3105l66920m13938l3164L75175L68967l9500l92127
$$ -300700 -311069 11799 389899 433004 66084 -347854 -381018 -5843 363124 323624 -68503
157f8503l15372P4784L28604J92869j10266j84790L9765K46864J24165k18953
$$ -68503 -383875 -309091 19513 212382 102116 -82674 -42909 203955 328120 109167
167A09167l77667j38988K47196L61282R2889k26432k49304k886J76117Q4252j00508
$$ 109167 -268500 -407488 -160292 200990 293879 67447 -181857 -184743 -8626 75626 -24882
178b4882p9044J49069K57538K0497l42069l89482R50M33869M04987q1954n08660
$$ -24882 -103926 45143 302681 323178 -18891 -408373 -407423 26446 431433 349479 -159181
189a59181l85921J51802N30352L64805j29174m00239k24792J22073K13385O68
$$ -159181 -545102 -393300 137052 501857 372683 -27556 -252348 -130275 83110 83778
199H3778j83477p6317J76736K27208l0867l17924k78133Q5252M06015L48052l3498
$$ 83778 -99699 -176016 720 227928 197061 -120863 -398996 -313744 92271 440323 406825
210D06825l63583l34338j5571K63383K51341O298k15164k09238j3238J62718J67187
$$ 406825 43242 -291096 -306667 -43284 208057 214355 -809 -210047 -223285 -60567 106620
221A06620K9456r4172q9048K1177J02534N9519o5161j44110r0719N1740J50162
$$ 106620 136076 41904 -47144 -25967 76567 136086 70925 -73185 -163904 -112164 37998
232C7998J03258n2175j62955j27994L6912J86869J91649M6307j32500k02062j18265
$$ 37998 141256 89081 -73874 -201868 -164956 21913 213562 259869 127369 -74693 -192958
$$ [...]
8191i2
##END NTUPLES=NMR FID
##END=
