##TITLE=1H_SAM_1.101
 CDCl3, 108 sc, 
 7.2.2019
##JCAMPDX= 6.0         $$ Bruker NMR JCAMP-DX V2.0
##DATA TYPE= NMR FID
##DATA CLASS= NTUPLES
##ORIGIN= UXNMR, Bruker Analytische Messtechnik GmbH
##OWNER= root
$$ XWIN-NMR		Version 3.5
$$ Thu Feb  7 14:19:07 2019 Russian Standard Time (UT+4h)  she@DPX200
##.OBSERVE FREQUENCY= 200.115
##.OBSERVE NUCLEUS= ^1H
##.DELAY= (6, 6)
##.ACQUISITION MODE= SIMULTANEOUS
##.ACQUISITION SCHEME= undefined
##.AVERAGES= 108
##.DIGITISER RES= 16
##SPECTROMETER/DATA SYSTEM= spect
##.PULSE SEQUENCE= zg30
##.SOLVENT NAME= CDCl3
##.SHIFT REFERENCE= (INTERNAL, CDCl3, 0, 15.7039)
##AUDIT TRAIL= $$ (NUMBER, WHEN, WHO, WHERE, WHAT)
$$ ##TITLE= Audit trail, XWIN-NMR		Version 3.5
$$ ##JCAMPDX= 5.01
$$ ##ORIGIN= Bruker BioSpin GmbH
$$ ##OWNER= she
$$ F:/spectra/data/she/nmr/H-F/1/audita.txt
$$ ##AUDIT TRAIL=  $$ (NUMBER, WHEN, WHO, WHERE, WHAT)
(   1,<2019-02-07 14:17:02.28 +0400>,<she>,<DPX200>,
      <continue with go, POWCHK disabled, PULCHK disabled
       configuration hash MD5:
       00 E9 B6 7A A2 85 ED C7 34 08 36 98 17 FE 4E 26
       data hash MD5: 16K
       A8 DB 7F 61 EB 65 B8 71 49 80 F7 8C 61 D2 BF 32>)
$$ ##END=
$$ 
$$ hash MD5
$$ 44 74 39 21 D7 67 C6 9E 63 65 28 51 4D C4 16 E1
##$RELAX= 
##$RELAX= 
##$RELAX= 
##$RELAX= 
##$RELAX= 
##$RELAX= 
$$ Bruker specific parameters
$$ --------------------------
##$DU= <F:/spectra>
##$EXPNO= 1
##$NAME= <H-F>
##$PROCNO= 1
##$TYPE= <nmr>
##$USER= <she>
##$AMP= (0..31)
100 100 100 100 100 100 100 100 100 100 100 100 100 100 100 100 100 100 
100 100 100 100 100 100 100 100 100 100 100 100 100 100 
##$AQSEQ= 0
##$AQ_mod= 1
##$AUNM= <au_zg>
##$AUTOPOS= <>
##$BF1= 200.13
##$BF2= 200.13
##$BF3= 200.13
##$BF4= 200.13
##$BF5= 200.13
##$BF6= 200.13
##$BF7= 200.13
##$BF8= 200.13
##$BYTORDA= 1
##$CFDGTYP= 0
##$CFRGTYP= 5
##$CHEMSTR= <none>
##$CNST= (0..31)
1 1 145 1 1 1 1 1 1 1 1 1 1 1 1 1 1 1 1 1 1 1 1 1 1 1 1 1 1 1 1 1 
##$CPDPRG= <>
##$CPDPRG1= <>
##$CPDPRG2= <>
##$CPDPRG3= <>
##$CPDPRG4= <mlev>
##$CPDPRG5= <mlev>
##$CPDPRG6= <mlev>
##$CPDPRG7= <mlev>
##$CPDPRG8= <mlev>
##$CPDPRGB= <>
##$CPDPRGT= <>
##$D= (0..31)
0 1.2 0 0 0 0 0 0 0 0 0 0.03 0 0 0 0 0 0 0 0 0 0 0 0 0 0 0 0 0 0 0 0 
##$DATE= 1549534382
##$DBL= (0..7)
120 120 120 120 120 120 120 120 
##$DBP= (0..7)
150 150 150 150 150 150 150 150 
##$DBP07= 0
##$DBPNAM0= <>
##$DBPNAM1= <>
##$DBPNAM2= <>
##$DBPNAM3= <>
##$DBPNAM4= <>
##$DBPNAM5= <>
##$DBPNAM6= <>
##$DBPNAM7= <>
##$DBPOAL= (0..7)
0.5 0.5 0.5 0.5 0.5 0.5 0.5 0.5 
##$DBPOFFS= (0..7)
0 0 0 0 0 0 0 0 
##$DE= 6
##$DECBNUC= <off>
##$DECIM= 2
##$DECNUC= <off>
##$DECSTAT= 4
##$DIGMOD= 1
##$DIGTYP= 9
##$DL= (0..7)
0 120 120 120 120 120 120 120 
##$DP= (0..7)
150 150 150 150 150 150 150 150 
##$DP07= 0
##$DPNAME0= <>
##$DPNAME1= <>
##$DPNAME2= <>
##$DPNAME3= <>
##$DPNAME4= <>
##$DPNAME5= <>
##$DPNAME6= <>
##$DPNAME7= <>
##$DPOAL= (0..7)
0.5 0.5 0.5 0.5 0.5 0.5 0.5 0.5 
##$DPOFFS= (0..7)
0 0 0 0 0 0 0 0 
##$DQDMODE= 0
##$DR= 16
##$DS= 0
##$DSLIST= <SSSSSSSSSSSSSSS>
##$DSPFIRM= 0
$$ [...]
##$SUBNAM2= <"">
##$SUBNAM3= <"">
##$SUBNAM4= <"">
##$SUBNAM5= <"">
##$SUBNAM6= <"">
##$SUBNAM7= <"">
##$SUBNAM8= <"">
##$SUBNAM9= <"">
##$SW= 254.9554414375
##$SWIBOX= (0..15)
0 0 2 0 0 0 0 0 0 0 0 0 0 0 0 0 
##$SW_h= 51020.4081632653
##$TD= 16384
##$TD0= 1
##$TE= 0
##$TE2= 300
##$TE3= 300
##$TEG= 300
##$TL= (0..7)
0 120 120 120 120 120 120 120 
##$TP= (0..7)
150 150 150 150 150 150 150 150 
##$TP07= 0
##$TPNAME0= <>
##$TPNAME1= <>
##$TPNAME2= <>
##$TPNAME3= <>
##$TPNAME4= <>
##$TPNAME5= <>
##$TPNAME6= <>
##$TPNAME7= <>
##$TPOAL= (0..7)
0.5 0.5 0.5 0.5 0.5 0.5 0.5 0.5 
##$TPOFFS= (0..7)
0 0 0 0 0 0 0 0 
##$TUNHIN= 0
##$TUNHOUT= 0
##$TUNXOUT= 0
##$USERA1= <user>
##$USERA2= <user>
##$USERA3= <user>
##$USERA4= <user>
##$USERA5= <user>
##$V9= 5
##$VALIST= <valist>
##$VCLIST= <CCCCCCCCCCCCCCC>
##$VD= 0
##$VDLIST= <DDDDDDDDDDDDDDD>
##$VPLIST= <PPPPPPPPPPPPPPP>
##$VTLIST= <TTTTTTTTTTTTTTT>
##$WBST= 1024
##$WBSW= 4
##$XGAIN= (0..3)
0 0 0 0 
##$XL= 0
##$YL= 0
##$YMAX_a= 206451
##$YMIN_a= -137356
##$ZGOPTNS= <>
##$ZL1= 120
##$ZL2= 120
##$ZL3= 120
##$ZL4= 120
##$ABSF1= 10
##$ABSF2= 0
##$ABSG= 5
##$ABSL= 3
##$ALPHA= 0
##$AQORDER= 0
##$ASSFAC= 0
##$ASSFACI= 0
##$ASSFACX= 0
##$ASSWID= 0
##$AUNMP= <proc_1d>
##$AZFE= 0.1
##$AZFW= 0.1
##$BCFW= 1
##$BC_mod= 2
##$BYTORDP= 1
##$COROFFS= 0
##$CY= 11.3945322036743
##$DATMOD= 1
##$DC= 2
##$DFILT= <>
##$DTYPP= 0
##$F1P= 18.9103706918063
##$F2P= -1.10871071338519
##$FCOR= 0.5
##$FTSIZE= 0
##$FT_mod= 4
##$GAMMA= 1
##$GB= 0.15
##$INTBC= 1
##$INTSCL= 1
##$ISEN= 128
##$LB= 0.24
##$LEV0= 0
##$LPBIN= 0
##$MAXI= 10000
##$MC2= 0
##$MEAN= 0
##$ME_mod= 0
##$MI= 1.114404
##$NCOEF= 0
##$NC_proc= 0
##$NLEV= 6
##$NOISF1= 3.799351
##$NOISF2= 2.8
##$NSP= 1
##$NTH_PI= 0
##$NZP= 0
##$OFFSET= 15.70392
##$PC= 1
##$PHC0= -8862.951
##$PHC1= 129.8001
##$PH_mod= 1
##$PKNL= yes
##$PPARMOD= 0
##$PSCAL= 0
##$PSIGN= 0
##$REVERSE= no
##$SF= 200.130013532006
##$SI= 16384
##$SIGF1= 3
##$SIGF2= 2
##$SINO= 400
##$SIOLD= 16384
##$SREGLST= <1H.CDCl3>
##$SSB= 0
##$STSI= 0
##$STSR= 0
##$SW_p= 3612.71676300578
##$SYMM= 0
##$S_DEV= 0
##$TDeff= 0
##$TDoff= 0
##$TI= <>
##$TILT= no
##$TM1= 0
##$TM2= 0
##$TOPLEV= 0
##$USERP1= <user>
##$USERP2= <user>
##$USERP3= <user>
##$USERP4= <user>
##$USERP5= <user>
##$WDW= 1
##$XDIM= 8192
##$YMAX_p= 0
##$YMIN_p= 0
$$ End of Bruker specific parameters
$$ ---------------------------------
##NTUPLES= NMR FID
##VAR_NAME=  TIME,          FID/REAL,        FID/IMAG
##SYMBOL=    X,             R,               I
##VAR_TYPE=  INDEPENDENT,   DEPENDENT,       DEPENDENT
##VAR_FORM=  AFFN,          ASDF,            ASDF
##VAR_DIM=   8192,          8192,            8192
##UNITS=     SECONDS,       ARBITRARY UNITS, ARBITRARY UNITS
##FACTOR=    1.96e-05,      1,               1
##FIRST=     0,             0,               0
##LAST=      0.1605436,     0,               0
##MIN=       0,             -137356,         0
##MAX=       0.1605436,     206451,          0
$$ Real data points
##PAGE= N=1
##DATA TABLE= (X++(R..R)), XYDATA
0 -14 6 -15 37 -66 90 -111 130 -155 185 -229 275 -323 380 -442 517 -593 685 -785 899 -1026 1160
21 1160 -1313 1479 -1666 1882 -2099 2355 -2638 2957 -3307 3709 -4155 4677 -5278 5980 -6814
36 -6814 7838 -9102 10739 -12942 16076 -20957 29653 -49734 148108 181961 -137356 49016
48 49016 9105 -40358 -1804 52668 -45203 -4437 33154 -4131 -23536 31802 -4501 -22562
60 -22562 4683 12741 -15075 2546 4139 -832 -804 7991 1194 -5949 -12600 4364 7248 -7844
74 -7844 3529 14803 -15688 -6780 20058 -6376 -15528 21248 -78 -26164 16774 13624 -23506
87 -23506 9135 21687 -22598 -3609 23816 -15483 -11727 24104 -5016 -16593 16442 1256
99 1256 -17516 10004 7186 -11797 3530 7282 -7142 124 2462 -2997 2994 371 -3286 5049
113 5049 -3066 -5327 9214 -877 -10120 11967 3294 -17058 9470 10193 -18592 4666 16766
126 16766 -17225 -5337 21465 -11257 -12185 21466 -3723 -17359 17218 4009 -18829 9634
138 9634 9254 -16744 3658 12061 -11147 -2609 9821 -6305 -3976 7684 -3147 -2722 2763 -1508
152 -1508 1405 2002 -4318 3498 2349 -7778 3603 5696 -10990 1696 11483 -11090 -2863 16012
166 16012 -9820 -11633 18874 -2777 -14975 16788 3764 -19597 10484 10696 -18780 3976 15989
179 15989 -15341 -2899 16472 -9558 -6715 15034 -3627 -9132 10039 -318 -8686 6665 1989
192 1989 -4453 4495 191 -4443 3162 -2123 -1138 6734 -3021 -4834 7620 -3607 -7279 10775 637
207 637 -11401 10163 3010 -15976 7638 9715 -14372 3281 13306 -13958 -4422 15576 -9465
220 -9465 -7807 16082 -5118 -11485 11592 507 -11448 9729 3114 -10535 4686 4074 -9119
233 -9119 3126 5540 -6480 2515 2345 -7303 2635 3282 -5479 5376 3464 -8865 3407 5512
247 5512 -8997 3043 9062 -10083 -1664 10846 -8947 -4876 13318 -4432 -9173 13254 -558
260 -558 -12772 11005 3886 -11762 7618 6004 -13177 3654 8382 -10177 156 8826 -7082
273 -7082 -2467 7502 -4694 -2422 6120 -3647 -1604 5042 -4645 -1605 6002 -5486 -753 7134 -6247
288 -6247 -3018 9772 -4884 -5845 12406 -3846 -10237 11480 1147 -11759 10083 5105 -14140
301 -14140 6861 9410 -13097 2106 12383 -11679 -2953 13591 -7330 -5953 12091 -3973 -8362
314 -8362 9586 66 -7713 6676 1360 -7382 6455 1546 -5225 4237 1238 -6180 5135 481
328 481 -6043 5780 1016 -7197 5737 1648 -9571 5592 5329 -11263 3777 8876 -11186 1103
342 1103 11425 -10205 -2980 13865 -6491 -8227 12464 -2321 -10532 10604 1302 -11428 8161
355 8161 3815 -11015 4154 6504 -9198 2889 6851 -8159 1202 5580 -5791 928 5576 -6068
369 -6068 1190 5313 -6704 700 6565 -7243 -743 8099 -6722 -3489 10004 -6375 -5873 11713
383 11713 -4043 -9002 11098 -52 -11091 9799 3155 -11883 6536 6585 -11960 2614 9486
396 9486 -10419 -371 9348 -7515 -2834 9299 -4952 -3067 9101 -4002 -3658 7169 -2717
409 -2717 -3489 7260 -2735 -4497 7495 -2846 -4639 7966 -1710 -7603 8980 -1111 -9209 7956
423 7956 2553 -10875 7414 4750 -12903 4488 8382 -11994 1325 11186 -10066 -2577 11943
436 11943 -7476 -6438 11455 -3284 -7023 9007 -1315 -7820 8450 1857 -7436 6233 1925
449 1925 -8080 4591 3060 -7187 3802 3294 -6350 4171 3481 -8133 3455 4563 -8945 3433
463 3433 6718 -8705 1689 8196 -8653 -881 10050 -7282 -4299 12055 -5091 -7521 11457
476 11457 -1797 -9469 10719 -182 -10616 7734 3584 -11053 4189 5207 -9073 2021 6275
489 6275 -9009 949 6537 -6872 792 6844 -5864 -437 6508 -6400 -1988 6837 -5032 -2494
503 -2494 8235 -5281 -4093 9215 -5065 -7245 9251 -1285 -8177 9286 567 -10424 7015
516 7015 3465 -9643 6118 5813 -10224 1920 8000 -8386 603 8350 -7532 -1769 8345 -6275
530 -6275 -3949 8309 -4093 -4881 7658 -2882 -5403 8225 -1401 -5285 8044 -590 -6938 6915
544 6915 29 -6896 7447 2509 -9067 6339 3804 -10940 4798 6420 -10387 1940 8431
557 8431 -9984 -673 9883 -7720 -3510 9966 -5585 -4945 10006 -3002 -5491 8479 -1034
570 -1034 -8187 6420 703 -7200 7081 1970 -7103 4842 2969 -7625 4013 3974 -7900 3073
584 3073 3894 -7528 2160 5629 -7872 806 6677 -7194 -488 9425 -7357 -3257 9158 -5335
598 -5335 -5017 9700 -2784 -8169 9585 72 -8632 8127 1150 -9709 5808 3645 -8513 3956
612 3956 5314 -7383 1511 6610 -7317 191 6539 -5551 -1236 6769 -5985 -1190 7223 -4979
626 -4979 -2380 8258 -4205 -3374 8395 -4443 -5555 9352 -1341 -6855 8359 214 -8485 6984
640 6984 2549 -9133 4922 5012 -9196 3329 6402 -8514 1335 7419 -7429 -756 9113 -6756
654 -6756 -2964 8134 -4402 -3759 7454 -3034 -4517 7258 -2901 -5263 6205 -966 -6185 6031
668 6031 -378 -6705 6601 1304 -7308 4930 2506 -7751 4437 4024 -8188 2304 6894 -8313
682 -8313 512 7934 -8150 -1881 8481 -4627 -2689 7887 -5087 -4606 7900 -2094 -6806 7160
696 7160 -89 -7699 6226 1080 -7650 4885 2750 -7993 4532 2441 -6883 3726 4235 -7655
710 -7655 2092 4388 -6573 1042 6735 -5808 -1053 7655 -6563 -2398 6499 -4186 -3976 8287
724 8287 -2448 -5614 7339 -1386 -6173 6519 1581 -7582 5540 2146 -8457 4662 3644 -8448
738 -8448 2980 4198 -7957 1792 5692 -6765 995 7013 -6032 -1155 6832 -5102 -2206 8182
752 8182 -3355 -4141 7328 -1998 -5147 7284 -845 -6093 6552 -36 -6459 5349 1894 -7150
766 -7150 4071 3268 -8181 3187 5753 -8169 1203 4857 -6489 354 6178 -6287 -754 7059
780 7059 -5057 -2501 8409 -4804 -3483 8328 -2784 -5471 6793 -1478 -6028 7325 143
793 143 -6972 5427 1978 -7892 4212 3333 -8109 3106 5268 -6953 2371 5254 -7816 -386
807 -386 6157 -6001 -1353 6798 -5007 -2718 7215 -4459 -3976 6953 -2012 -4255 6796 -1227
821 -1227 -6533 6536 446 -6089 5734 1593 -6658 3663 2981 -7151 2719 4327 -6977 1329
835 1329 5375 -7906 980 6836 -6805 -1591 8191 -5555 -2570 7562 -3694 -3762 7882 -2736
849 -2736 -5528 6590 -1055 -5763 6428 869 -6870 5440 756 -6878 3681 2726 -7179 4166
863 4166 3190 -7162 2249 4970 -6426 1100 6209 -6206 -1122 7052 -4687 -3269 7814 -4151
877 -4151 -3910 7349 -3139 -5790 7393 -2213 -6057 7511 414 -7328 5876 1347 -6806 4363
891 4363 3466 -6738 2461 3751 -7129 2393 5763 -6149 755 5644 -5146 -402 6696 -5576
905 -5576 -2314 6149 -4490 -3657 6976 -2925 -4103 7938 -3187 -5991 6730 -670 -7086 6152
919 6152 1519 -6771 3935 3402 -7949 4163 4889 -7454 2601 6193 -7575 221 6042 -5941
933 -5941 -996 6074 -4614 -2982 6670 -3613 -3795 7006 -2556 -4236 6770 -1431 -5912 5334
947 5334 -1160 -6322 5043 642 -6368 4661 1971 -7476 4272 4266 -7196 2694 5340 -5909 736
962 736 5357 -6161 -785 6947 -5965 -2301 6921 -3451 -3843 6189 -2532 -4854 7031 -1709
976 -1709 -6280 6698 -381 -6530 5413 -29 -6723 4490 1973 -6876 4179 3293 -6877 1175
990 1175 5323 -6757 1098 6008 -5822 -18 6843 -6291 -1768 7052 -4360 -3495 7594 -3028
1004 -3028 -4620 6426 -1463 -5886 6458 107 -6237 5322 1655 -6459 4650 2720 -6551 4370
1018 4370 4279 -6396 2061 5250 -5172 932 5333 -6222 542 6011 -5346 -988 6570 -4532
1032 -4532 -3241 6720 -3406 -3969 7221 -2073 -5006 6387 -829 -7665 5754 959 -7727 5055
1046 5055 2340 -6873 3557 3916 -7217 2507 4719 -6746 386 5506 -6101 -825 5593 -4918
1060 -4918 -1805 5934 -2526 -3479 6171 -3172 -3585 6101 -1520 -4967 5801 -2283 -5601 5753 -216
1075 -216 -5126 4805 1475 -6326 3374 2105 -7279 2968 3782 -7203 1648 5907 -6631 -46 6190
1090 6190 -5902 -1820 5909 -4461 -2875 7383 -3406 -4595 7132 -1505 -5045 5964 233
1103 233 -5680 4216 315 -6285 4184 1611 -5910 2938 2851 -5356 3262 4073 -6367 2297 4166
1118 4166 -5692 89 6083 -5368 -1274 6108 -5243 -2118 6627 -4300 -3606 6935 -2429 -5642
1132 -5642 6472 -215 -5687 5792 883 -7988 4343 2387 -6785 2550 3676 -6116 2451 3947
1146 3947 -6227 277 4759 -4498 368 5295 -4087 -2104 4667 -4086 -1150 5255 -3622 -2159 6059
1161 6059 -2569 -4208 5807 -1343 -5172 5944 170 -5620 5045 540 -6354 4459 3586 -7597
1175 -7597 3285 4454 -7106 1199 5790 -5498 86 6520 -5093 -926 6664 -3919 -2355 5458
1189 5458 -2525 -3709 6026 -739 -3390 4661 226 -3971 5141 357 -5039 4263 1159 -5397 3874
1204 3874 2207 -5487 3031 3265 -6028 1952 4743 -5852 218 5055 -5634 -1025 6638 -4972
1218 -4972 -2479 6919 -3737 -3682 6571 -1923 -3770 4993 -770 -5140 4796 145 -6182 4227 2142
1233 2142 -6647 3712 3114 -5260 2069 4016 -5118 2042 4267 -5681 1273 4822 -4841 472 5566
1248 5566 -4818 -1985 4574 -4221 -2566 5995 -2508 -2967 5377 -2183 -4747 6475 1160 -5380 5099
1263 5099 1989 -6371 3027 2859 -6889 2056 4004 -5229 1082 4730 -4662 292 4659 -4179 -134
1278 -134 4950 -4136 -2328 4508 -3312 -2672 4900 -2798 -2840 5042 -1539 -3962 5315 -1558 -5667 5420
1294 5420 855 -5635 3527 2413 -6117 2791 3489 -5370 2031 6008 -6017 1078 5126 -5009 -506
1309 -506 6406 -2981 -2130 5528 -2717 -4574 4667 -1271 -3563 4602 -182 -4273 5281 177 -4830
1324 -4830 3972 239 -4773 2768 2075 -4707 2762 2297 -5028 1693 3380 -5934 1386 5237 -4927
1339 -4927 -105 6393 -4285 -1719 5863 -3893 -3687 6531 -1544 -4770 5935 -1347 -4750 4832
1353 4832 383 -5448 3555 2261 -5868 2024 2320 -4074 2320 2428 -4167 2372 3890 -4653 1171
1368 1171 3979 -3910 -279 4083 -3949 -417 6020 -3776 -2158 5052 -2576 -2818 6107 -1759 -5493
1383 -5493 5653 -72 -5646 5744 1211 -6252 4347 2534 -6324 2748 3436 -5699 747 4290
1397 4290 -4685 -532 4621 -2880 -1705 4723 -3423 -1730 4903 -2238 -1834 4804 -2275 -3036 4226
1412 4226 -2072 -3137 4361 -1008 -3920 5234 -153 -4345 4324 1561 -5989 4327 3064 -6154 1686
1427 1686 4286 -6169 654 4568 -5351 -989 5339 -3742 -2163 5135 -3163 -3641 4895 -1165 -4847
1442 -4847 4499 -176 -4794 3904 -182 -4150 4352 1104 -4172 3653 883 -4729 2548 1384 -5534
1457 -5534 2761 2763 -4931 1882 2856 -6607 763 5104 -4968 -628 6793 -4025 -2603 5993 -2799
1472 -2799 -3853 5960 -656 -5135 5926 -97 -5746 4734 1842 -6068 3558 2134 -5481 2110
1486 2110 4011 -4603 375 3451 -4423 953 3901 -4261 -179 3794 -4838 32 4714 -3393 -1231
1501 -1231 5762 -2597 -1566 5689 -2861 -3688 5500 -579 -4414 5899 925 -5612 5138 1931 -5431
1516 -5431 2778 4052 -5334 1377 3601 -4888 422 4926 -5339 -861 5288 -3641 -1641 4968 -2276
1531 -2276 -2155 4634 -1696 -2479 5062 -2198 -2185 4607 -1039 -3542 4694 -103 -5791 4980 442 -5272
1547 -5272 3411 2803 -6074 2362 2670 -6022 2143 4588 -5212 -778 5344 -3093 -986 6073 -2917
1562 -2917 -3216 4898 -1482 -3592 5369 -1318 -3992 4373 -726 -4334 2845 1030 -4030 3207 1696
1577 1696 -3459 3420 1295 -4402 2460 2160 -5016 1210 3318 -5427 776 4891 -4599 -603 5827
1592 5827 -3989 -1286 6119 -3423 -1909 5786 -1603 -4452 5554 -818 -5115 4378 597 -4917 3836
1607 3836 2350 -4413 2474 2341 -5470 910 3857 -4562 552 3542 -3956 -1230 3269 -3150 -189
1622 -189 3851 -3682 -665 3927 -3206 -1238 5300 -2051 -2353 4861 -1462 -4485 4518 -316 -5282
1637 -5282 5850 821 -5909 3518 3011 -6505 2075 3761 -5655 595 4611 -4482 -1253 4907 -4266
1652 -4266 -1404 4455 -2664 -1560 4458 -2073 -3350 3513 -832 -2580 3821 -1616 -2915 3519 -451
1667 -451 -4091 4029 718 -3932 4320 1339 -4652 2979 1704 -5067 2781 3171 -5749 448 4845
1682 4845 -4833 -630 5906 -3224 -1879 5576 -2783 -3680 4937 -1651 -4678 4083 -859 -3998 2391
1697 2391 122 -4072 3545 1801 -3217 2447 948 -3262 1276 1160 -3988 1190 2376 -4168 1519
1712 1519 2835 -3587 428 3826 -4668 -1123 4412 -3130 -2131 5802 -3213 -4150 5164 -999 -3850
1727 -3850 5383 515 -5440 4129 1263 -5469 2599 3126 -4570 2322 3210 -4442 229 3271 -4031
1742 -4031 -714 4166 -2983 -1131 2399 -3120 -358 3464 -1309 -1318 4134 -991 -1864 4493 -1552 -2514
1758 -2514 3740 553 -4205 3433 552 -4649 3215 1494 -3936 2969 3534 -5668 1229 4294 -4849
1773 -4849 257 4489 -3833 -1530 3899 -2371 -1311 4803 -2141 -2815 3335 -1233 -3164 3345 194
1788 194 -3605 2815 -334 -3464 3116 54 -3659 3060 625 -3379 3197 1177 -4364 2050 2711
1803 2711 -5085 1052 3002 -4088 437 4524 -3928 -158 5576 -3407 -2151 5443 -1837 -4384 4669
1818 4669 -655 -3627 3786 1256 -4093 2330 1770 -4648 1999 1969 -4603 1404 2363 -3680 740 1579
1834 1579 -3264 253 3098 -3240 -179 3193 -3363 -350 3063 -3373 -1481 5028 -1953 -2847 5401
1849 5401 -1620 -3550 4350 -684 -3188 4979 682 -4155 3197 1637 -5278 2615 2656 -4738 695
1864 695 3381 -3946 -345 3462 -3143 -1858 4082 -2697 -432 4366 -2252 -1816 3860 -1133 -2289
1879 -2289 2778 -1416 -1935 3707 -511 -3252 4112 313 -3953 2667 1417 -5170 2503 2786 -4859
1894 -4859 1477 3728 -4153 291 4058 -3621 -1168 4754 -3264 -1336 5044 -2099 -2205 3995 -678
1909 -678 -2473 4052 -113 -3615 3200 -469 -3441 3061 -164 -3429 1427 1246 -4325 859 1955
1924 1955 -3560 1659 2113 -4451 1487 2596 -4566 -524 4305 -3888 -1126 4739 -2565 -2055 4247
1939 4247 -2162 -2953 5142 -1510 -4005 3750 495 -3912 2450 1184 -4049 2595 1464 -4242 1460
1954 1460 2208 -3808 1216 2713 -3750 1242 2482 -2776 607 3540 -3302 -1113 3509 -2391 -766
1969 -766 4003 -2292 -2142 4089 -1677 -2186 4841 -1305 -4374 3271 419 -4829 3238 2648 -3862 2470
1985 2470 3034 -4692 1275 2857 -3930 14 4631 -3620 -395 3649 -3973 -1235 3162 -2072 -1686
2000 -1686 3117 -1546 -2147 3445 -1261 -2187 3598 -446 -2233 2591 -193 -3709 3010 642 -3475
2015 -3475 3001 1626 -4832 1292 1894 -4010 909 3827 -3863 -197 4228 -3643 -836 4533 -2657
2030 -2657 -974 4044 -2708 -3410 4729 -916 -2318 2701 133 -3758 1958 1102 -3932 2027 1292 -3054
2046 -3054 2229 1288 -4254 1511 1752 -3688 281 2345 -3026 618 3641 -3098 -287 4372 -3273
2061 -3273 -1674 4715 -2113 -2115 5292 -898 -4038 4021 -1060 -3632 4147 1470 -3775 2708 1229 -4986
2077 -4986 1833 1955 -3767 1007 2936 -2950 463 2658 -3214 717 3009 -2191 -516 2824 -1986
2092 -1986 -1527 4185 -1557 -2071 4708 -922 -2468 3716 -798 -2534 4015 -909 -4321 4042 682
2107 682 -4582 2316 2292 -4251 2235 2325 -4034 951 3281 -4053 196 3439 -3370 -800 3837 -2174
2123 -2174 -2296 4254 -946 -2914 2729 -1251 -2319 2703 -174 -3035 3225 -22 -2628 3251 993
2138 993 -3749 2113 772 -2787 1803 1668 -4420 1766 1640 -4663 1501 2923 -3627 197 4010 -2652
2154 -2652 -1631 3520 -1274 -2357 4502 -1154 -2854 3841 -798 -4131 3282 -200 -2584 1884 750
2169 750 -2885 2016 947 -2815 1309 2020 -3241 386 2616 -2481 148 3321 -3220 -111 3433
2184 3433 -2601 -562 3392 -2130 -1179 3704 -1194 -2908 3820 258 -3247 3046 -516 -3369 2978
2199 2978 958 -3585 2122 2235 -3295 1520 2195 -3846 556 2603 -3918 559 2065 -1806 -808 2861
2215 2861 -2774 -479 3765 -1486 -1521 2593 -1167 -1813 4287 -1315 -2840 2508 27 -3136 2843 427
2231 427 -3980 3235 1431 -3383 2821 2205 -4170 1140 1917 -3964 1025 3160 -3560 -715 2198 -3289
2247 -3289 97 3002 -2634 -1953 2972 -800 -2785 3587 -767 -2919 2693 339 -2630 2125 132
2262 132 -2394 1920 1376 -3493 1759 2565 -2778 1068 2726 -2512 804 2376 -2862 -114 3123 -2928
2278 -2928 270 3550 -2255 -1809 3990 -1506 -2602 3540 -1338 -2608 2847 -53 -3258 2437 926
2293 926 -3673 2189 975 -3191 1532 2259 -2844 524 1900 -3963 447 1752 -2090 481 2592
2308 2592 -3113 -637 3238 -2237 -1664 3296 -1023 -1362 3255 -1403 -2697 3530 -1672 -2764 3705
2323 3705 383 -3777 1766 1656 -4317 1269 1883 -2527 867 1977 -2858 519 2876 -3503 -212
2338 -212 3373 -2520 -475 4001 -1584 -1838 2764 -840 -1734 2690 -874 -2303 3010 -228 -2721 2748
2354 2748 262 -2118 3513 1828 -4361 1870 2409 -3070 1172 2409 -3156 668 2953 -3422 -343
2369 -343 2386 -2976 -1152 2943 -2030 -1945 2757 -2071 -2250 3082 -1424 -3165 2339 -72 -3304 3366
2385 3366 427 -2370 1160 567 -3553 2017 2028 -3608 706 2379 -2791 960 2434 -2680 -171 3218
2401 3218 -2921 -404 2972 -2136 -2131 4121 -1363 -2518 3422 -1384 -2892 2513 -1376 -3587 3227 804
2417 804 -4109 1915 860 -3163 2301 1654 -2670 1416 1154 -3467 294 3056 -2443 -557 2734 -2218
2433 -2218 -1030 3055 -1229 -1600 2360 -1574 -2637 3149 -1507 -2042 3168 -405 -2794 2720 -32
2448 -32 -3381 2136 1137 -2855 1361 1664 -3370 380 1893 -3830 81 3071 -3018 -723 3005 -1332
2464 -1332 -294 2659 -1520 -1131 3824 -1958 -1836 3863 -949 -2425 2491 219 -3380 2315 383
2479 383 -2229 2450 778 -3604 1279 1404 -3312 606 2177 -2890 -94 2708 -2652 -255 2233
2494 2233 -2168 -490 2450 -2481 -884 3520 -754 -1106 2645 -266 -3002 3342 522 -2872 2871
2509 2871 -132 -2907 3019 644 -4013 1682 2238 -4010 1449 2092 -3199 140 1775 -2474 -86
2524 -86 3150 -2568 -364 3925 -2484 -1628 4059 -1861 -1715 2877 -1290 -1799 3224 -357 -2507 2488
2540 2488 203 -3409 2032 974 -3554 2105 1708 -3022 915 1588 -2794 726 2322 -2805 383
2555 383 3390 -2890 -353 2805 -2676 -862 2303 -2245 -2468 3373 -642 -1900 2836 32 -2710
2570 -2710 3113 -909 -3473 2183 1202 -2522 1687 713 -3245 804 1697 -2908 593 2084 -2559 1031
2586 1031 2193 -3264 -238 3010 -2262 -304 2415 -2170 -2456 4005 -1263 -2432 3019 244 -1917
2601 -1917 3059 321 -3053 2890 1860 -2801 1761 680 -3376 1302 1586 -2656 742 2174 -2480
2616 -2480 -783 2056 -1903 -138 3240 -1409 -1369 2501 -1360 -1088 3402 -1780 -2327 2272 -400 -2021
2632 -2021 3073 443 -2918 2634 840 -3179 1385 514 -2668 785 2146 -3827 902 2740 -3051
2647 -3051 34 2451 -2440 -914 2366 -1077 -800 3183 -1672 -1039 2463 -1725 -1585 2096 93 -2432
2663 -2432 2971 7 -3248 2629 134 -2293 1805 277 -2775 1765 980 -2844 1622 1556 -2858 23
2679 23 2621 -2849 -252 2614 -1992 -547 2763 -1327 -785 3329 -1260 -1429 1835 627 -2432 1675
2695 1675 1671 -1977 1668 -116 -1989 2825 1690 -2264 1676 1357 -2967 934 1565 -2882 491 1872
2711 1872 -2242 -954 2349 -1864 -796 3185 -1713 -1584 3767 -1544 -1451 3909 -860 -2122 3314 -368
2727 -368 -2471 2581 -58 -3426 1901 1243 -3258 1172 1740 -3611 778 2122 -2394 -602 1859 -1622
2743 -1622 -309 1870 -1557 -1325 2003 -1877 -461 2837 -1979 -1632 1765 -1025 -1852 1928 -418 -2676
2759 -2676 2789 17 -2661 2781 800 -2214 1276 1091 -2927 1609 2227 -2264 1275 2341 -2616
2774 -2616 -859 1928 -1724 -672 2701 -1815 -1412 2327 -1710 -2388 2046 495 -1762 2021 565
2789 565 -2402 1923 751 -2793 1665 979 -1902 1133 641 -2342 1155 1395 -2579 981 1952 -2596
2805 -2596 277 2360 -1518 86 3818 -1779 -1735 1766 -507 -699 2139 -186 -2410 2917 427 -2132
2821 -2132 1418 1321 -3397 1431 1455 -2802 854 1479 -1993 209 1803 -2068 70 2271 -2418 -1082
2837 -1082 2081 -1555 -506 2661 -2279 -1295 2138 -1429 -1867 2182 -1664 -1381 2460 -678 -2304 2467
2853 2467 29 -3280 1617 1255 -2798 552 1575 -2733 163 979 -2809 -87 1400 -1813 -140
2868 -140 2106 -1153 316 2635 -682 -1771 1808 -660 -2434 2218 -972 -1676 2722 234 -1881
2883 -1881 1806 411 -1813 2200 721 -2275 1368 1634 -2122 832 1757 -2303 317 2996 -1604
2898 -1604 -483 2035 -2015 -1120 3040 -1759 -1634 2353 -2185 -1697 2820 -928 -2114 1990 352 -2868
2914 -2868 1971 1841 -1515 1404 488 -2342 1503 1684 -1969 708 805 -2724 -368 2516 -2131 -159
2930 -159 2185 -1802 18 1485 -1627 -646 2242 -1730 -1326 2585 -1337 -2376 3217 -474 -2292 1532
2946 1532 1337 -2741 1510 1472 -2080 1013 1307 -2199 1214 1416 -2512 483 2739 -2995 407 2191
2962 2191 -1541 -752 1768 -2338 -589 2652 -1694 -1568 2704 -1224 -1764 2192 -341 -1248 3173 -279
2978 -279 -2458 1966 337 -3117 1579 1930 -3110 955 2089 -3335 1166 1195 -2445 443 1606 -1658
2994 -1658 -818 2447 -1764 -857 2636 -1137 -1216 1888 -810 -1090 1339 -794 -2322 2170 -343 -2377
3010 -2377 1346 183 -2940 1918 1120 -3040 864 1201 -2963 430 2673 -2459 550 2927 -2515
3025 -2515 -686 2696 -1913 -2080 3289 -1634 -1592 2737 -534 -2231 1751 508 -1543 2451 178 -1498
3041 -1498 751 643 -1544 1126 1466 -2549 387 701 -2257 792 1416 -2461 1182 1733 -2159 -110
3057 -110 2905 -1557 -2520 2840 -922 -1674 3203 -1003 -1987 2185 -405 -2010 2859 539 -2552 2090
3073 2090 313 -2553 1455 1887 -2568 1074 1452 -3342 -125 1736 -1786 -694 1905 -1984 -983
3088 -983 2246 -1278 -1180 2070 -754 -1262 2446 -1751 -1850 2985 -694 -1556 2081 170 -2254 2309 249
3105 249 -1739 1198 485 -2999 1545 1494 -2513 546 1965 -3014 -822 2088 -2374 -531 1833 -1703
3121 -1703 -1499 1945 -1547 -396 1657 -672 -1936 1598 -599 -2323 2033 -38 -1364 1906 349
3136 349 -1318 1935 1743 -2243 405 1495 -2018 738 1499 -2725 926 1496 -1972 -372 1745 -1882
3152 -1882 -1226 2287 -1213 -1918 1404 -1154 -1658 2433 -1041 -2437 1303 334 -2128 1007 393 -1871
3168 -1871 1382 1252 -1350 471 1315 -1977 350 1858 -1689 585 874 -2506 -757 1440 -1342 -236
3184 -236 2383 -2423 -763 3166 -674 -969 1867 -889 -2302 2133 37 -2592 1835 238 -2605
3199 -2605 863 288 -2161 220 1687 -2559 -12 2242 -763 -224 2862 -2460 -239 1458 -638
3214 -638 -962 2538 -639 -1153 1853 -1082 -1220 1147 -818 -1684 2578 -926 -1493 1704 -190 -1675
3230 -1675 2279 745 -2604 433 1230 -2799 2042 699 -2263 563 2257 -1589 -1359 2215 -1709
3245 -1709 -1211 2578 -1086 -1444 2939 -510 -1606 1292 97 -1227 1541 -836 -2315 2393 368
3260 368 -1799 1392 878 -2380 1113 648 -2052 956 580 -2541 346 958 -1588 27 3224 -1616
3276 -1616 -1208 1566 -905 -452 2324 -906 -1335 3010 -957 -1042 1973 830 -1585 1575 476 -2683
3292 -2683 -178 653 -1442 931 618 -2238 788 1467 -2299 -293 1878 -1576 -578 2062 -1535 -694
3308 -694 1201 -969 -125 2747 -1614 -1041 2149 -352 -2293 2322 952 -2266 2415 1016 -1005 1041
3324 1041 885 -2693 819 694 -2442 634 1367 -2265 478 2727 -2253 -635 1261 -1695 -993 1487
3340 1487 -1162 -225 2087 -969 -924 2419 -550 -1227 2729 -821 -96 1001 100 -1594 1451 -447
3356 -447 -2241 1218 1362 -1995 1044 1269 -2087 137 1672 -1888 109 1842 -685 -252 2366 -1763
3372 -1763 -1857 1497 243 -2223 2211 987 -2227 1533 651 -2449 299 203 -2008 1016 93 -1719
3388 -1719 1183 1619 -2200 756 1406 -1807 532 892 -2038 -674 1499 -1310 -1343 2138 -1824 -820
3404 -820 1749 -1135 -378 1500 -249 -3073 2055 218 -1962 1644 141 -2393 1504 1843 -2105 1422
3420 1422 1225 -2570 915 1583 -1896 16 1720 -1213 -894 1675 -1523 -230 2122 -1262 -492 1792
3436 1792 -1533 -1368 2051 -491 -1557 1558 -216 -1563 2219 706 -2584 2445 1185 -2397 1837
3451 1837 884 -1719 612 1097 -1811 -369 1429 -2145 347 3055 -2143 -231 2359 -843 -1615 2103
3467 2103 -52 -877 1254 -230 -554 1703 75 -1421 2143 230 -1550 1293 1173 -2392 818 864
3483 864 -1684 1512 1025 -2276 532 1682 -2247 764 1935 -2081 -1760 2316 -1539 -455 1924 -753
3499 -753 -1455 1118 -872 -1767 2519 -232 -1148 1337 1150 -1791 913 1029 -1831 416 1108 -2082 501
3516 501 837 -1339 425 1503 -1961 128 2516 -1370 -304 1394 -563 -374 2107 -1707 -957 2141
3532 2141 -1444 -771 1562 -55 -2319 1676 626 -2286 988 769 -1573 -65 885 -1964 780 961
3548 961 -1702 -54 1948 -1836 -530 1613 -950 -826 1485 -244 -315 1896 -545 -1595 1908 -1024
3564 -1024 -1254 1745 -343 -845 1362 712 -1182 1824 320 -1806 1038 1209 -1621 853 1643 -2199
3580 -2199 688 2343 -725 31 2186 -1713 -104 1737 -1014 -1307 1513 -891 -503 1517 -500 -2118
3596 -2118 1580 -348 -1182 732 291 -1227 1028 532 -385 1231 -188 -1618 1358 746 -2047 232
3612 232 442 -897 696 1504 -1525 -210 954 -1278 -1137 2506 -1636 -1074 2084 -628 -1762 1799
3628 1799 651 -1929 1455 -144 -896 1760 -169 -654 1279 177 -2316 879 282 -1335 680 1312
3644 1312 -1923 980 1527 -1637 -374 1098 -1133 -959 1502 -890 -703 1550 -66 -1773 2018 633
3660 633 -2160 1607 -224 -1706 1485 955 -2179 1530 1397 -1087 725 710 -2216 -173 1746 -1015
3676 -1015 842 1557 -795 -335 1540 -951 -251 1600 -2104 -257 1438 -351 -589 1574 -902 -1313
3692 -1313 1685 -360 -1169 1274 547 -1136 1676 1006 -1821 1060 2090 -1742 -550 62 -838 329
3708 329 2247 -1876 -703 2450 -1330 -732 1654 -88 -1278 1414 -697 -1366 1069 -388 -1731 829
3724 829 -327 -1498 1430 417 -1700 1481 185 -2100 806 1518 -2083 1167 1377 -1562 421 1693
3740 1693 -1323 91 1711 -730 -402 2250 -813 -734 2336 -400 -898 1992 169 -1579 1679 -210
3756 -210 -2187 1342 174 -1540 574 697 -954 1451 541 -1348 380 632 -1575 102 1653 -1536
3772 -1536 -572 2006 -704 -1002 1433 -1018 -220 1218 -994 -1616 2597 -125 -1158 744 -314 -2271
3788 -2271 1546 1160 -1098 1614 769 -1491 568 1991 -1517 434 1545 -1531 -521 799 -1514
3803 -1514 34 1765 -528 -383 1321 -664 -795 2409 -1135 -762 1033 93 -1216 1544 -188 -1046
3819 -1046 750 222 -1465 1180 1328 -850 1184 363 -1668 322 1407 -1143 636 1041 -708 515
3835 515 1409 -610 -233 1971 -1617 -1416 1489 -933 -1495 1562 -170 -1505 -3 -71 -1651 1009 938
3852 938 -1794 834 262 -1682 460 1242 -1652 -574 976 -1055 21 1410 -1644 -494 1450 -1506
3868 -1506 -409 1899 -310 85 1547 -169 -1428 1863 -647 -1349 1818 -669 -2459 756 133 -1831
3884 -1831 1343 -38 -2298 206 718 -1284 151 1584 -1378 154 1677 -608 126 1075 -1999 -815
3900 -815 944 -940 -1222 2004 -176 -1234 1788 -158 -1126 1023 -438 -1180 693 -263 -1870 1262
3916 1262 856 -1639 981 1330 -1456 879 1619 -1076 295 2173 -2073 219 1220 -1041 -812 1891
3932 1891 -511 -615 1819 -604 -839 743 -83 -1438 1082 947 -979 1479 790 -1828 300 292 -1057
3949 -1057 12 301 -1679 1724 457 -1417 -203 1000 -763 248 1387 -264 286 1221 -703 -187
3965 -187 974 -65 -1253 1307 -467 -898 1522 418 -1342 1143 465 -1773 1128 -209 -1523 854
3981 854 833 -1005 -82 1266 -2123 1079 2115 -1415 -250 595 -1335 -39 1211 -1054 -887 1234
3997 1234 -412 -1512 1159 -413 -1140 944 -274 -1833 495 -188 -2005 1195 498 -1411 1117 376
4013 376 -1740 412 1963 -1524 410 1729 -1386 -441 1041 -655 -387 1074 135 -1370 701 -917
4029 -917 -978 1633 -185 -2009 1929 -228 -764 533 20 -79 1335 175 -1673 860 492 -1310 1618
4046 1618 1592 -1456 -356 149 -1456 22 807 -764 -658 1042 -1110 -878 1404 -721 -1406 1677 44
4063 44 22 592 405 -1347 347 104 -1254 1481 336 -1770 1128 1039 -1023 885 566 -301 -149 1394
4081 1394 -494 473 1430 -1740 -849 1428 -903 -684 1986 151 -892 1035 -546 -434 906 -576
4097 -576 -211 1191 108 -1404 778 381 -802 984 653 -1738 1097 552 -1995 -88 952 -1783
4113 -1783 -283 1146 -916 -1198 1167 -695 -574 1400 -368 -584 1327 671 -615 1962 215 -1048
4129 -1048 1769 114 -1456 462 416 -1437 560 216 -1285 672 362 -2061 275 779 -1602 251
4145 251 687 -834 101 748 -806 -1034 591 -552 -874 1233 312 -1404 2090 106 -970 1342 -760
4162 -760 -1065 1052 536 -1237 83 778 -1126 171 784 -922 935 849 -2174 -253 968 -1561 -394
4179 -394 985 -1291 -579 1286 -555 -1291 1101 203 -513 1617 -89 -2182 1386 316 -1557 982
4195 982 430 -814 -24 806 -1746 178 192 -1536 338 873 -960 257 1859 -669 -608 1058 -943
4212 -943 103 1046 -844 -722 1022 -714 -749 1395 -268 -767 893 54 -1574 483 -192 -1341 944
4229 944 568 -509 148 536 -1618 50 1416 -1699 492 1366 -1579 -913 1546 -433 -1230 978 -996
4246 -996 -483 900 -732 -607 1229 -691 -1643 1294 -121 -1493 1458 394 -1139 1012 417 -896
4262 -896 293 1276 -1620 444 1874 -1140 452 840 -414 -602 1539 -22 -337 1153 -1035 -1083 804
4279 804 384 -486 806 -784 -1486 1345 425 -1429 894 236 -1100 1173 828 -1524 218 494 -1439
4296 -1439 -359 807 -1164 171 511 -1119 523 1108 -978 -708 1695 -519 -942 889 -280 -1119
4312 -1119 1034 -243 -1265 650 156 -461 727 232 -878 396 15 -1921 232 1381 -336 138
4328 138 27 -764 331 702 -768 -250 1408 -328 -65 1350 -865 -17 1099 -265 -585 588 -975
4345 -975 -836 1057 -379 -630 1680 1518 -1116 1056 488 -674 36 373 -947 733 105 -96 -288
4362 -288 930 -1228 829 1299 -1067 -469 694 -1534 -702 1383 -25 -1020 1260 133 -1167 1616
4378 1616 -246 -1222 1113 13 -625 633 839 -1570 -71 887 -1446 -2 352 -419 290 1254 -1071
4395 -1071 -408 305 -1525 -1011 1695 -702 -1269 882 -410 -773 1484 -509 -797 1791 -425 -1423 -295
4412 -295 494 -1384 1199 151 -927 859 1014 -1691 809 1552 -1251 418 1243 -350 29 1422
4428 1422 -874 -770 1287 -298 221 1123 -339 -469 1226 -659 -1464 1357 -774 -1044 1569 853 -1579
4445 -1579 588 498 -142 173 650 -504 222 1241 -548 -602 667 -1087 -626 577 -2156 10 601
4462 601 -475 6 1156 -597 -619 807 -746 -812 986 -261 -1277 851 408 -1603 586 595 -1189
4479 -1189 1018 161 -1686 -337 1583 -1108 -535 1407 -383 477 755 -463 249 796 -884 -979 1128
4496 1128 -846 -883 1221 -921 -857 720 -321 -1138 1349 474 -918 698 17 -1521 848 242 -1320
4513 -1320 156 801 -771 150 719 -811 669 1661 -658 -967 855 -1124 152 1672 -337 5
4529 5 2127 -667 -522 1163 -86 -348 1246 263 -1737 1075 320 -1371 -136 805 -1628 135 68
4546 68 -1091 -39 133 -1667 346 606 -1702 10 1039 -441 -53 681 -748 -648 357 -1075 -664
4563 -664 1273 641 -935 1487 408 -836 628 455 -1119 633 5 -1721 403 705 -1061 540
4579 540 492 -878 95 1547 -333 -468 1078 416 -1145 608 -551 -431 1019 -665 -828 413 -127
4596 -127 -1536 1226 583 -1848 -63 934 -915 1244 386 -481 910 42 -933 256 1091 -1113 -849
4613 -849 405 -999 81 2106 -451 -1577 536 -1124 -1161 1086 37 -914 615 -418 -760 1244
4629 1244 599 -708 -38 913 -859 388 853 -1561 937 590 -504 -111 423 -555 -274 647 81 510
4647 510 1448 -117 -73 1352 -826 -93 1169 -2120 -787 1154 -764 -911 435 195 -1312 496 814
4664 814 -1008 1174 115 -670 218 1231 -1197 -58 532 -1004 -75 1054 -768 -579 674 -305 -515
4681 -515 1361 25 -642 1525 -757 -273 1396 882 -847 798 -738 -799 858 -268 -934 826 677
4698 677 -250 516 942 -1156 319 878 -1430 -242 949 -811 347 1181 -839 69 849 -422 -631
4715 -631 2144 91 -1599 1196 67 -1152 -21 312 -1035 800 110 -746 736 909 -1372 798
4731 798 760 -807 364 691 -1350 -386 1193 -1088 -68 468 -536 374 553 -234 -1415 698 287
4748 287 -1795 312 72 -1257 867 336 -1384 1057 -61 -1485 661 973 -1056 -88 487 -1289
4764 -1289 130 246 449 -162 550 -1352 542 1159 -1494 49 976 -191 -426 1117 -400 -1193 329
4781 329 -127 -833 719 -16 -1183 1009 635 -236 158 616 -374 285 901 -1337 666 132 -1280 454
4799 454 2279 -334 -718 446 -1286 -915 -55 -934 -481 608 591 -679 1305 -296 -1103 804 290
4816 290 -548 1074 219 -1217 384 1043 -705 313 311 -910 -36 319 -1576 5 1096 -573 78
4833 78 956 -657 -339 365 -468 -438 1168 -86 -751 1379 -539 -1223 716 1746 -1341 1369 619 -1188
4851 -1188 389 825 -329 265 564 -387 887 953 -1266 214 664 -383 -283 1197 -849 -680 1534
4868 1534 -461 -1160 813 -431 -830 913 199 -1354 599 662 -1366 771 760 -537 -4 -148 -914
4885 -914 509 571 -1852 217 611 -519 331 680 -137 -1054 -165 -80 522 1721 -1216 -529 253 -932
4903 -932 -1180 862 -495 -796 1219 330 -838 768 265 -344 780 193 -880 981 816 -1605 474
4920 474 688 -912 -65 1369 -890 4 960 -1137 113 644 -1103 -788 1050 349 -305 662 -46 -759
4938 -759 517 332 -656 372 -236 -1190 -271 402 -1162 -24 -402 -728 218 -10 -199 308 727 -636
4956 -636 144 857 -1037 -838 819 173 -846 1145 -438 -533 121 -648 -8 917 654 -355 1002 1036
4974 1036 -1083 234 557 -1963 187 574 -1936 36 619 -882 752 766 -1582 -179 799 -305
4990 -305 -1457 1512 -421 -1388 937 673 -421 916 397 -1578 546 216 4 790 801 -2076 699
5007 699 1101 -982 1172 531 -1192 -25 1380 -773 816 788 -698 -217 489 -781 -1252 685 147
5024 147 -46 1271 159 64 -109 274 -776 1423 -776 -784 1100 654 -456 207 853 -1232 709 804
5042 804 -525 59 669 -1229 245 868 -1336 -735 1374 -641 -1103 848 -1271 -607 1536 -660 -796
5059 -796 900 415 -1360 1010 233 -1337 1592 918 -393 53 470 -58 184 365 -1265 89 55 -1053
5077 -1053 -141 1062 -1153 -496 753 -354 -469 1262 -589 -856 236 -487 -874 856 -378 -488 1385
5094 1385 1011 -943 677 674 -240 281 -470 -243 255 817 -495 433 445 -989 -382 1621 -1170 -31
5112 -31 1239 -1387 -74 400 326 120 832 221 -626 1278 -434 -514 657 -128 -869 436 480 -1306 -1
5131 -1 1416 -1152 517 281 -260 427 1083 -721 -728 949 -649 -204 1198 -612 -103 1487 -517 -907
5149 -907 1075 -80 -601 4 -421 -82 776 404 -510 388 -465 -1066 313 82 -1421 909 -151 -2321
5167 -2321 621 489 -1208 117 -106 370 -234 188 -183 -5 500 -336 -945 752 -892 -1183 489 26
5185 26 -599 549 991 -1797 829 -409 -912 -32 1392 -235 781 1121 -1030 -296 633 -163 225 633
5203 633 55 -158 -240 -1012 2 1153 -739 -116 1570 -297 -888 -26 712 510 1587 -105 -768 1220
5221 1220 664 -900 414 -107 -1078 -366 865 -372 223 866 -658 281 737 -218 -1056 575 -381 92
5239 92 1018 -805 96 229 544 -457 -275 234 -546 1100 -227 -623 -560 174 -576 1028 476 -1386 330
5258 330 -251 -697 433 166 -345 744 168 -478 25 526 -815 -467 687 -467 -396 334 -674 -1295
5276 -1295 584 113 -177 521 -160 -380 -25 237 13 981 436 36 -83 896 -136 -509 257 -671 -1106
5295 -1106 573 -1182 -121 976 -54 62 267 -1431 -1314 898 164 -640 439 -201 -1426 599
5311 599 -64 -1105 745 261 -331 459 480 -1755 -169 508 -290 1006 1219 -422 280 346 -658 280
5329 280 420 -824 -578 214 -267 238 494 -802 347 1403 -579 -1198 725 585 -606 611 764
5346 764 -365 1039 214 -379 306 820 -64 369 983 -1547 -437 69 24 -59 1427 -227 60 989 -1010
5365 -1010 -979 221 47 -278 564 -43 -571 -431 211 -963 301 840 -1643 871 -270 -1771 526
5382 526 1599 -1554 560 975 -1566 -477 1503 -969 -761 1197 -657 -955 388 -1174 745 981
5398 981 -686 366 1001 346 -615 -446 -104 -1143 998 148 -576 1385 -143 255 428 488 -1057 227
5416 227 92 -411 595 740 -595 369 222 -978 -571 1370 -1964 415 1069 284 -447 1188 414 -823
5434 -823 438 -234 -883 -637 916 -1415 678 -178 -1446 -90 757 -1334 -332 -253 -421 -124 -164 -634
5452 -634 -254 680 -699 -250 649 -152 -484 1057 -616 -1600 1176 -389 -424 1339 -205 -745 1092 -428
5470 -428 -427 634 -346 -852 356 830 -690 -21 1220 -1046 -289 66 -1242 -84 1088 64 -35 1285
5488 1285 -574 -135 761 -33 -66 -743 200 189 411 -63 -1125 262 -114 -1062 996 200 -612 78 -377
5507 -377 -1076 339 702 -839 -332 170 -759 972 263 -756 -180 1791 181 -232 490 -184 -729 291
5525 291 -400 -510 558 -706 73 -99 187 -1469 441 533 -1155 362 493 -933 242 3 -1086
5542 -1086 120 59 -1157 483 470 -855 -564 1499 -661 -842 885 -341 -423 797 -610 -831 1140
5559 1140 -672 -605 1112 247 -875 347 548 -882 730 408 -2023 520 -238 -1181 239 1171 -828
5576 -828 444 631 212 -470 232 -1555 -149 1475 -688 -15 277 -336 -476 -200 -355 -690 9 -117
5594 -117 -892 -77 25 -642 1595 -9 -481 162 445 -477 -708 141 -1072 -286 1189 -807 -10 682
5612 682 -1258 -57 844 -712 -760 887 27 -235 358 -154 -878 -217 -333 -86 768 -268 -820 983
5630 983 -1147 -593 1052 532 -414 -291 1388 -544 -363 1559 -812 707 644 -264 -65 160 -130 -541
5648 -541 1267 -262 -540 232 -111 -204 1058 -398 -1513 642 -72 -283 -279 423 -748 708 1186 -663
5666 -663 33 1037 -918 -953 579 -647 -347 902 -969 -634 407 -854 21 1324 265 -257 -189
5683 -189 630 -393 163 27 -570 107 370 -564 213 379 -1478 -166 2 -852 220 582 -610 357
5701 357 1109 22 -781 414 -1017 -584 288 162 -179 696 -68 -525 872 133 -471 556 -214 -1024
5719 -1024 643 765 -929 459 568 -330 652 172 -1070 243 228 -252 545 651 -1220 83 828 -494
5737 -494 -604 363 -863 -700 810 654 -358 461 529 -918 866 -286 786 924 169 -102 330 276
5755 276 -839 601 -85 -202 1059 664 -336 93 773 -59 31 1082 -279 -727 111 -846 -513 870
5773 870 -1137 -1166 268 -530 -44 950 -268 -998 560 445 -692 430 -168 -773 456 653 87 764
5791 764 1850 -571 -463 978 -862 -188 -37 -32 14 892 -1226 -655 112 -769 -48 776 -894 -773 1072
5810 1072 -199 -683 -177 -232 293 332 838 298 42 801 -945 -194 -162 -1421 525 -157 -145 329 609 -998
5830 -998 -818 245 197 -245 447 -782 -1468 391 411 -866 648 722 -813 867 97 -1333 -225 -91
5848 -91 -108 977 -618 -1322 -206 576 -1238 936 1607 -944 -389 642 -1507 -197 976 -787 537
5865 537 920 -13 -1015 851 -428 -816 583 -376 132 457 400 52 919 558 -712 520 1083 -688
5883 -688 353 1111 -269 209 -314 589 461 -537 -891 -997 -139 -131 -531 125 -510 -34 206 -602 -869 548
5903 548 596 -610 600 -1295 -1787 374 780 -1468 -692 330 -319 395 1028 -316 647 -233 -682 -931
5921 -931 -273 -55 67 1103 -114 -136 277 -383 -194 123 448 162 -485 326 -741 442 459 -1386 218
5940 218 416 -957 565 -214 167 285 996 -254 4 10 -323 -183 -39 -171 339 900 -252 -946 320
5959 320 170 -1077 831 164 -1058 732 -441 -110 644 119 -843 238 -104 -320 209 1035 -320 423
5977 423 259 -903 574 1339 -465 -267 1645 -494 -1802 946 -207 -823 272 -936 -1095 -35
5993 -35 -160 -1364 1086 366 558 422 -441 -626 1146 -88 -202 851 716 -369 -76 58 -200 474
6011 474 -39 367 -462 1088 -1170 -380 938 -259 -689 471 -81 -348 1093 -64 -455 924 -375
6028 -375 -188 738 49 -766 204 -206 -293 -124 -67 -231 760 1129 -631 193 178 -122 -137 648 -235 91 33
6049 33 -557 271 289 -85 -396 896 109 -803 258 -65 -130 -15 426 -1105 306 129 -554 691 573
6068 573 -632 -91 20 -76 469 747 -100 -14 1026 -49 -321 1072 -361 -438 1044 -439 68 443 273
6087 273 -750 846 874 -542 294 -85 -226 424 72 -224 258 -371 -404 251 688 -540 -108 581 -849
6106 -849 -400 479 -448 -17 726 -336 -707 129 163 32 990 86 -275 458 448 -662 470 227 -1066
6125 -1066 116 -468 -359 -265 243 -1128 -461 641 -36 -468 347 -789 -607 550 -371 -563 591 -577
6143 -577 -461 223 -1017 -625 -994 -605 -431 589 637 -234 268 -384 -455 977 613 -1235 7 246 -1371
6162 -1371 -366 636 -46 -754 334 -566 756 732 -522 -414 125 266 247 589 -116 -387 -42 313 -658
6181 -658 -308 -524 -600 1082 -117 -351 951 758 -923 324 243 -1323 454 191 -227 -869 -176 3
6199 3 -410 179 -456 -229 1623 -208 523 759 489 131 697 -204 -423 -966 -401 -1587 458 505 306 -247
6219 -247 -675 -154 467 644 -299 132 769 -689 -390 1520 -490 318 540 -1132 -905 729 -505 235
6237 235 377 -558 -196 398 -472 -241 30 -567 -302 196 -186 -334 425 550 -195 -65 -115 -877 -95 1674
6257 1674 -501 424 889 -670 863 6 361 -143 -527 -222 -878 1484 -874 457 -535 -296 -967 359
6275 359 194 -955 708 -206 -250 215 -7 -94 364 230 -383 484 -158 -1132 105 381 -904 -776 330
6294 330 440 -278 484 -730 73 454 -835 -1004 -66 233 203 870 -1021 -156 421 -63 -325 782 154
6313 154 -295 281 191 -238 1534 0 -642 259 513 59 332 247 -477 -316 318 -831 -946 805 -717
6332 -717 -329 660 -85 -50 50 19 -1154 -55 -489 -730 187 -185 -863 461 293 -42 196 201 -452 -31
6352 -31 760 -1043 -485 235 -986 517 561 -1061 -312 648 50 -238 102 -263 -830 456 1011 110 897
6371 897 -68 -346 1225 198 -1399 53 696 -1175 -254 276 -169 -18 102 -389 561 725 -143 22
6389 22 104 -199 277 1107 -634 -445 178 -32 -382 -302 389 -547 481 407 -491 1427 -142 -1722 -287
6408 -287 178 -1255 101 323 325 -243 -21 162 142 1230 -1382 -640 677 -1156 -232 782 -211 -1208 613
6427 613 -367 -482 119 -1079 -764 1117 956 -602 -135 8 -1496 -289 507 -981 240 754 462 919
6445 919 642 -674 548 563 -507 -535 610 -553 -613 302 -774 -498 1066 -180 259 791 -749 -928
6463 -928 535 706 -679 927 369 -509 37 1140 389 706 756 -1071 515 391 -575 -260 805 -100
6481 -100 -698 839 327 -340 165 262 -231 627 -703 -1201 236 -602 -564 567 731 -453 -202 933 -611
6500 -611 69 0 -734 176 500 -523 205 666 -62 529 121 269 49 120 1116 -32 582 -47 -387 612
6520 612 97 146 709 836 216 1057 500 -334 -107 475 -704 513 519 -333 490 280 -142 -438 -20 141
6540 141 152 1121 -260 -671 693 125 -206 798 -604 230 948 -142 -291 447 -193 -388 -145 -589 -174
6559 -174 -456 -9 -440 500 402 -407 121 749 -489 -760 289 -323 312 1184 -1078 -88 -532 -325 -266 56
6579 56 -1187 -608 -160 -152 -888 370 525 211 -257 -367 -580 200 424 -741 552 -146 -388 154 20 -657
6599 -657 105 -51 329 52 921 -801 -48 969 -497 -45 1117 -366 -10 304 -1059 -966 536 -260
6617 -260 -293 -303 -35 -181 -596 -943 -462 556 957 -1060 371 325 290 163 165 -737 -462 -162 -842 193 716
6638 716 -529 276 460 -1277 -192 422 975 -349 337 -361 101 496 201 -656 139 -940 -1304 415
6656 415 87 -26 606 170 -69 581 -232 -83 -142 336 -70 -232 893 -701 136 550 218 -236 -231 215
6676 215 475 431 -318 -405 268 734 -261 -99 819 -860 -76 542 -591 43 956 173 675 -362 27 443
6696 443 767 -736 -368 69 -557 -100 -80 -408 148 500 411 17 212 194 227 -207 -12 156 511 682 314
6717 314 -13 162 -875 643 -429 -806 -29 334 -112 -147 -32 -111 -608 60 -568 -629 279 163 -529 -446
6737 -446 132 -1173 470 -687 -338 86 388 -416 826 99 -710 -68 596 356 -53 970 -713 -170
6755 -170 932 -403 -287 -230 377 559 458 -16 78 114 -329 -83 205 119 -130 481 -351 -1049 413 -521
6775 -521 -893 1739 646 -623 -13 586 -1077 396 323 29 528 -25 -154 -775 579 -182 -468 -858
6793 -858 75 703 -184 151 -869 145 410 -134 761 -294 -1017 -382 -209 272 -291 187 -259 -3 256
6812 256 46 -30 -376 -719 -800 1125 111 2 -335 -1035 -319 310 775 980 641 -526 -710 1099 232
6831 232 -133 167 77 -319 1148 -145 -504 1024 535 -92 -266 1163 -911 900 -214 -183 -976 1089
6849 1089 53 -1113 288 138 -206 359 108 270 794 29 -382 749 3 -782 -69 108 -362 74
6867 74 -290 -741 6 -207 180 -290 506 -621 1069 622 -255 242 250 96 143 1010 -640 -426 -308 -502
6887 -502 -35 958 -265 -426 918 -552 661 387 367 -624 32 316 -1055 289 106 -743 694 277
6905 277 473 49 881 -598 -249 1419 231 418 218 -1049 832 1116 564 -521 218 -113 884 864
6923 864 63 -106 206 -1364 -318 157 -12 -869 56 659 -554 -533 1315 -1078 3 -224 59 91 -116
6942 -116 -369 -5 -491 -392 322 -186 -1065 -113 49 -558 116 -532 -941 -859 518 94 79 341 -158 -1043 946
6963 946 581 244 -118 -155 -931 607 -90 -327 -463 373 -101 -33 -446 -748 -475 -636 -425 -227 436 -72
6983 -72 880 552 -127 -654 -916 254 -1156 181 404 -607 -661 -65 -613 429 -109 -233 -878 803 -31
7002 -31 -973 -22 -455 66 241 -481 412 619 847 -99 -600 -480 -57 162 -238 -481 1178 101 -634 -56
7022 -56 413 235 281 803 -796 533 -178 -884 727 973 -654 -197 230 -264 227 -615 -150 -189 394 68
7042 68 -129 328 -570 -9 137 156 -359 944 -721 -420 357 -549 578 26 -911 -28 -91 -15 -1114 343
7062 343 51 -1213 -209 -375 -1157 -761 268 -557 213 -444 458 -164 427 -419 -1393 1293 145 -691
7080 -691 -631 -909 -407 1104 -383 -318 438 423 -507 620 90 -1261 549 533 -474 543 393 -672 -302
7099 -302 251 -762 451 73 -126 9 454 -93 -468 262 -198 124 -121 -706 -771 -56 -351 -459 993
7118 993 -302 -1047 15 -61 -189 487 120 -823 80 770 -408 363 -445 -255 -299 539 20 -245 682 -742
7138 -742 -1203 78 351 -1156 -276 -349 129 -443 444 -16 418 452 -97 318 200 -1069 -199 143 -766 370
7158 370 282 -17 -684 972 797 -474 721 -264 -158 835 -475 -264 228 -688 -117 75 31 -139 860
7177 860 -331 184 471 554 -830 250 -182 -534 110 -63 -997 102 426 -1062 307 1082 -212 -185
7195 -185 755 -497 364 568 -983 101 204 -72 -454 752 328 -140 1027 -291 -947 256 113 189
7213 189 -648 522 -297 333 763 -360 147 421 -459 166 -882 -889 -86 451 26 102 487 -35 -21 848
7233 848 -77 -296 551 -244 357 493 -23 -190 -624 995 403 -137 -84 -247 210 179 -382 411 -78 -982
7253 -982 106 898 -507 -62 566 -132 157 -245 -891 -297 -88 7 429 53 229 -10 -276 276 814 -297
7273 -297 -658 -734 204 151 -265 562 459 -928 -28 890 -441 155 -357 266 -275 381 -484 -74 833 -888
7293 -888 -307 115 -542 -361 1137 -279 -9 -567 640 -171 -256 -164 355 -289 -1064 -807 -335 -45 -624 322
7313 322 1519 -85 -781 467 -509 -125 469 -902 -194 554 -270 -371 132 -476 -343 385 236 257 101
7332 101 -377 670 519 -364 -541 -20 450 -1309 -553 -223 -520 238 55 -197 99 -201 -417 93 546
7351 546 239 -654 911 162 -691 73 -84 -1007 25 -621 267 568 314 -594 664 -697 -267 739
7369 739 381 -1294 -373 897 -971 -116 645 -395 29 146 -1032 -793 920 871 -571 980 -373
7386 -373 514 574 584 -528 -98 46 98 -373 -300 -158 149 -226 -600 356 -145 -488 -177 -673 -663 168 -60
7407 -60 -913 598 194 -401 -332 458 126 -16 738 -83 -261 211 -426 123 1314 -218 -987 1155 104
7426 104 -685 147 -40 -712 143 -511 300 469 590 -674 155 622 -236 54 -52 -765 207 144 347 -71
7446 -71 90 -556 -921 420 546 834 338 -603 -609 405 987 -1278 366 173 339 1019 335 -568 879
7465 879 -306 -266 158 -28 -906 -292 1148 -122 -402 -2 -651 -198 110 -1164 -154 312 -686 -305 475
7484 475 -237 417 1189 -228 145 652 515 436 98 873 165 442 789 -303 598 -312 -649 445 232
7503 232 183 362 -719 -700 23 5 -466 -432 922 -114 8 640 6 310 598 -440 216 -420 110 -148
7523 -148 200 -111 -883 446 34 -213 520 475 -226 -4 -148 -1319 -5 156 120 -798 123 -733 -313 -264
7543 -264 -1016 -849 542 -635 -498 -543 -431 -502 -152 259 142 182 162 -411 83 -154 -562 328 -32 -496 -914
7564 -914 19 -387 638 -890 -661 -692 545 -487 153 17 -281 -368 354 868 -402 793 -15 95 755
7583 755 -623 63 -165 151 -436 -133 -32 -153 241 66 5 1021 1062 -146 -905 -6 -75 -905 445 -858
7603 -858 -855 501 214 467 396 -1269 -1322 228 21 -718 16 20 -354 -43 303 -196 384 856 -438 -419 351
7624 351 -363 -517 376 -450 266 1308 76 252 1274 -563 -975 -204 15 -937 -565 -445 765 -318
7642 -318 490 -790 200 30 -201 176 1602 -148 -164 -158 -504 181 -483 236 383 834 -186 -285 459 488
7662 488 -450 600 94 1051 202 -421 -325 848 552 -119 675 630 -579 1035 -31 -177 117 371 -1338
7681 -1338 1288 -433 -758 -360 62 -504 163 140 -831 30 -252 120 348 668 -166 254 -310 -392 -4 -276
7701 -276 -20 -781 327 138 -875 -88 -140 -333 662 -830 -50 674 -90 -181 526 678 491 335 -280 -364
7721 -364 -297 282 310 -173 605 -169 -41 380 -1056 -36 807 438 -923 802 130 -965 260 499 -240
7740 -240 10 -218 -363 824 -42 477 -404 765 -886 179 -386 -258 -200 42 537 283 0 192 996
7759 996 533 207 -223 588 -484 -1290 -731 -32 26 -872 -706 848 9 31 -320 845 27 228 292 630
7779 630 -82 251 499 -59 -70 357 -156 132 724 199 -283 967 -306 -291 489 -1103 101 481 -1383
7798 -1383 -310 34 170 -1012 578 151 -287 -9 -273 -516 438 -1060 -278 -216 265 -196 29 25 157
7817 157 113 -579 -448 -53 359 -739 -187 -80 -229 -243 -388 -162 -208 67 159 80 580 878 -30 -145 269
7838 269 -882 -75 451 434 -162 406 -484 319 109 -1113 -181 -117 -95 -689 103 355 -1115 244 -175 93
7858 93 180 524 -503 -379 -823 -243 107 160 -114 604 948 -574 122 -726 -553 977 422 -394 661 -655
7878 -655 -296 -445 375 99 -282 786 242 -503 351 -174 -302 691 -816 58 312 -205 -680 22 33 255
7898 255 217 173 80 480 629 -179 545 184 -567 113 611 -564 -144 408 148 247 115 -689 464 716 154
7919 154 -247 220 350 121 -507 167 -358 -940 5 373 -195 -221 -50 328 -276 -460 728 -43 -232 -267
7939 -267 687 -814 45 525 -283 235 400 418 -155 663 -99 138 1228 114 136 -326 320 -193 147 -460
7959 -460 95 -303 -206 -665 627 481 -18 273 109 1197 -223 166 -8 -78 -503 -770 -550 -261 -721 -818
7979 -818 623 -126 -478 171 252 -131 464 291 144 453 -790 -154 -433 -3 -886 611 -138 -1384 -327
7998 -327 446 58 66 89 297 610 129 351 -355 604 -442 -222 820 502 -166 502 -464 316 322 287 12
8019 12 120 -388 118 816 398 -480 46 241 -496 51 -470 -937 -120 45 211 -138 -373 443 235 1079
8039 1079 -777 -399 269 843 119 -363 -467 -306 954 -755 332 514 -347 -444 169 957 152 -545 -244
8058 -244 39 46 676 260 -583 -335 -728 -36 840 -722 -640 501 -471 -271 296 -62 561 724 -577 -427
8078 -427 156 216 -641 533 -437 -430 -724 362 -668 1086 -654 435 456 -718 -301 289 516 -1121 -115
8097 -115 447 -633 81 222 -888 -612 181 -242 -160 371 -724 1007 26 -551 -24 -192 368 -408 271
8116 271 -367 -462 31 272 98 -657 486 -780 -78 285 -789 426 662 167 -256 464 459 -869 -2
8135 -2 551 158 17 -477 -470 339 46 -146 -495 187 -558 223 -754 -757 -474 214 -398 311 729 -33 247 606
8157 606 -126 210 -1007 454 -123 417 -427 222 387 176 -164 558 -136 -612 1 -469 -458 0 292 553
8177 553 -645 123 36 -31 -78 -323 -130 -242 14 -464 -16 -773 -195 -63
8191f3
$$ Imaginary data points
##PAGE= N=2
##DATA TABLE= (X++(I..I)), XYDATA
0 -2 0 0 3 -9 18 -31 43 -52 62 -73 88 -106 129 -151 169 -199 227 -255 288 -340 384 -433 489 -556 614
25 614 -692 774 -867 966 -1087 1216 -1368 1540 -1734 1976 -2253 2605 -3037 3617 -4388 5534
41 5534 -7370 10830 -19484 68459 206451 624 -48299 38697 12529 -56735 26149 23320
53 23320 -38281 -3691 32307 -20645 -6205 28245 -3817 -19616 12123 2952 -10697 1214
65 1214 2677 -4858 1219 7269 8303 -6186 -11527 4329 2054 -11663 10372 12482 -17785 -978
79 -978 19706 -14153 -7995 24697 -9303 -21197 21503 708 -24510 17997 14718 -25239 6060
92 6060 18555 -20980 -4746 21152 -11373 -9347 18148 -4355 -12910 12069 802 -9919 6584
105 6584 3234 -6307 1598 157 -2295 3664 -3262 -107 6789 -6690 -4685 11568 -7137 -8407
119 -8407 15717 -2189 -14685 14452 4381 -18647 11998 11893 -21316 4440 18302 -18732 -4244
132 -4244 21252 -11718 -11719 19115 -3656 -14872 14350 3372 -14813 8475 7374 -12470 2220
145 2220 6757 -7580 -286 5918 -3148 -24 1339 -2954 3053 154 -4027 6222 -675 -8971 8232
160 8232 2976 -12301 7235 8167 -14240 3225 14546 -14762 -5307 18286 -9908 -9516 19695
173 19695 -3535 -15896 16316 2868 -18952 9990 10302 -17322 2546 12353 -13107 -2060 13351
186 13351 -7926 -4644 10780 -4280 -6167 5718 -2091 -2590 5293 -1908 -1430 2920 -4650 -116
200 -116 6314 -5989 -726 7791 -8533 -4137 12703 -4651 -7657 13917 -2455 -14001 11208
213 11208 3437 -14241 10587 9627 -15595 3527 12420 -13219 -245 15650 -9349 -7813 12857
226 12857 -4602 -7841 11670 -11 -8485 6879 359 -7859 5169 1464 -4585 5148 -248 -6034
240 -6034 3729 -1022 -4851 7421 462 -8138 7307 1077 -11097 7402 6359 -12478 3842 9277
254 9277 -13831 -265 13060 -10612 -3898 14291 -6506 -8908 12601 -2955 -10676 11386 2157
267 2157 -12569 7169 5510 -10899 4383 5775 -8324 1751 4862 -6578 1475 5453 -5442
280 -5442 2165 3959 -5653 3071 4488 -7057 2012 5314 -8620 694 8053 -9612 -1487 11707
294 11707 -7392 -5481 12132 -4330 -9848 12961 -1173 -12027 11277 3849 -13204 8063 7631
307 7631 -13093 3345 10184 -9722 -2067 10676 -7655 -4299 9739 -2904 -3889 6963 -3060
320 -3060 -4068 6864 -1764 -4239 5196 -2610 -3967 6900 -2950 -3449 6470 -3327 -4902 10026 -1106
335 -1106 -8860 9970 1530 -11132 8818 6120 -12480 5976 8403 -12591 973 12148 -11425
348 -11425 -1840 12913 -7295 -5422 12592 -3868 -8949 10084 513 -9435 7796 1098 -8842
361 -8842 5223 3463 -6925 3771 3488 -6487 4532 2278 -7196 4300 3103 -7101 4679 4710
375 4710 -8724 4317 6293 -10863 2064 9496 -10265 -984 12075 -7837 -5185 12589 -5181
388 -5181 -8094 11969 -1396 -10805 9930 3162 -11759 6738 5529 -11073 4846 7293 -9148
401 -9148 1642 7240 -8250 286 6852 -5477 -422 6368 -5893 -718 6005 -5121 -1052 6500
415 6500 -6593 -2448 7768 -5085 -3450 8858 -4512 -6025 10957 -3329 -8419 11057 555
428 555 -11690 8101 3968 -12914 6292 7555 -11690 1847 9664 -10460 -803 11465 -6813
441 -6813 -3822 10812 -6111 -5126 9536 -2462 -6050 7347 -2288 -5747 7092 -940 -5117 6947
455 6947 -442 -6343 5850 -662 -7413 6512 857 -8381 5591 2076 -9465 5984 5880 -10709
469 -10709 3361 8579 -10258 100 10505 -8778 -3221 11706 -6149 -5216 11963 -3514 -8214
482 -8214 9423 -926 -8562 9205 1999 -9067 5931 3973 -9160 4992 2939 -8740 3571
495 3571 4799 -7007 1971 5033 -7671 2239 6145 -7568 869 7635 -8042 -80 8556 -7029
509 -7029 -2841 9750 -5750 -5680 11113 -2654 -7786 10127 -498 -8939 8469 1343 -10306 6520
523 6520 4797 -10563 4471 5663 -7963 2169 6283 -7486 1084 6675 -6271 -821 7070 -5972
537 -5972 -2227 6365 -5424 -2137 8677 -4907 -4294 8226 -3691 -5233 8997 -1493 -7714 8760
551 8760 -158 -9376 9237 2562 -10059 6650 4841 -10230 3479 7330 -9139 1408 8116
564 8116 -8728 -1313 9211 -6333 -3740 7926 -4816 -5159 7845 -3320 -5544 7432 -1781
577 -1781 -5771 6699 -308 -5321 6741 -7 -7274 6297 1328 -7454 5892 2972 -8015 4713
591 4713 5222 -9444 2416 6584 -9449 1534 8278 -7652 -179 10146 -7584 -4811 9386
604 9386 -4808 -6560 8965 -2235 -7714 8296 94 -7430 6866 2091 -8112 5490 3614
617 3614 -8044 4026 4176 -7457 3866 3753 -7618 2165 4398 -8070 1386 6505 -6893 -372
631 -372 8353 -6519 -2362 7913 -5643 -3804 8850 -3981 -5471 8714 -2430 -7894 7818
644 7818 929 -8428 6651 3094 -8440 5073 4608 -8560 2428 5397 -7291 1746 6174 -6873
658 -6873 269 6685 -5902 -1143 7206 -4585 -2355 6963 -3962 -3514 7826 -3367 -4880 8424
672 8424 -1588 -5991 6660 -371 -7584 7429 1511 -7870 6611 2950 -8505 4902 4905 -7875
686 -7875 2526 6866 -7128 -125 8000 -7197 -1550 8872 -5538 -3354 8730 -4315 -5421
699 -5421 6620 -2354 -5348 7043 -394 -6208 6695 596 -6017 6319 1456 -7203 5123 2735
713 2735 -7650 3534 3944 -8050 2134 5680 -7646 1181 7090 -6791 254 7598 -5169 -1566
727 -1566 7638 -4533 -4915 8334 -2453 -4756 7830 -1028 -6375 7868 379 -6749 5557 2208
741 2208 -7611 5330 2827 -8060 4737 4184 -8203 2006 5534 -6414 626 5729 -6107 -1634
755 -1634 7371 -5369 -3106 7229 -4547 -3417 8335 -2596 -5689 6850 -811 -6267 5762
768 5762 39 -7064 6098 1641 -6359 4546 2727 -7806 3669 4058 -7304 2290 4832 -6351
782 -6351 745 6838 -7567 -996 6806 -5838 -1815 7959 -4051 -4150 7408 -1720 -5094 6921
796 6921 -1834 -5268 6620 83 -7084 5515 1715 -7224 5361 3260 -7161 3053 4773 -7343
810 -7343 2094 5233 -6587 458 6131 -5779 -851 6372 -5707 -1854 8022 -4450 -3340 7251
824 7251 -3682 -5028 6544 -2493 -5377 6803 -370 -7249 5936 1458 -7376 4744 2777 -8089
838 -8089 3514 4934 -6989 1966 5965 -7086 56 6104 -5846 -1543 6303 -4852 -2426 6594
852 6594 -3635 -3560 6635 -2331 -4379 6489 -2302 -5444 7004 545 -6375 6272 773 -7323
866 -7323 5690 3372 -7409 4620 3548 -7638 2122 5204 -7934 1011 7213 -7430 -154 7073
880 7073 -5823 -2987 7472 -3663 -3338 7515 -2434 -4907 6825 -922 -5311 6382 459 -5449
894 -5449 4958 1464 -6967 4237 1965 -7170 4320 4116 -6172 3368 4190 -6288 1919 5222
908 5222 -5623 -297 6235 -5637 -1585 7010 -4497 -3290 7640 -4017 -3904 6731 -2050 -6017
922 -6017 7476 -107 -6966 6849 1248 -7585 5026 3205 -6992 3504 4173 -7260 1901 4294
936 4294 -6813 967 5584 -6101 329 7120 -6195 -994 7277 -3724 -3007 6693 -2720 -3554 6874
951 6874 -2391 -5979 5793 -831 -6684 5819 1481 -7110 5472 2287 -6897 3647 3683 -7268
965 -7268 2519 5332 -7629 274 5086 -6588 -801 6280 -4921 -788 6883 -4734 -2619 6706
979 6706 -2853 -4641 6271 -2227 -5720 6002 -1953 -5815 5773 -45 -5923 5026 1712 -7681
993 -7681 4858 3322 -6981 2758 4173 -7411 367 5946 -5697 -5 6644 -5796 -1508 7580
1007 7580 -3954 -3662 7383 -3481 -3486 5795 -2035 -6447 6047 118 -5551 6087 957 -6207 5001
1022 5001 2204 -5382 3685 2994 -6592 2572 3003 -6269 1648 4981 -6914 895 5327 -5701 -1196
1037 -1196 7007 -5071 -2674 7443 -3840 -3332 7354 -1741 -5658 7344 -544 -6385 6302 1127
1051 1127 -7460 5234 1539 -7968 3638 3182 -7312 2576 4881 -6088 591 4869 -6008 773
1065 773 5785 -4893 -1156 5186 -3429 -2138 6237 -2777 -2610 6265 -2754 -4817 7284 -1255 -5246
1080 -5246 5832 184 -6337 5256 1495 -7753 5231 3578 -6978 2508 4554 -7386 1704 5888
1094 5888 -5487 -633 6434 -5688 -1837 6790 -3700 -3050 6026 -3039 -3254 5344 -2795 -4741 5990
1109 5990 -356 -4880 6182 -170 -5364 4803 1355 -5621 4152 1860 -6467 3717 3252 -6144
1123 -6144 2788 4108 -7411 1237 5879 -5680 -185 6776 -5052 -2770 6280 -3423 -3443 6815
1137 6815 -1719 -5635 5787 -310 -5893 5875 1596 -5801 3646 1617 -5646 3445 3028 -4809 2017
1152 2017 2706 -5259 1242 3626 -5477 1761 4491 -5049 181 5215 -4972 -1401 6129 -4819 -2323
1167 -2323 6552 -3295 -4533 6012 -1217 -5081 6087 96 -5769 5952 1622 -5857 3976 2807
1181 2807 -6691 2051 4957 -6862 1639 5531 -5305 539 5571 -4922 -1132 4803 -4165 -1684
1195 -1684 6695 -2118 -2814 5429 -2415 -3336 4262 -898 -4792 5226 -1239 -4734 4800 -45 -6344
1210 -6344 5257 2081 -6650 3652 3491 -6000 1915 4124 -6171 635 5173 -6249 -324 6951
1224 6951 -4203 -2343 6203 -3424 -3860 5448 -2131 -3537 4947 -1151 -4764 5351 260 -5032 4376
1239 4376 672 -5243 3934 1736 -4668 2922 3335 -4570 2511 3081 -5509 1867 4451 -5093 -551
1254 -551 5702 -5448 -2323 6172 -4026 -3015 6463 -1938 -3370 5989 -910 -5291 5710 609
1268 609 -5740 4983 1470 -5300 2979 3163 -5095 1655 3607 -4705 1097 3638 -5392 1410 5159
1283 5159 -4202 -355 4741 -3890 -635 5384 -4127 -1596 5661 -2960 -3280 5218 -2644 -4821 6249
1298 6249 -323 -5670 5027 620 -6787 3825 2597 -6849 2387 4163 -5877 1293 4010 -6314
1312 -6314 270 5444 -5666 -855 5384 -3854 -1806 5289 -2753 -1990 4800 -1517 -2710 5807 -1013
1327 -1013 -3888 4737 -1092 -4807 5681 -531 -5788 4222 522 -6165 3897 2715 -6038 2332
1341 2332 4268 -6907 949 5304 -5209 -1107 5662 -3298 -2326 6380 -2642 -3166 5665 -1530 -4305
1356 -4305 5609 661 -4267 4494 799 -5197 3246 1017 -4324 3066 1898 -4692 2999 2631 -4906
1371 -4906 2236 3172 -5595 1371 4297 -5913 423 5007 -4869 -68 6476 -4749 -2645 6662 -3457
1386 -3457 -3876 6041 -1643 -5246 6046 463 -5537 3852 1713 -4886 3920 3045 -5603 1783 3344
1401 3344 -5002 1220 3327 -4103 869 3375 -4167 -210 3870 -4058 713 4925 -4257 -1176 5000
1416 5000 -3479 -2264 5483 -2570 -4050 5765 -1819 -4665 6253 648 -6029 4112 1702 -7019
1430 -7019 3245 3565 -6309 1354 4310 -5778 541 4803 -4416 -955 5354 -3431 -1685 5226 -1762
1445 -1762 -2050 4150 -2260 -2224 3451 -1660 -3536 4065 50 -3173 4833 -492 -4218 4292 256 -4903
1461 -4903 4805 1513 -6504 3245 2344 -6392 1472 5282 -5781 -18 4885 -5816 -1272 6209 -3806
1476 -3806 -2345 6399 -1124 -4022 4563 -1271 -4021 4766 95 -4597 4286 1020 -4346 3206 1430
1491 1430 -4150 2230 1551 -3134 2005 1531 -4855 922 2674 -4807 1205 4602 -5730 507 4894
1506 4894 -4363 -1863 5615 -2982 -2319 7036 -2060 -4309 5581 -712 -5707 5652 0 -5177 3520
1521 3520 1973 -6355 2796 3255 -5148 1552 3161 -4353 865 3657 -4328 583 3033 -3955 408
1536 408 4813 -2051 -822 3646 -2673 -1597 4464 -3498 -2612 4667 -1788 -4457 5239 -762 -5925
1551 -5925 4514 217 -5301 4011 2645 -5500 2474 4290 -5915 1039 4708 -5185 -740 5410
1565 5410 -3387 -1271 4544 -1674 -2112 4193 -1790 -2549 4672 -1044 -2432 4170 -1230 -3422 3251
1580 3251 -227 -3280 3552 -116 -4687 2970 870 -5440 4092 2363 -5338 2146 4227 -5452 573
1595 573 5376 -4498 253 5637 -3792 -2763 5777 -2443 -3321 5670 -956 -4011 4657 -116 -4489
1610 -4489 3363 1519 -4499 3272 1679 -4233 1814 2477 -4699 2749 2416 -4229 1721 2867 -5472
1625 -5472 444 3214 -4746 887 4077 -4384 -718 5775 -4087 -2243 6898 -2060 -3023 5107 -1185
1640 -1185 -4743 4759 475 -4212 5309 628 -5504 3175 3034 -5234 1689 2377 -3548 644 4096
1655 4096 -3896 204 3919 -3268 -615 4038 -2938 -1421 3168 -2241 -1129 4999 -2974 -2519 4431
1670 4431 -1821 -3184 4774 -326 -4154 5369 -187 -5107 4363 1840 -4748 3556 3400 -5439 2142
1685 2142 3587 -4384 12 4651 -4837 -1714 5200 -3582 -1048 4198 -1818 -3434 3993 -945 -3140
1700 -3140 3759 810 -3189 3650 -413 -3623 4548 577 -3885 3014 617 -5276 2768 1660 -4962
1715 -4962 2408 2711 -5471 1813 4351 -5228 -110 4396 -5238 -1086 5021 -3186 -2529 5827 -2209
1730 -2209 -2897 5192 -1024 -4461 4392 774 -4516 3531 1196 -3974 1622 2839 -4085 2088 3366
1745 3366 -3611 1722 3063 -3255 1324 3469 -3724 -123 3043 -3806 -277 3373 -3491 -1842 4088
1760 4088 -3105 -2661 5863 -2326 -3298 5155 -343 -3752 4109 949 -5030 3863 2137 -4815 2249
1775 2249 3139 -4588 1681 3603 -4385 -339 4498 -2980 -1176 3820 -2741 -1517 3350 -1782 -1442
1790 -1442 3883 -1746 -1566 3090 -852 -2754 3438 -672 -2682 3653 -578 -3062 3196 325 -3917
1805 -3917 4027 1382 -5312 1237 3564 -4624 562 3433 -4449 -797 5385 -3899 -1903 5174 -2089
1820 -2089 -1335 3743 -749 -3425 4016 -549 -3787 3726 456 -2611 2245 584 -3222 1658 709
1835 709 -3551 2339 1063 -3554 2727 1766 -4343 91 3154 -4600 766 3395 -3233 -238 4324
1850 4324 -3593 -1242 5963 -2481 -3403 4393 -850 -3264 3633 -156 -3944 4069 1596 -4358 3711
1865 3711 941 -3991 1655 2393 -4293 322 3288 -3450 1184 2496 -3689 -26 2915 -2684 -543
1880 -543 2667 -2566 -1692 4820 -2508 -2053 3489 -2082 -2303 4104 -1183 -2694 5239 -62 -4193 3947
1896 3947 1440 -4652 2442 2863 -5160 642 4855 -3831 597 3020 -4355 -552 4301 -2634 -1480
1911 -1480 4236 -2201 -1605 3368 -1797 -1850 3487 -1583 -2753 3548 -484 -3684 2608 690 -3521 3674
1927 3674 779 -4526 2781 1861 -4694 1538 2505 -4606 1157 3683 -4894 -26 4861 -3792 -870
1942 -870 4435 -2710 -2856 3824 -1375 -2802 4280 -495 -3617 4002 -649 -3626 3600 527 -4321
1957 -4321 2493 1486 -3535 706 1483 -3893 1931 2083 -3519 1394 3247 -4005 505 3406 -2845
1972 -2845 242 3893 -3262 -1775 4045 -3543 -1854 4544 -1553 -3451 5039 -9 -3863 4685 675
1987 675 -4493 2767 2068 -4572 1038 1709 -4112 841 2530 -3822 814 3903 -3679 -687 3488 -1721
2003 -1721 -1124 3232 -2600 -411 3160 -2745 -1977 3877 -1477 -1389 4268 25 -3504 4341 -804 -3160
2019 -3160 4519 1428 -3335 3066 2308 -4398 2570 2753 -4945 830 3936 -3562 206 3924 -3240
2034 -3240 -1836 3680 -2354 -1573 3796 -1494 -2742 3268 -1219 -2618 2560 -268 -2559 2385 623
2049 623 -3354 2946 149 -3771 3125 1134 -3846 2405 1723 -4311 869 3884 -4264 842 4034
2064 4034 -3182 -180 3629 -3012 -1816 4619 -2456 -2270 3657 -1503 -3299 3591 -94 -3983 2743
2079 2743 226 -3296 1820 1383 -2879 2144 1746 -3189 1693 2301 -3523 1494 2493 -2964 990 3127
2095 3127 -4005 -420 3544 -2780 -1017 3681 -1843 -2304 3673 -938 -3539 4410 -1019 -3588 3600
2110 3600 486 -2762 3748 915 -4229 2414 2024 -4512 583 2804 -3156 1369 2501 -2417 315
2125 315 2803 -3602 -1034 3425 -1845 -1476 3931 -2036 -2259 2920 -795 -1932 3530 -1788 -2193 3439
2141 3439 -314 -3181 3301 558 -3590 2814 2240 -3676 1673 2659 -4173 1600 3048 -4058 160
2156 160 3854 -3402 -645 4457 -2746 -811 4258 -1713 -1460 3271 -2111 -2263 3842 -356 -3178 3495
2172 3495 277 -3310 2856 709 -3210 2827 1709 -2847 2035 1370 -3015 1486 1736 -4488 1087
2187 1087 2795 -3302 -217 3396 -2446 -967 2963 -2530 -1739 3972 -2345 -2453 3718 -1456 -3427
2202 -3427 3236 -81 -3680 3371 649 -3553 1621 943 -3325 1793 1540 -4111 1647 3045 -3633
2217 -3633 -102 3164 -2662 -543 3182 -1644 -192 3555 -1511 -915 3670 -1694 -2340 3723 -1628
2232 -1628 -2403 3702 -814 -3152 2671 1050 -2328 3371 1308 -3831 2504 2531 -3500 1504 2775 -4834
2248 -4834 26 2803 -2563 -1191 3132 -3073 -1259 3441 -2225 -1613 3103 -1674 -2031 3419 -830
2263 -830 -2063 3513 -278 -3200 2656 344 -2605 2278 851 -3981 1960 888 -2822 1365 2384
2278 2384 -2989 280 2130 -3024 187 3832 -3289 -987 3942 -2108 -1580 3200 -758 -1749 3323
2293 3323 -879 -2710 2532 576 -2959 2076 150 -3084 3008 1737 -2544 1265 1416 -2635 1161
2308 1161 2092 -3620 1302 2013 -3269 -227 3471 -2210 588 2756 -2664 -895 4226 -1425 -2570
2323 -2570 3050 -824 -2781 3341 -41 -2469 2718 483 -2789 2695 1324 -3141 1922 1881 -3472
2338 -3472 1580 1714 -2937 105 2366 -2357 452 3001 -2679 -682 2997 -2669 -1256 3433 -2070
2353 -2070 -2007 3573 -504 -2339 2847 -354 -3023 3272 158 -3873 1700 1429 -3164 1578 2020 -3539
2369 -3539 1376 2192 -2458 -31 2946 -2545 -81 2180 -2294 -1180 3064 -1725 -2003 3107 -2460
2384 -2460 -1918 1287 -384 -2253 2653 -599 -2438 2085 236 -2821 1898 1042 -3322 1688 1056 -2429
2400 -2429 1776 2191 -3404 33 3156 -3059 -477 3163 -3127 -1245 3294 -1825 -1337 3767 -1390
2415 -1390 -1304 3203 -1385 -2346 3048 -246 -3036 2224 520 -3134 2875 1036 -3738 1708 1687 -4155
2431 -4155 1259 1441 -2586 -362 2683 -2302 -390 2526 -2517 -447 4192 -1786 -219 2842 -1654
2446 -1654 -1744 2652 -756 -2615 3227 174 -2707 2734 329 -2774 2435 859 -2670 1959 1627 -2957
2462 -2957 1960 2318 -2828 1096 2535 -2706 -44 2571 -2580 -500 3792 -1381 -621 3386 -1056
2477 -1056 -1738 3735 -1114 -1992 3174 -132 -3170 2369 125 -2852 1866 -49 -3441 1694 241
2492 241 -2286 1559 1353 -3005 580 2483 -2576 -148 2535 -3393 -453 3233 -2610 -419 3313
2507 3313 -1524 -2461 3339 -1542 -2819 2379 -1524 -2463 2972 459 -3266 2569 972 -3053 856
2522 856 1180 -4018 1252 2545 -2403 701 2605 -2813 -249 2934 -1557 -490 3243 -2004 -1620 2866
2538 2866 -1128 -1830 2762 -850 -2030 3021 -1399 -1675 3237 674 -2221 2301 509 -3319 1933
2553 1933 863 -2051 999 1698 -3514 1618 2540 -2978 826 3660 -2781 -1116 3091 -2377 -1259
2568 -1259 2982 -1381 -1889 2615 -612 -2286 3275 -488 -2294 3094 718 -3264 2693 1133 -2635
2583 -2635 1923 832 -2665 973 1004 -2754 458 2608 -2366 993 2741 -2728 -185 3287 -2424
2598 -2424 -1832 3456 -962 -1051 2829 -1223 -1413 2763 -191 -1997 2753 -187 -2676 2502 402 -2451
2614 -2451 2091 913 -3116 1227 1640 -2873 1166 1432 -2140 769 1944 -1960 -812 3196 -2155
2629 -2155 -650 3275 -1442 -788 2439 -1060 -1356 2967 -686 -800 2690 510 -3180 1990 748 -2304
2645 -2304 1662 1538 -2722 2254 1773 -2582 1583 1833 -3050 152 2359 -2443 -1221 2429 -1906 -766
2661 -766 2793 -1646 -1219 2780 -2010 -2165 2142 -820 -1877 2343 -685 -2218 1972 406 -1651 1874
2677 1874 830 -2839 1873 1436 -2906 896 1755 -3078 252 2988 -2062 -988 2375 -2159 -1178 2595
2693 2595 -165 -1233 2265 -815 -1778 2935 -1031 -1628 1838 -166 -2363 2344 673 -3093 2015
2708 2015 952 -2445 1516 777 -2355 1027 1299 -2781 -118 1767 -2180 315 2243 -2880 -308
2723 -308 3034 -1720 -1497 2644 -1943 -1855 2369 -779 -2493 2682 -348 -2464 1751 -699 -3309 2313
2739 2313 1176 -3092 1466 2229 -2581 530 1686 -3032 460 2151 -1493 262 1520 -1277 -983
2754 -983 2926 -1992 -1467 2153 -1837 -2324 2873 -1044 -1661 2446 -527 -3096 2877 435 -3308 2038
2770 2038 887 -2612 1608 1377 -2859 1568 1349 -2681 431 2222 -2505 -431 2301 -2270 -969
2785 -969 2496 -1402 -1648 1701 95 -1431 2480 191 -1508 2370 -791 -2066 1903 -345 -2464
2800 -2464 1235 830 -2868 1823 947 -2261 1815 1664 -2289 -357 1980 -3382 154 3429 -2376 -1504
2816 -1504 3356 -1590 -2088 2219 -1109 -1492 2160 -381 -2526 2149 -247 -2053 2352 557 -2790
2831 -2790 1719 896 -1351 1700 1812 -2095 1677 2060 -2714 872 1597 -1712 -621 2453 -1861 -444
2847 -444 2701 -1939 -1638 3848 -1687 -1213 2617 -121 -1766 2195 156 -2178 2236 651 -3070 1840
2863 1840 622 -3166 1082 2030 -2005 625 1881 -2474 609 1500 -2028 4 2220 -1067 -686 2212
2879 2212 -1751 -577 2064 -2121 -1719 2815 -1517 -1999 2869 -332 -1921 2904 -565 -2282 1756
2894 1756 389 -1739 1773 1756 -2456 782 2433 -1868 649 2213 -2513 -348 2294 -2137 -810
2909 -810 2250 -1558 -1670 3145 -1171 -2118 2437 -982 -2354 1813 -468 -2792 1725 -537 -2247 1877
2925 1877 222 -2472 1062 661 -3766 1786 1530 -3109 546 1799 -2069 -92 2546 -986 238
2940 238 1927 -1662 -1484 2679 -865 -1696 3087 -934 -3044 3108 -94 -2549 2102 619 -1892 1393
2956 1393 670 -2175 1837 2454 -2016 902 1613 -2644 615 1232 -1420 482 2475 -3163 -47 2231
2972 2231 -2287 -686 2960 -2194 -2165 2762 -566 -1612 1842 -578 -2080 2233 -1094 -2295 2524
2987 2524 -461 -2527 1445 1779 -2661 746 1820 -2195 288 2036 -1478 -257 2794 -2576 203
3002 203 1658 -1362 -1854 2376 -780 -1042 2226 -794 -796 2022 -1481 -1584 2781 194 -1480 1735 629
3019 629 -2886 1826 1594 -2820 1183 1778 -2611 -52 2576 -2724 180 2230 -2214 -657 3085 -1905
3035 -1905 -1867 2041 -154 -1217 2820 577 -827 2921 -675 -1006 1543 -106 -1401 2080 780 -2144
3051 -2144 1268 807 -2059 1212 -121 -1673 1251 1572 -2096 275 1740 -2644 -364 3268 -2065
3066 -2065 -1016 2628 -1380 -1178 1822 -1477 -1991 1823 -713 -1526 1842 1064 -2620 1972 1131 -1851
3082 -1851 1621 1001 -2108 736 728 -2940 506 1754 -2291 458 809 -1726 -118 1806 -1341 -1077
3098 -1077 2886 -679 -974 2716 -1642 -861 1923 184 -1602 1989 115 -2418 1910 -166 -3254
3113 -3254 1595 1003 -2443 1243 1132 -1787 274 2074 -1737 -419 2093 -2847 -686 1755 -1460
3128 -1460 -182 2318 -1739 -1064 1511 -244 -1212 1866 -967 -1408 1429 -759 -1302 1726 708 -2883
3144 -2883 1676 437 -3147 1282 1557 -2199 1434 1954 -2512 350 1460 -2228 -78 2507 -1878
3159 -1878 -775 2104 -814 -1450 1885 -938 -1335 1361 -841 -1925 1645 104 -1326 1661 1350 -1043
3175 -1043 1878 1123 -2813 1125 819 -1560 661 1180 -2031 150 1672 -2535 -265 1727 -1332 736
3191 736 2760 -1634 -1352 2796 -947 -1385 2052 -834 -2311 2943 940 -1610 2248 100 -1264 904
3207 904 1003 -1473 425 1244 -1881 313 1765 -1273 -372 1556 -1586 -452 1237 -1260 -631 2028
3223 2028 -985 -976 1736 -441 -944 2173 -941 -809 1980 -381 -1750 2154 77 -2281 1404 1878
3239 1878 -2051 714 1445 -1605 -33 1496 -2638 -47 1586 -2237 -360 2179 -1542 -2144 2051
3254 2051 -637 -1053 1745 -333 -558 531 -82 -1042 1925 -385 -1870 1679 -68 -2133 1019 423
3270 423 -2354 1406 1365 -1382 370 1354 -2105 302 1763 -1675 648 1838 -853 -907 1898 -1265
3286 -1265 -1341 1704 -1098 -1406 1959 -1064 -1636 1538 -80 -2467 1006 1553 -1775 1271 711 -1699
3302 -1699 1053 1261 -848 409 454 -2343 959 1928 -1377 759 1543 -1742 -37 2066 -1238 -813
3318 -813 1703 -1441 -1503 1956 -576 -1354 1061 377 -1858 1479 752 -2433 161 413 -1942 593 147
3335 147 -2401 397 1259 -1570 226 1410 -888 -789 1273 -1167 -57 191 -2041 -840 1018 -1176
3351 -1176 -1317 1920 -1163 -1611 2421 -405 -1269 1976 -26 -1821 1641 783 -1994 1200 850 -2248
3367 -2248 1239 1642 -2539 42 1764 -1238 -1008 2409 -1331 -1512 1539 -649 -1532 2492 325 -1364
3383 -1364 1491 -875 -2127 1531 230 -1032 815 -379 -1229 2158 40 -1486 1664 1624 -2592 1170
3399 1170 386 -2258 106 1400 -2158 892 2134 -2181 -268 1560 -1090 -1540 2126 -552 -1446 2059
3415 2059 -620 -1588 1251 -231 -2404 839 -40 -2382 1997 1107 -2179 1676 763 -1664 -1 2049
3431 2049 -1658 -362 1332 -1749 1279 1026 -2080 -448 1438 -1462 -1232 2040 -1325 -825 2636 -1151
3447 -1151 -1115 1399 -157 -1464 1570 -503 -2269 1921 90 -1885 1699 1096 -2394 980 1161 -1367
3463 -1367 828 1063 -1168 309 1635 -1327 -431 1487 -1387 -731 602 -658 -457 1623 -1509 -533
3479 -533 1703 -699 -999 1548 -1341 -1949 999 167 -2539 1554 1191 -1318 147 1380 -1990 250
3495 250 1794 -1454 565 1187 -630 -154 1950 -1244 -756 2288 -563 -668 1760 -463 -1720 1105
3511 1105 -268 -1146 603 397 -1826 1419 -50 -1541 773 821 -2053 933 1857 -2749 972 1012 -1639
3528 -1639 636 1567 -1372 93 1802 -831 -32 1953 -196 -1100 1740 -1043 -1324 1885 39 -674
3544 -674 1520 877 -1876 111 676 -511 1241 1569 -1831 315 1294 -1646 881 969 -634 75 1242
3561 1242 -1337 -60 1592 -1862 201 1890 -1061 -316 1319 -441 -448 2387 -696 -1796 1877 -354
3577 -354 -2386 2402 868 -1678 925 1111 -1954 382 1074 -2014 -410 1797 -1216 111 2161 -1388
3593 -1388 812 1678 -756 -55 1172 -1162 -389 1564 -718 -1802 1493 -437 -1062 1629 -454 -1552
3609 -1552 1517 280 -2073 1295 571 -1923 1896 1056 -1883 737 963 -1392 -551 1982 -1543 318
3625 318 2914 -1349 -766 2079 -1002 -694 2117 14 -1389 1040 -289 -414 1449 -736 -1271 1974
3641 1974 36 -1658 1303 79 -1255 493 1545 -1450 895 1573 -1479 -37 1106 -793 -77
3656 -77 2515 -1682 -594 2537 -537 -1485 1836 232 -1180 1675 -225 -1787 1181 -31 -1249 2340
3672 2340 273 -2071 1539 -92 -1401 964 1241 -899 466 2620 -1563 72 1311 -1181 -719
3687 -719 1815 -406 -714 1336 -232 -144 1547 -15 -1614 1580 -168 -1665 2386 -785 -1947 1441
3703 1441 631 -1861 1658 179 -1967 1048 386 -1245 1459 487 -1585 0 1760 -1498 -461 1635
3719 1635 -933 32 982 -1182 -810 1521 -483 -762 1832 -847 -330 1291 -385 -1680 1574 77
3735 77 -1214 873 93 -1898 710 1379 -2359 1209 479 -1863 778 1202 -1519 -41 1309 -1173
3751 -1173 -779 2898 -556 -430 1749 -638 -682 1293 440 -1346 1539 -105 -1544 1691 860 -2141
3767 -2141 1401 353 -1038 1398 978 -212 702 825 -1024 192 539 -1460 -353 1156 -670 -94
3783 -94 834 -117 -279 1647 -1493 -1148 2214 -564 -1477 1381 -365 -2307 812 125 -773 1435 96
3800 96 -1147 1079 394 -2184 129 1184 -1809 554 1315 -771 304 1139 -1212 -19 1413 -1326
3816 -1326 -622 1317 -542 -631 1667 -981 -629 1115 -205 -913 388 139 -1270 1270 300 -1900 1537
3833 1537 808 -1101 179 1063 -2184 959 1844 -1458 -182 1501 -1056 -185 1990 -1045 -1072 1839
3849 1839 433 -368 1134 -24 -248 2110 -285 -1308 779 -363 -1432 1011 1110 -1504 1564 521
3865 521 -2413 388 1885 -460 -467 1538 -1126 701 1100 -1565 -156 1812 -724 -765 1037 -595 -605
3882 -605 1640 -339 -257 1049 77 -1487 1860 327 -1774 1163 666 -1520 1168 869 -1058 244
3898 244 676 -1850 596 604 -1484 557 695 -866 323 1907 -630 -1036 1418 -396 -1348 1140 -469
3915 -469 -321 2120 -1086 -1021 2236 323 -1437 812 701 -1120 -162 644 -2102 1104 849 -1550 -727
3932 -727 1234 -1836 -922 2011 -806 -966 950 -691 -878 1097 -628 -546 1990 -699 -970 1370 32
3949 32 -632 1527 -618 -1967 1447 26 -1533 830 1209 -1844 1279 1678 -1688 529 1483 -1108
3965 -1108 445 2010 -648 -911 1237 -1379 -254 2100 -699 -1010 1681 -815 -196 817 -344 -1045
3981 -1045 1032 886 -1595 1102 727 -1978 954 1558 -1189 1149 549 -1126 667 1211 -1791 -936
3997 -936 951 -203 -360 856 -1390 28 1522 -39 -780 1410 -183 -1235 1249 -18 -740 834
4013 834 1024 -555 1496 337 -1610 -170 617 -2073 -600 745 -1271 206 1622 -748 479 1540
4029 1540 -1410 213 998 -874 -652 1543 -777 -326 2235 -176 -1448 640 -168 -837 951 -398
4045 -398 -1872 542 -305 -2521 183 1157 -1848 1142 2060 -1059 472 1609 -683 -78 1117 -1194
4061 -1194 -147 1649 -458 -288 1499 -534 -743 1711 -246 -1713 1240 28 -1191 1321 -125
4076 -125 -922 614 841 -1611 470 405 -1392 722 970 -1037 540 1535 -838 -619 974 -677 446
4093 446 1243 -739 -669 1240 94 -1353 1384 14 -219 1734 -97 -1454 707 460 -1575 1320
4109 1320 758 -2556 627 855 -1314 983 1053 -1797 707 1089 -1851 840 1717 -1080 456 349 -1161
4126 -1161 -1477 832 -308 -330 1110 -100 -1810 983 -806 -1360 1282 27 -1245 1125 -780 -1333
4142 -1333 193 1588 -1102 639 1231 -415 500 1254 -739 549 1408 -837 -394 1167 -705 415
4158 415 1408 -486 -990 1029 -180 -580 742 -313 -1212 545 -306 -2246 781 683 -911 1333 1284
4175 1284 -1471 1742 1188 -1331 841 1174 -1640 83 801 -781 -373 1298 -1236 -885 957 -822
4191 -822 -74 671 -356 -834 433 454 -952 1412 406 -973 959 87 -50 741 22 -1109 714
4208 714 542 -879 244 1670 -1431 -29 1538 -562 326 562 -1100 -332 960 -496 -1136 1355
4224 1355 -533 -1009 1197 -439 -170 616 25 -1674 227 290 -138 135 414 -1390 604 274 -1512
4241 -1512 51 444 -1359 -407 1427 -1655 -805 62 -90 -638 1393 51 -465 1090 -1408 -640 1557
4258 1557 375 -934 844 -7 -1898 473 -436 -937 129 518 -1159 683 856 -1126 -518 1765
4274 1765 -1353 401 440 -1587 -222 325 -796 -282 1551 -1169 -1755 853 -155 -820 631 -293 -1357
4291 -1357 105 -22 -1323 1001 143 -983 1413 1164 -1064 1045 477 -694 394 279 -1285 459
4307 459 945 -846 157 966 -621 -906 1480 -865 -96 622 -318 -409 1160 -867 -1218 522 -425 -1464
4325 -1464 1532 911 -1222 257 456 -1399 109 921 -953 809 1415 -1973 134 515 -1247 -313
4341 -313 1327 241 -797 1968 -804 -236 1136 -319 -477 1504 157 -921 258 -541 -440 2211
4357 2211 -299 -870 567 720 -1155 379 758 -1520 582 749 -883 241 945 -1407 -512 490
4373 490 -1295 -983 955 -305 -51 911 91 -767 1050 -304 -1161 829 197 -844 1029 1040 -1185
4390 -1185 942 585 -791 838 1414 -379 102 274 -1237 -86 1332 -858 -602 1341 -1004 -1133
4406 -1133 1477 179 -665 856 -1100 -1291 891 102 -397 1106 38 -318 1565 -520 -1524 1346
4422 1346 767 -848 413 -161 -1511 103 422 -886 192 1134 -1193 233 1549 -258 -171 1813
4438 1813 -621 62 1334 -911 -1062 1168 -58 -11 1353 768 -1084 862 -465 -1184 198 632 -922
4455 -922 -14 566 -1742 622 902 -828 -111 515 -1423 -1055 743 -1080 -439 998 -283 -993 1290
4472 1290 -1364 -645 912 -275 -1335 1259 929 -1030 1336 248 -962 632 96 -1824 1947 353
4488 353 -948 503 1468 -909 1280 857 -1179 -102 518 -638 -170 1479 -848 -683 1684 -340
4504 -340 -1088 1571 310 -524 597 410 -554 1046 -227 -924 211 229 -1427 501 508 -1039 257 535
4522 535 -769 152 314 -846 -74 970 -546 -333 1399 -1190 -1065 1797 -583 -1767 1369 443 -619
4539 -619 410 -492 -712 1117 727 -1552 1288 -126 -1457 1484 406 -521 -10 545 -981 -207 1078
4556 1078 -994 348 568 -633 -279 924 -1121 -207 911 -536 42 1546 -12 -951 221 -603
4572 -603 -754 1956 42 -1213 714 -503 -372 405 789 -459 819 927 -691 527 1041 -1159 669
4589 669 1162 -1087 -912 605 -308 -264 711 -1748 -311 740 -52 -466 -251 167 162 1027 -53 -928 -186
4608 -186 75 -662 887 777 -543 -150 -114 -981 860 1518 -1218 -789 788 -493 -827 2196 -745 -1774
4626 -1774 471 -62 -1078 630 299 -444 246 200 -1554 525 336 -1562 159 193 -1446 -469 204 -619
4644 -619 -83 1084 -1546 514 508 -1549 -7 1112 349 -340 1073 -576 314 1069 283 -710 921 -849
4662 -849 -598 1945 -840 -1850 330 528 -1197 1069 128 -1081 578 793 -644 69 399 -1415 17
4679 17 364 -212 -175 402 -1004 194 1009 -819 -1201 816 -88 -135 874 -403 -242 852 -163 -440
4697 -440 794 632 -568 315 -134 -1540 864 -387 -1690 581 1469 -853 -675 704 -896 -259 896
4714 896 -998 -188 493 -654 -379 1323 468 -494 1339 492 -1005 1000 106 -236 716 -717 -423 410
4732 410 112 -688 1421 221 -997 682 69 -1111 405 1717 -429 317 -2 -717 -105 1470 -735
4749 -735 -289 1423 -646 -962 1335 -376 -846 1039 13 -1071 663 -146 -809 705 779 -1438 612
4766 612 971 -529 194 517 -536 722 463 -1078 -100 427 -1463 -343 875 -1333 -458 1277 -271
4783 -271 -544 1521 -1141 -838 959 -210 -1263 1408 531 -459 932 386 -963 751 973 -542 583
4800 583 1225 -873 433 718 -1085 428 180 -1071 -144 1335 -1097 -706 -308 -68 -401 235 -299 -205
4818 -205 1055 245 -218 1378 -479 -1285 962 478 -756 247 -94 -502 207 1333 103 407 -84
4835 -84 -791 1056 858 -981 -21 1208 -369 -1103 667 14 -779 464 445 -254 1397 -357 -828 1219
4853 1219 767 -1098 857 -230 -1569 704 -773 -544 1036 -91 -732 431 7 -1390 -165 669
4869 669 -1113 895 825 -1395 -329 903 -858 -1426 1181 193 -1121 1176 -433 -1296 1222 254 -817
4886 -817 929 -144 -1494 -84 1431 -1174 335 350 -798 455 -52 -1691 556 719 -1446 -784
4902 -784 1005 -1111 -487 242 -1090 -367 565 -169 -458 724 -724 -668 1396 364 -208 868 -381
4919 -381 -493 1727 31 -1647 -27 1118 -949 526 1479 -157 156 1170 -395 -673 1460 -612
4935 -612 -871 1089 -297 -768 479 -1025 -929 574 -108 -558 1261 22 -334 1069 363 -827 999
4952 999 190 -1024 1200 -9 -753 395 918 -1347 1034 929 -1318 -1049 716 -521 -1013 602 -970
4969 -970 -498 1046 -615 -864 53 184 -823 243 -865 -1519 337 417 -1633 1119 865 -997 577
4986 577 1493 -872 -427 887 -242 -36 412 -479 614 1147 -404 -782 2204 -797 -811 597 -998
5003 -998 -330 612 7 -598 1635 682 -1501 908 -405 -300 874 -145 -409 30 1340 597 431 669
5021 669 -986 323 366 -1103 249 1187 -1192 116 927 -150 -264 1482 -558 -915 1237 -189 -1016
5038 -1016 1315 780 -938 1070 -1058 -1070 433 1318 -884 611 648 -948 243 38 -999 147 1131
5055 1131 -743 122 1057 -1273 -1079 939 -583 -364 1196 -644 -1082 488 -200 -544 149 -284 -799
5072 -799 1230 28 263 310 -57 -688 532 -156 -613 164 257 -518 537 750 -1518 21 1083 -837
5090 -837 72 342 -769 -125 882 -772 -229 549 32 -935 973 -289 -653 350 -379 -580 198 453
5108 453 -195 887 566 -579 86 1322 -1213 646 1256 -1115 259 608 -994 -22 0 -479 -98 958
5126 958 -331 230 1192 203 -1253 356 -217 -620 834 256 -1043 1266 725 -569 298 568 -1152
5143 -1152 590 55 -1030 258 562 -877 -389 614 -47 -628 1050 -333 -471 745 -200 -913 1102
5160 1102 -394 -1236 970 243 15 1041 271 -783 1190 1051 -1809 123 660 -263 825 1311 -1043
5177 -1043 695 752 -983 -8 33 -491 -31 1098 -659 -884 848 -232 -906 644 -819 -495 -8 1125
5195 1125 -233 147 108 -453 998 -447 -1042 -69 202 -1466 522 -31 -766 -86 240 -729 345 799
5213 799 -660 -39 870 -512 667 767 -355 -125 892 -217 -1044 303 -226 -106 666 -250 -552 339
5231 339 145 -588 129 77 -1324 288 535 -1238 -401 910 -458 789 1180 -224 91 716 -276 -167
5249 -167 607 -348 -441 1308 -104 -910 116 -1619 -1254 1045 550 -1275 847 978 -922 -350 723
5266 723 -390 563 644 -804 678 -201 -1481 -544 546 -46 -144 1122 -201 80 1007 403 -619 419
5284 419 23 137 622 180 -546 1410 -424 -919 725 -488 -1230 -153 819 -1551 100 226 -213 692
5302 692 304 -1046 -261 1378 -400 -286 960 -124 -858 -38 -519 -5 289 -335 775 1643 -14 -361
5320 -361 1219 1381 -1181 1162 801 -550 -175 284 -175 408 605 -974 -68 434 -386 -386 1506 -287
5338 -287 -747 713 -629 -278 185 72 -1060 -431 -102 -368 234 -160 -731 232 329 -1253 533 161 -589
5357 -589 574 259 -1120 -271 933 -1404 184 1691 -543 -326 340 -409 -441 112 -1374 -383 428 147
5375 147 140 374 -720 -1126 747 -1 -867 173 -261 -1054 589 401 -934 665 644 -639 270 695 -1025
5394 -1025 -632 1180 -406 -764 951 -223 -82 893 -628 246 137 -805 -494 919 395 -514 1050
5411 1050 -432 -545 476 -40 -511 1182 -332 74 425 684 -773 378 462 -193 431 511 -894 261
5429 261 807 -823 556 356 -5 -164 948 -599 -504 457 464 -468 1128 914 -1078 -39 904 -1281
5447 -1281 1031 417 -1080 359 332 -1240 -18 363 -1473 -546 778 -1142 166 773 89 -139 1134
5464 1134 -586 181 828 -778 -235 767 -432 -1289 511 -411 -1149 936 -464 -1627 685 364 -412
5481 -412 454 318 -962 -755 563 284 -131 -227 -745 219 -21 -964 -665 415 -1014 -796 335 -768
5499 -768 -670 1868 -372 -320 376 237 -816 282 -6 -553 1291 375 -127 1065 1249 -893 432 544
5517 544 -1011 132 951 -468 -175 216 -484 -423 838 -587 -1156 629 192 -306 930 -95 -956 361
5535 361 -107 -206 702 71 -1056 902 914 -661 815 423 -13 230 500 -607 38 882 -680 -232 1378
5554 1378 -275 -287 846 -290 -384 748 -864 101 250 -311 -571 1489 78 -961 155 -408 -734
5571 -734 746 -40 -675 739 1002 -667 1314 918 -958 70 145 -810 291 655 -976 -669 75 289
5589 289 268 1256 -370 172 502 -856 -1354 1182 36 -278 26 -47 275 1280 757 -970 -96 969
5607 969 -866 674 -208 -1639 -61 882 230 -704 408 638 253 556 -352 25 -388 -37 -489 532
5625 532 -941 -1212 1280 760 -409 -248 138 301 409 -50 -388 87 638 -912 810 444 -625 212
5643 212 -542 -183 -750 718 -437 632 201 -647 -771 250 -792 -259 1152 793 -983 440 118
5660 118 -70 546 184 -576 1372 -744 -763 515 -13 -202 1119 348 -980 775 130 -1513 -692 928
5678 928 74 -396 191 -1362 49 1133 -469 -1095 324 188 -746 1027 -227 -1020 750 1106 -1024
5695 -1024 1156 426 -976 -547 457 -460 540 346 -431 449 1142 -380 241 462 -613 1025 586
5712 586 -600 -416 409 51 -307 716 -23 -115 85 -470 -320 978 165 -980 739 888 -247 67
5730 67 1204 -216 -586 917 -629 95 791 -875 -162 -491 -19 468 519 -678 -822 442 -506 -1048
5748 -1048 381 1125 -504 819 -238 -962 765 420 -743 1659 1059 -1435 1168 1444 -959 -180
5764 -180 325 -618 -334 712 -765 313 469 -792 -764 1641 -120 -936 1120 -998 -487 153 -37 -507
5782 -507 883 579 -103 -11 -565 -727 -13 336 -1517 209 -413 -1115 963 594 -340 526 616 -432 -106
5801 -106 -530 -391 -738 679 -527 -22 140 -1004 -399 654 42 -779 559 -118 -182 1059 346 -1234
5819 -1234 345 756 48 547 607 362 125 330 -792 317 609 -1210 -557 98 -605 -357 641 -223 113
5838 113 447 -1142 -158 1715 -958 -13 -366 -1015 -305 1296 158 -1228 -811 171 -163 -6 801 -529
5856 -529 43 -365 -449 -726 409 -279 61 376 -825 172 753 75 -26 710 -75 480 1226 -99 -546
5875 -546 875 542 -959 1105 -641 -444 591 -357 -449 517 909 -923 -458 -14 -514 -54 852 -1004
5893 -1004 663 711 -158 -55 202 -1208 -29 -151 183 -1458 653 -635 -1658 525 128 -70 470
5910 470 -258 -695 205 -298 -499 1049 802 -471 217 583 -902 335 424 -235 -46 216 -1196 550
5928 550 506 -317 402 579 -650 -660 301 -14 -974 -553 86 359 914 193 -287 313 665 -926 817 64
5948 64 -560 -106 525 -424 1050 1298 -453 -552 1964 -140 630 956 16 -227 1028 -902 -915 257 -143
5967 -143 -892 1133 -593 -346 632 -548 -1123 412 759 -598 395 -179 498 -203 58 -275 -544 1366
5985 1366 -170 456 328 -432 216 688 -1145 -341 857 116 -677 454 -244 -1001 250 -630 -617 1207
6003 1207 -588 -763 240 372 -462 1131 985 -777 213 -951 269 892 464 65 470 145 102 24
6021 24 501 -412 -507 98 -106 -394 261 -517 -679 570 -315 -63 1235 312 121 810 74 -514 656 401
6041 401 -1271 -106 -151 -833 1910 338 -675 -5 703 -1001 -824 295 279 -407 310 67 -542 879
6059 879 -359 -627 84 381 -282 951 1067 -319 326 405 -852 444 229 -464 -403 663 -205 -396 45
6078 45 -406 -448 5 461 27 661 7 -197 710 -664 90 1592 -351 51 842 340 -953 1503 -267
6097 -267 708 166 -659 -1019 -76 -80 -925 685 1080 -6 -198 599 -492 775 346 -702 -642 -42 -506
6116 -506 177 135 -581 390 -412 -635 -907 840 153 -599 415 277 346 587 -60 -320 1120 347 -940
6135 -940 550 565 -469 280 723 -327 84 312 -399 -81 396 -531 248 685 -526 -913 -224 -807 -521
6154 -521 462 -515 -446 -36 -1016 -646 1012 993 -954 765 125 -389 1065 688 -549 74 744 -532 211
6173 211 859 58 -100 1064 -68 -340 1121 -722 -589 -54 119 63 -223 -119 -1596 646 -42 -207
6191 -207 1095 -390 -643 -233 326 -656 -261 365 -1155 -457 234 -921 -435 410 -325 -468 1493 -693
6209 -693 285 1511 -61 31 23 -564 -286 672 -460 -936 26 248 -115 828 -147 -644 175 -279 -719 460
6229 460 818 -490 -16 698 -565 122 161 -655 -196 502 -6 -339 540 -637 -64 -183 319 -394 512
6248 512 -6 -1042 989 357 427 671 309 -1152 -67 331 -709 22 131 -421 -534 -46 -787 182 -37
6267 -37 -200 -34 1032 -170 81 -130 44 -287 321 16 92 379 108 -503 547 -479 -617 813 186
6286 186 -320 374 660 -1322 908 268 157 644 500 -239 -549 5 -473 -265 8 -309 287 721 -658
6305 -658 27 1874 -431 108 809 45 -142 770 825 -600 787 -393 -619 -113 449 -870 1226 -404
6323 -404 -1258 86 466 -554 -103 -122 -872 22 454 -58 258 -10 -366 -189 209 -1011 -1692 823 -216
6342 -216 305 490 39 265 513 -11 -59 359 210 -743 100 417 -525 298 200 -419 425 -158 -686 -169 832
6363 832 119 -309 463 -290 -741 987 400 -60 37 251 -431 -304 -265 -570 935 -120 -425 255 -210 -836
6383 -836 667 360 -895 24 264 -929 150 111 -368 -791 231 -324 -738 950 414 -179 257 -168
6401 -168 -890 1387 199 -919 336 309 -729 -393 132 -642 753 -110 41 871 91 247 -269 297
6419 297 21 -744 159 -622 190 295 -228 398 728 -523 38 454 849 -1237 25 -381 -216 207 732
6438 732 -1419 474 -251 -995 88 -584 129 -207 664 567 -383 266 -638 117 732 -838 592 776 -284
6457 -284 -854 580 -319 -948 -109 -397 -875 823 -910 -363 82 -296 -630 1080 5 -1398 438 438
6475 438 -355 699 794 -370 -406 637 -1186 845 257 -470 -514 94 -1018 294 -39 81 -245 756
6493 756 -47 -264 479 -299 13 944 285 -977 108 -335 -394 -156 67 -948 -315 -569 -92 472 314
6512 314 -1101 -27 -508 -817 -37 1188 -350 520 1170 -115 -85 665 -867 -385 344 -208 12 551
6530 551 252 -448 138 -5 -365 578 -163 -270 -485 -811 -396 710 158 -162 212 1659 -159 747 173
6549 173 172 -301 443 -463 -416 31 -663 535 342 -127 160 416 571 -443 -1087 642 -1027 964 874 -1269
6569 -1269 -744 -663 -640 134 1077 -227 131 495 -710 -298 266 264 213 -227 -744 -348 78 -1432 -14 1166
6589 1166 -82 -430 574 -482 -659 1140 139 -314 1356 -366 -1018 470 327 -680 209 550 210
6606 210 -94 554 -578 -75 -374 -54 14 453 -352 -926 599 305 -574 41 170 -146 -63 -71 -99 -473 -636
6627 -636 -281 -53 -38 -432 780 509 -72 -342 542 -253 -143 640 -239 -216 966 -1204 -127 -346 -336 -811
6647 -811 493 -50 -931 165 177 -131 274 294 -552 284 -174 101 -386 -45 -411 512 1151 -700 179 -121
6667 -121 -467 -240 407 -498 72 726 507 690 893 39 253 338 8 -175 63 184 360 982 -901 -1027
6687 -1027 822 -539 -413 311 77 -375 687 389 -2 545 1438 141 -377 1200 -562 -87 804 -16
6705 -16 -201 845 -134 -31 418 415 -171 859 3 -237 638 -565 -324 454 -412 -52 485 -531 -810 -130
6725 -130 907 -314 365 -290 74 632 756 -774 1433 906 -1133 -271 295 -302 -556 196 -97 -531
6743 -531 654 -630 -697 177 -105 309 210 -31 -380 -391 230 -428 -8 284 -572 1 -259 -477 -794 491
6763 491 154 -598 386 -335 267 -218 -293 -206 326 -512 176 1278 131 -869 552 -304 658 19 -149
6782 -149 564 -519 326 -274 199 -657 13 755 552 -261 -465 -41 -729 616 967 504 -407 213 302 201
6802 201 144 54 -320 343 -290 -386 1383 61 -1374 1446 839 613 292 148 -173 447 -329 -762 115 715
6822 715 -607 196 217 -780 31 179 -951 -389 -71 105 -987 663 -4 12 513 332 -283 -162 95
6841 95 -865 540 -39 -630 748 -273 -338 317 -61 -627 314 308 -567 555 423 168 701 -363 96 -211
6861 -211 311 -413 154 775 -835 231 174 107 -313 -5 291 -498 843 -73 -531 956 598 -1419 -330
6880 -330 724 190 727 689 5 -261 762 -692 -151 -184 -184 -99 -684 -201 -602 302 -624 413 1422 557
6900 557 14 -156 -311 -607 143 428 -177 956 460 120 138 545 -457 -261 252 -860 215 230 -107
6919 -107 -4 -15 -66 -113 512 -658 -560 632 15 -830 -526 -367 251 1132 105 -440 102 -322 -412 726
6939 726 97 -326 546 230 -423 370 249 84 573 150 -557 559 1111 -899 -390 -67 -19 -49 50 -837
6959 -837 -303 633 -705 -398 404 69 -1063 117 615 285 659 -491 -418 500 -60 -571 -352 655 -858
6978 -858 1158 1085 -859 -308 428 -282 150 654 -368 -1015 -302 -279 -40 432 -400 -769 638 -255 -226 1456
6998 1456 438 -627 -5 117 -300 781 -733 -648 262 1069 -101 67 -167 -327 -704 34 -1206 386
7016 386 492 -299 -151 -639 -873 -362 548 -407 -821 -2 -1120 -558 215 -290 -394 1290 -32 -514 -288
7035 -288 71 -187 -101 176 -1069 315 557 130 -20 150 -290 525 1090 -19 -1065 1538 32 -655
7053 -655 69 -164 603 320 -519 422 500 413 -505 -335 85 -348 269 87 -666 84 137 244 -355 671 -863
7074 -863 -318 342 -636 324 223 3 485 973 -437 186 62 -225 -592 243 -66 -915 -158 -202 143 508
7094 508 280 -216 962 -500 -561 277 659 -1512 -274 410 -1212 -149 101 128 398 337 -487 381 1314
7113 1314 -656 -329 722 -278 519 -208 379 -946 90 -528 -450 516 396 -523 -191 23 -172 -265 253
7132 253 -761 37 384 74 89 -6 -464 218 -377 -780 -49 619 320 -697 405 -914 367 -33 469
7151 469 58 22 356 158 1326 -171 172 478 341 -181 219 282 -1066 -375 -387 -829 557 366 -567 627
7171 627 1039 -538 -581 984 119 274 253 -101 -405 1015 -220 -871 1503 -33 -229 1025 186 -1047
7189 -1047 974 706 -1224 138 610 -632 526 48 -924 775 265 -1016 -134 557 395 -421 239
7206 239 -615 278 775 -643 -584 327 -600 318 932 -743 -1141 400 278 -15 247 472 -848 -209 984
7225 984 -340 500 982 -458 -105 363 -139 -180 68 20 -307 756 -236 -415 723 -472 274 -175 1275
7244 1275 61 525 -433 -897 149 262 -443 676 420 -78 -309 1130 -420 49 414 -959 -213 955
7262 955 -180 -38 1029 -633 -74 -60 -32 15 323 -451 -132 250 -413 269 609 960 -102 175 -709 -733
7282 -733 -558 358 -888 729 347 -651 -536 157 -356 436 795 12 358 58 -202 -599 597 57 -17
7301 -17 977 591 54 523 82 -55 817 102 -282 508 -492 -219 529 -647 -181 -606 1193 -462 -80
7320 -80 400 -591 95 37 -950 -246 -1 -541 604 -164 -520 -402 587 344 -496 512 29 -645 436 -705
7340 -705 117 -100 63 -724 236 907 -229 179 625 -664 -547 691 -924 945 907 -767 889 103
7358 103 -102 -672 744 -611 263 486 -883 -93 -382 395 -166 709 70 -414 896 90 -983 695
7376 695 1318 78 232 918 -70 38 225 -715 576 994 -403 1160 302 -447 -409 701 663 -1386 1182
7395 1182 447 -732 -498 146 25 244 -620 -740 506 -351 -1084 -189 304 -553 -262 18 -978 113 293
7414 293 -563 431 513 -986 -290 161 -807 -675 227 -161 -295 374 -93 -151 291 -642 153 368 -485 -1324
7434 -1324 742 529 -491 349 401 115 -762 -120 45 491 265 -81 417 624 -699 142 -315 19 -18
7453 -18 317 -39 -60 288 60 -117 80 -859 -223 936 95 -532 258 -195 -429 914 28 333 -49 6
7473 6 -644 -81 1125 -441 792 403 332 -355 407 52 379 823 -975 60 -444 -534 -531 552 -525 -45
7493 -45 209 1140 -1121 147 210 -1032 -366 154 17 -1091 163 351 21 3 -594 24 617 -741 -655
7512 -655 182 128 -245 525 175 -489 1165 457 -560 580 -772 -1168 443 -71 -205 28 -38 118 1058
7531 1058 -100 -768 541 -275 -162 551 825 -777 -439 201 -1027 462 551 423 469 400 260 58 306
7550 306 66 253 467 -345 -415 -80 -117 -652 702 -555 52 772 -94 -736 633 145 111 84 225 -194
7570 -194 293 -735 -586 573 276 -437 6 -376 101 633 -32 185 -287 282 -464 -46 -106 -425 111 409
7590 409 -176 -1020 966 665 -1080 672 497 451 479 380 -130 -322 450 198 -197 618 -766 897 1087
7609 1087 -656 -596 -222 -923 823 711 442 -444 -831 -26 -37 818 -742 -715 515 226 -96 395 78
7628 78 107 -128 116 353 188 817 448 431 134 -539 -31 -337 -731 -486 388 291 821 618 -113 246 203 26
7650 26 -41 -168 -279 -853 8 895 -914 -384 281 114 -150 508 -690 425 -150 -1104 -600 772 -172
7669 -172 -553 615 -464 -136 21 -443 589 119 -744 -633 676 142 -316 1105 -801 -936 233 586
7687 586 -487 -40 -702 -554 101 -778 -775 899 1228 218 -566 162 73 -950 165 -68 77 414 -845
7706 -845 -480 628 -986 -510 584 649 -344 369 97 -182 346 -995 -431 -76 -22 -32 181 -223 -440 529
7726 529 591 -276 -25 757 -843 -8 683 -175 -166 387 -349 542 552 190 464 216 -87 -373 262 -458 -205
7747 -205 -249 755 -13 -2 50 253 140 -227 -198 -313 -16 -612 -472 40 -342 -867 -186 -352 317 -121 -139
7768 -139 -830 301 423 -821 550 210 -192 432 -440 -597 560 -648 -582 719 114 -704 491 553
7786 553 511 -14 1024 468 633 -407 -265 325 -296 -637 759 1108 -584 -218 500 -1024 -549 647
7804 647 -80 138 -360 876 -1191 1247 -504 -288 122 130 -241 429 46 132 -562 130 268 282 214 -1150
7824 -1150 -411 137 396 154 374 -244 488 830 227 -373 -647 -595 -106 269 -526 -424 -352 840 -537 206
7844 206 1115 -703 -157 -256 -149 -507 273 -722 -406 231 -477 264 157 -568 -224 -119 -466 -198 -199 280 -710
7865 -710 620 -79 372 741 -327 519 -60 368 -630 38 116 -276 40 36 663 927 -683 -361 -250 -163
7885 -163 -537 -305 214 -20 -326 152 22 546 155 -830 378 540 330 92 -34 -1392 318 74 -461
7904 -461 323 31 -330 -297 -220 379 258 216 505 -1068 349 482 -961 148 939 342 178 310 -355 501
7924 501 554 -253 -195 721 -59 -39 525 -241 -234 -250 133 574 81 219 -642 275 325 -490 964 381 460 745
7946 745 621 -866 -634 740 212 -491 160 -381 -208 442 -10 -920 -139 14 -705 80 66 280 464 -344
7966 -344 -162 -255 56 386 748 75 27 657 1203 -316 415 -252 -912 357 -136 -266 363 603 -151 628
7986 628 404 593 -942 197 1729 -372 -343 -276 -20 -188 353 -15 40 162 -344 279 -115 -801 -831 653
8006 653 14 -54 170 -479 413 235 -235 251 -374 -122 -308 -346 -149 -123 1106 1 507 -112 -3 -706
8026 -706 -39 -205 -401 -83 522 25 94 491 -11 115 507 -526 -634 574 -379 812 -33 -232 27
8045 27 950 -142 -286 95 555 -149 823 -95 -592 -227 -361 142 279 -200 -230 191 75 -510 75 614
8065 614 -79 -4 352 -679 958 501 -572 162 82 -507 144 -17 168 -143 785 -122 -328 70 169 -348
8085 -348 749 -401 -913 -252 -47 -488 232 -105 -675 1457 -124 -506 309 246 -131 706 -240 226 -175
8104 -175 -242 -340 -148 152 -70 -610 635 -556 606 322 -23 -779 439 299 -216 669 -445 -77 -312
8123 -312 1078 -309 208 284 -1009 -236 172 -510 -308 472 -103 -14 207 317 -1273 -174 -530 -545 631
8142 631 -524 -244 5 -72 808 256 -136 173 -291 -236 -552 718 -570 -561 357 845 -919 -170 476 -791
8162 -791 -412 767 -25 -509 -51 -676 323 -432 65 708 703 144 -411 163 -261 -1058 192 961 582 -275
8182 -275 110 1467 -607 -513 293 -656 322 -75 491
8191D91
##END NTUPLES=NMR FID
##END=
