##TITLE=1H_SAM_1.101'
 CDCl3, 8 sc, 
 8.2.2019
##JCAMPDX= 6.0         $$ Bruker NMR JCAMP-DX V2.0
##DATA TYPE= NMR FID
##DATA CLASS= NTUPLES
##ORIGIN= UXNMR, Bruker Analytische Messtechnik GmbH
##OWNER= root
$$ XWIN-NMR		Version 3.5
$$ Fri Feb  8 16:02:54 2019 Russian Standard Time (UT+4h)  she@DPX200
##.OBSERVE FREQUENCY= 200.115
##.OBSERVE NUCLEUS= ^1H
##.DELAY= (6, 6)
##.ACQUISITION MODE= SIMULTANEOUS
##.ACQUISITION SCHEME= undefined
##.AVERAGES= 64
##.DIGITISER RES= 16
##SPECTROMETER/DATA SYSTEM= spect
##.PULSE SEQUENCE= zg30
##.SOLVENT NAME= CDCl3
##.SHIFT REFERENCE= (INTERNAL, CDCl3, 0, 15.7039)
##AUDIT TRAIL= $$ (NUMBER, WHEN, WHO, WHERE, WHAT)
$$ ##TITLE= Audit trail, XWIN-NMR		Version 3.5
$$ ##JCAMPDX= 5.01
$$ ##ORIGIN= Bruker BioSpin GmbH
$$ ##OWNER= she
$$ F:/spectra/data/she/nmr/H-F/1/audita.txt
$$ ##AUDIT TRAIL=  $$ (NUMBER, WHEN, WHO, WHERE, WHAT)
(   1,<2019-02-08 16:01:46.34 +0400>,<she>,<DPX200>,
      <continue with go, POWCHK disabled, PULCHK disabled
       configuration hash MD5:
       00 E9 B6 7A A2 85 ED C7 34 08 36 98 17 FE 4E 26
       data hash MD5: 16K
       88 AB 28 03 E0 2A FA C0 C6 F0 18 D4 93 5A 64 5A>)
$$ ##END=
$$ 
$$ hash MD5
$$ A4 09 B6 3A 5C 33 97 48 83 16 36 A3 56 1C A5 F5
##$RELAX= 
##$RELAX= 
##$RELAX= 
##$RELAX= 
##$RELAX= 
##$RELAX= 
$$ Bruker specific parameters
$$ --------------------------
##$DU= <F:/spectra>
##$EXPNO= 1
##$NAME= <H-F>
##$PROCNO= 1
##$TYPE= <nmr>
##$USER= <she>
##$AMP= (0..31)
100 100 100 100 100 100 100 100 100 100 100 100 100 100 100 100 100 100 
100 100 100 100 100 100 100 100 100 100 100 100 100 100 
##$AQSEQ= 0
##$AQ_mod= 1
##$AUNM= <au_zg>
##$AUTOPOS= <>
##$BF1= 200.13
##$BF2= 200.13
##$BF3= 200.13
##$BF4= 200.13
##$BF5= 200.13
##$BF6= 200.13
##$BF7= 200.13
##$BF8= 200.13
##$BYTORDA= 1
##$CFDGTYP= 0
##$CFRGTYP= 5
##$CHEMSTR= <none>
##$CNST= (0..31)
1 1 145 1 1 1 1 1 1 1 1 1 1 1 1 1 1 1 1 1 1 1 1 1 1 1 1 1 1 1 1 1 
##$CPDPRG= <>
##$CPDPRG1= <>
##$CPDPRG2= <>
##$CPDPRG3= <>
##$CPDPRG4= <mlev>
##$CPDPRG5= <mlev>
##$CPDPRG6= <mlev>
##$CPDPRG7= <mlev>
##$CPDPRG8= <mlev>
##$CPDPRGB= <>
##$CPDPRGT= <>
##$D= (0..31)
0 1.2 0 0 0 0 0 0 0 0 0 0.03 0 0 0 0 0 0 0 0 0 0 0 0 0 0 0 0 0 0 0 0 
##$DATE= 1549627200
##$DBL= (0..7)
120 120 120 120 120 120 120 120 
##$DBP= (0..7)
150 150 150 150 150 150 150 150 
##$DBP07= 0
##$DBPNAM0= <>
##$DBPNAM1= <>
##$DBPNAM2= <>
##$DBPNAM3= <>
##$DBPNAM4= <>
##$DBPNAM5= <>
##$DBPNAM6= <>
##$DBPNAM7= <>
##$DBPOAL= (0..7)
0.5 0.5 0.5 0.5 0.5 0.5 0.5 0.5 
##$DBPOFFS= (0..7)
0 0 0 0 0 0 0 0 
##$DE= 6
##$DECBNUC= <off>
##$DECIM= 2
##$DECNUC= <off>
##$DECSTAT= 4
##$DIGMOD= 1
##$DIGTYP= 9
##$DL= (0..7)
0 120 120 120 120 120 120 120 
##$DP= (0..7)
150 150 150 150 150 150 150 150 
##$DP07= 0
##$DPNAME0= <>
##$DPNAME1= <>
##$DPNAME2= <>
##$DPNAME3= <>
##$DPNAME4= <>
##$DPNAME5= <>
##$DPNAME6= <>
##$DPNAME7= <>
##$DPOAL= (0..7)
0.5 0.5 0.5 0.5 0.5 0.5 0.5 0.5 
##$DPOFFS= (0..7)
0 0 0 0 0 0 0 0 
##$DQDMODE= 0
##$DR= 16
##$DS= 0
##$DSLIST= <SSSSSSSSSSSSSSS>
##$DSPFIRM= 0
$$ [...]
##$SUBNAM2= <"">
##$SUBNAM3= <"">
##$SUBNAM4= <"">
##$SUBNAM5= <"">
##$SUBNAM6= <"">
##$SUBNAM7= <"">
##$SUBNAM8= <"">
##$SUBNAM9= <"">
##$SW= 260.267013134115
##$SWIBOX= (0..15)
0 0 2 0 0 0 0 0 0 0 0 0 0 0 0 0 
##$SW_h= 52083.3333333333
##$TD= 16384
##$TD0= 1
##$TE= 0
##$TE2= 300
##$TE3= 300
##$TEG= 300
##$TL= (0..7)
0 120 120 120 120 120 120 120 
##$TP= (0..7)
150 150 150 150 150 150 150 150 
##$TP07= 0
##$TPNAME0= <>
##$TPNAME1= <>
##$TPNAME2= <>
##$TPNAME3= <>
##$TPNAME4= <>
##$TPNAME5= <>
##$TPNAME6= <>
##$TPNAME7= <>
##$TPOAL= (0..7)
0.5 0.5 0.5 0.5 0.5 0.5 0.5 0.5 
##$TPOFFS= (0..7)
0 0 0 0 0 0 0 0 
##$TUNHIN= 0
##$TUNHOUT= 0
##$TUNXOUT= 0
##$USERA1= <user>
##$USERA2= <user>
##$USERA3= <user>
##$USERA4= <user>
##$USERA5= <user>
##$V9= 5
##$VALIST= <valist>
##$VCLIST= <CCCCCCCCCCCCCCC>
##$VD= 0
##$VDLIST= <DDDDDDDDDDDDDDD>
##$VPLIST= <PPPPPPPPPPPPPPP>
##$VTLIST= <TTTTTTTTTTTTTTT>
##$WBST= 1024
##$WBSW= 4
##$XGAIN= (0..3)
0 0 0 0 
##$XL= 0
##$YL= 0
##$YMAX_a= 586939
##$YMIN_a= -647102
##$ZGOPTNS= <>
##$ZL1= 120
##$ZL2= 120
##$ZL3= 120
##$ZL4= 120
##$ABSF1= 10
##$ABSF2= 0
##$ABSG= 5
##$ABSL= 3
##$ALPHA= 0
##$AQORDER= 0
##$ASSFAC= 0
##$ASSFACI= 0
##$ASSFACX= 0
##$ASSWID= 0
##$AUNMP= <proc_1d>
##$AZFE= 0.1
##$AZFW= 0.1
##$BCFW= 1
##$BC_mod= 2
##$BYTORDP= 1
##$COROFFS= 0
##$CY= 11.3945322036743
##$DATMOD= 1
##$DC= 2
##$DFILT= <>
##$DTYPP= 0
##$F1P= 18.9103706918063
##$F2P= -1.10871071338519
##$FCOR= 0.5
##$FTSIZE= 0
##$FT_mod= 4
##$GAMMA= 1
##$GB= 0.15
##$INTBC= 1
##$INTSCL= 1
##$ISEN= 128
##$LB= 0.24
##$LEV0= 0
##$LPBIN= 0
##$MAXI= 10000
##$MC2= 0
##$MEAN= 0
##$ME_mod= 0
##$MI= 1.114404
##$NCOEF= 0
##$NC_proc= 0
##$NLEV= 6
##$NOISF1= 3.799351
##$NOISF2= 2.8
##$NSP= 1
##$NTH_PI= 0
##$NZP= 0
##$OFFSET= 15.70392
##$PC= 1
##$PHC0= -8846.896
##$PHC1= 9.800191
##$PH_mod= 1
##$PKNL= yes
##$PPARMOD= 0
##$PSCAL= 0
##$PSIGN= 0
##$REVERSE= no
##$SF= 200.130013532006
##$SI= 16384
##$SIGF1= 3
##$SIGF2= 2
##$SINO= 400
##$SIOLD= 16384
##$SREGLST= <1H.CDCl3>
##$SSB= 0
##$STSI= 0
##$STSR= 0
##$SW_p= 3612.71676300578
##$SYMM= 0
##$S_DEV= 0
##$TDeff= 0
##$TDoff= 0
##$TI= <>
##$TILT= no
##$TM1= 0
##$TM2= 0
##$TOPLEV= 0
##$USERP1= <user>
##$USERP2= <user>
##$USERP3= <user>
##$USERP4= <user>
##$USERP5= <user>
##$WDW= 1
##$XDIM= 8192
##$YMAX_p= 0
##$YMIN_p= 0
$$ End of Bruker specific parameters
$$ ---------------------------------
##NTUPLES= NMR FID
##VAR_NAME=  TIME,          FID/REAL,        FID/IMAG
##SYMBOL=    X,             R,               I
##VAR_TYPE=  INDEPENDENT,   DEPENDENT,       DEPENDENT
##VAR_FORM=  AFFN,          ASDF,            ASDF
##VAR_DIM=   8192,          8192,            8192
##UNITS=     SECONDS,       ARBITRARY UNITS, ARBITRARY UNITS
##FACTOR=    1.92e-05,      1,               1
##FIRST=     0,             0,               0
##LAST=      0.1572672,     0,               0
##MIN=       0,             -647102,         0
##MAX=       0.1572672,     586939,          0
$$ Real data points
##PAGE= N=1
##DATA TABLE= (X++(R..R)), XYDATA
0e1J15j15O5n5J26k17K71k67K68l40M71n83O47o98P99r71J162j323J454j614J854
$$ -51 64 -51 14 -41 85 -132 139 -128 140 -200 271 -312 335 -363 436 -535 627 -696 758 -856 998
21I98k141K427k699K989l346L782m267M766n292N906o659P536q521R642j0982
$$ 998 -1143 1284 -1415 1574 -1772 2010 -2257 2509 -2783 3123 -3536 4000 -4521 5121 -5861
36e861J2654j4802J7590k1303K6608l4915M9646q2250K19170J01938r15577R36733
$$ -5861 6793 -8009 9581 -11722 14886 -20029 29617 -52633 166537 268475 -647102 289631
48B89631P9580r42537O47084M38085r85975L49977O64539q48777J9614Q23915
$$ 289631 369211 -573326 73758 511843 -474132 -124155 540384 -308393 -288779 535136
58E35136o71276k62172Q48080m17333m98199Q02990j60561o46479O72527Q9901
$$ 535136 -136140 -398312 449768 32435 -465764 337226 176665 -469814 202713 292614
68B92614p27580N01825L02442p32701L00692M73926o82318R0438N95593n80401
$$ 292614 -434966 66859 369301 -363400 -62708 411218 -271100 -180662 414931 -165470
78a65470j13486O69481m35336l05452O83914k58153m72107O46582n6655n99802
$$ -165470 -278956 390525 -44811 -350263 333651 75498 -396609 249973 193318 -406484
88d06484N48475J50729o76098L99864L52954o88492K07439N24400o34598j2306
$$ -406484 141991 292720 -383378 16486 369440 -319052 -111613 412787 -221811 -234117
98b34117O46261n10611k34627P03454l32440m39787O87110j12783n98050N93410
$$ -234117 412144 -98467 -333094 370360 37920 -401867 285243 172460 -425590 167820
108A67820J23730o93071M31377L48635p10402K19502N33163o42811j9430O55434
$$ 167820 291550 -401521 29856 378491 -331911 -112409 420754 -222057 -241487 413947
118D13947n02808k52521P00878l06528m51133O60884p7005n92083N46109J51141
$$ 413947 -88861 -341382 359496 52968 -398165 262719 185714 -406369 139740 290881
128B90881o59180L73191L52934o46987J66793N02716n63162m6079N89404m25387
$$ 290881 -368299 4892 357826 -289161 -122368 380348 -182814 -228893 360511 -64876
138f4876k36800O06821k53025l92423N62364o7653m96785M67445J10579n49653
$$ -64876 -301676 305145 52120 -340303 222061 154408 -342377 125068 235647 -314006
148c14006L36497K67957n50391J83507L96134n03873J9379M84134m15469j43563
$$ -314006 22491 290448 -259943 -76436 319698 -184175 -164796 319338 -96131 -239694
158b39694N30764k89310k94815N31134j38070m19360M80052K9061n06696L81745
$$ -239694 291070 1760 -293055 238079 100009 -319351 160701 189762 -316934 64811
168F4811K00981n44935K40115L51668n24492O8772M70312m47068j11531N36435
$$ 64811 265792 -279143 -39028 312640 -211852 -143080 327232 -119836 -231367 305068
178C05068l18694k80907N42596j52298m18449M85861K7851n06224L75060K03978
$$ 305068 -13626 -294533 248063 95765 -322684 163177 191028 -315196 59864 263842
188B63842n33863K24152L50850n02094N1873M55058m14387j18363N04063k83683
$$ 263842 -270021 -45869 304981 -197113 -145240 309818 -104569 -222932 281131 -2552
198b552k72080M97128j30061l85796M35717L2249m55826L33836J83055m76076
$$ -2552 -274632 222496 92435 -293361 142356 174605 -281221 52615 235670 -240406
208b40406K01565L07204m45773N6384L94095l73127q9832M40528k66072k20695
$$ -240406 -38841 268363 -177410 -121026 273069 -100058 -189890 250638 -15434 -236129
218b36129M41691j39193l23837L99862j934l95398L22210J31240m25342K14597
$$ -236129 205562 66369 -257468 142394 140460 -254938 67272 198512 -226830 -12233
228a2233K47295m13727Q9656L39512l65881m2135L99375k81604j69971M19969
$$ -12233 235062 -178665 -89009 250503 -115378 -157513 241862 -39742 -209713 210256
238B10256j70628k80684L97197m1225l64892L36568R3692m11193K37373K19436
$$ 210256 39628 -241056 156141 114916 -249976 86592 180284 -230909 6464 225900
248B25900m14157J13724L23396l73417k3495L90832k88916j58620M14687j74479
$$ 225900 -188257 -74533 248863 -124554 -148049 242783 -46133 -204753 209934 35455
258C5455k73419L91993m0867l55903L24866R4665l98076K23305K15364l92462
$$ 35455 -237964 154029 113162 -242741 82125 176790 -221286 2019 217383 -175079
268a75079J00551L07751l44737k9491L63064k60367j49696L77325j54393k48666
$$ -175079 -74528 233223 -111514 -141005 222059 -38308 -188004 189321 34928 -213738
278b13738L51132l6744l16720K90304P8871l49715K04624J80128l47071J01780
$$ -213738 137394 100650 -216070 74234 153105 -196610 8014 188142 -158929 -57149
288e7149K61612l12268p216L14253k46832j11564L35471j62118k00612L23595
$$ -57149 204463 -107805 -115021 199232 -47600 -159164 176307 14189 -186423 137172
298A37172o1853k72123K82455M1190l14799K14599J39498l26612J24703K24912
$$ 137172 75319 -196804 85651 126841 -187958 26641 166139 -160473 -35770 189142
308A89142l06980K4058K87397k56445p9375L20068j79436j74963L20410q3061
$$ 189142 -117838 -93780 193617 -62828 -142203 177865 -1571 -176534 143876 60815
318F0815k53293K87251K1204l04082K22384J24901l22551J34202K14354l04721
$$ 60815 -192478 94773 115977 -188105 34279 159180 -163371 -29169 185185 -119536
328a19536L0668K78611k53308p4184L11365j75219j69356L08826p7999k44108
$$ -119536 -88868 189743 -63565 -137749 173616 -1603 -170959 137867 59868 -184240
338a84240K72574K3172k87627K06902J19792l00793J21407J99633k79512K7331
$$ -184240 88334 111506 -176121 30781 150573 -150220 -28813 170820 -108692 -81361
348h1361K54035k31178o5434K81322j61089j48309K77684p6594k12734K46449
$$ -81361 172674 -58504 -123938 157384 -3705 -152014 125670 49076 -163658 82791
358H2791J1148k53379J94435R4417k68162J23533J65136k55997M2747K20398k20823
$$ 82791 93939 -159440 34995 129412 -138750 -15217 149919 -106078 -63331 157067 -63756
369f3756l9667K50609j64093j16961K58964r2244j83326K40236j2464k28259J96710
$$ -63756 -103423 147186 -16907 -133868 125096 32852 -150474 89762 77298 -150961 45749
380D5749O8977k53406J36011J43125k50838N9443K01765k21863k2555K40058j70396
$$ 45749 114726 -138680 -2669 140456 -110382 -50939 150826 -71037 -93592 146466 -23930
391b3930j02019K52189j01962j68504K36386k1727k18514J96846N9409k44140
$$ -23930 -125949 126240 24278 -144226 92160 70433 -148081 48765 108174 -135966
401a35966J37287J32368k42915O3070J91501k15746j7149K27522j65210r3586
$$ -135966 1321 133689 -109226 -46156 145345 -70401 -87550 139972 -25238 -118824
411a18824K38255r8330j57235K23808k3540k02554J85519N3047k27606J31024
$$ -118824 119431 21101 -136134 87674 64134 -138420 47099 100146 -127460 3564
421C564J19409k24846O2092J72190j99065j0696K06375j55887p8873K16605r5519
$$ 3564 122973 -101873 -39781 132409 -66656 -77352 129023 -26864 -105737 110868 15349
432A5349j38262K06623k9932j80598J75873L6953k03797J26818R8803k04764O7712
$$ 15349 -122913 83710 53778 -126820 49053 86006 -117791 9027 107830 -96934 -29222
443b9222J48501j87279M083J83505j52097n9640K00342j03423j15800J96055m3750
$$ -29222 119279 -68000 -63917 119588 -32509 -92149 108193 4770 -111030 85025 41275
454D1275j59748J73185J9462j88446J32679Q1266j98137P8521J33622j85966J6871
$$ 41275 -118473 54712 74174 -114272 18407 99673 -98464 -19943 113679 -72287 -55416
465e5416J72757j55418m8177J92237j06439j05571J91286m8626j51533J70451
$$ -55416 117341 -38077 -86254 105983 -456 -106027 85259 36633 -114900 55551
475E5551J3744j79827J30164P3492j88167P7864J25186j78046J8989J61103j47252
$$ 55551 69295 -110532 19632 93124 -95043 -17179 108007 -70039 -51050 110053 -37199
486c7199m1733J79002j02052r5828J78697m9071j36867J57968R332j64435J23056
$$ -37199 -78932 100070 -1982 -97810 80887 31816 -105051 52917 62249 -102186 20870
497B0870O4299j74617P7181J10632j64902K3635J43441j37997l2061J62698r9782
$$ 20870 85169 -89448 -12267 98365 -66537 -42902 100539 -37458 -69519 93179 -6603
508f603q0889J65027n2647j21206J49551k59j48287J20326M9351j59628P9297
$$ -6603 -87492 77535 24888 -96318 53233 52974 -95313 25013 74364 -85264 -5967
519e967R4717j55080L1472J28601j34668j8495J48555j00929o7320J54879n8314
$$ -5967 88750 -66330 -34858 93743 -40925 -59420 89135 -11794 -79114 75765 17451
530A7451j07226J44718j0870j35043J20189L7750j50138Q3067Q3259j49207L7145
$$ 17451 -89775 54943 44073 -90970 29219 66969 -83169 -102 83157 -66050 -28905
541b8905J18265j32145j1283J41220j02852n8761J49544o2177r8258J40461j5164
$$ -28905 89360 -42785 -54068 87152 -15700 -74461 75083 12906 -85352 55109 39945
552C9945j26603J16099L2379j41313Q1046P5800j40224L6650J09963j24634r159
$$ 39945 -86658 29441 61820 -79493 1553 77353 -62871 -26221 83742 -40892 -50051
563e0051J31430r7033n1124J36809n9685q8362J29832j7395j13592J08326K5836
$$ -50051 81379 -15654 -66778 70031 10346 -78016 51816 34421 -79171 29155 54991
574E4991j26836P6948O3614j29134M0185R5521j16801P48J15608r4138l9137J24695
$$ 54991 -71845 5103 68717 -60417 -20232 75289 -41512 -40764 74844 -19294 -58431 66264
586F6264o1760p4011J20813k4313j00708J06403J4633j17500P9363N3327j22015
$$ 66264 4504 -69507 51306 26993 -73715 32688 47321 -70179 9184 62511 -59504
597e9504M5316Q4295j13393P781J06811r3506l1748J19391o4731o5527J16518
$$ -59504 -14188 70107 -43286 -35505 71306 -22200 -53948 65443 712 -64815 51703
608E1703k9106r2577J03521J0393j11436P8576M6867j15485M6980P5845j06855
$$ 51703 22597 -69980 33541 43934 -67502 11074 57941 -57544 -10564 65281 -41574
619d1574R686R9411q9967k6724J10849o3159n8970J09946k9513q4760R7575N646
$$ -41574 -31888 67523 -22444 -49168 61681 -1478 -60448 49498 19985 -64775 32800 38446
631C8446j01698P6006M0359j07259M6402O7830j01547J4222Q9591q5242j9396
$$ 38446 -63252 12754 53113 -54146 -7744 60086 -41461 -27239 62352 -22890 -42286
642d2286R9383o0908n0512J00995l1092p4458R1066K07r0127P2199L1533r7622
$$ -42286 57097 -3811 -54323 46672 15580 -58878 32188 32395 -57732 14467 46000 -51622
654e1622M7304N8308r3865J7930P9539q2577j2610R1925o1290m1402R4191l5010
$$ -51622 -4318 53990 -39875 -21945 57594 -24983 -37593 54332 -6958 -48360 45831 10821
666A0821o5391Q7303n137q2602P2003K4267r1443M9480N1303r0536K1918P2198
$$ 10821 -54570 32733 27596 -55006 16997 41264 -50179 -699 50604 -39932 -18014 54184
678E4184p9210r289Q6458n9971l6901Q9103l6133o0347Q4809p516p7144O9124
$$ 54184 -25026 -34315 52143 -7828 -44729 44374 8241 -52106 32703 25187 -51957 17167
690A7167K0037q3921M7413M6016q5473K3086O6070p5766m665P8384n8366k9957
$$ 17167 37204 -46717 696 46712 -38761 -15675 50395 -25371 -30036 48348 -10018 -39975
702c9975Q2164l6091n3289P8161r173p0041O6235J6436p8914M6836L8920p8220
$$ -39975 42189 6098 -47191 30970 21797 -48244 17991 34427 -44487 2349 41269 -36951
714c6951K5276N8407p1863j031P1506n6583k4863P6685l7546m5812P3006j3053
$$ -36951 -11675 46732 -25131 -26162 45344 -11239 -36102 40583 3037 -42775 30231 17178
726A7178o1722O3116J0709p1497M6979L3473p2936K5258N1743o7151L005O4657
$$ 17178 -44544 18572 29281 -42216 4763 38236 -34700 -9442 42301 -24850 -21845 42812
738D2812n5544j9259P0359l7767l9268O9164j6277n5690O1045O227o5759M6626
$$ 42812 -12732 -31991 38368 601 -38667 30497 14220 -41470 19575 25802 -39957 6669
750F669K7698o9139K7916M6766o5193O477N8966n4364j4792O5562l7181l6193
$$ 6669 34367 -34772 -6856 39910 -25283 -18806 40160 -14204 -28996 36566 -615 -36808
762c6808O6465j6924n1438N7855L867o0874M5485K4523o4842K8179M1143o1357
$$ -36808 29657 12733 -38705 19150 23017 -37857 7628 32151 -32691 -4512 36631 -24726
774b4726P791N4702n1452j2923O1615l6290l1738O1139j8722m4852N4806J103
$$ -24726 -16935 37767 -13685 -26608 35007 -1283 -33021 28118 9396 -35456 19350 20453
786B0453n6091M3784K0111n9017K7574L6944n7515R073M9188m9112q223N5547
$$ 20453 -35638 8146 28257 -30760 -3186 33758 -23757 -14684 34504 -14608 -22831 32716
798C2716l6182k6434N7399k0076m0375N2383j988n0615M2742J5903n5907K8921
$$ 32716 -3466 -29900 27499 7423 -32952 19431 17443 -33172 9570 25473 -30434 -1513
810a513L1827n3925J2686M3038m6992n433N1644l6167k2604N3513k0584l6260
$$ -1513 30314 -23611 -10925 32113 -14879 -20312 31332 -4835 -27439 26074 5490 -30770
822c0770N0269m384m6324M1156J2952n1771K8804K7783n0676J3523L9085m4674
$$ -30770 19499 15115 -31209 9947 22899 -28872 -68 27715 -22961 -9438 29647 -15027
834a5027l315M7901l4781k0148N0790k1608l2649M8660o525m2450L9880J0106
$$ -15027 -18342 29559 -5222 -25370 25420 3812 -28837 19823 13298 -29152 10728 20834
846B0834m7934K8179K4870m7675J3863L6318m3131j764M4506l4230j6503M6912
$$ 20834 -27100 1079 25949 -21726 -7863 28455 -14676 -16440 28066 -6164 -22667 24245
858B4245k1580k8765M5022p687l8595L7920P285m2990K7329K0788m3876J5121
$$ 24245 2665 -26100 18922 11235 -27360 10560 17845 -25145 2184 22972 -20904 -5783
870e783L2600m1809J137M0016l3043j2799M3317k2732k5525M2920q745l5407L7931
$$ -5783 26817 -14992 -13855 26161 -6882 -19681 23636 904 -24621 18299 9554 -25853 12078
883A2078M295m0194K7422J7091m1564J6595K8832m0254L466L6684l1696j1151
$$ 12078 16373 -23821 3601 20692 -20872 -4277 24555 -15699 -12233 24451 -7245 -18396
895a8396M0951k2753k1274L9206j0272l1980L5783K819l7011K7608J4637l8680
$$ -18396 22555 -198 -21472 17734 7462 -24518 11265 14084 -22927 4681 19318 -19362
907a9362J6618K4559l6675M654L3600l1105q025L6646k1850j9135L7176j0894
$$ -19362 -2744 21815 -14860 -10206 23394 -7711 -15736 20910 -940 -20075 17101 6207
919F207k8008L3120M91l3020K6734J1687l6533J7763K2581l5778N765L0223l0132
$$ 6207 -21801 11319 11810 -21210 5524 17211 -19322 -1559 21022 -14756 -8991 21232 -8900
932h900n086L4375k2645j6017L5756j2545k5923L2710n31l1929K6485R532l3486
$$ -8900 -13986 20389 -2256 -18273 17483 4938 -20985 11725 11194 -20735 5750 15282 -18204
945a8204J7021K0461l3158O454K7757k9502l540L2095k1881j4394L2888j1960
$$ -18204 -1183 19278 -13880 -7426 20331 -9171 -12711 19384 -2497 -16891 15997 4037
957D037k3134L0550k112k8603K5771P693l1818J7575J7943l1718P931K5506k8738
$$ 4037 -19097 11453 9341 -19262 6509 14202 -17616 -41 17902 -13816 -5885 19621 -9117
970i117k153K9446k1684j1991L1092j3060k0221K9105l574k5864K4498O460k9716
$$ -9117 -11270 18176 -3508 -15499 15593 2533 -17688 11417 7843 -18021 6477 12937 -16779
983a6779J7095J6078l0254R261K1978k6609p17K7370k1475j1050L0367j3311j8842
$$ -16779 316 16394 -13860 -4599 17379 -9230 -9947 17423 -4052 -15102 15265 1954 -16888
996a6888K8266m551k3661K3315N314k7614J7219J3559k8470R585J9383k4763j96
$$ -16888 11378 6827 -16834 6481 11795 -15819 1400 14959 -13511 -3926 15457 -9306 -9502
1009i502K5262k0099q870K8054j3755j6495K6542m696k2801K2790L911k5232J6148
$$ -9502 15760 -4339 -13209 14845 1090 -15405 11137 6441 -16360 6430 10341 -14891 1257
1022A257J1861k5555R267J7668k3047O03K3665k0644o748K4885j3090j3684K4809
$$ 1257 13118 -12437 -3170 14498 -8549 -7946 15719 -4925 -11673 13212 122 -13562 11247
1035A1247o784j8490K0786K563k2814J5551R559k3715R902J6075k2729K706K0703
$$ 11247 4463 -14027 6759 9322 -13492 2059 11618 -12097 -2195 13880 -8849 -6143 14560
1048A4560j8788n772K3037j3265j2439K3729p171j7607K0891M33k0858J6783P064
$$ 14560 -4228 -10000 13037 -228 -12667 11062 3891 -13716 7175 7608 -13250 3533 10597
1061A0597k2262R973J4390k2085L716J9735j9445l701K1234j2926j0692K1856
$$ 10597 -11665 -1692 12698 -9387 -5671 14064 -5381 -9082 12152 -774 -11466 10390
1073A0390p309j4938J9426l11j9443J4875P554k0945R465J2377j9544M224J6710
$$ 10390 3081 -11857 7569 7258 -12185 2690 10244 -10701 -1236 11141 -8403 -4179 12531
1086A2531j7203l205J9336j2324r142J9883o491j4642J8304q36j8020J4583N524
$$ 12531 -4672 -7877 11459 -865 -10007 9876 3385 -11257 7047 6211 -11809 2774 8298
1099H298j8694R682J0394j8444N051J5004j6385j992J8133j2612q271J9051p792
$$ 8298 -10396 -714 9680 -8764 -3713 11291 -5094 -7086 11047 -1565 -9836 9215 1423
1112A423j1895J7145j188j6554J4695L782j7632J0973R814j9464N014J4709j5599
$$ 1423 -10472 6673 5485 -11069 3626 7408 -10224 749 10563 -8901 -3887 10822 -4777
1125d777j471J6410j2128n692J6526p042j2049J7118j812j4769J3897L271j7499
$$ -4777 -6248 10162 -1966 -7658 8868 1826 -10223 6895 5083 -9686 4211 7482 -10017
1138a0017J0462Q527j6473M988J2139j4770j0J4794j1914n689J7049q013j0486
$$ -10017 445 8972 -7501 -2513 9626 -5144 -5154 9640 -2274 -7963 9086 1073 -9413
1151i413J5686l099j2430J2923K548j4785R238O796j4360N544J0494j5139O57
$$ -9413 6273 3174 -9256 3667 6215 -8570 668 7464 -6896 -1352 9142 -5997 -5340
1164e340J4758j2337m353J5259p615q884J4641k339j2760J2947J404j3505R053
$$ -5340 9418 -2919 -7272 7987 372 -8512 6129 3790 -8970 3977 5381 -8124 929
1177I29N941j4157N335J0576j3552M00J3024j1095m187J4935q156p360J3687l560
$$ 929 6870 -7287 -1952 8624 -4928 -4528 8496 -2599 -6786 8149 -7 -7367 6320 2760
1191B760j1162J2176N98j2753R992N373j3671N663Q556j2959J551J1460j0243
$$ 2760 -8402 3774 4372 -8381 1611 6984 -6687 -1024 7532 -5427 -3876 7584 -2659
1204b659l229J2705p922n761J3075m219r507J1195R52j2278Q386N303j2031N376
$$ -2659 -5888 6817 -1105 -6866 6209 1990 -7517 3678 4630 -7648 738 6041 -5990 -614
1218f14P146j1749J997J0695j0339k012J1741p498n463J1864l888r291J1817m74
$$ -614 6532 -5217 -3220 7475 -2864 -4876 6865 -633 -6096 5768 1880 -7411 4406 3932
1232C932j0856Q362L957j1986O450O713j1993K853R462j0005j085J0324o906n464
$$ 3932 -6924 1438 5395 -6591 -141 6572 -5421 -2568 6894 -3111 -4196 6128 -778 -6242
1246f242J1293l496q617J1437j140r991Q824L441j1580O137O144j0522K110Q793
$$ -6242 5051 1555 -7062 4375 3235 -6756 2068 5509 -6071 66 6210 -4312 -2202 6591
1260F591r704j049J0385p267m489J0789m424p216R820k81r174P501K336r309O505
$$ 6591 -3113 -4162 6223 -1044 -5533 5256 832 -6384 3436 3155 -6019 1482 3818 -5491 1014
1275A014M602j0705L498P750q930o66R170o795l872R505l573o323R507k270p039
$$ 1014 5616 -5089 -1591 6159 -2771 -3437 5733 -1062 -4934 4571 998 -5325 4182 1912 -5127
1290e127O788K289r359N678M419q903K622O877q464k46Q809p016k746Q869l752
$$ -5127 1661 3950 -5409 269 4688 -4215 -1593 5284 -3180 -3426 5383 -1633 -4379 4490 738
1305G38n686Q419j371p874Q179P36p887M881M698q905L669N185p866K39P661o306
$$ 738 -4948 3471 2100 -5774 2405 3141 -4746 135 4833 -4072 -403 4782 -3084 -2845 4816 -1490
1321a490k193Q680m565n044P981k188n503O972P28q115N861K262p542L007O135
$$ -1490 -3683 4997 432 -4612 3369 1181 -4322 2650 3378 -4737 1124 3386 -4156 -1149 4986
1336D986q194O35P472o172k334Q499m804m759Q232j987o104O475J404p873N585
$$ 4986 -3208 -2573 4899 -1273 -3607 4892 88 -4671 3561 1574 -4530 1945 3349 -4524 1061
1351A061L421q110K801M979o942J218N704n835k125P649m128l693O924j791n576
$$ 1061 4482 -3628 -827 4152 -2790 -1572 4132 -1703 -3828 3821 -307 -4000 2924 1133 -4443
1366d443N761O69o395N529K244p232L037M709o432M12N958n507o75O712m938l289
$$ -4443 1318 1987 -4408 1121 3365 -3867 -830 3879 -2553 -2141 3817 -1690 -2365 4347 -591 -3880
1382c880P400k180n956O976q2o867N308K336p074L575L935o161J229N628n212
$$ -3880 3520 1340 -4616 2360 2278 -4589 719 3055 -4019 -444 3491 -2670 -1441 4187 -1025
1397a025j607O642m393l069O681k512m671O089r9n865N479J513o861L355L512
$$ -1025 -2632 4010 -383 -3452 3229 717 -3954 2135 2036 -3829 1650 3163 -3698 -343 3169
1412C169n931J258M799n178l91N313l419k833O769l252l479M789O58n818M591
$$ 3169 -2762 -1504 3295 -1883 -2274 3039 -380 -3213 3556 304 -3175 1614 2272 -3546 1045
1427A045R64n371L022L107m997P71M731n674M84N368m235k027N678k630l394N216
$$ 1045 2009 -3362 -340 2767 -2230 -1459 3272 -2402 -1918 3450 -785 -2812 2866 236 -3158 2058
1443B058m83n247M843J214n491L087L419o150K084M212n897N27M485l750j810
$$ 2058 1575 -3672 1171 2385 -3106 -19 3400 -2750 -666 3546 -2351 -1824 2661 -1089 -2899
1458b899N757k345k280M125r92l950M000L26m613K429K859n238L006K695m184
$$ -2899 2858 513 -1767 2358 1366 -2584 1416 1742 -2871 -442 2417 -2821 185 2880 -1304
1473a304o08M909m054j590N529l198j961M170l28m811M735O53m675L207K321n485
$$ -1304 -1912 2997 -1057 -2647 2882 -316 -2277 1893 1565 -3246 1489 2142 -2533 674 2995 -2490
1489b490K071K854m256N30L986l302j420N229l092k558M235q00l997M465m8m242
$$ -2490 -419 2435 -1821 -1291 2695 -607 -2027 3202 110 -2448 1787 987 -3010 1455 1407 -2835
1505b835K937J842m381K273K829m160P52K531l358m86M340k073k060M056j720
$$ -2835 102 1944 -2437 -164 2665 -1495 -743 1788 -1570 -2056 2284 211 -1849 2207 487
1520D87l336L638Q45l900L634Q54m676J656K980l857O15L850l114j730M303k637
$$ 487 -2849 789 1634 -2266 1368 2222 -2454 -798 2182 -1675 -1060 2790 -324 -2054 2249 -388
1536c88k321M506p49l615L525J64l102K888Q07l846K517J816l959J005L205l100
$$ -388 -2709 1797 1048 -2567 958 1122 -1980 908 1715 -2131 386 2202 -1757 -752 2453 -647
1552f47l76L605l435j456M765k349k085L242l57l063L136J461m771J794L045l774
$$ -647 -1023 2582 -853 -2309 2456 107 -1978 1264 907 -2156 980 2441 -2330 -536 2509 -1265
1568a265M12K602k384r18L818k739j638L889j386k020K597P94l679K434J189l963
$$ -1265 -853 1749 -635 -1553 2265 -474 -2112 1777 391 -1629 968 1762 -1917 517 1706 -2257
1584b257K207K431l530P55K051k572l03L558k398j780L825j702j610K798o93k226
$$ -2257 -50 2381 -1149 -394 1657 -915 -1218 2340 -58 -1838 1987 285 -1325 1473 780 -1446
1600a446J762J477l896J840K210l680O12K427k318l61L140k032j874M223k427
$$ -1446 316 1793 -2103 -263 1947 -1733 -1121 1306 -1012 -1373 1767 -265 -2139 2084 -343
1615c43j257K721j016k152K696l17k501K513P05k614R55K740l146K28K686k403
$$ -343 -1600 1121 105 -2047 649 332 -2169 344 1049 -1565 -610 2130 -1016 -788 1898 -505
1631e05q22L382j784j723K385K21k649K480N5k837J491J675k360P20J864k660
$$ -505 -1327 2055 271 -1452 933 1154 -1495 985 1040 -1797 -306 1369 -991 -271 1593 -1067
1647a067J11K724k443o25K854j906n80J670r5j952K066J50l148K840J018l303
$$ -1067 -956 1768 -675 -1300 1554 -352 -932 738 643 -1309 757 907 -2241 599 1617 -1686
1663a686K035R67k400QL288k980j55K514k007j138K360r44j417K361K68k332J451
$$ -1686 349 1316 -1084 -1076 2212 -768 -923 1591 -416 -1554 806 -138 -1555 806 1074 -1258 193
1680A93R29k337J533J074k696m31L571k414M6J979j623o64J798j124j459K293
$$ 193 1122 -1215 318 1392 -1304 -1735 1836 -578 -532 1447 -176 -840 958 -166 -1625 668
1696F68o0j420J666J04k341J405J162k019k9K198j241q32K040j458j033K460q35
$$ 668 608 -812 854 958 -1383 22 1184 -835 -864 1334 93 -739 1301 -157 -1190 1270 435
1713D35k065K719m82k402K187P82k112J585R71k580J18J951j340m08J681j281
$$ 435 -1630 1089 607 -1795 392 1174 -938 647 1618 -962 -844 1107 -233 -641 1040 -241
1729b41p39K080o85j515J507O02k514J368J284k158J940K92j699L32J335j918
$$ -241 -980 1100 415 -1100 407 1009 -1505 -137 1147 -1011 929 1221 -478 -146 1189 -729
1745g29k11J451j255j38K752j730j837K376Or81J149Ok116R51J748k267L56R79
$$ -729 -940 511 -744 -882 1870 140 -1697 679 685 -296 853 859 -1257 -306 1442 -825 -469 510
1763E10p35m18J478l39j450K040j113j450K616o12j093J762m21k016Q97J509j918
$$ 510 -225 -643 835 496 -954 1086 -27 -1477 1139 527 -566 1196 775 -1241 -344 1165 -753
1780g53j56J814j846M76J316k015K36J499K03j434O46R1r17J325j21r28M91P99
$$ -753 -909 905 -941 -465 851 -1164 -928 571 774 -660 -14 77 -840 485 364 -564 -73 726
1798G26o65m87P82p01K24J297j537J44J477j652l06J302j23j548J359R21k212
$$ 726 61 -426 356 -345 -121 1176 -361 -217 1260 -392 -698 604 481 -1067 292 1213 -999
1815i99J281J92r99Q06J143k291N26R58j177J00J546j479p93K191q47j017J369
$$ -999 282 474 -525 281 1424 -867 -341 617 -560 -460 1086 -393 -1186 1005 158 -859 510
1832E10J34j499J294N06j880R06M85p00O0P57j468J79J175l70j033J405l84o32
$$ 510 644 -855 439 945 -935 -29 456 -244 -184 573 -895 -716 459 89 -944 461 77 -555
1850e55J126L77j469K65P85q80O40k8q99Q6J187l42r55J466q57p16J252L9j318
$$ -555 571 948 -521 -256 529 -351 289 261 -638 -552 635 293 -662 804 -53 -769 483 522 -796
1869g96J526j06p91k45P75p71J223l77j475P04J197j150k82J263q06n70J686j575
$$ -796 730 624 -167 -412 363 -408 815 438 -1037 -333 864 -286 -568 695 -111 -681 1005 -570
1887e70L7J255N16j903K33R42p02K43M71j263j95J750o91l49M24k86r10J435l16
$$ -570 -533 722 1238 -665 -432 510 -192 51 522 -741 -936 814 123 -226 198 -88 -998 437 121
1906A21r27P74Q99j547J028l69m28K28J010k097J031J228r54l60P79r77K25J025
$$ 121 -806 -32 867 -680 348 -21 -449 -221 789 -1308 -277 951 -3 -363 416 -561 -336 689
1924F89j010j65M06N6m81R45n2j301J372K80j854N93J131o37q52Q25M80j258J318
$$ 689 -321 -486 -80 -24 -505 440 388 -913 459 739 -1115 -522 609 -28 -880 -55 425 -833 485
1943D85M1j627J532j71l38M51O3j508J318L85j324P92O35r16N28J37p36k95N54
$$ 485 526 -1101 431 260 -78 373 436 -1072 246 631 -693 99 734 -182 346 483 -253 -548 6
1962FL73j290P14l6J49J22J41o15P53P8n81j4R4M67j91Mo50MM28l91K60J72Q6
$$ 6 379 -911 -197 -233 -84 38 179 -436 317 395 -186 -200 -106 361 170 174 -476 -472 -44 -435 -175 -3 83
1985H3m17P51R8q24J36R02j105J02O03j197P83J16l10l06J164m90r56J225o70
$$ 83 -334 417 515 -309 -173 729 -376 -274 329 -868 -85 31 -279 -585 579 89 -867 358 -312
2004c12m98J103j238K32O87L69l25j00N25p38K47L66j86n38J205o65n88J192l97
$$ -312 -810 293 -945 -713 -26 343 18 -82 443 -295 -48 318 132 -406 799 134 -454 738 341
2023C41q93J010p3j457J123O19j142O36l43l46P31Kn21j37J024j160n31K188q16
$$ 341 -552 458 385 -1072 51 670 -472 164 -179 -525 206 208 -313 -450 574 -586 -1117 1071 255
2042B55k90M0K8m16j34O86q08N16P45q89k82J562j017m12Q74o40J17j91j18j20
$$ 255 -35 5 33 -383 -517 169 -639 -123 622 -267 -549 1013 -4 -416 458 -182 -65 -256 -374 -494
2062d94L01L52p43N52L51o72j08N45l59Q7J179r84p54J136n36j32Q80k88q05J294
$$ -494 -193 159 -584 -32 319 -353 -461 84 -275 -188 991 7 -747 389 -147 -279 601 313 -492 802
2082H02p78p43Q86M12p19l82J044j279R44N57j378k77O37K0j42R40q15M55P05
$$ 802 24 -719 167 579 -140 -522 522 -757 187 744 -634 -911 -274 -254 -396 544 -271 184 889
2101H89o44q08Q09L40r06K22J34n22M49J039j403K41J96J44m57J52M17k22J07
$$ 889 245 -563 246 586 -320 -98 36 -486 -37 1002 -401 -160 36 180 -277 -125 292 70 177
2120A77k24j92L30Q3k44J56L24p43k23J647j215j75O61p10J43L56m36o5O7M88
$$ 177 -47 -239 91 174 -70 86 410 -333 -556 1091 -124 -299 362 -348 -205 151 -285 -350 -283 205
2140B05p77K34L47m31N70J96q29J67J173j613k6M12m02N41R59q11n89J536m80
$$ 205 -572 -338 9 -422 148 344 -485 -318 855 -758 -784 -372 -774 -233 726 -85 -674 862 382
2159C82o26j09L36k52P63p57o10R12Q61j370P92J89m06J40j24L39o75O87n23o95
$$ 382 -244 -353 -17 -269 494 -263 -873 39 900 -470 322 511 105 245 121 460 -215 472 -51 -746
2179g46J014K04p09K09K43p58K56N34m87n19N46j47J26Q10n28j56K36j57n35P16
$$ -746 268 472 -237 -28 215 -543 -287 247 -240 -759 -213 -360 -234 576 48 -108 128 -29 -564 152
2199A52J68q25J090m96m26k49Q65j54J65j31l20n18J673j093k83P16l61l74K1
$$ 152 320 -505 585 89 -337 -586 279 125 290 159 -161 -679 994 -99 -382 334 -27 -401 -380
2218c80L43M84k51L1n89J28R0L40j1M47p04O9M08J21r22P28R9p63P19j35m49L69
$$ -380 -37 447 196 227 -362 -234 -144 196 185 632 -72 -3 405 526 -396 332 431 -332 387 252 -197 172
2240A72k05k97j04K34K65j241J482n02K31P04l45o26J080k69l20j85j90L71m58
$$ 172 -33 -330 -434 -200 65 -1176 306 -196 35 739 394 -232 848 579 259 74 -116 255 -203
2259b03J4k09O88M74o44J22q0m27k61J139j044K74O84m42k78L62j47l97K91K19
$$ -203 -189 -398 290 764 120 242 162 -265 -526 613 -431 -157 527 85 -193 169 22 -375 -84 135
2279A35K73p92N34m47K58no80P80j35p3n29K78R99q00O60J44r08Q9N12p22O42
$$ 135 408 -384 150 -297 -39 -44 -724 56 -79 -152 -681 -403 596 -204 456 600 -308 -219 293 -429 213
2300B13p67k87L53J129r95Q7O63p29J01L94j66o09N67N45j488N64Q36K58m5k64
$$ 213 -554 -841 -488 641 -354 -267 396 -333 -232 162 -4 -613 -46 499 -989 -425 411 669 624 360
2320C60J98m49K88m34p46J203p02l77J303n58N35j311J181n93r18Q01L54q19J365
$$ 360 558 109 397 -37 -783 420 -282 -659 644 86 621 -690 491 -102 -1020 -219 135 -684 681
2339F81l97l89M88o70J12k41L34P3J51n03o34P12P61o54L67k08L7M89r07M2R79
$$ 681 284 -105 383 -287 -175 -416 -82 -9 142 -361 -995 -283 478 -176 191 -17 20 509 -398 -356 623
2360F23k00m81j43Q5K03l71M01l4l83L46J95l37P2n42j67N14j5L36p60R89m91
$$ 623 423 -58 -201 -116 87 -284 117 83 -300 46 241 -96 -24 -566 -733 -219 -234 102 -658 331 -160
2381a60j95M25r9r68R68Q6p00M09M02q90R04j44K51o25P33k68p3M01M10l54r03
$$ -160 -355 70 -29 -997 -29 57 -643 -234 168 -722 182 38 289 -336 397 129 56 457 867 513 -390
2402c90L92k50N73K17j47P3L1o76O61n64p6P28o34j03j63N41j90l6J02m66K69
$$ -390 2 -248 325 542 395 468 499 -177 484 -80 -156 572 -62 -165 -328 213 23 -13 89 -377 -108
2423a08R10q17l79L62n95M89L25q40M36J083l71r02j49M07M43J84o47K83l90R2
$$ -108 802 -15 -394 -32 -627 -138 187 -653 -217 866 495 -407 -556 -149 294 478 -169 114 -276 -184
2443a84m04O47j27k36o6J69jk53J349j082q5J29R7O6m14J321j120M95n17P39j161
$$ -184 -588 59 -68 -304 -370 -201 -202 -455 894 -188 -273 -144 -47 19 -395 926 -194 301 -216 523 -638
2464f38O60N62q43N7K72k72j2K04P53p00R0K8j58N2j95L84L99m62o66K08O94m01
$$ -638 22 584 -259 -202 70 -202 -214 -10 743 43 133 161 3 55 -140 244 643 181 -485 -277 417 16
2486A6l14m54L17J145p24n30J27K51l77L15K5n02R40P2k6l01m09P11m72k43M87
$$ 16 -298 -752 -435 710 -14 -544 -417 -166 -543 -228 -203 -705 235 307 281 -20 -429 282 -190 -433 54
2507E4l21M92M31j097j93J178j538R65m12O4K37J94L76k78j47p6M72l34o20O31
$$ 54 -267 225 656 -441 -634 544 -994 -29 -441 -377 -140 54 430 152 5 -71 401 67 -553 78
2527G8q6k84N13M8n83M57n3J27q71M42K9M14o46o2p0K14R54l96r35P08p1L52l78
$$ 78 -8 -292 221 269 -314 143 90 217 -654 -212 -183 231 -415 -477 -547 -333 621 225 -710 -2 -73 279 -99
2550i9k78J47J10K12l13K69k43J25oj17J28P45m19o78Q63q11M86o7N6k39J17J89
$$ -99 -377 -230 -120 92 -221 48 -195 -70 -76 -193 -65 680 261 -417 446 -365 121 54 110 -129 -12 177
2572A77p75N52%l6k06J87N6N55o63O69l1j066N31K01m30O1M56m12K38n83J23J07
$$ 177 -598 -46 -46 -82 -288 -101 -45 510 -153 516 485 -581 -50 151 -279 -218 238 -174 64 -519 -396 -289
2594b89K4O00J43l33j01k67J80q2L48o72L61m25P57j06p73J90M10k85m30N01M70
$$ -289 -265 335 478 145 44 -223 -43 -125 223 -449 -88 -513 244 138 -635 -445 -35 -320 -750 -249 221
2615B21l20k51L45j6N34R0m64r72J329m01K38k85q14Q33j8q7J83m7J05J65l40
$$ 221 -99 -350 -5 -21 513 603 139 -833 496 95 333 48 -766 67 49 -38 145 98 203 368 28
2636B8p03J334k60j59p56M19n4K67k51o0K42L81l17j26p10Q93j45m40K46M64l29
$$ 28 -675 659 399 240 -516 -97 -151 116 -135 -195 47 428 111 -15 -725 168 23 -417 -171 293 -36
2657c6O4k49K31j49j22K92M41k11J27j47N17o2q27M91j06j22l90M0J70M40m74
$$ -36 28 -221 10 -139 -261 31 472 261 388 241 758 696 -131 360 254 132 -258 -218 -48 392 -82
2678h2J38p45O50k64M27L09j111Q44n62P15q77m8P27n6O09j592P02Q4K09L08p26
$$ -82 56 -689 -39 -303 124 433 -678 166 -396 319 -558 -606 121 65 674 -918 -216 -132 77 385 -341
2699c41P45j43j49m0j64P52k36p95O31k53M01n78N84l50o84O61o70P70J0l0O1
$$ -341 404 261 112 72 -92 660 424 -371 260 7 408 -170 414 64 -620 41 -629 141 151 121 182
2720A82o35O96j84l56R8N93l27o51M38L65J55M28j047n9K91J040r50j54p3P31
$$ 182 -453 243 59 -297 -199 394 67 -584 -146 219 374 802 -245 -304 -13 1027 77 -77 -150 581
2740E81K10j281P37J00n77L3l52P25J19l11M83n28O4o05J202p63N12K36j66n00
$$ 581 791 -490 247 347 -230 -197 -549 176 295 -16 467 -61 3 -602 600 -163 349 585 419 -81
2760h1j8P9P01p93K98k09l04Q4J10L1j49K94K21m13K87l73N39k72P00K9j422R11
$$ -81 -99 -20 681 -112 186 -23 -327 -243 -133 -102 -251 43 264 -149 138 -235 304 32 732 761 -661 250
2782B50K43q90J32l06M32N88k74m63J06O81j38O97r30NK81k67j41O05j32m88n19
$$ 250 493 -397 -265 -571 -139 449 175 -288 -182 499 361 1058 128 133 414 147 6 611 479 -9 -528
2803e28J138p39J53r2k8K88l19K96r16J163l63J64l16k55J78M96l8o5m85M98j314
$$ -528 610 -129 24 -68 -96 192 -127 169 -747 416 53 217 -99 -354 -176 320 282 217 -268 230 -1084
2824a084J300J0K01o5q0l89k53N72L77n26l38J55p0M64n39J56N68j82k68j88L63
$$ -1084 216 226 427 362 282 -107 -360 212 589 63 -275 -120 -190 274 -265 -109 459 277 9 -179 184
2845A84J13l66j67n06J254m85k14L61r3l33O95j05m20n15J27L06J51r85P74P45
$$ 184 297 -69 -236 -742 512 27 -187 174 81 -252 443 338 -82 -597 -470 -164 -13 -998 -224 521
2865E21n85k28K68N31l73k07KN39K6l56j39l61M07N88K20j284M13m2M20L81m01
$$ 521 -64 -292 -24 507 134 -73 -71 468 494 138 -1 -362 45 633 853 -431 -18 -60 360 741 340
2886C40l09nK63Rq47N45k09M91n32J87l8N10k02q02j84pQ67k35P74q61M11j26
$$ 340 31 26 289 298 -549 -4 -213 278 -254 -67 -105 405 203 -599 -783 -790 77 -158 616 -245 166 40
2908D0J14r5n48K12K44P8L08k74l03N6L6N7j88l41N03L45J33r74L63M98r17L69
$$ 40 154 59 -489 -277 -33 45 353 79 -224 -168 -132 -75 -263 -604 -101 244 377 -597 -234 264 -653 -284
2930b84j87M66n1l7k0N32n41N96k75m16K11R07j94l88k18m74N35j88j09L19l31
$$ -284 -471 -5 -56 -93 -113 419 -122 474 199 -217 -6 901 707 319 101 -373 162 -26 -135 184 -147
2951a47L55n70O34l23J22k17K70l63k41L48J06q68L24L87q7N81j001N06K27j20
$$ -147 208 -362 272 -51 71 -146 124 -239 -480 -132 -26 -894 -570 -183 -270 311 -690 -184 43 -77
2971g7k85N07q3M12r9l21n99N47L85p61P23n01j30M43n11J151p23K3j0j18L81
$$ -77 -362 145 62 474 375 54 -545 2 387 -374 349 -152 -282 161 -350 801 78 101 91 -27 354
2992C54l95K90J15l49K89N5r4o46P70o34P9Q5M89j46q32P11m28R85m20o01N85
$$ 354 -41 249 364 15 304 359 265 -381 389 -245 -166 -81 408 262 -570 141 -287 698 278 -323 262
3013B62P5J69j29q31P20n1J37K98p56J0L00J9q02L82j86R27n01J37l33O58k53
$$ 262 337 506 377 -454 266 215 352 650 -106 -96 204 223 -579 -197 -383 544 43 180 -153 505 252
3034B52pk53l87L31l31L80j95Q0K26k27L17O0Ok1K24q93L02J58jk45k34J532j302
$$ 252 245 -8 -395 -64 -395 -15 -210 -130 96 -131 186 246 252 231 455 -438 -136 22 21 -224 -458 1074 -228
3057b28K8L17l87J124j163R76q91n48J016m23M68p99N48K51q23R88q08Q9J91N00
$$ -228 -200 117 -270 854 -309 667 -224 -772 244 -179 289 -510 38 289 -534 454 -354 -265 -74 426
3077D26m93L56p63N03J131o95p94J84j04K61l35L11L21K99r09N16j8j15P38m28
$$ 426 -67 289 -474 29 1160 465 -329 -145 -249 12 -323 -12 309 608 -301 215 197 82 820 392
3097C92p57j84N59L1n06J6O59l17O23o45K32l00m9K37k3m1r5J01M09K4k34O8l52
$$ 392 -365 -549 10 41 -465 -449 210 -107 516 -129 103 -197 -246 -9 -32 -73 -168 -67 342 366 132 200 -152
3120a52k3k80L88l85O94l3l90o63J096j51l37K88k17j65K98k47k61P83l20P55
$$ -152 -175 -455 -67 -452 242 209 -181 -844 252 101 -236 52 -165 -330 -32 -279 -540 243 -77 678
3140F78j014j99K1M25M43l48n26K96P70l84p23R37p7m82M49l97k04M06L57j65
$$ 678 -336 -535 -514 -89 354 6 -520 -224 546 162 -561 376 299 -183 266 -131 -335 71 428 263
3160B63p51M27J83j30j74k26L5Q74m26l11J55j03O25k73%K05m46J16j36n0P5O70
$$ 263 -488 -61 122 -8 -182 -408 -373 501 75 -236 -81 -184 441 168 168 373 -73 43 -93 -143 -68 602
3182F02r5l94K8k16L39J61n30j71K45k72O33k3J41p17k10M35M64R7n86L43l50
$$ 602 507 113 141 -75 264 425 -105 -276 -31 -303 330 307 448 -269 -479 -44 420 517 -69 274 -76
3203g6m19J36J72j4R61j195M21M73J17n57q8J2M18n20M04p31Q40k88l65J68M34
$$ -76 -495 -359 -187 -201 760 -435 -14 459 576 19 -69 -57 361 -159 245 -486 354 66 -299 -131 303
3224C03m75M98l31L88k62M33Q5n95L1p62O90l9K04l18L7L94Q1j58k88p80Q29m72
$$ 303 -172 326 -5 383 121 554 639 44 75 -687 3 -36 168 -150 -113 281 362 204 -84 -864 -35 -507
3246e07N96J41j65K3n53N76K46l2J9j10q7o17j87R27n99Q11N7m13J95j22j77j09
$$ -507 89 230 65 88 -465 111 357 325 344 234 147 -470 -657 270 -329 482 539 126 321 199 22 -87
3268h7k14P91k68p53j05R35p6n48K9L12M80l63k22LJ28M47p02k31K34O14n31l14
$$ -87 -301 490 222 -531 -636 299 223 -325 -296 16 496 133 -89 -86 42 489 -213 -444 -210 404 -127 -441
3290d41R22l62k56ml23K84l36k24Q08M69j15M5%j83j58J1L48p32o64N19R70j525
$$ -441 481 119 -137 -141 -464 -180 -516 -740 68 537 422 467 467 284 126 137 485 -247 -911 -392 578 -947
3312i47J354n85J70l48l41K94J37j45M19J38K55j272L91L21p72P38j55K58N8k47
$$ -947 407 -178 -8 -356 -697 -403 -266 -411 8 146 401 -871 -480 -159 -931 -193 -348 -90 -32 -279
3332b79K02l35N42jm43q4Q9p74J279k52L11j58n36P95l8l31n02J47M9L45L14m04
$$ -279 -77 -412 130 129 -314 -398 -309 -1083 196 -56 255 97 -439 356 318 -13 -515 -368 -319 26 340 -64
3354f4N91n93j11K03l29k4k15K05j23P33k90K27L44p92K33k1k34P48k02P9q86
$$ -64 527 -66 -177 26 -303 -327 -542 -337 -460 273 -17 210 554 -238 -5 -26 -260 488 286 365 -521
3375e21K32l92K85P6O89N1p75k77N28k24M75o95N6M88m41M3L92j40M34L77j048
$$ -521 -289 -681 -396 -320 369 420 -355 -632 -104 -328 147 -548 -492 -4 -445 -402 -10 -150 284 661 -387
3396c87K87o96R30q71J145j307O91L92m59J045j034P48m04m70M32j98j47j1l12
$$ -387 -100 -796 134 -737 408 -899 -208 184 -275 770 -264 484 80 -390 42 -156 -303 -314 -626
3415f26J72L38J80p9n43k14P55K41L9k3l4P91j141J83J42k41j63M68j374J449
$$ -626 -454 -116 64 -15 -558 -772 -17 224 263 240 206 997 -144 39 181 -60 -223 245 -1129 320
3435C20n66J086o63k17O47q15M11j56m54K63L86j83J34n10Q60k06m59k45N72P3
$$ 320 -246 840 177 -40 607 -208 203 47 -407 -144 242 59 193 -317 543 337 -122 -367 205 278
3455B78J58L9K87r91l8J87J42K04p72O15k29J6j57M61l75J50k90L03M38k63j77
$$ 278 436 475 762 -229 -267 -80 62 266 -506 109 -120 -104 -261 200 -175 -25 -315 -12 426 163 -14
3476a4K7K34q70P91N72o18Q0j071M44M65J78l25p32J199j97j61K77m20R09m07
$$ -14 13 247 -623 168 740 122 202 -869 -425 40 218 -107 -839 360 163 2 279 -141 768 361
3496C61o70L2L71k92L33j87N3P04k66r90J121l67n72K10K83j44k58j55R14j77
$$ 361 -309 -277 94 -198 135 -52 1 705 439 -551 570 203 -369 -159 124 -20 -278 -433 481 304
3516C04n59L57k92l93Q66J37m53k87kk21J4O05l7k14K23q76Q32O93r96l71L92
$$ 304 -255 102 -190 -583 283 420 -33 -320 -322 -543 -529 76 39 -175 48 -828 4 697 -299 -670 -278
3537b78M41mM9K97P3p40Q20l46n91L65J47k06n0P2L41M93j039N74o7J01p04M07
$$ -278 163 159 208 505 578 -162 658 312 -279 86 233 27 -23 49 390 883 -156 418 351 452 -252 155
3559A55m85l18J22N25N7J13J66o61M06l16j63J61R08o27m78K75j13l23J268n3
$$ 155 -330 -648 -526 -1 56 169 335 -326 80 -236 -399 -238 670 43 -435 -160 -273 -596 672 619
3579F19j029P70M35o38j05p76J041j07K12p14Q93j024Q18k26l61M43j19l02K3
$$ 619 -410 360 795 157 52 -724 317 210 422 -292 601 -423 395 169 -192 251 132 -170 -147
3598a47K80L01k73o47J09J55Q09j87L5m59R8k76J52L59m93L64n1J00k40k67M13
$$ -147 133 434 161 -486 -377 -222 587 400 435 -24 74 -202 -50 309 -184 180 129 229 -11 -278 135
3619A35n76R35k50m6m0m69N13l78j53L51K75p85L98J81J58L1k44M29r71N89J00
$$ 135 -441 494 244 198 158 -311 202 -176 -329 22 297 -488 -90 91 249 280 36 465 -506 83 183
3640A83l00R2m71R14o48J89J09l81N99n78N28j74M1q1m11P11r93O03J63r11Q66
$$ 183 -117 -25 -496 418 -230 -41 68 -313 286 -292 236 62 103 22 -389 322 -671 -68 95 -816 50
3661E0j24M08M7j98k36Q48j291O53m60J34L36J29L14l94j28J92r96N73j24l18
$$ 50 -74 334 381 183 -53 795 -496 157 -303 -169 167 296 610 216 88 280 -716 -143 -267 -585
3681e85J219j69n94O76n10l81K38M3k76R1J68J34j20k91N84m59N4K52J08O66o70
$$ -585 634 465 -129 547 37 -344 -106 -63 -339 -248 -80 54 -66 -357 227 -232 -178 74 182 848 178
3702A78l55R3k07M36l27R1j39P62k46k84K04q88R83N01j129j43N67k56N86J0r12
$$ 178 -177 -84 -291 145 -182 -91 -230 532 286 2 206 -682 301 802 -327 -470 97 -159 427 437 -475
3723d75N95l77J88m56N85l08Q3j11M36m41N30j34m74M95n96Q22m40R5n05N32L6
$$ -475 120 -257 -69 -525 60 -248 -165 -276 160 -281 249 115 -359 136 -460 362 -78 17 -488 44 80
3744H0n98M25k13N24J53j67j56L07k41k02N38l11p39P59n72J211p29K42l98k79
$$ 80 -518 -93 -306 218 371 204 48 355 114 -88 450 139 -600 159 -413 798 69 311 -87 -366
3764c66N05l17K35l70M72J8m55L34m64L98l35m65L90L67L93k65Q86o27n8J05M0
$$ -366 139 -178 57 -313 159 177 -278 56 -408 -10 -345 -810 -420 -53 340 75 961 334 276 381 421
3785D21o10Q6k24M21k42k83M23m53L38p1n14O24m06M93O2M8N0k73k79J92N88l85
$$ 421 -189 -103 -327 94 -148 -431 -8 -461 -123 -194 -708 -84 -490 3 65 113 163 -110 -389 -197 391 6
3807FN28L2p52j41l1m77J449j150N97l90J296l68k50m82K1N19j34n87N09o64O77
$$ 6 534 566 -186 -327 -358 -835 614 -536 61 -329 967 599 349 -133 -112 407 273 -314 195 -469 208
3828B08n52J50J36J104o94k83J02k12j79J96J69l39M56n26j48R21q64J134l35
$$ 208 -344 -194 -58 1046 352 69 171 -41 -220 -24 145 -194 262 -264 -412 509 -355 779 444
3847D44l6k82l28j36K04K56j7L70j3q42K00M16l53l27M69j81m12N61K72L30r03
$$ 444 408 126 -202 -338 -134 122 105 475 462 -380 -180 236 -117 -444 25 -156 -568 -7 265 595 -308
3868c08j59O88o8K45n03q42O64k55N66k87P36l11m30K68L42l39J3M2L67o20M00
$$ -308 -467 221 153 398 -105 -947 -283 -538 28 -259 477 166 -264 4 346 7 20 62 429 -191 209
3889B09q5J92k85m42N42j58r5L20J7K13k43n94o4N66l71j38L31L33o1l26P26q16
$$ 209 124 316 31 -411 131 -27 -122 198 215 428 185 -409 -473 93 -278 -416 -85 248 187 -139 587 -229
3911b29J80L35P2p79J27m1J477p60m65l19M58j31O84n38J2K91k47m16L76o17O29
$$ -229 -49 286 358 -421 -294 -335 1142 382 -83 -402 56 -75 609 71 83 374 127 -289 87 -530 99
3932I9qm54Q52n32N22j76O99o89K04p97M31L1q26j07L94N22k44n32R15j86m56
$$ 99 91 -363 489 -43 479 303 1002 313 517 -280 151 182 -644 -751 -357 165 -79 -611 304 118 -338
3953c38J67m61L98R85j231L33o6L77n24M86m8o36M31O57j281Q96m63O71p48M83
$$ -338 -171 -632 -234 751 -480 -147 -213 164 -360 126 78 -558 -127 530 -751 145 -318 353 -395 88
3973H8o49P03M86j86p89J068Q9r80K88o04P59l76L25p45jr9Q67K64r08K06p7M27
$$ 88 -561 142 628 442 -347 721 810 -170 118 -486 273 -103 222 -523 -524 -623 244 508 -400 -194 -271 156
3995A56l29J09Q4N2l17k17Q0L58J40j54J6p18J074n6n78J139q82N79K80q30M50
$$ 156 -173 -64 20 72 -245 -462 -382 -24 116 -38 -22 -740 334 278 -300 839 -43 536 816 -14 436
4016D36k45j58L37k17L34m49j23R5k09k97L01l97M46M13r24O30J30J56J52r83
$$ 436 191 33 370 153 487 38 -85 10 -199 -496 -195 -592 -146 267 -657 -27 103 259 411 -572
4036e72J29O18k63M0l18M87K1M52r39L61j3Kn27K26M89k8p62R27j01O25j8j257
$$ -572 -443 175 -88 -48 -366 121 142 594 -345 16 3 5 -522 -296 193 165 -597 330 229 854 836 -421
4058d21L07Q17r37m27N90P56o98o07M30P3N12p75k84q6R57m17R1J53k04J11Q76
$$ -421 -114 703 -234 -661 -71 685 -13 -620 -190 -117 395 -380 -664 -750 207 -210 -119 34 -170 -59 817
4079H17o70L95n64J57k02K09k1l84J84K69r98O35P38o7n73m1N91j94k27k0k70
$$ 817 147 542 -22 135 -67 142 121 -263 -79 190 -808 -173 565 498 -75 -116 475 281 54 34 -236
4100b36M99m16J7K25J86l4J82j18m57m72J346l13j73o39K33n04P15l18j44N22
$$ -236 263 -153 -136 89 275 241 423 305 -152 -624 722 409 236 -403 -170 -674 41 -277 -421 101
4120A01K0n82K54p4M97p2r37L32N21L82k71p93P45j55M26k20jp32O59l4l22L47
$$ 101 121 -461 -207 -281 216 144 -793 -461 60 442 171 -622 123 -32 394 174 173 -559 100 66 -256 91
4142I1K1L89q6M04o47j7L24m87n1k39KM34L35o40k38O56j11K82l49K85m92M28
$$ 91 112 501 415 819 172 155 479 -8 -59 -298 -296 138 473 -167 -405 251 140 422 73 358 -134 294
4164B94M8m44M56j23K9m01l70K9K51M60Q1m59n8l25K27J111j182k32L79N92p27
$$ 294 342 -102 354 231 260 -141 -511 -482 -231 229 310 -149 -207 -532 -305 806 -376 -608 -229 363 -364
4185c64N8K20P64q74L17k68L90K20j91m15k02R74k80l89l42R44j002O69r91P42
$$ -364 -306 -86 678 -196 121 -147 243 463 272 -143 -345 629 349 -40 -382 562 -440 229 -762 -20
4205b0k64N49m04k67J93L17r0o18O40K2k28J72l03L4N19j39n22K71Q4Q9j02J42
$$ -20 -284 265 -139 -406 -213 104 14 -604 36 58 -170 2 -301 -267 252 113 -409 -138 -54 35 -67 75
4227G5j00N69j222J538n68o99L81K60k43k0K14m37N43q17K45J78J40n83J310q90
$$ 75 -25 544 -678 860 292 -407 -26 234 -9 -29 185 -252 291 -526 -281 -103 37 -546 764 -126
4247a26l18M41L93q63O37O97j452M06L74m40O78r44J153j289P34N5m77M14N12
$$ -126 -444 -3 390 -473 164 861 -591 -185 189 -251 427 -517 636 -653 81 136 -341 73 585
4266E85r02K03k9K04L69p69K99l55q0J100o7l50j37j07Q6m24O51M66j071L08N97
$$ 585 -317 -114 -143 61 430 -339 -40 -395 -475 625 558 208 71 -36 50 -374 277 743 -328 -20 577
4287E77q42K4O33Q4n94M2rm19Q48o28j9N82k40o32%R47N3l65k08M11l12K04m27
$$ 577 -265 -241 392 476 -118 -76 -85 -504 344 -284 -303 279 39 -593 -593 354 407 42 -166 245 -67 137 -290
4310b90M76n67N89L31k44m37j87N74j46J33J49l54J87L12m47n83l9L91K6L13k99
$$ -290 186 -381 208 539 295 -142 -329 245 99 232 381 27 214 526 79 -504 -543 -152 -126 187 -112
4331a12L80m31O9J021r70J64N8q33J022j61k25N42j111J63J126m64n7M7l0n83
$$ -112 268 -163 -94 927 -43 121 179 -654 368 207 -18 524 -587 -424 702 238 181 228 198 -385
4351c85K58qj13P00n5j67l73L07n4J65O7o68K99J51O52n85o47O02K2K22q09Q04
$$ -385 -127 -135 -248 452 397 230 -143 164 110 275 342 -326 -27 124 776 191 -456 146 168 390 -419 385
4373C85p33N7Q59k38p2m92N03o99m46N73J29o1j86O63k46M53m73j32j16L44p0
$$ 385 -348 -291 568 330 258 -234 269 -430 -876 -303 -174 -235 -421 242 -4 449 -24 -156 -272 72 2
4394BO9m0p03R03j00M28n82J68m44N48l72N47j30m46P39o05P5j31k53M89M4N22
$$ 2 71 31 -672 231 131 559 -23 145 -299 249 -123 424 294 -152 587 -18 57 -74 -327 162 206 728
4416G28j617N16K91K12m62l40O33N3J49Q2m14k67M30j81N49j66k76N59l48r38
$$ 728 -889 -373 -82 130 -332 -672 -39 14 163 245 -169 -436 -6 -187 362 196 -80 479 131 -807
4436h07N71N91j6o40J53Q16m33o61n2N14K33m41L9j41O32j33j27O8n05j12K21
$$ -807 -236 355 339 -301 -148 668 235 -426 -478 36 269 -172 -133 -274 358 225 98 166 -339 -451 -230
4457b30N5J6J66o1M75n04J7J11J57J57K85n15MN0Q04p18j52R3r8J88k58L27j59
$$ -230 -175 -159 7 -54 421 -83 -66 45 202 359 644 129 133 183 987 269 117 210 112 300 42 369 210
4480B10p87O42J26j008M37M65k11P08r19N01k2l52m8m14R37n2n23K16K23R19q99
$$ 210 -577 65 191 -817 -380 85 -126 582 -337 164 142 -210 -258 -672 265 213 -310 -94 129 1048 149
4501A49J59m49N72k38M03r07K14M1N24k97m63K8N13n17Q8K19m30J36P3L34n95
$$ 149 308 -141 431 193 596 -311 -97 -56 468 171 -292 -264 249 -268 -180 39 -391 -255 -182 152 -443
4522d43K35P54p31l12L92O10q51N66p6o59O39l41J88K90j024K95O57j000Q21l31
$$ -443 -208 546 -185 -497 -105 505 -346 220 144 -515 124 -217 -29 261 -763 -468 189 -811 10 -321
4542c21M69N5K86m16N4R7r40L59K16MM04l06M02p15J225q38N5J58n74J86J75M32
$$ -321 148 203 489 73 127 224 -716 -357 -141 -137 267 -39 363 -352 873 35 90 248 -326 -140 35 467
4564D67n07RL09q42P58k92M34k44k64M19k3k54k32j2m2K32m78O47k34P06l95k73
$$ 467 -40 -31 278 -564 194 -98 336 92 -172 247 224 -30 -262 -274 -316 -84 -562 85 -149 557 162 -111
4586a11J91l19l02P32l91M51l24L88m30L87L25n92L7j222J519l17p41Q9O47k46
$$ -111 80 -239 -541 191 -200 251 -73 315 -115 272 597 5 42 -1180 339 22 -719 -630 17 -229
4606b29K60M5j21O64k08o55j55N72n52j35j17O57J46m6m40K01m10M21J25l37m4
$$ -229 31 76 -45 619 411 -244 -399 173 -379 -514 -631 26 172 126 -314 -113 -523 -102 23 -314 -358
4627c58M40m4j42j90K78j59O5O88j167J193m63J83k65J03J37l97l10j98M51j99
$$ -358 82 38 -104 -294 -16 -175 -110 578 -589 604 141 324 59 162 299 -98 -408 -606 -155 -354
4647c54P10j79m10J43n92M90q9R1j62L13L37k62m26N19J22m63L22l01l57q4Q27
$$ -354 356 177 -233 -90 -682 -192 -281 -190 -352 -39 298 36 -390 129 251 -212 110 -191 -548 -632 195
4668A95k34l3k37K33M49n20M2K6Q5P02j062N8K36j40m4K63J43L53l59J37M2m75
$$ 195 -39 -72 -309 -76 373 -147 -105 -79 6 708 -354 -296 -60 -200 -244 19 162 515 156 293 335 -140
4690a40L81J32q67O38m56r0K80L79m36n4Q28o76o2N49m63m09Q44m60N2Q8J21J2
$$ -140 241 373 -494 144 -312 -402 -122 257 -179 -233 595 -81 -143 406 -57 -466 378 -82 -30 58 179 191
4712A91j96Q02j602J166l81L1L18n73O13m30J93k97l00P00l92Q1R3l19M35j76
$$ 191 -5 797 -805 361 -20 11 329 -244 369 -61 132 -165 -465 235 -157 -76 17 -302 133 -43
4732d3N65l81M8l73P11r38kL97M71j195R97L5K09k42J8l33j75l47R91j48k1m50
$$ -43 522 141 189 -184 527 -411 -413 -16 455 -740 257 292 501 259 277 -56 -231 -578 413 265 244 -206
4754b06J31K90o04l97P21j38L25m72L19l5M69n13K64R5o3l54O82r76J83j60J99
$$ -206 -75 215 -389 -786 -65 -203 122 -350 -31 -66 403 -110 154 249 186 -168 514 -462 -279 -439 -240
4775b40K74J47P44o89k63m14j4P62k63J55m99O36R4m83N42l01J63p59R47m60m58
$$ -240 34 181 925 236 -27 -441 -455 307 44 199 -300 336 430 -53 489 188 351 -408 539 79 -379
4796c79P08m11K34L54r51O30L5L12l14l14M22J23L11k93m4j42l75L39l51m60O63
$$ -379 329 -82 152 506 -445 185 220 532 218 -96 326 449 760 467 423 281 -94 245 -106 -566 97
4817I7N57q49j53N98J37k66k25j34K40R41k62j238M1Q03q6k9M38q85l3J49k85
$$ 97 654 -195 -348 250 387 121 -104 -238 2 943 681 -557 -516 287 201 172 610 -275 -308 -159 -444
4838d44M76l38R1K09r0n73P95n40O65O4p14P75J62J00o75j2Ql22N17L58o68M34
$$ -444 32 -306 -215 -6 -96 -669 126 -414 251 315 -399 376 538 638 -37 -49 -41 -363 154 512 -156 278
4860B78J80R7j106N7O89n30K25J34N7O2O3kk57j66Q5k62p74J079k66n2P06k55
$$ 278 458 555 -551 -494 195 -335 -110 24 81 143 206 204 -53 -219 -134 -396 -1170 -91 -357 -409 297 42
4882D2k62M96LJ44M0n09L22o25O17n65M74p2m85L17o75J61Q1P02k95J54J36p6
$$ 42 -220 276 279 423 463 -46 276 -349 268 -297 177 105 -380 -63 -738 -577 -496 206 -89 65 201 125
4904A25k95J20Q88j054M73q90J83R47L37j066J21K71q8M00p59J67o68N12j33K57
$$ 125 -170 -50 838 -216 257 -633 -450 497 834 -232 -111 160 72 472 -287 -120 -788 -276 -409 -152
4924a52Q13K04r18M23q48M09l87M06M41o31L26j46N46l71p29O19J65J67J16p40
$$ -152 661 865 -53 370 -478 -69 -456 -50 391 -240 86 -60 486 115 -614 5 170 337 453 -287
4944b87L41o6Q0k83l29M95k9m49P43m20k6L2R33q2p36Mk46o0r6L51J102p88r1
$$ -287 54 -12 68 -215 -544 -49 -78 -527 216 -204 -230 -198 735 653 -83 -79 -325 -385 -481 -130 972 184 93
4967I3l97K66j02qM79n32j03l81J182o50J005j273N26j1j49l8l58Q55l78n40K69
$$ 93 -304 -38 -140 -148 331 -201 -304 -685 497 -153 852 -421 105 94 -55 -93 -451 404 26 -514 -245
4988b45j22K8L67k23P78j59M48p15o27P71p41R81k05j10l69M9P97r84K20q78R30
$$ -245 -367 -339 28 -195 583 424 872 157 -470 301 -440 541 336 226 -143 -94 703 -281 -61 -939 -9
5009ij57q7n9Q10M2k86m94p8N07Q8k06J5m69rJ308j041n05L98m13N2O61m66L03
$$ -9 -166 -253 -312 498 540 254 -240 -318 189 277 71 86 -383 -392 916 -125 -630 -232 -645 -593 68 -398 -95
5032i5j0M57l65l94O25n62P6P50p64N80M11j265P11O4k31j97K30L95j055J597
$$ -95 -105 352 -13 -407 218 -344 -268 482 -282 298 709 -556 155 219 -12 -209 21 416 -639 958
5052I58p27m35P2J03K27p25K48Q5m49O38J64r8o82O75L87j74P4n05O92k46O4o00
$$ 958 231 -204 -132 -29 198 -527 -279 -194 -643 -5 159 61 -621 54 441 267 341 -164 528 282 346 -254
5074b54L13j35Q99j535P96R0m8M8k32Q42O4l05l04l39l13L57O53k24j06k11j71
$$ -254 59 -76 823 -712 84 174 126 174 -58 784 848 543 239 -100 -413 -56 597 373 267 56 -115
5095a15M53n91J19k46R14n47k01N9m66O67k05K18n89Q73p13m4O53l58N14r09L16
$$ -115 338 -253 -134 -380 534 -13 -214 -155 -621 46 -159 59 -530 343 -370 -414 239 -119 395 -514 -198
5116a98R19q19j95l25P94l81L18N1K85k85P0k74k36M15m24k49L67j03N79j83L3
$$ -198 721 -98 -293 -618 176 -205 113 164 449 164 234 -40 -276 139 -285 -534 -167 -270 309 126 159
5137A59m99R70l56n92K44K53q1K50o31J73q6J76j95M09q89P92O66p14k03n74P55
$$ 159 -340 630 274 -318 -74 179 98 348 -283 -110 -196 -20 -215 194 -695 97 763 49 -154 -728 27
5158B7l69M38p8R4m32P07m51M69Q6q72K68n25K16O04M17r31Q5J87l7O69j227j49
$$ 27 -342 96 18 112 -320 387 -64 405 491 -381 -113 -638 -422 182 599 -332 -247 -60 -97 572 -655 -804
5180h04Q47m25R74p22o46K36L26R92o41p50M72K1P72q03L02o05Q17m35m0O5K04
$$ -804 43 -382 592 -130 -776 -540 -214 778 137 -613 -141 -120 652 -151 151 -454 363 -72 -112 -47 157
5201A57n1K18m78N27o47m04M04j2K50L45L35j168M40M84k70j66j38M59j070J055
$$ 157 106 324 -154 373 -274 -678 -274 -286 -36 309 644 -524 -84 400 130 -36 -174 285 -785 270
5221B70r62O04k66J065p77l23L42j90N02m14O76q76M31l43L92l09j32K06j078
$$ 270 -692 -88 -354 711 -66 -389 -47 -237 265 -149 527 -349 82 -261 131 -178 -310 -104 -1182
5240a182J235k65M70o45O16J3j82n86M78R7K05o33J247q88l04M02m29j72L48P43
$$ -1182 53 -212 258 -387 229 242 60 -526 -48 49 254 -379 868 -20 -324 78 -351 -523 -175 568
5260E68q97Q57j057K25P49k30n29K7P81n93j81O42j045N18J3j64J42p43L02M86
$$ 568 -329 528 -529 -304 445 215 -314 -287 494 -99 -280 362 -683 -165 -152 -316 -174 -917 -615 -129
5280a29K02K28j80N20j08n80j56l8M85r4l62L7K11j46l2J67N1L85l23J9p93R89
$$ -129 73 301 121 641 533 -47 -203 -241 244 150 -212 -175 36 -110 -142 25 76 461 138 157 -636 353
5302C53J2j19l78n63P28J95j29m49K31O28q0o12o18J608j253M14n6j31M32J80
$$ 353 365 246 -132 -695 33 228 99 -350 -119 509 429 -183 -801 807 -446 -32 -88 -219 213 393
5322C93p36k24o8R77o66N75J05p92K44K01O0m71K1L16O60r83M1J00J88r5k78J90
$$ 393 -343 -567 -635 342 -324 251 356 -436 -192 9 69 -402 -381 -65 595 -388 -347 -247 -59 -154 -432 -242
5344b42M54L83p84n36N16l32R78l09p06j26N71j67O05l61k28L81l02N79m29J39
$$ -242 212 595 -189 -725 -209 -541 437 128 -578 -704 -133 -300 305 -56 -284 97 -205 374 -55 84
5364H4j27j71K24%Jl07J36J15n3L38p28L70N91n68Q32n54m14l00M90n9O45J027
$$ 84 -43 -214 10 10 11 -296 -160 -45 -98 240 -488 -118 473 -95 737 183 -231 -531 -41 -100 545 1572
5386A572j991L97K59o11K0M63m16Q91l02j07o26R21M03j032M84j001O82j6P18
$$ 1572 -419 -22 237 -374 -354 109 -307 584 282 175 -451 470 873 -159 325 -676 6 -10 708
5405G08n17n28O04K2K41j196K41L82J25J29l23j14L09o85O88o41N3J031l72r6
$$ 708 191 -337 267 289 530 -666 -425 -43 82 211 -112 -226 83 -602 86 -555 -502 529 157 61
5425F1l41m01R83m75R7k84N05n26N98j99k51k50Q62j44n74K11m10P47J66m78M12
$$ 61 -280 -681 302 -173 -76 -360 145 -381 217 18 -233 -483 379 235 -339 -128 -538 209 375 -103 309
5446C09n47M08K30j87J95K7l22L24o50N73p25M69o30j98Q96n87O37p17Q66m43
$$ 309 -238 170 400 213 408 435 113 437 -213 360 -365 104 -526 -724 172 -415 222 -495 371 -72
5466g2P41n40m6j03L78n79N81r10M35N38k39J27k2J21q64J12n84P88J63J3k88
$$ -72 669 129 83 -20 358 -221 360 -550 -115 423 184 311 289 410 -454 -342 -926 -138 25 38 -250
5487b50K66m2j98j42R33p42j01M20LM26l95r01J353p81j40j66L55O77l5m51j52
$$ -250 16 -26 -224 -366 567 -175 -276 144 147 573 178 -723 630 -151 -291 -457 -102 575 540 89 -63
5508f3k38q6K89J8K08j83K44q10L98O74o05M57r52Q61j0R0k16r3N77o51j0K51
$$ -63 -301 -387 -98 -80 128 -55 189 -621 -223 451 -154 303 -649 212 202 292 76 -17 560 -91 -101 150
5530A50n57N84M12m07m44L18l35L65J96n87M0mO84k06m19L20K71k46p91j4L71
$$ 150 -407 177 589 182 -262 56 -279 86 282 -305 -265 -269 415 209 -210 110 381 135 -656 -670 -299
5551b99j5M07o43M69J87r4j71O13l16p36N97n61L47k7l75M38J99P1K05n33N2M4
$$ -299 -314 93 -550 -81 106 12 -159 454 138 -598 -1 -562 -215 -242 -617 -179 20 91 296 -237 -185 -141
5573a41O53j047j77M84m0l72P85L95j18l86j69l33K54J245j477k29R20O6n08Q9
$$ -141 512 -535 -712 -228 -268 -640 145 540 422 36 -133 -466 -212 1033 -444 -673 247 313 -195 -106
5593a06O2j2J50M10r16J03J1M19q5M06q13k48J006r18N13K92O19l75l11K41p75
$$ -106 -44 -56 94 504 -412 -309 -298 121 36 442 -371 -619 387 -531 -18 274 893 518 207 448 -327
5614c27K09L43q09M60q7N1L97j9K16j040Q09O15r45N60k40J66n02k15J56k30N88
$$ -327 -118 225 -584 -124 -211 -160 237 218 434 -606 203 818 -127 433 193 359 -143 -358 -202 -432 156
5635A56K51j028N80K93k17l91O99j096R37o9p03j35Q72j35n5N7l64L44N52p24
$$ 156 407 -621 -41 252 35 -356 343 -753 184 115 -588 -723 149 14 -41 16 -348 -4 548 -176
5655a76O4m63Q33P5n86M70l20J21J88p3j24l01L97Q02j073N45q92O65p33O53P40
$$ -176 -112 -575 258 333 -253 217 -103 18 206 133 9 -292 105 907 -166 379 -513 152 -581 72 812
5676H12q69k2k25Q23p08j51J96R68p29n92R16m24J9r1J03p4l28l9k9M68q5R0L
$$ 812 -57 -79 -304 519 -189 -340 -144 824 95 -497 419 -5 14 -77 26 -48 -376 -415 -444 24 -61 29 32
5699C2q0l61j18Q17n60J94m95P99L4j38n69L05m20j60J054k35j047N43L37p2l0
$$ 32 -48 -409 -527 290 -270 -76 -571 228 262 124 -445 -140 -560 -720 334 99 -948 -405 -68 -140 -170
5720a70l6N64m31J69j9k26J23L00k12j39L35J55r92L49k91L64J47K56l72J89K26
$$ -170 -206 358 -73 96 77 -149 -26 274 62 -77 258 413 -579 -230 -521 -157 -10 246 -126 63 289
5741B89j35n23N19j44J8J57l82M30J67p38k61J122m9o29N26r44O0O46q8k53J38
$$ 289 154 -369 150 6 24 181 -201 229 396 -342 -603 519 470 -159 367 -577 -517 129 41 -212 -74
5762g4L2M33J18n92k45J25L57k00o0k2K14M75m75l74K21P5k02N66q1N7L69q42
$$ -74 -42 391 509 -83 -328 -203 154 -46 -106 -128 86 561 86 -288 -67 8 -194 372 291 348 717 -125
5784a25P1m19N40m1m60M74o9M67j25K00o34n47R97n83L09m65M43j85K85n17k08
$$ -125 -54 -473 67 26 -434 40 -29 438 313 513 -121 -668 329 -254 55 -410 33 -152 133 -384 -592
5805e92L81l50R61J35k27n3j086N54J92o13Q46m23P3J0k03K07N56k10m84J03J76
$$ -592 -211 -561 400 535 308 255 -831 -277 -85 -698 148 -275 -202 -192 -395 -188 368 158 -326 -223 -47
5826d7J78L97p71m10M14L65n73P05p4L26o20j58l12P23M51r3o84n25J049l41j23
$$ -47 131 528 -243 -653 -239 126 -447 258 184 510 -110 -268 -580 143 594 501 -183 -708 341 0 -123
5847a23N11k61k43M24n47o7O52q96J03N06p87O07N93J45r99O17j53K17k72K05
$$ -123 388 127 -116 308 -239 -306 346 -550 -447 59 -728 -121 472 617 -382 235 82 299 27 232
5867B32l11J48N70m47k81k40P74o02M58p31L98p43P24M71q73K15K48j46j27M20
$$ 232 -79 69 639 192 -89 -329 445 -157 301 -430 -32 -775 -51 420 -453 -238 10 -136 -263 157
5887A57N29q58J33m5p4J30J56l93J11N27J26J32p68m74J3Q16P3j9o58K66k89L88
$$ 157 686 -172 -39 -84 -158 -28 128 -265 -154 373 499 631 -137 -611 -598 218 291 272 -386 -120 -409 -21
5909b1k26K19k62K86j00P73o35J71o75N4L41l5L04n93O99j103R03l49N94K05q63
$$ -21 -247 -28 -290 -4 -104 669 34 205 -470 -416 -75 -110 194 -399 300 -803 100 -249 345 550 -313
5930c13L91j49K98l06q47P29M82l85k48Q59l03n12M09n6m16R0L61o0n7l37K04
$$ -313 78 -71 227 -79 -926 -197 285 -100 -348 511 208 -304 105 49 -367 -277 84 24 -33 -370 -166
5951a66N05j01l00j14k97J123o26o73O42J81k1o08j06K7J192q2r31L02k46R0J091
$$ -166 339 238 -62 -176 -473 650 24 -649 -7 174 153 -455 -561 -534 658 576 -355 -53 -299 -209 882
5972H82j104m34K50L1R17n34K04j44L49l22L76j032J053l69q7p8m78O77l79J25
$$ 882 -222 -656 -406 -375 542 8 212 68 417 95 471 -561 492 123 36 -42 -520 157 -222 -97
5992i7N77p23K54k33J52j30r1O29J50j052P52K97j108O02j19k46L72K5O7k2q28
$$ -97 480 -243 11 -222 -70 -200 -291 338 488 -564 188 485 -623 -21 -140 -386 -14 11 78 56 -772
6013g72P69M67n0q31J103j06k50l25L39k59p30K71L83j72L25o2k23j07P4n8M19
$$ -772 -3 464 414 -417 686 580 330 5 344 85 -645 -374 9 -163 162 100 -123 -230 -156 -214 205
6034B05l94m34N58l51J91l70N19K50j47J50k79j45k72Q01r7K4q29R31m02N94j108
$$ 205 -189 -623 -65 -416 -225 -595 -76 174 27 177 -102 -247 -519 282 185 209 -620 311 -91 503 -605
6055f05L55k17R54m76l62k73P46L53r0m75L39n63L65K89q30N69p55J117k17M9
$$ -605 -250 -467 487 11 -351 -624 122 475 385 -90 249 -314 51 340 -490 79 -676 441 224 273
6075B73J25p32O13m75J79O02n7k42m07R48j250M03m19L27J68m00P05q52k39L29
$$ 273 398 -334 279 -196 -17 585 528 286 -121 827 -423 -20 -439 -112 56 -344 361 -491 -730 -401
6095d01M16j25J60l58j42R68m00k98J04M1m95j13O94j30L30r73N42p3M07m37l63
$$ -401 15 -110 50 -308 -450 518 118 -180 -76 -35 -530 -643 51 -79 251 -722 -180 -253 154 -283 -646
6116f46Q61m96J18n0L42p0k68m17K63J170r58J88j85L43k00j23p87R30j43K34
$$ -646 215 -281 -163 -213 129 59 -209 -626 -363 807 -151 37 -148 195 -5 -128 -915 15 -128 106
6136A06J31J71l3j85l71R6P7P90o77q9m18L2P51n12m27j35J262p54k42j04J73
$$ 106 237 408 375 190 -181 -85 -8 782 105 16 -402 -370 381 -131 -558 -693 569 -185 -427 -531 -358
6157c58K0k61Q55n3l58N59j066O54K18m76L13n4K37m55m91L70J44k52L48J3M57
$$ -358 -338 -599 256 203 -155 404 -662 -8 210 -266 47 -7 230 -225 -716 -346 -202 -454 -106 -93 364
6178C64n81N37p60Q67j032P50o29R95l09r4j54K52o33P23l45K51L9j0n86J28O04
$$ 364 -217 320 -440 427 -605 145 -484 511 202 108 -46 206 -427 296 -49 202 241 231 -355 -227 377
6199C77j09j05n0m07L97n26M74Q10l0j040q7O88p77M81k51J55j6j76K13K78rn77
$$ 377 268 163 113 -294 103 -423 51 861 831 -209 -296 392 -385 96 -155 0 -16 -192 21 299 290 -287
6221b87N47l71l16o37N98L95p64O22M39p84N11L3o8m37L29O4M57o83Q8Q5P9M76
$$ -287 260 -111 -427 -1064 -466 -71 -835 -213 226 -558 -47 -14 -82 -519 -190 -126 331 -352 -264 -179 -100 376
6243C76l80j71J51r0J07K55J70m18N55n17k02N33o41L73M82k89l14K79q84K45
$$ 376 -4 -175 -24 -114 -7 248 418 0 555 38 -164 369 -272 101 583 294 -20 259 -625 -380
6263c80N45q2k52K95k92K64o21P05o02k00Q81q3r8o72N96l11M13k6P7K73m75J94
$$ -380 165 83 -169 126 -166 98 -523 182 -420 -620 261 178 80 -592 4 -307 106 80 157 430 -45 149
6285A49q5J1J01l06q2K32L7k05Q94j214L16k4O18r96O92n41p26Q71Q66p84J0k40
$$ 149 64 75 176 -130 -212 20 57 -148 746 -468 -152 -176 442 -554 138 -403 -1129 -258 608 -176 -166 -406
6307d06O47r0K1o6o14Q38m2m91O27l50j58J1L27l28j84P18p90k25R20k67o07M76
$$ -406 241 151 172 106 -508 330 288 -203 424 74 -84 -73 254 -74 -258 460 -330 -555 365 98 -509 -33
6329c3L35K68p18N4L72o5J8k4J86K18j436R85M04p38L9L46J33q36J244j330O55
$$ -33 302 570 -148 -94 278 213 231 207 393 611 -825 160 564 -174 -135 211 344 -492 752 -578 77
6350G7N57r70q4K55L4L5M95p45N06j3R2Q0n23J15J53J3j51J91l67p0K59N6l7J140
$$ 77 634 -336 -420 -165 -131 -96 399 -346 160 147 239 319 -204 -89 64 77 -74 117 -250 -320 -61 -5 -42 1098
6374A098j440K59PJ5J16k36K33m81L09M24k8j140O89K28L25K30m79j66p03R19
$$ 1098 -342 -83 -76 -61 55 -181 52 -429 -120 304 276 -864 -175 53 378 608 129 -37 -740 179
6394A79n5m82k51N76k53M54M9k96L92l93k89M44l06O9p0L29n6o09O17M51m23L22
$$ 179 124 -358 -609 -33 -286 168 217 -79 313 -80 -369 75 -231 -162 -232 97 41 -568 49 500 77 399
6416C99m79K09o17M41j20L85m90k72P40p7j63M63j99j71p02M40M86n22n5p55J237
$$ 399 -80 129 -488 -47 -167 218 -272 -544 196 119 -44 419 220 49 -653 -213 273 -249 -304 -1059 178
6437A78J49p92R93o5o8n37K98p95M08q3L25q5q2r8Q19p33o77R71l04LL54M7k59
$$ 178 327 -465 528 463 395 -142 156 -639 -231 -314 11 -74 -156 -254 565 -168 -845 126 -178 -175 179 226 -33
6460c3j07l78J21m17N84K99N60m45N89q16K42M37j092M21m68L00K23RL89K10q9
$$ -33 -140 -518 -397 -814 -230 69 629 184 773 -43 199 636 -456 -35 -503 -203 20 29 418 628 539
6481E39o62Q4M12o32M37j50l80O96l37L15m83M1M12K07l46m12J39j91K09R2q7
$$ 539 -123 -39 373 -259 178 28 -352 344 7 322 -161 -120 292 499 153 -259 -120 -311 -102 -10 -97
6502i7J67J30m67L98l25O4r5M08k26q23M46M24j73L18k48q8l87N51L9L61r39M17
$$ -97 70 200 -267 131 -194 -130 -225 183 -43 -866 -420 4 -169 149 -99 -187 -574 -23 16 377 -562 -145
6524a45o07M95j56J84J25K7K53l24N7k68R48n82k63J21M21r45L75L58M52l86j0
$$ -145 -752 -257 -413 -229 -104 -77 176 -148 -91 -359 589 7 -256 -135 286 -659 -284 74 526 140 130
6545A30Q3K60n61J75j49j10O36m79q17P45o97Q13jl66O05q78J051J22j155N72
$$ 130 213 473 -88 87 -62 -172 464 -15 -832 -87 -784 29 28 -338 267 -611 440 562 -593 -21
6565b1p0J74l23q7K60K52n52J43k27L4N79k67L88l75j40N1M13n52L23j3J05K72
$$ -21 -91 83 -240 -327 -67 185 -367 -224 -451 -417 162 -105 283 -92 -232 -181 232 -320 3 -10 95 367
6587C67n27L15n9n16P36K37l41n78Q45k43n59L46M01J32m48L7n18Q47n73J36m11
$$ 367 -160 155 96 -420 316 553 212 -366 479 236 -323 23 424 556 108 145 -373 474 -99 37 -374
6608c74J242p87K1K41j204K20P47k03qm29J78k20J217m62j48K83j23k59o8K65
$$ -374 868 81 102 343 -861 -641 106 -97 -105 -534 -356 -576 641 179 31 314 191 -68 -136 129
6628A29M8q72kK03L60N84o19N34K55j211M00L63j071J086m20J35M08n8M76k04
$$ 129 177 -695 -697 -494 -134 450 -169 365 620 -591 -191 172 -899 187 -233 -98 310 252 728 524
6648E24k40k30P64o71j4j89L87j17p62Q19P1j97L92o09j88J34N2j7L3R55n54p31
$$ 524 284 54 818 147 133 -56 331 214 -548 271 342 145 537 -72 -260 -126 -74 -91 -58 897 343 -388
6670c88l77O25j53k1O55n55r8L33R5k74M38J32j071N15p58M60Q25o38J70P40l56
$$ -388 -765 -140 -293 -314 341 -214 -312 21 116 -158 280 412 -659 -144 -902 -442 383 -255 -85 655 299
6691B99j39L75n16j8N68m08k05K5j97N63m01j31K7k46K92l7J86N75p52K84pj76
$$ 299 160 535 19 1 569 161 -44 -19 -216 347 -54 -185 -158 -404 -112 -149 37 612 -140 144 137 -39
6713c9m10J51M15p4N0k22Rl73N52K21l96j62O07n04m84J058m96j9J58m2J14l58
$$ -39 -449 -298 117 43 93 -129 -120 -493 59 280 -116 -278 329 -175 -659 399 -97 -116 42 0 114 -244
6735b44M50q46P40K08m07k64L37p7J3K13o80N09j97R74r05P24o77K91o64Q02p25
$$ -244 206 -640 100 308 -99 -363 -26 -103 -90 123 -557 -48 -245 729 -176 548 -129 162 -502 300 -425
6756d25P74J56m52m5N36k61l95j16m7j97k27M17K79m7J81k32L3M5J209j102J5
$$ -425 349 505 53 8 544 283 -112 -228 -275 -472 -699 -282 -3 -50 131 -101 -68 -23 1186 84 99
6777I9K90l00n42L20k63L81O30j070L90J38k84k39L34l14N39K75K8J26l11R8n12
$$ 99 389 89 -453 -133 -396 -15 615 -455 -65 73 -211 -450 -116 -430 109 384 412 538 227 325 -187
6798a87LJ76o94N27j28O43m45J65K26K1L3j075L67M82m53K59k22L66L08l59J64
$$ -187 -184 -8 -702 -175 -303 340 -105 60 286 307 340 -735 -368 114 -339 -80 -302 64 372 13 177
6819A77o04N80J78J4N01q95J96j75L44j40l75j70N49j72Q4J71p37R50m03L28j13
$$ 177 -427 153 331 345 846 -49 147 -28 316 176 -199 -369 180 8 92 263 -474 476 73 401 288
6840B88l50K92m75J07N84m01k52L3l09M98L41o74K22j59O1R8o6M14q1l08K08K59
$$ 288 -62 230 -245 -138 446 45 -207 -174 -483 15 356 -318 -96 -255 -194 -96 -162 252 171 -137 71 330
6862C30k10j32m86Q71o28O07o13j73k73J070p20l73J007m14J9O5j79k50L94K06
$$ 330 120 -12 -498 373 -255 352 -261 -434 -707 363 -357 -730 277 -137 -118 -53 -232 -482 -88 118
6882A18o05P3J073o98K47J51J50m94M65r87K57K9K14q4P4P6n66L20M77l85p1N02
$$ 118 -487 -414 659 -39 208 359 509 15 480 -507 -250 -221 -7 -91 -17 59 -507 -187 290 -95 -166 336
6904C36j83K46l25K73L70j022l30K92R9L82K52p25O3P79l60M09j566J074o56R19
$$ 336 153 399 74 347 717 -305 -635 -343 -244 138 390 -335 -272 507 147 556 -1010 64 -592 327
6924C27q54P46k64m22R79p96Q1LN53j41l64j2R7q2n39M14Q02j64j32l57K23n64
$$ 327 -527 219 -45 -467 512 -284 -203 -200 353 212 -152 -164 -67 -149 -688 -274 528 364 232 -125 98 -466
6946d66K54M03m83N2K05M72j85n84N11K7k08j71l49J081o59n22O8O10j2M26k37
$$ -466 -212 191 -292 -240 -35 437 252 -332 179 206 -2 -173 -522 559 -100 -622 -554 56 44 470 233
6967B33o48o67J592q30M73o81l1Q31l36K75q21L13P60M47j385N27k22P92p16K92
$$ 233 -415 -1082 510 -320 153 -528 -559 272 -64 211 -610 -297 463 910 -475 52 -170 622 -94 198
6987A98m54l17N86l76J85L47k78J71M83m06o85j12J15L69N84j69k47k03k56O39
$$ 198 -256 -573 13 -363 -178 169 -109 62 545 139 -546 -658 -543 -174 410 241 -6 -209 -465 174
7007A74l79M46N24k67k8n93O65j47n24N98k81k37j04K05j47j0L60L80j192J25
$$ 174 -205 241 765 498 470 -123 542 395 -129 469 188 -49 -153 52 -95 -105 255 635 -557 -432
7027d32K98N02j86J19j88K13J14j227M55O99l24J98j23M46j400J111m8n58M01
$$ -432 -134 368 182 301 113 326 440 -787 -332 367 43 241 118 564 -836 275 227 -331 70
7046G0j25L86l02k83k87P3O53L39r09Q30m92M27o32K50J72J29K50r7l9m37j57
$$ 70 -55 331 29 -254 -541 -468 185 524 -385 445 -47 380 -252 -2 170 299 549 452 413 -24 -181
7067a81N71o90k77R70k5J97n54j54k00Q7j90l9L63L09k31q9k21L25o20J071r37
$$ -181 390 -300 -577 393 368 565 11 -143 -343 -256 -446 -485 -122 187 -44 -133 -354 -29 -649 422 -515
7088e15K08J92M47L19j013N95k08j48Nl62K5J63Q44r55L08J12K30p83J78L82l20
$$ -515 -307 -115 332 651 -362 233 25 -123 -118 -480 -455 -292 552 -403 -95 17 247 -536 -358 24 -296
7109b96R38q39L20k77L12p29k00L27N02o02M4R94l17m10K91N47p73K41j13k48
$$ -296 642 -197 123 -154 158 -571 -771 -444 58 -544 -500 494 177 -233 58 605 -168 73 -40 -288
7129b88M60k68N8j23j7o5R8J75J86m05JK2J28O65o18n3J84kl21N76l84n39j34
$$ -288 172 -96 -38 -161 -178 -243 -145 30 216 -189 -188 -166 -38 627 9 -44 140 138 -183 393 9 -530 -664
7152f64O55k99M23m96L29J66o7J19j017L49ON78n78Q65j23k80L91p25n0O81j87
$$ -664 -9 -308 115 -381 -52 114 47 166 -851 -502 -496 82 -496 369 246 -34 357 -368 -418 263 76
7173G6Q9K67r33J061m80K9L6J44Jl35N44j254Q77k27M43j75M25j89j67n22Q3M19
$$ 76 165 432 -501 560 80 109 145 289 290 -45 499 -755 122 -105 338 163 588 399 232 -290 -207 212
7195B12l71K72nl45J15J17J08J96m73R2l36J021p64Q6J83j46Q83j188J10N21l38
$$ 212 -159 113 108 -237 -122 -5 103 299 -174 -82 -418 603 -161 -75 108 -38 845 -343 -233 288 -50
7216e0P05n55k10n81J018k53l48n05M71J85k3K53n79N2O68L90m40o17N23L1j62
$$ -50 655 100 -110 -691 327 74 -274 -779 -308 -123 -146 107 -472 -420 248 638 198 -419 104 135 -27
7237b7L16m45l7N89o01P86o97j31P84l38m76Q00nj043QM55n9l25K00K1J86K08
$$ -27 289 -156 -193 396 -205 581 -116 -247 537 199 -277 523 518 -525 -517 -62 -121 -446 -246 -225 -39 169
7259A69J46K80j366M71J027j536J66O18K31j10j140P74n6J18O74n31K7J4K44l17
$$ 169 315 595 -771 -300 727 -809 -643 -25 206 96 -1044 -270 -326 -208 466 -65 -38 -24 220 -97
7279i7P61m11m69L51j67k28J6k60j04M95J0j31j30k17J142q36L82L7k91P04P7
$$ -97 664 253 -216 135 -32 -260 -244 -504 -608 -113 -103 -234 -364 -581 561 -275 107 144 -147 557 634
7300F34q70N85p92L52N79j728J121J387j676J93p8j5O45j2l91r5j73J66l41K57
$$ 634 -236 349 -443 -91 488 -1240 -119 1268 -408 -215 -293 -308 337 325 -66 -161 -334 -168 -509 -252
7320b52M69n12R28m35k93P6J20K8k58l84R26m34m77M06L0O42o37l33O57o37J76
$$ -252 217 -295 633 198 -95 -19 101 129 -129 -513 413 -21 -498 -92 -62 580 -57 -390 267 -370 -194
7341a94M94o87j19q5K46P77p15k54Q25J00N6k62k95R11j78j004M61o76J80J24
$$ -194 300 -387 -506 -591 -345 432 -283 -537 288 388 444 182 -113 798 620 -384 77 -599 -419 -295
7361b95P82j55q9l38M98N2k16p35N60k07R6N99j245R98p0m76O53o84M38l20k33
$$ -295 487 332 243 -95 403 455 239 -496 64 -143 -47 552 -693 305 235 -241 412 -272 166 -154 -387
7382c87k56J31Q93p14K31n18J539m29n84j61K58L95p01J98l93J89L87k03k3J52
$$ -387 -643 -512 381 -333 -102 -620 919 490 -94 -255 3 398 -303 -105 -498 -309 78 -125 -148 4
7402DO43j59p0n93N46l98l68L81m58O52o16j23N19m80P24n58J37K51m5j83Q28
$$ 4 647 488 418 -175 371 -27 -395 -14 -472 180 -436 -559 -40 -520 204 -354 -217 34 -11 -194 634
7423F34r10J40r3l2J86k53N41p55R73n68l4q43R24j58J10P92p97M52K43q88L3
$$ 634 -276 -136 -229 -261 -75 -328 213 -542 431 -137 -171 -1014 -90 -248 -138 654 -143 309 552 -336 -303
7444c03l09P52j26J85o55M96k70K87j11L38l69M73J38k60k22m2l5J78l24N62J69
$$ -303 -612 140 14 199 -456 40 -230 57 -54 284 -85 388 526 266 44 2 -33 145 -179 383 552
7465E52p52J88K36q92K80O16p8k11p27M92k8J53M26k66k67L87rr5J064l35o24
$$ 552 -200 -12 224 -668 -388 228 150 -61 -788 -296 -324 -171 255 -11 -278 109 100 5 1069 734 110
7486A10k51R3j57M87R2P7J80kp17R4l1J40o0k65K64j232J345k54L93l21n82J55
$$ 110 -141 -48 -205 282 374 451 631 629 -88 6 -25 115 55 -210 54 -1178 167 -87 306 -15 -597 -442
7508d42N28J74N62r75k49M88l0J21r87K68O92l75M79l61p90J455K40q62K01M0
$$ -442 86 260 822 -153 -402 86 56 177 -810 -542 150 -225 254 -107 -897 558 798 -64 137 177
7528A77k73J85l56R2k8K15L26q29M54k03L81n04J26K9K75L12j40p16N65j08P9
$$ 177 -96 89 -267 -175 -203 12 338 -491 -37 -240 141 -363 -237 -208 67 379 239 -477 88 -20 59
7549E9j9o95J266O3m86p09J077k24j39k09J44k8n89O33L02J06m55L46M03p41p47
$$ 59 40 -655 611 674 188 -521 556 332 193 -16 128 100 -489 144 446 552 97 443 846 105 -642
7570f42M41j60P23n74q5M81J1L11j133J128o29N51k02l30N7L8K01m3k54M67l79
$$ -642 -201 -361 362 -212 -297 184 195 506 -627 501 -128 423 221 -109 -52 -14 187 144 -110 357 -22
7591b2J05n98M16N55o72N02j32l34N79J30o15N51p03K16kn0m3k12J36O91m69k07
$$ -22 83 -515 -99 456 -216 286 154 -180 399 529 -86 465 -238 -22 -24 -74 -117 -329 -193 498 29 -178
7613a78J30J95l40J95n63O34k47k95L54L61q46Q90j55j30J26l82J67k12j8j0k7
$$ -178 -48 147 -193 2 -561 73 -174 -469 -115 246 -600 290 135 5 131 -251 -84 -296 -314 -324 -351
7634c51j95N97O4r58R97M7J59k55o36J077j72k43O90j064r26J258j61o2L83M92
$$ -351 -546 51 115 -843 154 201 360 105 -531 546 374 131 821 -243 -1169 89 -72 -134 249 741
7654G41j564P06L40Q45p88oj6p21J58K42J31P4J58jj07m46N34q07O16%K79m06
$$ 741 -823 -117 223 1068 280 274 258 -463 -305 -63 68 142 300 299 192 -254 280 -527 89 89 368 -38
7676c8m16O88n87P4J58J84J25k82l66l65J48L42j23K97l6O22n46j0L90L67n01
$$ -38 -454 234 -353 -279 -121 63 188 -94 -460 -825 -677 -335 -458 -161 -197 425 -121 -131 259 626 125
7697A25J05r49J52N86l64q6K84M90m91n78R64n38K46k84p1R92q22O58j61m85K76
$$ 125 230 -719 -567 19 -345 -431 -147 343 -148 -726 238 -300 -54 -338 -409 583 -239 419 258 -227 49
7718D9J11j01j20J79N4j73j28n6L90n4o2j68P74o25l28k20O30M99N5q26J19m98
$$ 49 160 59 -61 118 172 -1 -129 -185 205 151 89 -79 695 70 -258 -478 152 651 706 -120 -1 -499
7740d99N26q7%j09M94o44J76r2P45l45p53P65l61j7M33p57K83M42m93L57k82o4
$$ -499 27 -60 -60 -169 325 -319 -143 -235 510 165 -588 177 -184 -201 232 -525 -242 200 -293 64 -218 -282
7762b82K61j55r9O36j060P71m99r8j5R84m97k45L06m18j37O18m23l5P29m5o3J47
$$ -282 -21 -176 -275 361 -699 72 -427 -525 -540 444 -53 -298 8 -410 -547 71 -352 -387 342 297 234 381
7784C81l78J03l1m25N87l91l49Q40k20n32M88K04r66M19K75l62Q73q91L78l23
$$ 381 3 106 75 -350 237 -154 -503 337 117 -415 73 277 -689 -270 5 -357 516 -375 3 -320
7804c20P1K20l22J062m24j71k73P54n94P9j45j7k7J99o21k4Q99m85q4N39n99O04
$$ -320 -249 -29 -351 711 287 116 -157 597 3 82 -63 -80 -107 92 -529 -553 346 -139 -223 316 -283 321
7826C21o78P81p65j1M87l48P97j029Q4J34O69j035P07J12J90m99j39P08o73mP95
$$ 321 -357 424 -341 -352 135 -213 584 -445 -361 -227 442 -593 114 226 416 -83 -222 486 -187 -191 604
7847F04o38l59J97j3L28m2j42K63J0Kj58m03J27R30l47q36J69O55k0l31j3L94
$$ 604 -34 -393 -196 -209 119 77 -65 198 208 210 52 -351 -224 706 359 -477 -308 347 327 -4 -17 377
7869C77o64O9K47r1P18n21K81o84P48o63J61J66n75K39J05L7k15L68r19O30J26
$$ 377 -287 -218 29 -62 656 135 416 -268 480 -183 -22 144 -431 -192 -87 -50 -265 103 -816 -186 -60
7890f0j10N52m75j27M19j08K08l80k50J90L51o27O54M78p95J65k62N48o11P47
$$ -60 -170 382 -93 -220 199 91 299 -81 -331 -141 210 -417 237 715 -80 85 -177 371 -240 507
7910E07p60J025m45Q9n39l91J66L08O9K19n98L37m20P3K23K77J89l68J23L01o83
$$ 507 -253 772 327 416 -123 -514 -348 -40 29 248 -350 -13 -433 -360 -137 140 329 -39 84 385 -298
7931b98P17k10m35k83l60O56N25k80j51p1K46J35R4r24K91R24n53q6K3J4m6k06
$$ -298 419 209 -226 -509 -869 -213 312 32 -119 -190 56 191 285 -639 -348 576 23 -63 -40 -26 -72 -278
7953b78k1J71M3l17N3Q54m82Q0q6o2K35j168N77N68o65p7M45K47L41j010N99K32
$$ -278 -299 -128 -85 -402 -349 505 23 103 17 -45 190 -978 -401 167 -498 -575 -130 117 458 -552 47 279
7975B79j8m34L37m88m93J271n92L57l15N03j78K88o79N66l33m77M29M0P8N23k51
$$ 279 261 -173 164 -324 -817 454 -138 219 -96 407 229 517 -162 404 71 -406 23 63 141 664 413
7996D13n20j17L25O11k84p09l43J021J05o53L94k47l39O19jm85l08M14l74O71
$$ 413 -107 -224 101 712 428 -281 -624 397 502 -151 243 -4 -343 276 275 -210 -518 -104 -478 193
8016A93j98QN97k01m2l61J95l40K29r6n47P05L45o08J18k81N60k35L36J86o93
$$ 193 -5 3 600 399 357 -4 191 -149 80 -16 -563 142 487 -121 -3 -284 276 41 377 563 -130
8037a30K53k45j5N0N25o68r8P7n60L55L72k02q0M97l59L23m63m8K51n0j8m10K65
$$ -130 123 -122 -137 -87 438 -230 -328 -251 -811 -456 -84 -286 -366 131 -228 95 -368 -416 -165 -215 -233 -643 -378
8060c78O21m06p8o5j28N15k89m14Q01r44k33J607j91q99o8O76Q13r57m74K89J53
$$ -378 243 -163 -241 -306 -434 81 -208 -622 179 -765 -998 609 418 -481 -549 127 940 -17 -491 -202 -49
8081d9o66J188K36r06J023o16k35J07k71P17j108P57k95j66J154m57J98j549J087
$$ -49 -715 473 709 -197 826 210 -25 82 -189 528 -580 177 -118 -284 870 413 611 -938 149
8100A49J85j053J099o32l32Q88rn65K53l84J212j273M37L2J87m58Q8K62j33J74
$$ 149 334 -719 380 -252 -584 304 295 -270 -17 -401 811 -462 -25 7 194 -264 -176 86 -47 127
8120A27L07n66P28n83j63m00N13l60J80K24n52L17q0M96p06P62m71N07l33ol65
$$ 127 434 -132 596 13 -150 -550 -37 -397 -217 7 -545 -228 -308 188 -518 244 -227 280 -53 -59 -424
8141d24O18m85K51j80O5J17r5l38O41j59p8l26O54o10K05K75j43M31m8k99o70
$$ -424 194 -291 -40 -220 -155 -38 -133 -471 170 11 -67 -393 261 -349 -144 131 -12 419 371 72 -598
8162e98N94J73L74m68L3o9Q9k49L04j3K06l86q3m73K86O56j74M40r88j81K39l24
$$ -598 -4 169 543 75 108 39 128 -121 183 170 376 -10 -93 -566 -280 376 202 642 -346 -527 -288 -612
8184f12O96p0n16M24M02K79k84
$$ -612 84 14 -502 -78 324 603 319
8191C19
$$ Imaginary data points
##PAGE= N=2
##DATA TABLE= (X++(I..I)), XYDATA
0ej9Q8j21P3l8Q5j81K52k59K56l05M18n45O18o55P37q89J076j246J383j537J751
$$ -5 -24 64 -57 16 -22 63 -118 134 -125 131 -174 244 -301 317 -338 399 -490 586 -660 723 -814 937
22I37k021K315k591K863l194L612m093M584n085N656o346P170q102R135j0326
$$ 937 -1084 1231 -1360 1503 -1691 1921 -2172 2412 -2673 2983 -3363 3807 -4295 4840 -5486
37e486J1779j3604J5904j8820K2619k7719L3810j8815N87271n82797n70613J053786
$$ -5486 6293 -7311 8593 -10227 12392 -15327 18483 -332 586939 4142 -566471 487315
49D87315l39675p26703Q73094N5626r09307O66477L36886r03263L75275N95505
$$ 487315 147640 -579063 294031 349657 -559650 106827 443713 -459550 -84275 511230
59E11230q35619R5634P27769o66385j82688P94066m62236l96970P64783k28876
$$ 511230 -324389 -228755 499014 -167371 -350059 444007 -18229 -415199 349584 120708
69A20708n62845O80172l942o59152N40896K09162p01437L70245L86533o85850
$$ 120708 -442137 238035 234093 -425059 115837 324999 -376438 -6193 380340 -305510
79c05510J77447N34331o14820k4545O33598m97151k27742O83869l32100m10642
$$ -305510 -128063 406268 -208552 -233097 400501 -96650 -324392 359477 27377 -383265
89c83265O71291j35654n63438N94823P8943o62354M59457K93742p00605K72467
$$ -383265 288026 152372 -411066 183757 262700 -399654 59803 353545 -347060 -74593
99g4593M83072o64929N3329O25245n55601j79201P01202l85818l94173P01798
$$ -74593 408479 -256450 -203121 422124 -133477 -312678 388524 2706 -391467 310331
109C10331j68002n67988O23013P0356o77449M70547L00299p08713K65256M94158
$$ 310331 142329 -425659 197354 267710 -409739 60808 361107 -347606 -82350 411808
119D11808o56446K9408O27826n27746k02825O83014l40630m04203O57405j22277
$$ 411808 -244638 -215230 412596 -115150 -317975 365039 24409 -379794 277611 155334
129A55334n52019N57797R9579o26524M00907K96353o29921K10815M50173n65487
$$ 155334 -396685 161112 260691 -365833 35074 331427 -298494 -87679 362494 -202993
139b02993J0680N44786m46878j74291N78786k95695l30844N58101j26205m46650
$$ -202993 -192313 352473 -94405 -268696 310090 14395 -316449 241652 115447 -331203
149c31203M86478M5270n18049L77578K05366n41764K38773L43598n18616Q0811
$$ -331203 155275 200545 -317504 60074 265440 -276324 -37551 306047 -212569 -131758
159a31758M51602m49552q5514N20915l39339k45426N39286j91480l86323N05989
$$ -131758 319844 -129708 -215222 305693 -33646 -279072 260214 68734 -317589 188400
169A88400k1742m89412M16889J54360n43199K81940L17116n35562J12990M45663
$$ 188400 166658 -322754 94135 248495 -294704 -12764 304352 -231210 -118220 327443
179C27443m70348o9585N24576l49663k42742N42006j90323l86650M95953j2483
$$ 327443 -142905 -212490 312086 -37577 -280319 261687 71364 -315286 180667 168184
189A68184m81699L96314J61283n21204K55875L11979n01879R2161M22891m28081
$$ 168184 -313515 82799 244082 -277122 -21247 290732 -211147 -118986 303905 -124176
199a24176p5368M81504l10179k27082M87874j66162l48232M42860j2220m27338
$$ -124176 -199544 281960 -28219 -255301 232573 66411 -281821 161039 148819 -278519
209b78519L54056J37337m60536K35857K64842m45076R7716L60614l87208m4343
$$ -278519 75537 212874 -247662 -11805 253037 -192039 -94323 266291 -120917 -165260
219a65260M18376k94864j76135M33828j76938k86125M08399m6341l67442L44416
$$ -165260 253116 -41748 -217883 215945 39007 -247118 161281 114940 -252502 91914
229I1914Q5750m13174K49866K08804m18140J30722L11257l82906k97L81900l09226
$$ 91914 177664 -235510 14356 223160 -194980 -64258 246999 -135907 -136204 245696 -63530
240f3530j31032M16134k05859k50381M07593p8181l44443L56189N8111m02788
$$ -63530 -194562 221572 15713 -234668 172925 94744 -249699 106490 164601 -238187
250b38187K65395J89429m16780J45223K98953l84829J0145L75169l09311j26198
$$ -238187 27208 216637 -200143 -54920 244033 -140796 -130651 244518 -64793 -190991
260a90991M06957j99421k44640L93535p1328l33318L36568O1604l82117K44118
$$ -190991 215966 16545 -228095 165440 94112 -239206 97362 158966 -223151 20967
270B0967J82702l86800J28324K79133l48791L464L41038k76616j14971L64728
$$ 20967 203669 -183131 -54807 224326 -124465 -121001 220037 -56579 -171550 193178
280A93178j79357k15658L50694o9533k89973L02331M1955l32259K26294J45526
$$ 193178 13821 -201837 148857 79324 -210649 91682 133637 -198622 27672 173198
290A73198l41130J31864K32018l19320K8894K92987k66116p5052L24598j88345
$$ 173198 -167932 -36068 195950 -123370 -94476 198511 -67605 -142657 181941 -6404
300f404j70040L26551r4829k49336K96016Q093l01620K36754J10046l25648J53295
$$ -6404 -176444 150107 55278 -194058 101958 110051 -191569 45185 155231 -170417 -17122
311a7122K00763l15754N4764K71560k73442n0266L13671k02503j50867L23113
$$ -17122 183641 -132113 -77349 194211 -79231 -129497 184174 -18329 -169196 153917
321A53917j08773k35346K98211m290k93093K39064R9903l18316J55458J91823
$$ 153917 45144 -190202 108009 103719 -189374 49690 149593 -168723 -13265 178558
331A78558l08559N6154K62006k64875m8511L01834j93016j45154L06658j01029
$$ 178558 -130001 -73847 188159 -76716 -125227 176607 -16409 -161563 145095 44066
341D4066k22519K77897l023k71796K19678R3120k92071J42100J74804k79700N2085
$$ 44066 -178453 99444 96421 -175375 44303 137423 -154648 -12548 162256 -117444 -65359
352f5359K34143k39435l8693K67830j76972j22438K73740j01082j89569K52979
$$ -65359 168784 -70651 -109344 158486 -18486 -140924 132816 31734 -157835 95144
362I5144j5805k37250K07560O6353k59758J44570J41721k58199O8271K01923k31928
$$ 95144 79339 -157911 49649 116002 -143756 814 142535 -115664 -47393 154530 -77398
373g7398j3306K41598j82691r3087K57531j15256j62743K46144l5975k16680K10396
$$ -77398 -90704 150894 -31797 -124884 132647 17391 -145352 100792 64817 -151863 58533
384E8533M5609k47237J54527J22307k52199Q1428J85074k30456R52K29704j85447
$$ 58533 104142 -143095 11432 133739 -118460 -37032 148042 -82414 -81462 148242 -37205
395c7205q0104K47954j19646j50828K40408m2386k04979K06608L8271k36595J52398
$$ -37205 -117309 130645 10999 -139829 100579 58193 -146786 59822 98093 -138502 13896
406A3896J12606k40979Q1386J74008k20316L352K16139j76780p2825K33739j14931
$$ 13896 126502 -114477 -33091 140917 -79399 -76047 140092 -36688 -109513 124226 9295
417I295j39297K25073m2572j89561J94941L1049k17598J43484J00513k22170P8639
$$ 9295 -130002 95071 52499 -137062 57879 88928 -128670 14814 115327 -106843 -28204
428b8204J56252k03526R032J94500j65428n8921K11469j12732j18226K06368m9079
$$ -28204 128048 -75478 -66446 128054 -37374 -96295 115174 2442 -115784 90584 41505
439D1505j64856J81721J6822j93712J39909P9577k03149Q6116J32829j94095K4669
$$ 41505 -123351 58370 75192 -118520 21389 100966 -102183 -16067 116762 -77333 -52664
450e2664J72046j63220l9623J94716j17869r9448J98539o1562j48158J81430Q91
$$ -52664 119382 -43838 -83461 111255 -6614 -106062 92477 30915 -117243 64187 65078
461F5078j81000J43727O5200j96264R3836J19810j89557L3142J62183j63372l0582
$$ 65078 -115922 27805 93005 -103259 -9423 110387 -79170 -46028 116155 -47217 -77799
472g7799J87470j19841r0160J90617o2867j39473J75028k471j70979J38972N8127
$$ -77799 109671 -10170 -100330 90287 27420 -112053 62975 60504 -110475 28497 86624
483H6624j84680R0809J10563j79370L4167J50590j54183k5283J72397j13382q0007
$$ 86624 -98056 -7247 103316 -76054 -41887 108703 -45480 -70763 101634 -11748 -91755
494i1755J77485o3261j24693J62573o954j55647J31865M7557j69020Q8760R6205
$$ -91755 85730 22469 -102224 60349 53395 -102252 29613 77170 -91850 -3090 93115
505I3115j65162L7821J33078j44515j5642J56381j11803o4201J61953o5743j08510
$$ 93115 -72047 -34226 98852 -45663 -61305 95076 -16727 -80928 81025 15282 -93228
516i3228J52359j5094j38472J27739L4078j54149R0260Q0085j55018M5068J18066
$$ -93228 59131 44037 -94435 33304 67382 -86767 3493 83578 -71440 -26372 91694
527I1694j40139l810J42601j11802n1710J53265p1696r4679J47706k4506j27428
$$ 91694 -48445 -52255 90346 -21456 -73166 80099 8403 -86276 61430 36924 -90504
538i0504J26855K4408j46342R3749P0498j49244M9517J09559j37974J884J35303
$$ -90504 36351 60759 -85583 8166 78664 -70580 -21063 88496 -49478 -47594 87709
549H7709j10207m5478J45430p1702q7668J41738k7180j18396J22148J9140j36209
$$ 87709 -22498 -67976 77454 5752 -81916 59822 32642 -85754 36394 55534 -80675
560h0675Q9809O3700j39862M8785R9144j27660M532J22534j02919l8218J32520
$$ -80675 9134 72834 -67028 -18243 80901 -46759 -42227 80307 -22612 -60830 71690
571G1690o8968p6708J30008k8751j05323J13681J2458j21722Q6235N1049j28233
$$ 71690 2722 -73986 56022 27271 -78052 35629 48087 -73635 12600 63649 -64584
582f4584N2874Q4335j19351J2265J08740r9964k7549J21803p1016o3176J22489
$$ -64584 -11710 72625 -46726 -34461 74279 -25685 -53234 68569 -2447 -65623 56866
593E6866l5841r3716J10482L840j12885Q6851M2894j20818N4876P5169j15687
$$ 56866 21025 -72691 37791 41631 -71254 15597 58491 -62327 -7451 67718 -47969
604d7969J9357R9410r8812k0385J15496p2258n6216J15929l7569q5964J06811
$$ -47969 -28612 70798 -28014 -48399 67097 -5161 -61377 54552 16983 -68981 37830
615C7830q8j05311Q4901L6467j13725N5599O7812j10176K1476R1515r3893j5523
$$ 37830 37742 -67569 17332 53799 -59926 -4327 63485 -46691 -25215 66300 -27593 -43116
627d3116J05623o9327m9463J08416l8315p6654R9270l363r6092Q1154K9832j03511
$$ -43116 62507 -6820 -56283 52133 13818 -62836 36434 33071 -63021 18133 47965 -55546
639e5546N3232O0272j01658K2314Q2449q8660j0519R5576o6504m0991R9787l9867
$$ -55546 -2314 57958 -43700 -21386 61063 -27597 -38116 57460 -9044 -50035 49752 9885
651I885o6505R2672r364q4985P7960K2430r5009N4467N0096r4985K7041P2631
$$ 9885 -56620 36052 26688 -58297 19663 42093 -52916 1551 51647 -43338 -16297 56334
663E6334q4985l474Q6213o6231l2637R3538m2894n8233Q9209j3643p8024P6090
$$ 56334 -28651 -32125 54088 -12143 -44780 48758 5864 -52369 36840 23197 -54827 21263
675B1263J6027q7861N4364M3144q9948K9140O7187q2559L99Q0842o5346k7984
$$ 21263 37290 -50571 3793 46937 -43011 -13871 53316 -29243 -28844 51998 -13348 -41332
687d1332Q7602m2578n2980Q4951j5637p0544P2205J2302q2489N2894L9217q3257
$$ -41332 46270 3692 -49288 35663 20026 -50518 21687 33989 -48500 4394 43611 -39646
699c9646K9244N8328p6423K398P4455o2371k2418Q0166m2164m5378P8386j8446
$$ -39646 -10402 47926 -28497 -26099 48356 -14015 -36433 43733 1569 -43809 34577 16131
711A6131o3529O9066P573p4646N2173L2519p8011L1493N2093p2882O193O7555
$$ 16131 -47398 21668 29241 -45405 6768 39287 -38724 -7231 44862 -28020 -21827 45728
723D5728o0405j8296P4317m2577l9970P4501j9722n7097O4824M228o8362N1152
$$ 45728 -14677 -32973 41344 -1233 -41203 33298 13576 -43521 21303 25531 -42831 8321
735H321K6386p1437L1822M5355o8762J0009O0084n7656j3121O7957m1212l4406
$$ 8321 34707 -36730 -4908 40447 -28315 -18306 41778 -15878 -28999 38958 -2254 -36660
747c6660O8873k1448n1724O3220L76o2674N0141K2050o8785L3649M0553o4835
$$ -36660 32213 10765 -40959 22261 22637 -40037 10104 32154 -36631 -2982 37571 -27264
759b7264J1906N5687n7217r112O4508m3299k9299O6323k3737m6608N9952k464
$$ -27264 -15358 40329 -16888 -26000 38508 -4791 -34090 32233 8496 -38112 21840 19376
771A9376n7210M8525J8506o3092L2780L6825o1899J2325N0444n2789p455N8849
$$ 19376 -37834 10691 29197 -33895 -1115 35710 -26189 -13864 36580 -16209 -23664 35185
783C5185m0766k5064O0662k3558m1170N5898m703n1239M6071J4679n8071L2826
$$ 35185 -5581 -30645 30017 6459 -34711 21187 16484 -34755 11316 25995 -32076 750
795G50L0968n7546J5206M4935n1150l437N4081m0738k1359N7230k4020l7147N3492
$$ 750 31718 -25828 -10622 34313 -16837 -20274 33807 -6931 -28290 28940 4920 -32227 21265
808B1265p514m6674M4444J1192n3857L2591K7864n4740J7542L9613m9024q65N0007
$$ 21265 13751 -32923 11521 22713 -31144 1447 29311 -25429 -7887 31726 -17298 -18163 31844
821C1844l9296j7400N2603k5287l1895N0788q824m3576M4464P150n0094L2881
$$ 31844 -7452 -24852 27751 2464 -29431 21357 12533 -31043 13421 20571 -29523 3358
833C358K2548m9992J8444L5186m6801J888M4681l7679j5290N0202k5099k8241
$$ 3358 25906 -24086 -5642 29544 -17257 -15369 29312 -8367 -23657 26545 1446 -26795
845b6795M7707j0586l9381M2500N014m6121L1680K0080m6967J7912L2629m4179
$$ -26795 20912 10326 -29055 13445 18459 -27662 4018 24098 -22869 -4957 27672 -16507
857a6507K908M1383l6837j1635M5510k4617k4416M4065j1455l4712L9544L016
$$ -16507 -13599 27784 -9053 -20688 24822 205 -24211 19854 8399 -26313 13231 16247
869A6247m2551L1373J6350m3369J8263K8283m1542N935L7173l5040q526M1802
$$ 16247 -26304 5069 21419 -21950 -3687 24596 -16946 -11011 26162 -8878 -17404 24398
881B4398k5682k1033M1781j3071l1684L9159O79l8892L0496J3788m1990K0169
$$ 24398 -1284 -22317 19464 6393 -25291 13868 14547 -24345 6151 19939 -22051 -1882
893a882K5590l9737N905L4159l3786o634L9675k5757j8124L9659j2949k9125L6124
$$ -1882 23708 -16029 -10124 24035 -9751 -16385 23290 -2467 -20591 19068 6119 -23006 13118
906A3118l55l5617K9470J0905l8057J9363K2395l7166P165L0642l2210m155L5752
$$ 13118 12763 -22854 6616 17521 -20536 -1173 21222 -15944 -8779 21863 -10347 -14502 21250
919B1250k4712j5300L7326j5038k5152L5160k706l2560K8649R143l6184J9792
$$ 21250 -3462 -18762 18564 3526 -21626 13534 10828 -21732 6917 16060 -20124 -332
931c32K0380l5601Q642K8133l1708j910L2825k4269j3537L4937j4321k3908L3905
$$ -332 20048 -15553 -6911 21222 -10486 -12396 20429 -3840 -17377 17560 3239 -20669 13236
944A3236l918k9568K7279P683l3232J9268J7832l4309R970K5071k9914l08L0208
$$ 13236 9318 -20250 7029 14712 -18520 748 18580 -15729 -5759 19312 -10602 -10910 19298
957A9298k3587j1237L2223j4530k0395L0751m529k6293K5872M869l0189J8958
$$ 19298 -4289 -15526 16697 2167 -18228 12523 7994 -18299 7573 12442 -17747 1211
969A211J5915l2054J0691K2200k8550O65K8275k3553r079L0522j4783j7747K8135
$$ 1211 17126 -14928 -4237 17963 -10587 -9922 18353 -5200 -14279 16243 1460 -16287 11848
982A1848m942k4245K4677L845k7845J8465J3900l0112J1177K0488k7044J406K5327
$$ 11848 6906 -17339 7338 11183 -16662 1803 15703 -14409 -3232 17256 -9788 -8382 16945
995A6945k2135p463K8049j5079j6342K8283o454k2690K4885J983k6333J9367J0911
$$ 16945 -5190 -12653 15396 317 -16025 12258 5804 -16886 7999 9982 -16351 3016 13927
1008A3927k6963J0661J7827k5345K085K3710k1275o496K6535j5249j3479K6310
$$ 13927 -13036 -2375 15452 -9893 -7808 15902 -5373 -11869 14666 -583 -14062 12248
1020A2248p712k0192K3321J007k4037J7980R733k5158J1361J5420k3547K801K1531
$$ 12248 4536 -15656 7665 8672 -15365 2615 12348 -12810 -1449 13971 -9576 -6775 14756
1033A4756k0011n172K4336j5457j0724K3802q307j8127K3630p76k2239J7858Q002
$$ 14756 -5255 -10427 13909 -1548 -12272 11530 3223 -14904 8726 7950 -14289 3569 11571
1046A1571k3848J1222J4272k3219M576J9084j9119l815K2434j4741r766K2486
$$ 11571 -12277 -1055 13217 -10002 -5426 13658 -5461 -9276 13158 -1583 -11349 11137
1058A1137q757j5725K1297j510k0260J7647O163k2111J2428J1394k0831M569J6976
$$ 11137 2380 -13345 7952 6442 -13818 3829 9992 -12119 309 11703 -9128 -4559 12417
1071A2417j8210j897K0141j4178r153K1526q889j3622J9738j650j9679J7629M959
$$ 12417 -5793 -7690 12451 -1727 -10880 10646 1757 -11865 7873 6223 -13456 4173 9132
1084I132k0517J1962J0183k0038N241J6293j7657j984J8987j3900p425K0274r232
$$ 9132 -11385 577 10760 -9278 -4037 12256 -5401 -7385 11602 -2298 -9723 10551 1319
1097A319j2831J9721l103j6911J5779L935j8714J1870R527j9724N741J4385j7394
$$ 1319 -11512 8209 5106 -11805 3974 7909 -10805 1065 10592 -9132 -3391 10994 -6400
1110f400l39J7982j3589o505J9004r966j0236J7549k952j5464J4666L365j6825
$$ -6400 -6739 11243 -2346 -8851 10153 187 -10049 7500 4548 -10916 3750 7115 -9710
1123i710J0415Q517j7649N275J3678j6639L04J5965j3142m917J7776r218j0697
$$ -9710 705 9222 -8427 -3152 10526 -6113 -5809 10156 -2986 -7903 9873 655 -10042
1136a0042J7394l235j4119J4636J001j5570J1288P497j6751O574J1742j6549J492
$$ -10042 7352 4117 -10002 4634 5635 -9935 1353 8850 -7901 -1327 10415 -6134 -4642
1149d642J3913j1910l796J5348q921q759J5986m004j2565J4615K63j5035J1935
$$ -4642 9271 -2639 -6435 8913 -8 -8767 7219 3215 -9350 5265 5528 -9507 2428
1162B428N586j5293N874J0420j4678K240J2780j2374l190J4745r136p807J5005
$$ 2428 8014 -7279 -1405 9015 -5663 -3423 9357 -3017 -6207 8538 -598 -8405 6600
1175F600m006j1259J3655m22j3391J1583M505j4113N601R306j4064J837J2712
$$ 6600 2594 -8665 4990 4568 -8823 2760 7265 -6848 -1247 8059 -6005 -4168 8544
1188H544j1658k986J3777q496o649J3785l589j0311J2202m13j2763J0667M601
$$ 8544 -3114 -6100 7677 -819 -7468 6317 2728 -7583 4619 4206 -8557 2110 6711
1201F711j3675O039P791j2525K717J0819j1335j581J2178p929n976J3064m717
$$ 6711 -6964 -925 6866 -5659 -2942 7877 -3458 -5039 7139 -790 -6766 6298 1581
1214A581r170J2272k67j2027R737L384j2812P054O782j1508K957R217j0567j140
$$ 1581 -7589 4683 4416 -7611 2126 5510 -7302 -248 6534 -4974 -2017 7200 -3367 -4507
1228d507J0788p674n321J2705m579q370J0985r38j0057R455K494j1446O621O097
$$ -4507 6281 -1393 -6714 5991 1412 -6958 4027 3089 -6968 2487 4981 -6465 156 6253
1242F253j1656L414R554j0979o83J0385p165m530J1514n290p210J0930j379r618
$$ 6253 -5403 -1989 7565 -3414 -4097 6288 -877 -5407 6107 817 -6393 4537 3158 -6460
1256f460Q929K345j0490O358M735r739K415P731r531K74R166p033l396J0513n715
$$ -6460 2469 4814 -5676 682 5417 -4322 -1907 5824 -3707 -3433 5733 -1300 -4696 5817 102
1271A02o065R864j276q581Q089K244j0563O893M558r799L632O395q265O2Q412
$$ 102 -5963 3901 2625 -5956 2133 4377 -6186 707 5265 -4534 -902 5493 -2772 -2710 5702
1286E702o643k881R579n494n689R376j138q693Q449J090q766O575L173r190L692
$$ 5702 -941 -3822 5757 263 -5426 3950 2812 -5881 2568 3658 -5108 1467 4640 -4550 -858
1301h58O037q208J83P763o900k216R938n970m965R542k259p229P413J065q392
$$ -858 5179 -3029 -2846 4917 -1983 -4199 5739 -231 -5196 4346 2087 -5142 2271 3336 -5056
1316e056O020L088q337L373N053p325R69P289o365k096P900m720m221P333j269
$$ -5056 964 4052 -4285 -912 4141 -3184 -2215 5074 -1291 -3387 4513 -207 -4428 2905 1636
1331A636o257O857O59p625O392K288q118K627O558q452J540O673o079q38O616
$$ 1636 -4621 2236 2895 -4730 1662 3950 -4168 -1541 5017 -3435 -1895 4778 -1301 -2139 4477
1346D477m947l811Q054k833n906P033j03n996M936K247p637M105M486p006R22
$$ 4477 -470 -4281 3773 940 -4966 2067 1964 -4032 904 3151 -4486 -381 4105 -2901 -1979
1361a979O528o343r56P473n356k862P163j938n438O110n92n339L941K959p794
$$ -1979 4549 -1794 -2750 4723 -633 -3495 3668 1730 -3708 2402 1810 -3529 412 3371 -4423
1376d423M064M360p143J719N093n692m62P010m987m116Q008k691n144P575j149
$$ -4423 -359 4001 -3142 -1423 3670 -2022 -2484 4526 -461 -4577 3431 740 -4404 3171 2022
1391B022o238N998J007o458L661L710o742J934M774o146N08N852m811k686O830
$$ 2022 -4216 1782 2789 -3669 -8 3702 -3040 -1106 3668 -2478 -1970 3882 -929 -3615 3215
1406C215k319m450N754o63n671N876J036o504L446L099n439J100M870n624N30
$$ 3215 896 -3554 2200 1537 -4134 1742 2778 -3726 -280 2819 -2620 -1520 3350 -2274 -1744
1421a744M989l934k133N380k248l295N523j255m602M457J143o097M091K482m976
$$ -1744 3245 -689 -2822 2558 310 -2985 2538 1283 -3319 1138 2281 -3816 275 2757 -2219
1436b219J484M068n508M19N462m435k384O309k969l060N879j702m248M331N78
$$ -2219 -735 3333 -2175 -1756 3706 -729 -3113 3196 227 -2833 3046 1344 -2904 1427 2005
1451B005n649L845K609n387K381L290n217J018M058l989r91N121k952l448N352
$$ 2005 -3644 201 2810 -2577 -196 3094 -2123 -1105 2953 -1036 -2027 3094 142 -3306 2046
1466B046j202m304N143M05m944L187J947m853K114L529m851J98M314l907r03M847
$$ 2046 844 -3460 1683 2088 -2856 331 2278 -2575 -461 3068 -1783 -1585 2729 -1178 -2081 2766
1482B766k538k595M998j424m154M349M23l694K420J480m423J932L213m466N49
$$ 2766 228 -2367 2631 1207 -2947 1402 1825 -1869 551 2031 -2392 -460 2753 -1713 -1164
1497a164L887l433j066M148l200j448M743j607l364L438O41m206L384J250m339
$$ -1164 2723 -710 -1776 2372 -828 -2276 2467 860 -2504 934 1575 -2631 753 2003 -2336
1512b336K284L369n468J088L734l829n94M864k737k405M468j918l660M710n06
$$ -2336 -52 3317 -2151 -1063 2671 -1158 -1752 3112 375 -2030 2438 520 -3140 1570 1064
1527A064l690L297J609m902K658K878m388N25L074l379j38M036l110j696L803
$$ 1064 -2626 671 2280 -2622 36 2914 -1474 -949 2125 -1254 -1392 2644 -466 -2162 1641
1542A641j453k089K977r62k050K577P78l985K949K061m393J094K549l189L14L598
$$ 1641 188 -1901 1076 114 -1936 641 1419 -2566 383 2444 -1949 -855 1694 -1495 -1181 2417
1558B417l387j040M413j895l875N102q17k799K586P15l427K337J883m023J231
$$ 2417 -970 -2010 2403 508 -3367 1735 918 -1881 705 1420 -2007 330 2213 -1810 -579
1573e79K640k893m02L053k288j145L802k489k000L726j578k210L761P6m193L342
$$ -579 2061 -832 -1234 1819 -469 -1614 2188 -301 -2301 1425 -153 -2363 1398 1474 -2719 623
1589F23J156l139O90K759k763p9K903k696r12L782k255j377L133j300k336K077
$$ 623 1779 -1360 -670 2089 -674 -753 2150 -546 -1458 2324 69 -1308 1825 525 -1811 266
1605B66N37k987K837J122k643R67J915k928j24K489j950m44K607j624j258K946
$$ 266 803 -2184 653 1775 -868 99 2014 -914 -1038 1451 -499 -943 1664 40 -1218 1728
1621A728k003j397K510O03l126K136M17k275J908J028k581M74K007k560L52K480
$$ 1728 -275 -1672 838 1441 -1685 451 868 -1407 501 1529 -1052 -578 1429 -1131 -779 1701
$$ [...]
8191D03
##END NTUPLES=NMR FID
##END=
