##TITLE=1H_SAM_11.106
 CDCl3, 108 sc, 
 6.3.2019
##JCAMPDX= 6.0         $$ Bruker NMR JCAMP-DX V2.0
##DATA TYPE= NMR FID
##DATA CLASS= NTUPLES
##ORIGIN= UXNMR, Bruker Analytische Messtechnik GmbH
##OWNER= root
$$ XWIN-NMR		Version 3.5
$$ Wed Mar  6 15:44:57 2019 Russian Standard Time (UT+4h)  she@DPX200
##.OBSERVE FREQUENCY= 200.1316
##.OBSERVE NUCLEUS= ^1H
##.DELAY= (6, 6)
##.ACQUISITION MODE= SIMULTANEOUS
##.ACQUISITION SCHEME= undefined
##.AVERAGES= 108
##.DIGITISER RES= 18
##SPECTROMETER/DATA SYSTEM= spect
##.PULSE SEQUENCE= zg30
##.SOLVENT NAME= CDCl3
##.SHIFT REFERENCE= (INTERNAL, CDCl3, 0, 15.7039)
##AUDIT TRAIL= $$ (NUMBER, WHEN, WHO, WHERE, WHAT)
$$ ##TITLE= Audit trail, XWIN-NMR		Version 3.5
$$ ##JCAMPDX= 5.01
$$ ##ORIGIN= Bruker BioSpin GmbH
$$ ##OWNER= she
$$ F:/spectra/data/she/nmr/H-F/1/audita.txt
$$ ##AUDIT TRAIL=  $$ (NUMBER, WHEN, WHO, WHERE, WHAT)
(   1,<2019-03-06 15:43:41.50 +0400>,<she>,<DPX200>,
      <continue with go, POWCHK disabled, PULCHK disabled
       configuration hash MD5:
       00 E9 B6 7A A2 85 ED C7 34 08 36 98 17 FE 4E 26
       data hash MD5: 16K
       F0 E6 4A 8D 08 96 E7 0B 52 3F BC 59 A3 88 07 CF>)
$$ ##END=
$$ 
$$ hash MD5
$$ 18 30 73 9F DA CF 4D D9 7A 4B 1C 1D CB 8C A6 F6
##$RELAX= 
##$RELAX= 
##$RELAX= 
##$RELAX= 
##$RELAX= 
##$RELAX= 
$$ Bruker specific parameters
$$ --------------------------
##$DU= <F:/spectra>
##$EXPNO= 1
##$NAME= <H-F>
##$PROCNO= 1
##$TYPE= <nmr>
##$USER= <she>
##$AMP= (0..31)
100 100 100 100 100 100 100 100 100 100 100 100 100 100 100 100 100 100 
100 100 100 100 100 100 100 100 100 100 100 100 100 100 
##$AQSEQ= 0
##$AQ_mod= 1
##$AUNM= <au_zg>
##$AUTOPOS= <>
##$BF1= 200.13
##$BF2= 200.13
##$BF3= 200.13
##$BF4= 200.13
##$BF5= 200.13
##$BF6= 200.13
##$BF7= 200.13
##$BF8= 200.13
##$BYTORDA= 1
##$CFDGTYP= 0
##$CFRGTYP= 5
##$CHEMSTR= <none>
##$CNST= (0..31)
1 1 145 1 1 1 1 1 1 1 1 1 1 1 1 1 1 1 1 1 1 1 1 1 1 1 1 1 1 1 1 1 
##$CPDPRG= <>
##$CPDPRG1= <>
##$CPDPRG2= <>
##$CPDPRG3= <>
##$CPDPRG4= <mlev>
##$CPDPRG5= <mlev>
##$CPDPRG6= <mlev>
##$CPDPRG7= <mlev>
##$CPDPRG8= <mlev>
##$CPDPRGB= <>
##$CPDPRGT= <>
##$D= (0..31)
0 1.2 0 0 0 0 0 0 0 0 0 0.03 0 0 0 0 0 0 0 0 0 0 0 0 0 0 0 0 0 0 0 0 
##$DATE= 1551872404
##$DBL= (0..7)
120 120 120 120 120 120 120 120 
##$DBP= (0..7)
150 150 150 150 150 150 150 150 
##$DBP07= 0
##$DBPNAM0= <>
##$DBPNAM1= <>
##$DBPNAM2= <>
##$DBPNAM3= <>
##$DBPNAM4= <>
##$DBPNAM5= <>
##$DBPNAM6= <>
##$DBPNAM7= <>
##$DBPOAL= (0..7)
0.5 0.5 0.5 0.5 0.5 0.5 0.5 0.5 
##$DBPOFFS= (0..7)
0 0 0 0 0 0 0 0 
##$DE= 6
##$DECBNUC= <off>
##$DECIM= 24
##$DECNUC= <off>
##$DECSTAT= 4
##$DIGMOD= 1
##$DIGTYP= 9
##$DL= (0..7)
0 120 120 120 120 120 120 120 
##$DP= (0..7)
150 150 150 150 150 150 150 150 
##$DP07= 0
##$DPNAME0= <>
##$DPNAME1= <>
##$DPNAME2= <>
##$DPNAME3= <>
##$DPNAME4= <>
##$DPNAME5= <>
##$DPNAME6= <>
##$DPNAME7= <>
##$DPOAL= (0..7)
0.5 0.5 0.5 0.5 0.5 0.5 0.5 0.5 
##$DPOFFS= (0..7)
0 0 0 0 0 0 0 0 
##$DQDMODE= 0
##$DR= 18
##$DS= 0
##$DSLIST= <SSSSSSSSSSSSSSS>
$$ [...]
##$SUBNAM2= <"">
##$SUBNAM3= <"">
##$SUBNAM4= <"">
##$SUBNAM5= <"">
##$SUBNAM6= <"">
##$SUBNAM7= <"">
##$SUBNAM8= <"">
##$SUBNAM9= <"">
##$SW= 24.9336934301222
##$SWIBOX= (0..15)
0 0 2 0 0 0 0 0 0 0 0 0 0 0 0 0 
##$SW_h= 4990.01996007984
##$TD= 16384
##$TD0= 1
##$TE= 0
##$TE2= 300
##$TE3= 300
##$TEG= 300
##$TL= (0..7)
0 120 120 120 120 120 120 120 
##$TP= (0..7)
150 150 150 150 150 150 150 150 
##$TP07= 0
##$TPNAME0= <>
##$TPNAME1= <>
##$TPNAME2= <>
##$TPNAME3= <>
##$TPNAME4= <>
##$TPNAME5= <>
##$TPNAME6= <>
##$TPNAME7= <>
##$TPOAL= (0..7)
0.5 0.5 0.5 0.5 0.5 0.5 0.5 0.5 
##$TPOFFS= (0..7)
0 0 0 0 0 0 0 0 
##$TUNHIN= 0
##$TUNHOUT= 0
##$TUNXOUT= 0
##$USERA1= <user>
##$USERA2= <user>
##$USERA3= <user>
##$USERA4= <user>
##$USERA5= <user>
##$V9= 5
##$VALIST= <valist>
##$VCLIST= <CCCCCCCCCCCCCCC>
##$VD= 0
##$VDLIST= <DDDDDDDDDDDDDDD>
##$VPLIST= <PPPPPPPPPPPPPPP>
##$VTLIST= <TTTTTTTTTTTTTTT>
##$WBST= 1024
##$WBSW= 4
##$XGAIN= (0..3)
0 0 0 0 
##$XL= 0
##$YL= 0
##$YMAX_a= 324827
##$YMIN_a= -446273
##$ZGOPTNS= <>
##$ZL1= 120
##$ZL2= 120
##$ZL3= 120
##$ZL4= 120
##$ABSF1= 10
##$ABSF2= 0
##$ABSG= 5
##$ABSL= 3
##$ALPHA= 0
##$AQORDER= 0
##$ASSFAC= 0
##$ASSFACI= 0
##$ASSFACX= 0
##$ASSWID= 0
##$AUNMP= <proc_1d>
##$AZFE= 0.1
##$AZFW= 0.1
##$BCFW= 1
##$BC_mod= 2
##$BYTORDP= 1
##$COROFFS= 0
##$CY= 11.3945322036743
##$DATMOD= 1
##$DC= 2
##$DFILT= <>
##$DTYPP= 0
##$F1P= 18.9103706918063
##$F2P= -1.10871071338519
##$FCOR= 0.5
##$FTSIZE= 0
##$FT_mod= 4
##$GAMMA= 1
##$GB= 0.15
##$INTBC= 1
##$INTSCL= 1
##$ISEN= 128
##$LB= 0.24
##$LEV0= 0
##$LPBIN= 0
##$MAXI= 10000
##$MC2= 0
##$MEAN= 0
##$ME_mod= 0
##$MI= 1.114404
##$NCOEF= 0
##$NC_proc= 0
##$NLEV= 6
##$NOISF1= 3.799351
##$NOISF2= 2.8
##$NSP= 1
##$NTH_PI= 0
##$NZP= 0
##$OFFSET= 15.70392
##$PC= 1
##$PHC0= -8850.861
##$PHC1= 1.600142
##$PH_mod= 1
##$PKNL= yes
##$PPARMOD= 0
##$PSCAL= 0
##$PSIGN= 0
##$REVERSE= no
##$SF= 200.130013532006
##$SI= 16384
##$SIGF1= 3
##$SIGF2= 2
##$SINO= 400
##$SIOLD= 16384
##$SREGLST= <1H.CDCl3>
##$SSB= 0
##$STSI= 0
##$STSR= 0
##$SW_p= 3612.71676300578
##$SYMM= 0
##$S_DEV= 0
##$TDeff= 0
##$TDoff= 0
##$TI= <>
##$TILT= no
##$TM1= 0
##$TM2= 0
##$TOPLEV= 0
##$USERP1= <user>
##$USERP2= <user>
##$USERP3= <user>
##$USERP4= <user>
##$USERP5= <user>
##$WDW= 1
##$XDIM= 8192
##$YMAX_p= 0
##$YMIN_p= 0
$$ End of Bruker specific parameters
$$ ---------------------------------
##NTUPLES= NMR FID
##VAR_NAME=  TIME,          FID/REAL,        FID/IMAG
##SYMBOL=    X,             R,               I
##VAR_TYPE=  INDEPENDENT,   DEPENDENT,       DEPENDENT
##VAR_FORM=  AFFN,          ASDF,            ASDF
##VAR_DIM=   8192,          8192,            8192
##UNITS=     SECONDS,       ARBITRARY UNITS, ARBITRARY UNITS
##FACTOR=    0.0002004,     1,               1
##FIRST=     0,             0,               0
##LAST=      1.6414764,     0,               0
##MIN=       0,             -446273,         0
##MAX=       1.6414764,     324827,          0
$$ Real data points
##PAGE= N=1
##DATA TABLE= (X++(R..R)), XYDATA
$$ [...]
$$ plain form
2798 715 53 -1231 0 -242 -1123 -1305 -1218 -850 705 -405 970 -749 -309 368 -772 -169 -488 645
2816 645 763 -61 -409 413 -309 -648 855 624 -436 -59 85 674 589 377 828 215 -106 194 -844
2835 -844 491 517 -647 386 131 716 -81 785 -24 121 -255 -982 -721 -48 -411 -402 -728 -871 408 967
2855 967 1 909 390 -129 383 1004 470 324 -202 1349 -927 91 1156 252 -338 229 485 -41 398
2874 398 663 -318 172 -683 -1309 -796 -388 283 -119 405 -788 12 -283 176 -334 522 -363 493 1054 -66
2894 -66 1536 47 58 388 292 903 -265 195 413 -884 98 794 182 309 -43 85 -139 -208 -386 -1302
2914 -1302 -15 -289 -1303 -650 -329 153 -988 -685 149 -457 -376 -1181 -126 454 992 -103 667 158
2932 158 645 796 793 837 759 481 -119 1287 -426 -364 574 573 93 482 -345 -234 -859 62 -1059 253 -938
$$ packed form
2798G15o62j284J231k42q81j82Q7L68J555j110J375j719M40O77j140O03l19J133
2816F45J18q24l48Q22p22l39J503k31j060L77J44N89q5k12M51o13l21L00j038
2835h44J335K6j164J033k55N85p97Q66q09J45l76p27K61O73l63Rl26j43J279N59
2855I67r66R08n19n19N12O21n34j46n26J551k276J018J065r04n90N67K56n26M39
2874C98K65r81M90q55o26N13M08O71m02N24j193Q00k95M59n10Q56q85Q56N61j120
2894f6J602j489J1L30r6O11j168M60K18j297R82O96o12J27l52J28k24o9j78r16
2914a302J287k74j014O53L21M82j141L03Q34o06Q1q05J055N80N38j095P70n09
2932A58M87J51lM4p8k78o00J406j713O2R38jm80L89q27J11o25R21j121J312j191
$$ plain form
2953 -938 -653 140 341 -1003 526 -300 -1142 270 -844 170 1671 -966 1501 23 403 824 486
2970 486 505 450 305 45 59 84 1245 546 -330 -511 507 553 -545 -592 152 933 517 -336 195 279 795
2991 795 -547 -645 391 -673 -812 451 837 214 67 -436 59 -524 948 266 -184 48 -615 531
3009 531 -94 -5 887 -563 1390 47 1145 51 -812 -978 -494 -676 -289 597 -459 -577 -341 573
3027 573 -192 -450 311 688 -406 518 -293 99 -103 150 -343 -462 -361 -564 -144 116 -2 -209 798
3046 798 86 437 169 95 34 270 1137 -114 -98 423 -399 571 -632 -251 58 -22 363 -267 26 45 -142
3067 -142 250 -917 -642 -415 -137 -692 -422 417 787 -169 412 179 796 57 23 -1495 580 320 184
3086 184 172 468 -413 -135 -405 -118 -303 -493 -417 -728 613 -17 -835 -49 426 186 141 -15 347 -325 503
$$ packed form
2953i38K85P93K01j344J529q26q42J412j114J014J501k637K467j478L80M21l38
2970D86J9n5j45k60J4K5J161o99q76j81J018M6j098m7P44P81m16q53N31Q4N16
2991G95j342r8J036j064j39J263L86o23j47n03M95n83J472o82m50K32o63J146
3009E31o25Q9Q92j450J953j343J098j094q63j66M84j82L87Q86j056j18K36R14
3027E73p65k58P61L77j094R24q11L92k02K53m93j19J01k03M20K60j18k07J007
3046G98p12L51k68p4o1K36Q67j251J6N21q22R70j203L81L09q0L85o30K93J9j87
3067a42L92j167K75K27K78n55K70Q39L70r56N81k33O17p39l4j518K075k60j36
3086A84j2K96q81K78k70K87j85j90P6l11J341o30q18P86M75k40m5j56L62o72Q28
$$ plain form
3107 503 533 63 221 551 -162 145 194 -630 110 532 -148 -218 -175 -421 -150 -425 -476 -66 -145 373 -119 -495
3129 -495 -141 -861 224 -136 -1160 -924 892 383 96 -557 48 775 -797 -361 -636 463 20 1544
3147 1544 272 519 -19 246 6 -1065 -706 651 721 79 -163 -452 404 -821 -747 373 -334 -835 102
3166 102 -404 800 -42 136 -600 -173 -430 -276 -574 626 -96 -844 485 41 -141 664 341 788 426
3185 426 76 783 921 1486 -274 -128 417 734 375 318 72 1115 499 243 490 -1200 405 -599 423
3204 423 -661 -185 -1035 -60 -960 409 321 -781 -235 -981 -328 957 -458 -81 -906 292 19 535
3222 535 61 -275 252 -689 -235 136 -111 -119 68 -30 -74 543 -219 189 -745 -401 123 100 -197 704 -476
3243 -476 -1091 -364 -316 642 -293 436 222 902 22 -864 769 22 566 -866 -317 -343 -325 -739 215 300 907
$$ packed form
3107E03L0m70J58L30p13L07M9q24P40M22o80p0M3k46K71k75n1M10p9N18m92l76
3129d95L54p20J085l60j024K36J816n09k87o53O05P27j572M36k75J099m43J524
3147A544j272K47n38K65k40j071L59J357P0o42k42k89Q56j225P4J120p07n01R37
3166A02n06J204q42J78p36M27k57J54k98J200p22p48J329m44j82Q05l23M47l62
3185D26l50P07J38N65j760J46N45L17l59n7k46J043o16k56K47j690J605j004J022
3204D23j084M76q50R75r00J369q8j102N46p46O53J285j415L77q25J198k73N16
3222E35m74l36N27r41M54L71k47qJ87r8m4O17p62M08r34L44N24k3k97R01j180
3243d76o15P27M8R58r35P29k14O80q80q86J633p47N44j432N49k6J8m14R54Q5O07
$$ plain form
3264 907 -249 -467 476 433 -360 -71 240 -435 -953 -510 382 221 313 43 199 -192 -618 -38 -161 -454
3284 -454 -740 -1271 414 300 -213 282 1121 502 -95 407 86 885 610 -198 33 311 169 258 652 -586
3304 -586 -585 -1076 -543 379 -157 -517 -113 -1103 -7 -641 -118 -707 38 243 -838 447 208 987 842 553
3324 553 -96 392 -73 -448 27 -207 -164 -704 1153 -243 -911 552 -366 1283 675 316 -681 -332 -1186
3343 -1186 -1341 -535 -367 -836 439 -453 -524 -508 538 -1209 86 701 399 483 -215 1454 -847 170
3361 170 -830 -809 97 230 -449 751 400 693 791 -623 1118 1057 81 182 -10 -438 -378 -1907 454
3380 454 -352 -468 44 266 565 -600 -80 186 -56 -179 -249 -24 -719 460 825 -442 349 126 285
3399 285 401 -504 119 830 -56 -653 405 -899 68 -569 1068 -159 -967 554 145 260 -617 -1297
$$ packed form
3264I07j156k18R43m3p93K89L11o75n18M43Q92j61R2k70J56l91m26N80j23k93
3284d54k86n31J685j14n13M95Q39o19n97N02l21P99k75q08K31K78j42Q9L94j238
3304e86Jm91N33R22n36l60M04r90J096o34N23n89P45K05j081J285k39P79j45k89
3324E53o49M88m65l75M75k34M3n40J857j396o68J463r18J649o08l59r97L49q54
3343a186j55Q06J68m69J275q92p1J6J046j747J295O15l02Q4o98J669k301J017
3361A70j000K1R06J33o79J200l51K93R8j414J741o1r76J01j92m28O0j529K361
3380D54q06j16N12K22K99j165N20K66k42j23p0K25o95J179L65j267P91k23J59
3399B85J16r05O23P11q86n97J058j304R67o37J637j227q08J521m09J15q77o80
$$ plain form
3417 -1297 227 -575 -699 -200 -723 376 468 -600 -606 -438 525 -974 -392 233 -558 19 -51 -1389 179
3436 179 -50 -80 425 31 -833 174 605 -697 -283 322 -797 410 112 -1478 -51 -117 352 189 -447
3455 -447 647 -824 -498 -404 -1057 215 -114 -220 1405 780 -673 185 -567 897 -1019 -622 -532 -278
3473 -278 -381 516 803 911 183 -905 163 -213 249 492 -758 -1088 -743 -49 683 -9 517 909 -164
3492 -164 -669 -68 635 853 382 738 286 -759 -143 -88 84 807 255 266 -483 -803 -262 -128 90 63 -241
3513 -241 523 -885 -661 -751 1086 463 -443 -122 -326 -1063 473 -804 -857 192 200 -1034 -1142 169 -787
3532 -787 -31 548 591 -27 52 -1197 18 -220 1383 749 845 -1005 -1 666 567 71 -864 306 144
3551 144 638 -15 409 340 -483 -91 -867 201 430 -587 585 357 97 73 486 -238 45 -1012 23
$$ packed form
3417a297J524q02j24M99n23J099R2j068oJ68R63j499N82O25p91N77p0j338J568
3436A79k29l0N05l94q64J007M31j302M14O05j119J207k98j590J427o6M69j63o36
3455d47J094j471L26R4o53J272l29j06J625o25j453Q58p52J464j916L97R0K54
3473b78j03Q97K87J08p28j088J068l76M62K43j250l30L45O94P32o92N26L92j073
3492a64n05O01P03K18m71L56m52j045O16N5J72P23n52J1p49l20N41J34K18k7l04
3513b41P64j408K24r0J837o23r06L21k04p37J536j277n3J049Qj234j08J311r56
3532g87P56N79M3o18P9j249J215k38J603o34R6j850J004O67r9m96r35J170j62
3551A44M94o53M24o9q23L92p76J068K29j017J172k28k60k4M13p24K83j057J035
$$ plain form
3570 23 -582 730 66 -382 246 122 -961 336 205 -864 -280 552 522 -101 830 -434 98 952 -41
3589 -41 -687 305 -538 514 92 -1363 670 1064 200 -379 -1106 -1236 448 -43 93 -758 -266 41 -863
3608 -863 555 -781 -465 -481 679 739 -898 23 -11 -83 164 1105 846 -651 -1145 -447 251 -364 890
3627 890 -180 -627 -106 -1169 -272 -26 -174 -328 535 -253 -421 350 338 727 1077 -477 -774 -48 23 -294
3647 -294 122 717 591 215 -623 -194 737 -489 -354 489 -496 -442 608 -400 265 196 -788 768 280
3666 280 -108 224 -225 -648 -13 -50 78 -159 -53 -217 -675 -124 -463 -13 -101 297 -1049 -210 573 -275
3686 -275 183 -790 6 1125 -487 -410 -845 506 1525 363 184 -872 -1614 357 -325 -1181 -215 216
3704 216 -619 -101 -448 422 538 -955 1006 -180 533 -686 989 220 -266 71 51 -62 762 -236 -22
$$ packed form
3570B3o05J312o64m48O28j24j083J297j31j069N84Q32l0o23R31j264N32Q54r93
3589d1o46R92q43J052m22j455K033L94q64n79p27j30J684m91J36q51M92L07r04
3608h63J418j336L16j6J160O0j637R21l4p2K47R41k59j497m94O98O98o15J254
3627H90j070m47N21j063Q97K46j48j54Q63p88j68P71j2L89L50j554k97P26P1l17
3647b94M16N95j26l76q38M29R31j226J35Q43r85N4J050j008O65o9r84J556m88
3666B80l88L32m49m23O35l7J28k37J06j64m58N51l39M50q8L98j346Q39P83q48
3686b75M58r73P96J119j612P7m35J351J019j162j79j056p42J971o82q56R66M31
3704B16q35N18l47Q70J16j493J961j186P13j219J675p69m86L37k0j13Q24r98K14
$$ plain form
3723 -22 356 1475 657 -293 166 230 21 207 -322 759 -797 199 526 -459 -207 301 66 229 -545 -431
3743 -431 71 -547 -983 -208 -196 129 1111 -544 101 -793 593 33 -595 205 340 -303 -32 790 775 24
3763 24 -408 -624 399 164 -53 -580 -392 -514 -753 -225 364 338 -451 -127 -465 255 179 -1357 -161 53
3783 53 1039 289 -467 191 -109 557 -493 -294 -985 -606 290 54 -81 428 -222 237 1176 -738 625
3802 625 -442 -168 -62 -3 255 -148 -147 657 -294 -1500 681 688 491 -773 598 -51 50 -1028 -314 805
3822 805 -187 1085 167 697 -525 -760 -203 479 -1093 466 819 -1129 910 265 544 -939 -20 204
3840 204 -55 -825 36 -820 121 681 1166 -166 33 462 -94 -193 -479 520 -805 -281 611 -16 -30 13
3860 13 -6 550 746 777 -847 162 748 -8 757 201 120 388 576 624 282 -737 -103 41 -226 895
$$ packed form
3723b2L78J119q18r50M59O4k09J86n29J081j556R96L27r85K52N08k35J63p74J14
3743d31N02o18m36P75J2L25R82j655O45q94J386n60o28Q00J35o43K71Q22j5p51
3763B4m32k16J023k35k17n27J88j22k39N28N89k6p89L24l38P20p6j536J196K14
3783E3R86p50p56O58l00O66j050J99o91L79Q96k36j35N09o50M59R39j914J363
3802F25j067K74J06N9K58m03JQ04r51j206K181Pj97j264J371o49J01j078P14J119
3822H05r92J272r18N30j222k35N57O82j572J559L53j948K039o45K79j483R19K24
3840B04k59p70Q61q56R41N60M85j332J99M29n56r9k86R99j325N24Q92o27j4M3
3860A3j9N56J96L1j624J009N86p56P65n56q1K68J88M8l42j019O34J44k67J121
$$ plain form
3880 895 188 -996 -70 -84 -966 531 -173 -581 519 -850 1714 -312 -1209 -459 -356 840 591 2
3898 2 -868 946 86 66 124 194 1450 504 829 214 -113 -15 -462 -702 14 -145 42 151 -330 388 150
3919 150 -209 -212 223 846 504 -700 -838 -535 -59 804 -440 771 -35 1005 488 -184 34 498 1367
3938 1367 -279 -761 -968 406 1463 100 37 -322 117 -1165 918 814 151 -253 545 -803 -643 -205
3956 -205 -857 239 -298 97 215 142 199 465 64 1227 572 -71 -393 1287 741 -1164 421 -62 258
3975 258 -573 -907 86 -600 -469 -635 254 373 -304 -505 -952 -277 -809 -46 215 -260 249 53 142 -153
3995 -153 242 -84 282 -626 678 -214 -91 -205 37 -276 -8 -318 -168 -1272 -687 -334 -556 143 256
4014 256 1230 997 -229 -570 -91 291 -447 -316 607 749 345 -557 -180 -172 -181 666 518 -318 -125 1129 -190
$$ packed form
3880H95p07j184R26j4q82J497p04m08J100j369K564k026q97P50J03J196k49n89
3898Bq70J814q60k0N8P0J256r46L25o15l27R8m47k40P16j59J87J09m81P18k38
3919A50l59lM35O23l42j204j38L03M76Q63j244J211q06J040n17o72K18M64Q69
3938A367j646m82k07J374J057j363o3l59M39j282K083j04o63m04P98j348J60M38
3956b05o52J096n37L95J18p3N7K66m01J163o55o43l22J680n46j905J585m83L20
3975B58q31l34R93o86J31j66Q89J19o77k01m47O75n32P63K61m75N09j96Q9k95
3995a53L95l26L66r08J304q92J23j14K42l13K68l10J50j104N85L53k22O99J13
4014B56R74k33j226l41M79L82p38J31R23J42m04r02L77QrQ47j48q36J93J254j319
$$ plain form
4035 -190 -322 -166 -13 136 -1 -911 -450 188 -29 -133 806 -838 489 -2 -7 170 123 212 1113 -754
4055 -754 658 813 -703 148 -681 -238 407 44 -486 -507 24 1141 -442 555 81 -794 -113 -207 469
4074 469 595 -859 766 -1 -127 64 15 376 -1053 -969 261 84 315 834 447 -56 -576 1138 -22
4093 -22 -367 260 725 -275 -544 -880 -308 99 1085 802 -323 -562 -427 -628 86 719 -167 -965 596
4112 596 202 413 -219 -129 -195 710 -605 -517 291 -181 -114 -211 270 -312 -81 -128 181 351 -189 122 404 -331
4134 -331 115 348 785 502 -294 149 105 606 -1645 1045 196 1640 49 882 560 313 -425 -109 502
4153 502 -786 403 326 -328 356 495 8 1710 -252 95 885 -710 -177 -67 -658 -82 -219 -770 -208
4172 -208 -783 -209 809 56 -283 429 285 666 -185 -344 172 -101 137 -1440 -254 405 900 94 -318
$$ packed form
4035a90j32J56J53J49j37r10M61O38k17j04R39j644J327m91nJ77m7Q9R01j867
4055g54J412J55j516Q51q29M43O45l63n30k1N31J117j583R97m74q75O81r4O76
4074D69J26j454J625p67j26J91m9L61j429Q4J230j77K31N19l87n03n20J714j160
4093b2l45O27M65j000k69l36N72M07R86k83j125k39J35k01P14O33q86p98J561
4112E96l94K11o32R0o6R05j315Q8Q08m72O7r7M81n82K31m7L09J70n40L11K82p35
4134c31M46K33M37k83p96M43m4N01k251K690q49J444j591Q33l22k47p38L16O11
4153E02j288J189p7o54O84J39m87J702j962L47P90j595N33J10n91N76j37n51N62
4172b08n75N74J018p53l39P12j44L81q51j59N16k73K38j577J186O59M95q06m12
$$ plain form
4191 -318 783 -914 576 -24 1483 137 187 -233 -426 135 -206 1270 628 -454 -274 -422 -162 -2148
4209 -2148 43 -273 -641 -1004 676 751 -451 7 -116 -174 15 -219 44 157 -32 1311 -844 201
4227 201 11 513 -1266 307 -558 -103 1095 -45 764 386 -118 242 300 -248 -685 -1366 263 -515 260
4246 260 65 -616 -555 -165 762 -641 -28 21 -232 399 620 691 -788 -126 -338 -460 698 -144 -723 -420
4266 -420 194 -191 -335 -49 -686 810 1048 -223 -218 1135 160 132 -603 -216 -431 405 987 714 -392 528
4286 528 -267 351 1509 190 494 -674 -142 1238 -333 -457 565 152 795 -2002 -1068 1444 442
4303 442 -331 129 516 354 414 -295 370 89 830 -182 -120 17 792 415 -586 640 -263 -501 -281 -297
4323 -297 489 531 484 105 -55 -350 412 236 -256 899 136 276 -412 152 -276 841 1516 -286 -596 -1054
$$ packed form
4191c18J101j697J490o00J507j346N0m20j93N61l41J476o42j082J80j48K60j986
4209b148K191l16l68l63J680P5j202M58j23n8J89k34K63J13j89J343k155J045
4227B01j90N02j779J573q65M55J198j140Q09l78n04L60N8n48m37o81J629p78P75
4246B60j95o81O1L90R27j403O13M9k53O31K21P1j479O62k12j22J158q42n79L03
4266d20O14l85j44K86o37J496K38j271NJ353r75k8p35L87k15Q36N82k73j106R20
4286E28p95O18J158j319L04j168N32J380j571j24J022m13O43k797R34K512j002
4303D42p73M60L87j62O0p09O65k81P41j012O2J37P75l77j001J226r03k38K20j6
4323b97P86M2m7l79j60k95P62j76m92J155p63J40o88N64m28J117O75j802l10m58
$$ plain form
4343 -1054 48 -428 76 -521 -512 369 -489 -20 -290 -811 -635 404 355 362 -550 55 109 -251 328 -124 350
4364 350 -64 -477 -29 -2 -1620 -472 205 257 1440 -808 609 276 -1150 -1484 68 18 -332 -1012 380
4383 380 72 508 9 652 1064 427 81 653 -237 327 -1077 -1060 381 15 -430 -401 506 477 -87 1390
4403 1390 -79 536 101 -916 -484 206 -1555 315 -1106 -1342 278 -1281 904 -324 410 -89 -1563
4420 -1563 -137 268 494 -284 -611 -201 818 -658 707 544 516 -1025 783 140 -389 941 419 498
4438 498 -512 797 393 -681 -310 185 614 -137 340 12 590 -271 -80 634 -89 -588 886 -69 -438
4457 -438 950 253 714 -288 -392 -445 -989 -1151 22 -211 594 -246 -630 -253 -687 -438 308 -171 628
4476 628 -253 210 32 -293 -803 144 258 45 -291 91 69 814 -330 -1282 649 430 -1126 -122 160
$$ packed form
4343a054J102m76N04n97RQ81q58M69k70n21J76J039m9Pr12O05N4l60N79m52M74
4364C50m14m13M48K7j618J148O77N2J183k248J417l33j426l34J552n0l50o80J392
4383C80l08M36m99O43M12o37l46N72q90N64j404J7J441l66m45K9R07k9n64J477
4403A390j469O15m35j017M32O90j761J870j421k36J620j559K185j228P34m99j474
4420a563J426M05K26p78l27M10J019j476J365j63k8j541J808o43n29J330n22P9
4438D98j010J309m04j074L71M95M29p51M77l28N78q61J91P14p23m99J474r55l69
4457d38J388o97M61j002j04n3n44j62J173k33Q05q40l84L77m34K49P46m79P99
4476F28q81M63j78l25n10R47J14k13l36L82k2P45j144r52J931k19j556J004K82
$$ plain form
4495 160 375 -46 -32 514 -337 274 860 970 -14 865 332 -1733 -4 444 -138 362 -106 394 -436 -449
4515 -449 -215 292 328 -592 -349 261 -1046 -418 -480 473 487 890 -394 -481 -501 -662 -440 787 493 807 526
4536 526 -670 -959 -374 510 376 1044 -288 -502 113 -1028 -629 -451 281 408 511 9 84 503 699
4555 699 306 259 466 -108 -158 487 677 213 1255 499 69 -212 -150 -59 298 -92 -327 169 175 368 -239 -1011
4577 -1011 -581 956 -444 -259 -408 483 441 1173 538 -454 45 -212 -730 247 -274 222 447 -302 -615
4596 -615 -495 -476 755 -461 -159 -559 -747 -1448 180 -781 -931 -949 773 985 -1051 -650 -606 -637 -350 -241
4616 -241 -367 449 -229 -1142 1019 198 646 576 50 -858 567 -620 -1220 -496 755 -530 642 87
4634 87 451 129 411 -163 -1400 -213 -316 310 -39 667 -105 -64 -660 172 -164 497 -509 110 -854 477
$$ packed form
4495A60K15m21J4N46q51O11N86J10r84Q79n33k065J729M48n82N00m68N00q30j3
4515d49K34N07L6r20K43O10j307O28o2R53J4M03j284q7k0j61K22J227k94L14k81
4536E26j196k89N85Q84j34O68j332k14O15j141L99J78P32J27J03n02P5M19J96
4555F99l93m7K07n74n0O45J90m64J042p56m30k81O2R1L57l90k35M96OJ93o07p72
4577a011M30J537j400J85j49Q91m2P32o35r92M99k57n18R77n21M96K25p49l13
4596f15J20J9J231j216L02m00j88p01J628r61j50j8J722K12k036M01M4l1K87J09
4616b41j26Q16o78r13K161q21M48p0n26r08J425j187o00P24J251j285J172n55
4634H7L64l22K82n74j237J187j03O26l49P06p72M1n96Q32l36O61j006O19r64J331
$$ plain form
4654 477 877 666 -1373 942 292 336 -154 -158 -579 341 -205 -1174 -104 446 -1027 -510 150 -60 -1035 -555
4674 -555 855 -731 407 666 400 -783 649 546 -755 162 186 -495 37 758 124 -37 279 670
4692 670 -969 -316 -243 -197 -25 35 370 383 -361 -313 -14 -475 489 -939 -55 -244 35 57 -62 -171 1260
4713 1260 275 190 -447 -205 -970 -1098 -628 850 820 369 982 649 122 -169 40 598 318 -488 491 133
4733 133 204 870 -819 883 -231 30 -355 -74 -577 991 -459 415 -530 -331 -504 305 -183 -431 1640
4752 1640 -508 284 -508 598 -338 411 13 818 -705 -337 371 -132 417 -625 -129 -127 -888 -977 -2
4771 -2 771 11 613 -369 1197 239 -127 -333 315 -1401 763 551 376 241 -1101 258 -466 -769 -1100
4790 -1100 598 -583 -1090 3 651 -800 600 -444 -60 610 256 359 -520 348 252 210 722 442
$$ packed form
4654D77M00k11k039K315o50M4m90mm21R20n46r69J070N50j473N17O60k10r75M80
4674e55J410j586J138K59k66j183J432j03j301R17K4o81N32P21o34j61L16L91
4692F70j639O53P3M6J72O0L35J3p44M8K99m61R64j428Q84j89K79K2j19j09J431
4713A260r85q5o37K42p65j28M70J478l0m51O13l33n27k91K09N58k80q06R79l58
4733A33P1O66j689J702j114K61l85K81n03J568j450Q74r45J99j73Q09m88k48K071
4752A640k148P92p92J106r36P49l98Q05j523L68P08n03N49j042M96Kp61q9R75
4771bP73p60O02r82J566r58l66k06O48j716K164k12j75j35j342J359p24l03l31
4790a100J698j181n07J093O48j451J400j044L84O70l54J03q79Q68r6m2N12k80
$$ plain form
4808 442 -655 -256 878 182 581 1207 114 -379 -1261 726 -628 1092 504 -277 38 -1479 153
4825 153 815 546 641 -864 -341 155 -1253 -397 511 391 -433 -13 319 -63 350 157 -828 -862 -534 1058
4845 1058 -229 -491 83 -414 109 442 299 167 331 -854 319 -438 -624 146 -621 -236 -403 -424 -41
4864 -41 -507 277 827 129 -779 -864 194 62 674 513 880 -782 -686 -969 1174 342 -542 215 -129 -246
4884 -246 9 257 -420 -572 401 207 -346 671 -37 -1510 -361 -906 49 974 49 -102 -210 -170 -957
4903 -957 -306 -1123 -136 232 -262 -134 -90 -514 135 266 -505 -1377 560 244 91 -555 91 -46 -316 1063
4923 1063 -912 -81 -1236 180 448 84 -59 -703 981 -398 283 -97 539 760 -108 -483 -301 578
4941 578 671 -947 -323 885 -268 66 -58 122 245 -200 578 757 1045 454 -685 1131 -465 149
$$ packed form
4808D42j097L99J134o96L99O26j093m93q82J987j354J720n88p81L15j517J632
4825A53O62k69R5j505N23M96j408Q56R08j20q24M20L32l82M13j93r85l4L28J592
4845A058j287k62N74m97N23L33j43j32J64j185J173p57j86P70p67L85j67k1L83
4864d1m66P84N50o98r08q5J058j32O12j61L67j662R6k83K143q32q84P57l44j17
4884b46K55K48o77j52R73j94n53J017p08j473J149n45R55R25r25j51j08M0p87
4903i57O51q17R87L68m94J28M4m24O49J31p71q72J937l16j53o46O46j37k70J379
4923A063j975Q31j155J416K68l64j43o44J684j379O81l80O36K21q68l75J82Q79
4941E78R3j618O24J208j153L34j24J80J23m45P78J79K88n91j139J816j596O14
$$ plain form
4959 149 -169 345 155 436 -1016 432 113 112 -248 -72 349 895 -185 -358 597 -1422 -354 333 -893
4978 -893 -662 -1019 882 -1041 1001 506 -685 438 38 -425 216 229 733 -38 -728 -464 -508 115 209
4997 209 83 -612 -289 111 412 -376 1337 48 767 188 5 807 683 -140 -989 280 -223 -617 8
5016 8 -402 -198 -769 -764 -154 518 -702 417 -346 -529 -351 -142 503 -234 280 -41 342 194 -253 -331 150
5037 150 -1041 131 -1177 411 -177 -157 -947 760 764 -597 202 -176 -535 -259 -483 -752 232 -1008 149
5056 149 -707 8 211 -500 494 258 655 -469 -443 1276 -373 -151 -470 454 -65 -238 501 -856 526
5075 526 -463 -127 -392 -133 -75 485 -294 -285 649 -965 608 64 1553 -324 335 259 1483 -396 96
5094 96 -522 482 -1316 546 680 -653 563 -424 499 -277 143 -265 447 334 1939 506 94 -22
$$ packed form
4959A49l18N14j90K81j452J448l19jl60J76M21N46j080j73R55k019J068O87j226
4978h93K31l57J901j923K042m95j191J123m00m63O41J3N04p71o90K64m4O23R4
4997B09j26o95L23M00L01p88J713j289P19n79j83Q02j24q23q49J269n03l94O25
5016Hm10K04n71NO10O72j220J119p63j83J78K09O45p37N14l21L83j48m47p8M81
5037A50j191J172j308J588n88K0p90J707Mj361P99l78l59K76k24k69R84j240J157
5056A49q56P15K03p11R94k36L97j124K6J719j649K22l19R24n19j73P39j357J382
5075E26r89L36k65K59N8N60p79RR34j614J573n44J489j877O59p6J224j879M92
5094I6o18J004j798J862J34j333J216r87R23p76M20m08P12j13J605j433m12j16
$$ plain form
5112 -22 300 103 -499 877 562 -308 -187 -136 5 -756 -265 246 754 843 1 -29 -392 510 -162 241 317
5133 317 342 -350 685 -209 152 -554 896 116 232 54 439 -1450 707 627 -397 -40 13 13 404 207
5153 207 231 -458 -316 323 48 -496 -85 -487 710 336 -549 -22 -98 -425 -690 -1134 -43 -686 -300 1074
5173 1074 -553 -339 279 500 -306 -589 796 -193 -260 571 696 -35 886 -344 22 -515 -4 -154 -746
5192 -746 -22 -59 1115 -65 -478 -548 -339 -1088 271 187 323 1103 -77 -611 619 -259 5 724 -702
5211 -702 670 636 489 50 -591 -603 89 61 -3 788 -627 -607 -467 674 -715 -398 857 -587 40 123
5231 123 -186 2 41 -897 -270 278 195 -636 -340 899 946 347 441 717 -660 -102 289 -350 29 -245 322
5252 322 136 301 -103 129 -26 368 228 -467 -1391 -355 -94 -63 -214 301 396 -42 321 -195 -995 -593
$$ packed form
5112b2L22j97o02J376l15q70J21N1J41p61M91N11N08Q9q42l0l63R02o72M03P6
5133C17K5o92J035q94L61p06J450p80J16j78L85j889K157q0j024L57N3%L91j97
5153B07K4o89J42O39k75n44M11m02J197l74q85N27p6l27k65m44J091o43L86J374
5173A074j627K14O18K21q06k83J385r89o7Q31J25p31R21j230L66n37N11j50n92
5192g46P24l7J174j180m13p0K09p49J359q4J36P80j180n34J230q78K64P19j426
5211g02J372l4j47m39o41j2O92k8o4P91j415K0J40J141j389L17J255j444O27Q3
5231A23l09J88L9r38O27N48q3q31K96J239M7n99R4K76j377N58L91o39L79k74N67
5252C22j86J65m04K32j55L94j40o95r24J036K61L1j51N15R5m38L63n16q00M02
$$ plain form
5272 -593 344 538 325 398 -340 597 897 -151 619 260 311 -152 247 -194 479 -342 -68 -555 -551 -30 -1370
5293 -1370 -169 -533 -97 -598 341 -755 245 704 653 -798 1156 309 -433 -570 415 -399 66 -399
5311 -399 -272 567 -197 282 -941 -373 -824 -135 -1050 72 -322 -422 -794 423 -524 495 82 -863 -97
5330 -97 -316 783 182 551 342 -919 551 544 -346 500 452 264 -140 -443 -411 -25 -1 -419 -897 131 -488
5351 -488 -110 -277 -408 684 263 213 -346 -1142 -288 318 -101 -142 -569 -697 -152 180 355 -29 -13 -509 506
5372 506 -833 157 838 -161 513 -1304 -467 -586 105 -441 473 -320 759 -45 728 -163 -844 345 -386
5391 -386 -1130 204 228 -438 -279 569 66 897 485 690 1342 -189 576 408 1143 360 -642 -224 331
5410 331 -759 142 -12 -70 222 428 219 852 439 -703 413 48 -868 767 825 -245 -441 -89 242
$$ packed form
5272e93R37J94k13P3p38R37L00j048P70l59N1m63L99m41O73q21K74m87MN21j340
5293a370J201l64M36n01R39j096J000M59n1j451J954q47p42j37R85q14M65m65
5311c99J27Q39p64M79j223N68m51O89r15J122l94j00l72J217r47J019m13r45P66
5330i7k19J099o01L69k09j261J470pq90Q46m8j88m04l03L2L86K4m18m78J028o19
5351d88L78j67j31J092m21n0n59p96Q54O06m19m1m27j28N45L32J75l84J6m96J015
5372E06j339R90O81r99O74j817Q37j19O91n46R14p93J079q04P73q91o81J189p31
5391c86p44J334K4o66J59Q48n03Q31m12K05O52j531P65j68P35p83j002M18N55
5410C31j090R01j54n8K92K06k09O33m13j142J116l65r16J635N8j070j96L52L31
$$ plain form
5429 242 461 -360 -795 -177 137 -51 1409 458 -416 128 -341 -1081 -790 -125 43 61 1091 517 -293 674
5449 674 -648 635 317 -349 -521 494 407 312 501 -136 440 -45 -735 -582 244 247 -336 -1348 12 -161
5469 -161 -723 -813 -341 -809 -346 -49 551 1159 28 -87 600 -635 68 255 -300 614 -45 -152 -94 -394
5489 -394 50 -637 115 -141 -34 -89 1282 -806 539 400 -171 600 211 810 -856 495 -735 -73
5507 -73 -571 148 125 115 80 412 -132 79 1006 -200 -439 338 -370 -195 -134 -138 577 47 125 -301 -282 -346 -326
5530 -326 65 -588 -367 -381 29 -1037 -545 -799 -141 457 -627 61 94 532 223 947 15 -223 -450 -453 -318
5551 -318 0 1393 -334 529 227 -139 854 -488 -1409 518 -917 -254 -438 173 -438 -191 -1070 319
5569 319 -334 -308 674 -960 493 -461 1009 259 -616 401 -359 -81 -317 -383 220 216 595 183 211 89
$$ packed form
5429B42K19q21m35O18L14j88J460r51q74N44m69p40K91O65J68J8J030n74q10R67
5449F74j322J283l18o66j72J015q7r5J89o37N76m85o90J53Q26Ln83j012J360j73
5469a61n62r0M72m68M63K97O00O08j131j15O87j235P03J87n55R14o59j07N8l00
5489c94M44o87P52k56J07n5J371k088J345j39n71P71l89N99j666J351j230O62
5507g3m98P19k3j0l5L32n44K11R27j206k39P77p08J75O1mP15n30P8m26J9o4K0
5530c26L91o53K21j4M10j066M92k54O58N98j084O88L3M38l09P24r32k38k27lJ35
5551c18L18J393j727Q63l02l66R93j342r21J927j435O63j84O11o11K47q79J389
5569C19o53K6R82j634J453r54J470p50q75J017p60K78k36o6O03mL79m12K8j22
$$ plain form
5589 89 -18 271 365 -1683 -935 231 1234 1053 -749 568 -527 -240 14 -150 -534 -318 364 -839
5607 -839 318 -74 122 486 -701 -761 395 -104 -82 -124 -607 -45 667 559 -523 -636 48 -221 -758 -1117
5627 -1117 -872 213 171 -371 -526 -371 337 -473 -361 624 -1202 -362 -22 -224 -42 -392 1112 298 -574
5646 -574 106 -216 -12 140 -888 -581 -455 -117 206 -694 254 -289 305 -670 -388 -994 695 115 368
5665 368 1 1275 -253 57 -789 460 -240 290 -7 557 -1755 -504 966 -730 -258 -906 -733 -296
5683 -296 -902 22 738 1779 256 -620 -565 138 -2014 276 -306 -64 698 291 381 -1016 174 -426 -346
5702 -346 601 -221 -1106 551 223 296 349 -304 -431 311 -406 232 123 -750 478 -560 1596 968 645
5721 645 95 275 -99 -397 200 298 1017 324 404 251 -901 17 270 611 156 -66 -330 -215 -728 307
$$ packed form
5589H9j07K89R4k048P48J166J003j81j802J317j095K87K54j64l84K16O82j203
5607h39J157l92J96L64j187o0J156m99K2m2m83N62P12j08j082j13O84k69n37l59
5627a117K45J085m2n42j55J55P08q10J12R85j826Q40L40k02J82l50J504q14q72
5646e74O80l22K04J52j028L07J26L38L23r00R48n43N94r75K82o06J689n80K53
5665C68l67J274j528L10q46J249p00N30k97N64k312J251J470j696M72o48J73M37
5683b96o06R24P16J041j523q76N5P03k152K290n82K42P62m07R0j397J190o00Q0
5702c46R47q22q85J657l28P3N3o53j27P42p17O38j09q73J228j038K156o28l23
5721F45n50J80l74k98N97R8P19o93Q0j53j152R18K53L41m55k22k64J15n13J035
$$ plain form
5741 307 1141 252 469 -1000 -612 1532 546 -993 17 704 -745 19 79 1135 -713 499 723 384
5759 384 539 424 -1447 -417 231 -38 350 108 -263 186 223 182 -29 319 -143 -496 116 -562 735 447
5779 447 176 -552 1119 242 310 -262 -453 -387 111 226 -279 249 560 -304 167 -126 607 64 -496 -215
5799 -215 777 -180 346 698 -524 147 -257 -509 -326 10 -144 -61 310 -238 561 -370 -377 -82 -458 41 -314
5820 -314 718 236 -533 490 266 550 -4 532 87 457 -310 -126 20 -193 227 -5 -86 -118 -135 -420
5840 -420 192 513 -276 236 630 131 520 328 -128 17 1495 -489 -496 509 585 215 -1730 416 909
5859 909 -878 65 175 1096 -101 -833 364 -123 -154 53 -986 417 -581 337 231 -587 21 744 -37
5878 -37 -835 80 66 -1152 88 226 -1230 600 -110 -965 414 -218 118 146 141 813 309 -979 -1105 121
$$ packed form
5741C07Q34q89K17j469L88K144r86j539J010O87j449P64O0J056j848J212K24l39
5759C84J55j15j871J030O48k69L88k42l71M49L7m1k11L48m62l53O12o78J297k88
5779D47k71p28J671q77O8n72j91O6M98J15n05N28L11q64M71k93P33n43n60K81
5799b15R92r57N26L52j222O71m04k52J83L36j54Q3L71n48P99r31pK95l76M99l55
5820c14J032m82p69J023k24K84n54N36m45L70p67J84J46k13M20k32q1l2j7k85
5840d20O12L21p89N12L94m99L89j92m56J45J478j984pJ005P6l70j945K146M93
5859I09j787R43J10R21j197p32J197m87l1K07j039J403r98R18j06q18O08P23p81
5878c7p98R15j4j218J240J38j456J830p10q55J379o32L36K8nO72n04j288j26J226
$$ plain form
5898 121 -1116 -248 -909 -506 -39 -415 -771 445 733 945 -1013 -870 582 459 -753 -90 -67 -321 -459
5917 -459 967 337 -845 -363 1137 -1094 -464 804 -453 -1026 -178 -111 41 468 -503 913 149 -75
5935 -75 -87 355 27 383 -468 -866 -79 -230 523 -32 487 -542 -859 321 -192 -596 904 488 -265 -137
5955 -137 -34 -110 165 -3 368 255 -457 -611 -32 -400 -200 669 -580 -743 -463 -161 -64 148 903 -611
5975 -611 -127 -194 144 -112 -169 1134 670 4 400 22 510 -1321 -339 26 -1485 -1030 -719 1149 -223
5994 -223 -1747 -501 116 1042 -409 755 -405 348 -3 363 516 -940 -968 715 21 916 -400 499
6012 499 875 -373 -255 53 -214 1071 761 -596 -1331 491 -11 -68 -99 542 250 -149 722 584 1074
6031 1074 829 -177 166 297 -438 -336 -347 -371 -1070 437 287 -155 -430 -114 649 -405 -319 -441 13 315
$$ packed form
5898A21j237Q68o61M03M67l76l56J216K88K12j958J43J452j23j212O63K3k54j38
5917d59J426o30j182M82J500k231O30J268j257n73Q48O7J52M27r71J416p64k24
5935g5j2M42l28L56q51l98P87j51P53n55N19j029l17J180n13m04J500m16p53J28
5955a37J03p6K75j68L71j13p12j54N79l68K00Q69j249j63K80L02R7K12P55j514
5975f11M84o7L38k56n7J303m64o66L96l78M88j831R82L65j511M55L11J868j372
5994b23j524J246O17R26j451J164j160P53l51L66J53j456k8J683o94Q95j316Q99
6012D99L76j248J18L08k67J285l10j357p35J822n02n7l1O41k92l99Q71j38M90
6031A074k45j006L43J31p35J02j1k4o99J507j50m42k75L16P63j054Q6j22M54L02
$$ plain form
6051 315 54 -27 -54 584 275 -358 35 -464 182 78 -178 297 593 186 167 232 -151 501 396 -515 265
6072 265 -20 -421 -1357 130 -249 -688 -806 809 21 -1084 -489 -91 -555 519 -719 -157 -538 -619 -868
6091 -868 148 82 604 1103 -514 -66 -197 250 -1352 36 -572 -494 -518 -51 816 -363 496 -345 199
6110 199 -109 1225 107 422 -601 70 990 212 -885 -178 -76 183 -463 1287 901 -1025 496 828
6128 828 -240 -347 -60 -88 607 -375 959 -1180 279 204 202 -45 423 359 -567 -359 231 77 461 869
6148 869 700 -18 -657 -275 492 418 -455 -504 437 -358 -856 228 -672 576 493 372 -490 -302 -398 307 542
6169 542 138 -422 95 -859 -887 1161 -656 -197 704 388 958 120 146 148 -301 -149 -435 258 201 663 -578
6190 -578 -532 -78 706 -1091 -260 -514 -247 -54 414 801 766 -586 -134 571 -16 489 538 940 -860 286
$$ packed form
6051C15k61q1k7O38l09o33L93m99O46j04k56M75K96m07j9O5l83O52j05r11P80
6072B65k85m01r36J487l79m39j18J615p88j105N95L98m64J074j238N62l81q1k49
6091h68J016o6N22M99j617M48j31M47j602J388o08P8k4M67Q67j179Q59q41N44
6110A99l08J334j118L15j023O71R20p78j097P07J02K59o46J750l86j926J521L32
6128H28j068j07K87k8O95r82J334k139J459p5kk47M68o4r26K08N90j54L84M08
6148H69j69p18o39L82P67p4q73m9R41p95m98J084r00J248q3j21q62J88r6P05K35
6169E42m04n60N17r54k8K048j817M59R01l16N70q38K6Km49J52k86O93n7M62j241
6190e78M6M54P84j797Q31k54K67J93M68L87l5j352M52P05n87N05M9M02j800J146
$$ plain form
6210 286 -387 591 -166 -133 -544 264 -4 -9 227 239 1809 -376 682 -327 828 759 206 -331 738 776
6230 776 -1188 424 521 129 1347 429 -86 -532 233 821 -524 544 605 -155 93 -28 608 720 -333
6249 -333 -288 91 205 196 -56 424 422 777 -203 -628 -110 -39 16 -1046 -508 -881 317 -184 -153 128 48 8 863
6272 863 591 336 -1206 34 -705 -432 -366 338 958 -478 515 127 -783 -1235 240 172 -332 16 -1267
6291 -1267 420 432 -304 17 -916 -371 105 1187 -824 1495 762 -87 -141 -252 249 1022 277 535 792
6310 792 -416 -126 1017 262 118 -1027 -196 -292 -75 281 -1267 645 358 -614 694 365 -583 334
6328 334 -239 -292 -851 -671 1605 -118 443 202 73 959 -655 695 22 693 134 1347 339 -170
6346 -170 -643 1221 218 26 755 883 -1117 -557 513 194 -582 150 -148 219 -901 -225 331 965
$$ packed form
6210B86o73R78p57L3m11Q08k68nK36J2J570k185J058j009J155o9n53n37J069L8
6230G76j964J612R7l92J218r18n15m46P65N88j345J068O1p60K48j21O36J12j053
6249c33M5L79J14rk52M80kL55r80m25N18P1N5j062N38l73J198n01L1K81q0m0Q55
6272H63k72k55j542J240p39K73O6P04O20j436R93l88r10m52J475o8n04L48j283
6291a267J687J2p36L21r33N45M76J082k011K319p33q49n4j11N01P73p45K58K57
6310G92j208K90J143p55j44j145Q31r6K17L56j548J912k87r72J308l29r48R17
6328C34n73n3n59J80K276j723N61k41j29Q86j614J350o73O71n59J213j008n09
6346a70m73J864j003j92P29J28k000N60J070l19p76P32k98L67j120O76N56O34
$$ plain form
6364 965 69 239 256 -105 1056 -36 -56 438 -624 311 -1013 749 532 716 11 454 930 -13 -521
6383 -521 -331 -459 -847 -241 -184 645 15 -299 970 -2 -537 509 -319 189 -147 -750 -990 -376 195 -792
6403 -792 -126 -386 -353 131 -954 -1087 337 608 -504 -1 -124 -291 708 -493 -355 459 802 -414 44
6422 44 -642 616 -254 890 963 654 587 -229 828 -164 458 -374 197 12 280 46 56 -472 -281 399
6442 399 108 -272 -10 -498 232 -508 459 -142 401 -884 614 873 -682 154 332 1098 137 -18 -141
6461 -141 1389 -270 -448 -190 -60 -435 -644 -161 -289 573 -290 785 67 71 6 1293 230 210 1048 158
6481 158 -241 641 1195 -406 188 -84 -597 -410 -62 -883 -114 -392 599 851 -408 36 1050 742 569
6500 569 -292 -675 -47 1140 -183 405 -221 344 617 -464 1146 -531 -488 35 -400 -548 981 -25
$$ packed form
6364I65q96J70J7l61J161j092k0M94j062R35j324J762k17J84p05M43M76r43n08
6383e21J90j28l88O06N7Q29o30l14J269r72n35J046q28N08l36o03k40O14N71r87
6403g92O66k60L3M84j085j33J424K71j112N03j23j67R99j201J38Q14L43j216M58
6422D4o86J258q70J144P3l09o7q16J057r92O22q32N71j85K68k34J0n28J91O80
6442C99k91l80K62m88P30p40R67o01N43j285J498K59j555Q36J78P66r61j55j23
6461a41J530j659j78K58J30l75k09M83j28Q62q63J075p18Mo5J287j063k0Q38q90
6481A58l99Q82N54j601N94k72n13J87L48q21P69k78R91K52j259M44J014l08j73
6500E69q61l83O28J187j323N88o26N65K73j081J610j677M3N23m35j48J529j006
$$ plain form
6518 -25 -293 323 -860 -135 -342 363 796 -735 174 -112 781 230 161 113 210 -844 -177 874 -511 -322
6538 -322 -1028 499 -261 -606 196 -8 -770 208 1280 533 -190 893 -604 -50 -127 662 -147 463 229
6557 229 484 -299 175 393 380 372 294 22 974 -10 -90 -1035 376 647 -97 -173 -48 -1296 441 778 -145
6578 -145 -502 -587 -178 339 729 1228 -470 -137 272 315 654 36 910 -72 -81 -164 463 290 466 538 691 1083
6600 1083 482 560 -244 -656 1337 478 -57 528 195 303 174 -1131 344 -315 368 -354 153 -263 70
6619 70 29 207 8 -1100 742 -343 603 -142 -315 657 -1485 1254 62 -257 27 183 -109 -249 -535
6638 -535 -52 249 922 256 -1468 152 888 -491 855 741 -704 -1040 780 80 -1139 -315 222 -244
6656 -244 -78 -147 -1604 -175 396 -739 -686 -283 15 125 913 -713 -347 -487 143 710 -126 -304 401
$$ packed form
6518b5k68O16j183P25k07P05M33j531R09k86Q93n51o9m8R7j054O67J051j385J89
6538c22p06J527p60l45Q02k04p62R78J072p47p23J083j497N54p7P89q09O10k34
6557B29K55p83M74K18j3qp8k72R52r84q0r45J411K71p44p6J25j248J737L37r23
6578a45l57q5M09N17L90M99j698L33M09M3L39o18Q74r82rq3O27j73J76P2J53L92
6600A083o01P8q04m12J993q59n35N85l33J08j29j305J475o59O83p22N07m16L33
6619G0m1J78j99j108J842j085R46p45j73R72k142K739j192l19K84J56k92j40k86
6638e35M83L01O73o66j724J620P36j379J346j14j445l36J820p00j219Q24N37m66
6656b44J66o9j457J429N71j135N3M03K98J10P88j626L66j40O30N67q36j78P05
$$ plain form
6675 401 479 -73 -346 -990 -142 171 -330 -523 142 531 -144 -520 -49 -213 123 -642 512 172 -562 -34
6695 -34 -450 -537 736 -280 520 -78 -330 125 218 -952 -682 288 -261 -287 144 -181 -280 -11 -795 -193 55
6716 55 -486 98 59 -1083 -463 -202 713 132 -220 738 -906 -665 -22 152 208 -297 9 460 -168 -741
6736 -741 329 -381 1405 968 483 -832 -1091 -394 -412 537 -202 -39 -495 197 537 499 410 85 -41 -743
6756 -743 -445 -810 1192 94 -266 333 1116 514 -193 -583 215 616 670 496 24 -490 233 444 489 -71
6776 -71 -241 560 622 -53 434 122 1 212 298 -779 245 -1247 -804 1218 -274 -61 -657 -198 -1377
6795 -1377 -183 -151 532 -900 -1345 -556 -508 -608 519 -645 56 -178 -951 -45 444 -890 663 652 -18
6814 -18 -104 3 -364 -993 966 253 305 312 185 -1440 688 28 -1337 -78 313 81 -286 555 -134 549
$$ packed form
6675D01P8n52k73o44Q48L13n01j93O65L89o75l76M71j64L36p65J154l40p34N28
6695c4m16q7J273j016Q00n98k52M55R3j170K70R70n49k6M31l25r9K69p84O02K48
6716E5n41N84l9j142O20K61R15n81l52R58j644K41O43J74N6n05L06M51o28n73
6736g41J070p10J786m37m85j315k59O97j8R49p39J63m56O92L40l8q9l25j26p02
6756g43K98l65K002j098l60N99P83o02p07l90P98M01N4j74m72n14P23K11M5n60
6776g1j70Q01O2o75M87l12j21K11Q6j077J024j492M43K022j492K13n96M59j179
6795a377J194L2O83j432m45P89M8j00J127j164P01k34p73R06M89j334J553j1o70
6814a8q6J07l67o29J959p13N2Pj27j625K128o60j365J259L91k32l67Q41o89O83
$$ plain form
6834 549 332 -266 988 -1657 230 387 -209 -56 459 -1499 9 -146 -387 473 -242 -142 496 -230
6852 -230 -1051 146 -538 559 -221 -45 255 676 49 -541 -368 -298 -630 1541 -411 369 905 -264 352
6871 352 836 -280 277 -219 -609 -51 -600 -304 70 21 -376 -318 -428 -1332 -1230 23 -17 -146 454 -194
6891 -194 -155 -124 -256 787 171 -336 -489 473 700 -181 956 -1067 272 879 15 240 426 259 -262
6910 -262 385 896 150 195 -215 255 399 1062 98 524 -273 -323 1178 234 -172 62 496 -227 543 158
6930 158 -260 235 -545 -370 523 151 645 -546 -207 1014 158 -318 532 230 1089 -678 -229 -547 -830
6949 -830 -237 -372 -195 -678 -402 -349 616 1148 1169 -1184 -45 -141 -259 910 -504 1005 942 24 -100 -424
6969 -424 -379 -184 1072 -514 311 -377 -358 318 -248 -36 -152 -829 -515 -217 -709 -698 -325 260 332 998 -849
$$ packed form
6834E49k17n98J254k645J887J57n96J53N15j958J508j55k41Q60p15J00O38p26
6852b30q21J197o84J097p80J76L00M21o27n90J73P0l32K171j952P80N36j169O16
6871C52M84j116N57m96l90N58n49K96L74m9l97N8j10r04J02J253m0j29O00o48
6891a94L9L1j32J043o16n07j53R62K27q81J137k023J339O07q64K25J86j67n21
6910b62O47N11p46M5m10M70J44O63r64M26p97n0J501r44m06K34M34p23P70l85
6930A58m18M95p80J75Q93l72M94j191L39J221q56m76Q50l02Q59j767M49l18k83
6949h30N93j35J77m83K76N3R65N32K1k353J139r6j18J169j414J509o3r18j24l24
6969d24M5J95J256j586Q25o88J9O76n66K12j16o77L14K98m92J1L73N85P2O66j847
$$ plain form
6990 -849 -271 16 335 127 -246 144 1610 -651 542 343 -371 -152 -628 -188 -12 506 -6 -237 918
7009 918 -344 -358 -194 -735 254 192 144 -14 -184 54 568 -524 -489 275 256 463 442 897 1182 -258 -1374
7030 -1374 -134 290 -796 -487 -845 -270 689 632 288 -78 1080 534 -955 932 740 549 618 -1052
7048 -1052 -327 -664 74 -49 1142 689 256 538 -10 -607 -618 -45 -1448 267 263 233 348 280 812 -795
7068 -795 -61 -645 -387 60 301 301 354 33 -142 -23 -296 -479 -54 412 4 102 590 -824 44 -618 -604
7089 -604 -36 -209 771 155 195 -1086 211 -1172 850 -862 347 -307 705 -195 -390 -39 -703 745
7107 745 -391 -20 -33 -473 -334 28 216 438 40 -875 -586 -379 786 -531 373 -313 -118 311 -105
7126 -105 -198 -1148 769 -1044 -84 -564 109 529 8 -300 63 -392 -484 21 -509 252 883 491 87 53
$$ packed form
6990h49N78K87L19k08l73L90J466k261J193j99p14K19m76M40J76N18n12k31J155
7009I18j262j4J64n41R89o2m8j58j70K38N14j092L5P64j9K07k1M55K85j440j116
7030a374J240M24j086L09l58N75R59n7l44l66J158n46j489J887j92j91O9j670
7048a052P25l37P38j23J191m53m33K82n48n97j1N73j403J715ml0J15o8N32j607
7068g95P34n84K58M47K41%N3l21j75J19k73j83M25M66m08R8M88j414Q68o62J4
7089f04N68j73R80o16M0j281J297j383K022j712J209o54J012r00j95L51o64J448
7107G45j136L71j3m40J39L62J88K22l98r15K89K07J165j317R04o86J95M29m16
7126a05r3r50J917j813R60m80O73M20n21l08L63m55r2N05n30P61O31l92m04l4
$$ plain form
7146 53 -315 -190 -568 413 -689 -477 -909 1156 -372 572 -122 422 260 -1028 -215 19 409 642 599
7165 599 194 474 -590 40 -591 960 75 -609 -883 333 496 76 42 25 262 712 656 114 -727 -226
7185 -226 132 -1128 -441 359 437 -67 -275 -332 321 -186 -708 -418 380 -675 1244 -927 464 67 -250
7204 -250 -408 162 -219 -471 -361 381 599 -611 -743 80 -857 -147 100 839 190 -205 329 211 -469 -949
7224 -949 -407 1048 189 1268 -302 90 -562 -88 934 298 374 547 211 30 -89 670 -494 295 -401
7243 -401 79 -163 1274 10 -721 661 -368 153 -596 679 512 -10 -1254 563 155 -755 447
7260 447 -377 736 -336 216 -406 -201 -972 -429 -200 -254 -63 -245 145 -661 450 -966 -586 -70 748
7279 748 839 -21 -89 164 -150 826 -559 -693 1085 1091 361 14 -36 613 576 1260 -31 0 -1680 -425 364
$$ packed form
7146E3l68J25l78R81j102K12m32K065j528R44o94N44j62j288Q13K34L90K33m3
7165E99m05K80j064O30o31J551q85o84k74J216J63m20l4j7K37M50n6n42q41N01
7185b26L58j260O87Q00P8n04k08n7O53n07n22K90P98j055J919k171J391l97l17
7204b50j58N70l81k52J10P42K18j210j32Q23r37P10K47P39o49l95N34j18o80m80
7224i49N42J455q59J079j570L92o52M74J022o36P6J73l36j81j19P59j164P89o96
7243d01M80k42J437j264p31J382j029N21p49J275j67n22j244J817m08r10J202
7260D47q24J113j072N52o22K05p71N43K29n4J91j82L90q06J111j416L80N16Q18
7279G48R1q60o8K53l14R76j385j34J778Op30l47n0O49l7O84j291L1j680J255P89
$$ plain form
7300 364 308 -969 -44 729 -987 582 784 584 634 488 -950 -60 -246 -39 -378 334 -624 -339 1075
7319 1075 158 518 -18 -433 181 908 -776 323 -52 -358 330 -421 -600 305 561 1046 -553 -1018 -146
7338 -146 663 -123 -200 -409 -245 298 -810 648 269 776 593 957 126 -466 -379 -822 -1200 176 -907
7357 -907 -205 457 144 107 -46 176 -505 480 364 978 95 632 1221 -473 -770 138 -56 98 957 189
7377 189 -854 525 395 91 777 1348 368 -1097 741 -746 1142 914 455 547 361 -727 -219 436
7395 436 -382 177 331 -14 364 1 282 -512 436 832 -1134 -608 122 -394 388 727 -1847 112 -573
7414 -573 779 -596 -210 415 -105 67 599 -193 -959 690 -149 -455 -266 446 1008 -520 -924 605
7432 605 -520 -1080 -1030 226 593 -668 49 831 -919 245 293 648 -32 -1019 19 -481 -106 369 985
$$ packed form
7300C64n6j277R25P73j716J569K02k00N0j46j438Q90j86K07l39P12r58K85J414
7319A075r17L60n36m15O14P27j684J099l75l06O88p51j79R05K56M85j599m65Q72
7338a46Q09p86p7k09J64N43j108J458l79N07j83L64q31n92Q7m43l78J376j083
7357i07P02O62l13l7j53K22o81R85j16O14q83N37N89j694k97R08j94J54Q59p68
7377A89j043J379j30l04O86N71r80j465J838j487J888k28m59R2j86j088N08O55
7395D36q18N59J54l45L78l63K81p94R48L96j966N26P30n16P82L39k574J959o85
7414e73J352j375L86O25n20J72N32p92p66J649q39l06J89P12N62j528m04J529
7432F05j125n60N0J256L67j261P17P82j750J164M8L55o80r87J038n00L75M75O16
$$ plain form
7451 985 1224 -389 316 492 -113 -162 403 -228 16 -541 636 50 -508 -556 -52 248 -25 -587 -371 -248
7471 -248 -1167 -838 105 -63 83 346 -606 -243 62 -233 -715 44 324 -454 710 -502 748 -374 959
7490 959 456 558 230 126 516 159 80 -163 -237 121 -651 -608 48 450 124 -393 -115 228 514 258 698
7511 698 -511 636 -651 471 296 -296 -23 445 77 -1046 -428 210 65 502 797 64 -509 313
7529 313 412 433 -199 580 -1530 151 -979 -130 455 -898 269 295 136 -121 -325 -536 1047 306 502
7548 502 -172 -538 1251 -183 -239 -34 704 -665 -560 472 339 -538 434 79 -1012 697 47 818
7566 818 263 -57 684 -54 640 644 -322 18 -501 -1302 -55 -65 -29 104 298 -835 591 -505 -383 8
7586 8 -158 -542 -1159 -35 -222 567 47 -502 -1320 -392 759 172 -833 -628 -506 908 694 382 -610
$$ packed form
7451I85K39j613P05J76o05m9N65o31K44n57J177n86n58m8N04L00k73n62K16J23
7471b48r19L29R43j68J46K63r52L63L05k95m82P59K80p78J164j212J250j122J333
7490I59n03J02l28j04L90l57p9k43p4L58p72M3O56M02l26n17K78L43K86k56M40
7511F98j209J147j287J122j75n92K73M68l68j123O18O38j45M37K95p33n73Q22
7529C13R9K1o32P79k110J681j130Q49N85j353J167K6j59k57k04k11J583p41J96
7548E02o74l66J789j434n6K05P38j369J05J032j33q77R72l55j091J709o50P71
7566H18n55l20P41p38O94Mr66L40n19q01J247j0L6J33J94j133J426j096J22L91
7586Hj66l84o17J124j87P89n20n49q18R28J151n87j005K05J22J414k14l12r92
$$ plain form
7605 -610 630 -82 563 -732 429 -330 526 -323 77 -876 -766 -336 -679 -750 113 84 215 -777 72 1019
7625 1019 125 -66 22 -172 -64 135 -1472 -341 5 523 -212 358 421 -41 142 77 27 1740 336 31
7645 31 486 1104 6 -35 67 544 167 890 -37 -243 -361 -331 -47 155 -138 -679 408 307 227 -218 394
7666 394 -204 601 964 148 -692 -621 85 676 -470 886 486 834 488 950 1432 -741 193 -437 157
7685 157 491 -1382 -99 281 -123 176 -635 -294 192 644 -1804 -393 358 376 530 119 841 578 629
7704 629 -716 550 179 -471 5 -650 443 896 17 1281 726 -724 1152 231 -248 -688 -330 -256
7722 -256 -90 670 34 -528 273 -508 -260 403 -675 -867 -828 660 -215 -154 685 179 -700 788 -348
7741 -348 -402 -781 -373 461 -510 -295 612 -538 -109 566 370 977 368 1843 326 47 10 -841 -200 253
$$ packed form
7605f10J240p12O45j295J161p59Q56q49M00r53J10M30l43p1Q63k9J31r92Q49R47
7625A019q94j91Q8j94J08J99j607J131L46N18p35N70O3m62J83o5n0J713j404l05
7645C1M55O18j098m1J02M77l77P23r27k06j18L0K84K02k93n41J087j01q0m45O12
7666C94n98Q05L63q16q40P1P06N91j146J356m00L48l46M62M82k173R34o30N94
7685A57L34j873J283L80m04K99q11L41M86M52k448J411P51J8J54m11P22k63N1
7704F29j345J266l71o50M76o55J093M53q79J264n55j450J876r21m79m40L58P4
7722b56J66P60o36n62Q01p81K48O63j078j92L9J488q75O1Q39n06q79J488j136
7741c48n4l79M08Q34r71K15R07j150M29O75j96O07o09J475j517k79l7q51O41M53
$$ plain form
7761 253 403 -352 -721 -217 815 153 -428 730 -220 167 -233 355 -389 428 -192 280 1158 -24 -1475
7780 -1475 -1001 701 409 514 -37 630 -678 -603 -104 -510 -107 727 258 24 333 -204 169 326 745
7799 745 -1051 139 924 1011 -627 -24 -392 -556 -511 26 -107 -87 -163 243 -193 -98 -284 226 603 515 114
7820 114 -296 114 -832 114 -226 -172 -435 586 -431 -416 77 -497 460 -528 -298 76 40 377 831 728
7840 728 57 110 -86 65 -288 504 1109 -532 -75 270 -999 479 -518 183 -1299 -7 313 -698
7858 -698 -86 -232 -92 526 499 17 476 -75 657 776 240 129 -503 -1784 -933 758 723 -27 230 28
7878 28 -440 -446 -724 836 -490 31 146 253 -500 -606 -227 167 -1064 54 743 320 -69 198 963 -1252
7898 -1252 41 -240 -351 -412 247 803 1255 -1146 -637 -588 -221 1340 -218 34 475 250 -328 1032 -406
$$ packed form
7761B53J50p55l69N04J032o62n81J158r50L87m00N88p44Q17o20M72Q78j182j451
7780a475M74J702k92J05n51O67j308P5M99m06M03Q34m69k34L09n37L73J57M19
7799G45j796J190P85Q7j638O03l68j64M5N37j33K0p6M06m36R5j86N10L77q8m01
7820A14m10M10r46R46l40N4k63J021j017J5M93n74R57r88K30L74l6L37M54j03
7840G28o71N3j96J51l53P92O05j641M57L45j269J478r97P01j482J292L20j011
7858f98O12j46J40O18k7m82M59n51P32J19n36j11o32j281Q51J691l5p50K57k02
7878B8m68ok78J560j326N21J15J07p53j06L79L94j231J118O89m23l89K67P65k215
7898a252J293k81j11o1O59N56M52k401N09M9L67J561j558K52M41k25n78J360j438
$$ plain form
7917 -406 -505 412 -318 -485 46 -296 -963 901 437 419 -304 -11 -17 311 987 719 468 565 43 -690 -182
7938 -182 1253 -608 -22 -615 -429 481 -426 406 44 417 -338 -139 746 457 541 469 -1043 -57 -567 -647
7958 -647 319 717 -46 755 -290 -38 -48 416 209 -325 -118 -841 244 -402 453 -321 949 25 -645
7977 -645 -1435 -32 40 700 -185 94 563 254 339 -678 914 111 208 361 112 -425 -26 1770 194
7996 194 -262 -35 -823 -275 -178 -913 836 905 800 507 -717 618 392 -486 -519 1849 176 -268 361
8015 361 830 -1180 -775 -246 -462 310 -432 -821 -411 -411 544 80 124 291 520 -297 -408 -847 -775 -1144 630
8036 630 313 -254 -1229 219 -593 -324 -343 805 -276 -260 448 -149 -23 318 -654 418 -374 -1123 453
8055 453 885 -206 -244 543 929 562 -1221 707 -194 894 206 -468 262 1003 -89 132 -192 -1053 -624
$$ packed form
7917d06r9R17p30j67N31l42o67J864m64j8p23K93oL28O76k68k51R7n22p33N08
7938a82J435j861N86n93J86R10r07Q32l62L73p55J99Q85k89Q4p2j512R86n10q0
7958f47R66L98p63Q01j045K52j0M64k07n34K07p23J085o46Q55p74J270r24o70
7977f45p90J403P2O60q85K79M69l09Q5j017J592q03R7J53k49n37L99J796j576
7996A94m56K27p88N48R7p35J749O9j05k93j224J335k26q78l3K368j673m44O29
8015C61M69k010M05N29k16P72p42l89M10%R55m64M4J67K29q17j11m39P2l69J774
8036F30l17n67r75J448q12K69j9J148j081J6P08n97J26L41r72J072p92p49J576
8055D53M32j091l8P87L86l67j783J928r01J088o88o74P30P41j092K21l24q61M29
$$ plain form
8074 -624 -1028 472 -155 -601 102 449 273 112 -436 189 23 381 -283 66 1011 239 774 -830 409
8093 409 -499 -761 -320 -227 726 67 261 -133 515 -210 93 -932 281 686 578 98 886 1184 -77
8112 -77 1076 581 -60 245 -861 829 573 265 -540 -1008 -1724 -125 367 238 683 606 -284 162 517
8131 517 11 -270 -496 -7 797 -570 -178 -208 -1592 299 249 509 158 -712 -534 -719 -533 -3 -21 -557
8151 -557 -580 -577 489 -590 -233 -915 509 26 -644 -343 635 -252 416 195 405 944 -204 184 853 291
8171 291 -73 728 151 267 -50 -1555 -516 422 -748 368 138 -315 266 -690 206 -853 792 -585
8189 -585 -948 -495
$$ packed form
8074f24m04J500o27m46P03L47j76j61n48O25j66L58o64L49R45p72N35j604J239
8093D09r08k62M41R3R53o59J94l94O48p25L03j025J213M05j08m80P88K98j261
8112g7J153m95o41L05j106J690k56l08q05m68p16J599M92j29M45p7q90M46L55
8131E17n06k81k26M89Q04j367L92l0j384J891n0K60l51q70J78j85J86N30j8n36
8151e57k3LJ066j079L57o82J424m83o70L01R78q87O68k21K10N39j148L88O69n62
8171B91l64Q01n77J16l17j505J039R38j170J116k30m53N81r56Q96j059J645j377
8189e85l63M53
8191d95
$$ Imaginary data points
##PAGE= N=2
##DATA TABLE= (X++(I..I)), XYDATA
$$ plain form
0 0 0 0 0 0 0 0 0 0 0 0 0 0 0 0 0 7 -86 107 -108 108 -108 108 -126 193 -214 217 -246 306 -329 368 -427 472 -534
33 -534 591 -664 744 -821 908 -1009 1119 -1240 1380 -1521 1683 -1864 2071 -2297 2568 -2870
49 -2870 3228 -3643 4157 -4782 5572 -6628 8074 -10236 13773 -20628 38873 -199845 -446273
62 -446273 -56734 175954 59303 -147142 -73318 23425 -32419 -129887 -66215 29400 53721
73 53721 18892 -3802 -46411 -71418 -31187 53203 58566 -3518 -16559 72354 127423 69497
85 69497 -7885 13805 67911 44169 -23702 -17846 45655 52996 -13005 -50806 -15225 28108 1904
98 1904 -54396 -55048 1323 12169 -54609 -97111 -50525 9804 -21724 -81956 -55511 23619 35864
111 35864 -20492 -29943 32836 74202 40868 -2190 -5765 4260 14604 46603 73637 45785
$$ packed form
0@%%%%%%%%%%%%%%%Pr3J93k15K16k16K16k34L19m07M31m63N52o35O97p95Q99j006
33e34J125j255J408j565J729j917K128k359K620k901L204l547L935m368M865n438
49b870O098o871P800q939J0354j2200J4702j8310K4009l4401N9501k38718k46428
62d46273L89539K32688j16651k06445P3824R6743n5844r7468O3672R5615K4321
73E3721l4829k2694m2609k5007M0231Q4390N363o2084j3041Q8913N5069n7926
85F9497p7382K1690N4106k3742o7871N856O3501P341o6001l7801L5581M3333k6204
98A904n6300o52N6371J0846o6778m2502M6586O0329l1528o0232K6445P9130J2245
111C5864n6356r451O2779M1366l3334m3058l575J0025J0344L1999K7034k7852
$$ plain form
123 45785 5624 28080 70435 26311 -46436 -18932 69711 56493 -50619 -78082 -1935 24980
135 24980 -51981 -97735 -44709 16088 1555 -40189 -41215 -17250 -14991 -31643 -29625 -6367 7033
148 7033 -2539 -13233 1886 27492 39831 42992 46533 38666 13280 7746 34953 52671 31460
161 31460 9368 19111 22790 -8029 -28602 578 27130 -2092 -40818 -29356 5282 -3860 -47881
174 -47881 -60286 -33272 -21412 -39744 -44837 -11907 16014 4866 -22919 -21475 9613 20383
186 20383 9264 8030 29103 31917 18271 17968 33909 36058 21152 21970 37366 31852 5386 3312
200 3312 22950 17164 -17860 -26740 -6514 -7137 -38212 -45029 -16626 934 -20379 -40020 -30360
213 -30360 -16170 -24245 -35523 -24486 -60 6705 -5966 -9298 6838 23075 16235 9486 20244
$$ packed form
123D5785m0161K2456M2355m4124p2747K7504Q8643j3218j07112k7463P6147K6915
135B4980p6961m5754N3026O0797j4533m1744j026K3965K259j6652K018K3258J3400
148G033r572j0694J5119K5606J2339L161L541p867k5386n534K7207J7718k1211
161C1460k2092R743L679l0819k0573K9180K6552k9222l8726J1462L4638r142m4021
174d7881j2405K7014J1860j8332n093L2930K7921j1148k7785J444L1088J0770
186B0383j1119j234K1073K814j3646l03J5941K149j4906Q18J5396n514k6466k074
200C312J9638n786l5024q880K0226o23l1075o817K8403J7560k1313j9641R660
213c0360J4190q075j1278J1037K4426O765j2671l332J6136J6237o840o749J0758
$$ plain form
226 20244 36269 33121 21547 25267 34602 23734 6721 9325 19283 13709 1631 4399 9705 -5139
240 -5139 -22363 -17587 -10248 -22263 -37006 -32919 -19308 -19653 -29506 -29014 -14316 -8733 -16939 -22435
254 -22435 -8514 8903 8690 2262 9473 22892 24166 11705 10640 26597 31558 24397 21117 27043
268 27043 29458 15789 8382 8517 5310 -3484 -7298 -4141 -5347 -13888 -19339 -16186 -18388 -26936 -30357
283 -30357 -23510 -15482 -19532 -21318 -16590 -6390 -7639 -12031 -7836 4962 11404 10813 10759 18862 27212
298 27212 23658 16158 18857 25644 21572 15857 16415 20668 16676 7205 3632 2172 -4535 -9379 -12705
313 -12705 -11718 -14736 -19056 -19031 -19487 -22136 -24426 -23625 -20206 -15784 -15138 -11976 -5102 12 130 168 3264
330 3264 10507 13580 12143 14172 23050 24665 21640 20521 21546 19237 14506 10902 12073 9064 4755
$$ packed form
226B0244J6025l148j1574L720R335j0868j7013K604R958n574j2078K768N306j4844
240e139j7224M776P339j2015j4743M087J3611l45r853M92J4698N583q206n496
254b2435J3921J7417k13o428P211J3419J274j2461j065J5957M961p161l280N926
268B7043K415j3669p407J35l207q794l814L157j206q541n451L153k202q548l421
283c0357O847Q028m050j786M728J0200j249m392M195J2798O442n91n4Q103Q350
298B7212l554p500K699O787m072n715N58M253l992r471l573j460o707m844l326
313a2705R87l018m320K5m56k649k290Q01L419M422O46L162O874N114J18L8L096
330C264P243L073j437K029Q878J615l025j119J025k309m731l604J171l009m309
$$ plain form
345 4755 2546 -1518 -5678 -11187 -13610 -16911 -18305 -19759 -18952 -18791 -18164 -17777 -17526 -17792 -15230 -10384 -8914
362 -8914 -5312 1502 6062 6427 8164 11640 14657 15357 15484 18610 21345 20521 16921 16952 16531 12065 8095
379 8095 6582 2164 244 -2553 -3983 -7732 -11697 -13973 -17662 -20191 -20464 -18191 -18286 -17627 -15893 -13495
395 -13495 -12731 -10971 -7288 -2696 -1459 801 6109 10711 12037 13887 16761 17857 15557 15844 18424
410 18424 16508 14562 14786 12947 9090 6447 3336 942 -4557 -6544 -8283 -9783 -12658 -13265 -16093
425 -16093 -16796 -18726 -17788 -16594 -16255 -12126 -10281 -7729 -5553 -3124 520 802 3988 8206 11993 12651
441 12651 14136 17618 18451 16067 14487 15616 13901 12341 10500 10499 6332 2558 -546 -3061 -7018 -8924
457 -8924 -10103 -12880 -13753 -15660 -15396 -16631 -15032 -13795 -13464 -14009 -12199 -7951 -5416 -4241 371 4548
$$ packed form
345D755k209m064m160n509k423l301j394j454Q07J61O27L87K51k66K562M846J470
362h914L602O814M560L65J737L476L017P00J27L126K735q24l600L1m21m466l970
379H095j513m418j920k797j430l749l965k276l689k529k73K273r5O59J734K398
395a3495P64J760L683M592J237K260N308M602J326J850K874J096k300K87K580
410A8424j916j946K24j839l857k643l111k394n499j987j739j500k875o07k828
425a6093p03j930R38J194L39M129J845K552K176K429L644K82L186M218L787O58
441A2651J485L482Q33k384j580J129j715j560j841jm167l774l104k515l957j906
457h924j179k777q73j907K64j235J599J237L31n45J810M248K535J175M612M177
$$ plain form
473 4548 4420 5213 9249 13193 13452 11687 15072 18600 17560 14029 13054 13677 11401 6137 3554 3485 1613
490 1613 -2314 -6024 -7300 -8688 -11029 -14194 -15878 -15225 -13773 -14435 -15019 -12247 -10553 -10484 -9500 -5373 -1928
507 -1928 -1510 1666 6949 8820 8720 9431 13526 14555 12199 11798 14828 16494 12550 8629 10132 9816
523 9816 5543 1026 -2475 -1237 -3068 -8679 -11562 -8727 -8642 -14326 -16496 -15242 -11348 -12344 -14627 -11088
539 -11088 -6616 -5823 -7188 -3275 743 2495 2241 6435 10755 9999 9495 13700 16949 15069 9773 11069
555 11069 15354 12460 5663 4819 7400 5937 -516 -6385 -4134 -3457 -8245 -12297 -13310 -9236 -9444 -16739
571 -16739 -16901 -10841 -8010 -12375 -10613 -4128 -1465 -1975 -463 3514 5201 4820 6073 12205 13437 10301
587 10301 10905 14076 17621 11439 7779 10192 12256 7415 211 547 3188 539 -8278 -11169 -5901
$$ packed form
473D548j28P93M036L944K59j765L385L528j040l531r75O23k276n264k583o9j872
490A613l927l710j276j388k341l165j684O53J452o62n84K772J694O9R84M127L445
507a928M18L176N283J871j00P11M095J029k356m01L030J666l944l921J503l16
523I816m273m517l501J238j831n611k883K835Q5n684k170J254L894r96k283L539
539a1088M472P93j365L913M018J752k54M194M320p56n04M205L249j880n296J296
555A1069M285k894o797q44K581j463o453n869K251O77m788m052j013M074k08p295
571a6739j62O060K831m365J762O485K663n10J512L977J687l81J253O132J232l136
587A0301O04L171L545o182l660K413K064m841p204L36K641k649q817k891N268
$$ plain form
602 -5901 -5724 -13958 -18129 -11488 -7237 -11364 -17255 -11010 -5320 -7440 -10209 -5406 -8 3295 17
617 17 1703 8588 9496 7559 8936 13671 12154 9897 11047 15166 12146 5919 5708 8620 6190 -1332
633 -1332 -3356 148 797 -6253 -13630 -9082 -4247 -9375 -16948 -16137 -6803 -5498 -13118 -12920 -4425 299
649 299 -5565 -7359 280 6066 3736 2513 7605 10769 8757 8604 12337 13404 9874 8568 10280 11475
665 11475 6831 1020 4005 5430 481 -7050 -5792 -625 -3787 -13648 -14406 -5253 -3516 -13433 -18750
680 -18750 -9648 -2673 -7337 -13698 -7834 1266 1971 -3581 -761 7386 9422 5301 5085 10366 13470
695 13470 10806 9268 11823 8612 6107 6035 9137 7512 2751 -2199 1000 1332 -5700 -9303 -5429 -1403
711 -1403 -8694 -16608 -12702 -4984 -6539 -14183 -13719 -3429 -1627 -7723 -8833 55 6096 3091 -547
$$ packed form
602e901J77q234m171O641M251m127n891O245N690k120k769M803N398L303l278
617A7J686O885R08j937J377M735j517k257J150M119l020o227k11K912k430p522
633a332k024L504O49p050p377M548M835n128p573Q11R334J305p620J98Q495M724
649B99n864j794P639N786k330j223N092L164k012j53L733J067l530j306J712J195
665A1475m644n811K985J425m949p531J258N167l162r861p58R153J737r917n317
680a8750R102O975m664o361N864R100P05n552K820Q147K036m121k16N281L104
695A3470k664j538K555l211k505p2L102j625m761m950L199L32p032l603L874M026
711a403p291p914L906P718j555p644M64J0290J802o096j110Q888O041l005l638
$$ plain form
726 -547 4347 9899 8333 6394 8591 13380 9971 8552 8207 10042 7830 3333 4414 4763 1808 -3027
742 -3027 -3309 -574 -2969 -9826 -10671 -4896 -4445 -11763 -15160 -7270 -3171 -9543 -12539 -7263 -380 -1602
758 -1602 -5647 -2709 6315 6905 2425 2523 8953 11029 8007 6245 9403 10756 7969 5285 6939 6496
774 6496 4365 735 1030 1748 -2303 -7379 -4088 -1764 -8729 -11243 -7704 -4483 -8136 -13906 -11615 -3586
790 -3586 -3026 -7889 -7290 -140 2673 -2489 -2073 3090 7926 5565 3927 7017 10995 9727 6369 7692
806 7692 9567 8940 4899 3574 5539 3787 -30 -470 -829 -2399 -5834 -7544 -4782 -5013 -10012 -10604
822 -10604 -7763 -4564 -9119 -11024 -5738 -2923 -3845 -7630 -2054 3680 3061 -18 1612 8027 9519
837 9519 5707 5270 7798 10094 6976 5185 7373 8026 4440 1649 2699 2926 -8 -2389 -4050 -2295
$$ packed form
726e47M894N552j566j939K197M789l409j419l45J835k212m497J081L49k955m835
742c027k82K735k395o857q45N775M51p318l397P890M099o372k996N276O883j222
758a602m045K938R024N90m480R8O430K076l022j762L158J353k787k684J654m43
774F496k131l630K95P18m051n076L291K324o965k514L539L221l653n770K291Q029
790c586N60m863N99P150K813n162M16N163M836k361j638L090L978j268l358J323
806G692J875o27m041j325J965j752l817m40l59j570l435j710K762k31m999n92
822a0604K841L199m555j905N286K815r22l785N576N734o19l079J630O415J492
837I519l812m37K528K296l118j791K188O53l586k791J050K27k934k381j661J755
$$ plain form
853 -2295 -4837 -8844 -7329 -5937 -7322 -10112 -7771 -5224 -5545 -8583 -5490 -1205 -702 -3463 -1542 2136
869 2136 4475 3829 1865 5745 8715 8187 5659 6055 9554 9313 5458 5069 6122 5971 1271 -51 392
886 392 -565 -3465 -4322 -4321 -4575 -6182 -8428 -6664 -5749 -8989 -7978 -4920 -4070 -4938 -5098 -1591 -129 625
904 625 -289 753 4591 5287 4073 4027 6881 9350 6349 4892 6969 8427 6032 2028 4163 2489
920 2489 1095 -1055 -1478 -1496 -3095 -6694 -5621 -5701 -6410 -7139 -6716 -5748 -5980 -6033 -5468 -3748 -3417 -3128 -2655
939 -2655 -85 1165 966 2830 4699 6724 5673 4958 6642 7609 7310 4720 5118 6601 4484 2672
955 2672 1301 1369 681 -2169 -2704 -2633 -3829 -5138 -6822 -6108 -6136 -6705 -7651 -5100 -5619 -4647 -5114 -2379 -1296
974 -1296 -1245 -316 1030 3567 3549 3057 4781 7131 6484 6545 5699 7248 6046 6658 4027 4436 3188 1721
$$ packed form
853b295k542m007J515J392j385k790K341K547l21l038L093M285N03k761J921L678
869B136K339o46j964L880K970n28k528L96L499k41l855l89J053j51m700j322M43
886C92r57k900q57Jk54j607k246J764R15l240J011L058Q50q68j60L507J462P54
904F25r14J042L838O96j214m6K854K469l001j457K077J458k395m004K135j674
920B489j394k150m23j8j599l599J073q0p09p29M23R68k32n3N65J720L31K89M73
939b655K570J250j99J864J869K025j051p15J684R67k99k590L98J483k117j812
955B672j371O8o88k850n35P1j196j309j684P14k8n69r46K551n19R72m67K735J083
974a296N1R29J346K537j8m92J724K350o47O1q46J549j202O12k631M09j248j467
$$ plain form
992 1721 -1114 133 -944 -2386 -3938 -4470 -3823 -5174 -6113 -5971 -5570 -6841 -6573 -4898 -4458 -3350 -2876
1009 -2876 -2058 -484 33 1204 1797 3113 3932 4917 5045 6456 6352 6516 5300 4626 5419 4860 2894 3513
1027 3513 2849 1498 -1086 -1947 -1750 -2749 -3585 -4517 -4810 -4990 -6097 -6326 -5125 -6186 -3825 -4297 -4312 -2554
1045 -2554 -1384 -1704 385 1535 2235 2999 2670 3744 6066 4528 5136 6240 5902 5596 4598 3941 4312
1062 4312 1784 2360 923 -299 -1236 -3588 -2271 -2693 -3237 -5565 -5402 -4642 -5485 -5755 -5145 -4956 -3991 -3495
1080 -3495 -3321 -1769 -706 -68 809 2584 2889 3750 4108 3607 4713 4716 5064 4517 5635 4486 3782 3204
1098 3204 1920 3202 508 -170 -362 -1453 -2782 -4323 -3568 -3894 -5040 -4612 -5581 -5967 -4471 -4868 -2657
1115 -2657 -4756 -1333 -730 -615 -331 -252 2188 1607 3672 4402 4711 4851 5151 4193 4187 3574 4745 4117 3291
$$ packed form
992A721k835J247j077j442j552n32O47j351r39J42M01j271K68J675M40J108M74
1009b876Q18J574N17J171N93J316Q19R85J28J411j04J64j216o74P93n59j966O19
1027C513o64j351k584q61J97r99q36r32k93j80j107k29J201j061K361m72j5J758
1045b554J170l20K089J150P00P64l29J074K322j538O08J104l38l06r98o57L71
1062D312k528N76j437j222r37k352J317m22n44k328J63P60q43k70O10J89R65M96
1080c495J74J552J063O38Q77J775L05Q61L58n01J106LL48n47J118j149p04n78
1098C204j284J282k694o78j92j091j329j541P55l26j146M28r69l86J496l97K211
1115b657k099L423O03J15K84P9K440n81K065P30L09J40L00r58oo13J171o28q26
$$ plain form
1134 3291 2589 1545 1149 424 -1221 -2305 -2140 -2453 -4211 -4140 -5394 -4779 -5448 -5427 -4386 -2561 -2977 -2740
1152 -2740 -2112 -643 -860 735 1144 1269 3172 2753 3341 4912 3723 4055 4776 5346 5115 3709 4187 2966
1170 2966 2744 1453 -245 21 -305 -1911 -2361 -3943 -3380 -4798 -3986 -4168 -3933 -3921 -5053 -3678 -3095 -1918
1188 -1918 -2827 -1251 -1112 378 91 921 2927 4482 3246 3774 4403 4333 4574 3805 3467 3866 3085 2133
1206 2133 1757 1665 537 -312 -1490 -911 -1979 -2932 -3146 -3864 -3846 -4502 -4684 -3121 -2963 -3123 -4063 -2847 -1320
1225 -1320 -172 -1684 232 1029 1798 2634 2319 3127 3226 4120 4338 3966 3556 2527 3063 3492 2462 1475
1243 1475 1027 728 -210 -1626 -2188 -1429 -1925 -3508 -3802 -4109 -3038 -4435 -4499 -4127 -2279 -3401 -2366 -2521
1261 -2521 -36 339 -118 870 1739 2221 1558 2596 3012 4953 3627 3320 2337 3949 3403 2768 2964 1989
$$ packed form
1134C291p02j044l96p25j645j084J65l13j758P1j254O15o69K1J041J825m16K37
1152b740O28J469k17J595M09J25J903m19N88J571j189L32P21N70k31j406M78j221
1170B966k22j291j698K66l26j606m50j582N63j418Q12j82K35J2j132J375N83J177
1188a918r09J576J39J490k87Q30K006J555j236N28O29p0K41p69l38L99p81r52
1206B133l76r2j128q49j178N79j068r53k14p18J8o56j82J563J58j60r40J216J527
1225a320J148j512J916P97P69Q36l15Q08R9Q94K18l72m10j029N36M29j030r87
1243A475m48k99r38j416n62P59m96j583k94l07J071j397o4L72J848j122J035j55
1261b521K485L75m57R88Q69M82o63J038M16J941j326l07r83J612n46o35J96r75
$$ plain form
1279 1989 691 1360 -274 -392 -912 -2774 -2499 -2694 -4158 -4396 -2674 -4244 -2091 -4150 -4822 -1939 -1218
1296 -1218 -1759 -1051 103 668 1320 1449 1544 2908 3676 2497 3249 5159 3769 3513 2166 3355 2534 2804
1314 2804 781 1426 1334 -1280 -755 -966 -1769 -2108 -3545 -2859 -3421 -2609 -4151 -3608 -1904 -3092 -3153 -2138
1332 -2138 -1614 -431 -1918 -465 1172 1617 1529 1948 4094 5042 3728 2046 3900 3738 3770 2586 1631
1349 1631 2455 601 532 -487 610 119 -1040 -1655 -1562 -1769 -3362 -3641 -3196 -3915 -3419 -4463 -2075 -1437
1367 -1437 -2343 -2478 -487 -598 -368 967 412 3414 2143 2142 2159 4038 4088 2885 2563 3193 2882 838 1584
1386 1584 1581 1803 93 -58 -1310 -1089 -1425 -2394 -1942 -2888 -2656 -4414 -3035 -2162 -3581 -3640 -3658 48 -727
1405 -727 -2394 -131 1317 794 -317 1446 2504 2965 3345 2692 3063 4872 2987 2969 2343 2322 3139 697
$$ packed form
1279A989j298O69j634j18n20j862K75j95j464k38J722j570K153k059o72K883P21
1296a218n41P08J154N65O52J29R5J364P68j179P52J910j390k56j347J189q21K70
1314B804k023O45r2k614N25k11q03l39j437O86n62Q12j542N43J704j188o1J015
1332b138N24J183j487J453J637M45q8M19K146R48j314j682J854j62L2j184r55
1349A631Q24j854o9j019J097m91j159o15R3k07j593k79M45p19M96j044K388O38
1367a437r06j35J991j11K30J335n55L002j271jJ7J879N0j203l22O30l11k044P46
1386A584lK22j710j51j252K21l36r69M52r46K32j758J379Q73j419n9j8L706p75
1405g27j667K263J448n23j111J763J058M61L80o53L71J809j885j8o26k1Q17k442
$$ plain form
1423 697 1251 1372 801 -2216 -830 -1958 -1752 -2112 -2970 -2603 -2842 -3810 -3092 -3120 -2089 -2623 -1179 -493 -1179
1442 -1179 -834 415 981 1502 1300 1789 2294 2826 3748 3140 2261 3739 2477 2592 2738 789 1211 310
1460 310 -1122 -444 -64 -1440 -1866 -1766 -1513 -2704 -2539 -2849 -1753 -2332 -1541 -3360 -2159 -1695 -1689 -1150 89
1479 89 301 541 773 2900 2594 2629 1605 2441 2978 2450 1459 2633 3429 1643 984 1044 455 1027 597 -1509
1499 -1509 -1110 -3272 -528 -2256 -2447 -1937 -2096 -2626 -1254 -2264 -2453 -2065 -1654 283 -750 -132 -255
1516 -255 828 953 885 2320 3292 1582 1963 3355 2548 3984 3073 1629 1456 1644 681 438 61 51 -340
1535 -340 -561 -2743 -1394 -1882 -3010 -1790 -2278 -2192 -3332 -2041 -1621 -1611 -1214 -1542 -365 -447 -1120 1068
1553 1068 341 3203 2723 853 3117 2517 3179 2268 2561 2627 2170 1883 2637 1545 267 731 -1518 -581
$$ packed form
1423F97N54J21n71l017J386j128K06l60q58L67k39r68P18k8J031n34J444O86o86
1442a179L45J249N66N21k02M89N05N32R22o08q79J478j262J15J46j949M22r01
1460C10j432O78L80j376m26J00K53j191J65l10J096n79P91j819J201M64ON39J239
1479H9K12K40K32K127l06L5j024Q36N37n28r91J174P96j786o59O0n89N72m30k106
1499a509L99k162K744j728j91N10j59n30J372j010j89L88M11J937j033O18j23
1516b55J083J25o8J435R72j710L81J392q07J436r11j444j73J88r63k43l77j0l91
1535c40k21k182J349m88j128J220m88Q6j140J291M20J0L97l28J177q2o73K188
1553A068p27K862m80j870K264o00O62r11K93O6m57k87P54j092j278M64k249R37
$$ plain form
1571 -581 -994 -1662 -1255 -2066 -1902 -2533 -2893 -2831 -2570 -963 -2717 -551 -1043 -1311 -199 1103 94 -149
1589 -149 1314 2181 459 1072 2124 2146 3094 1627 1971 2102 863 583 1035 561 751 -626 -389 -1734
1607 -1734 -819 -364 -2179 -2577 -2346 -2970 -1674 -2218 -1924 -1421 -1894 -1370 -1912 -1927 -905 -1555 486 866 517
1626 517 1047 616 2318 1267 2595 1672 2611 2439 1309 1416 2298 1277 262 -92 -662 539 165 -578
1644 -578 -592 -1265 -446 -2632 -2544 -1347 -1638 -1839 -2686 -295 -2296 -1774 -1322 248 -13 849 558 947 1654
1663 1654 848 2611 1939 1921 2234 1616 2631 2029 1940 2063 1276 1012 387 9 -135 -460 1398 -1231 -2540
1682 -2540 -1445 -1540 -2090 -3600 -2954 -1006 -511 -1513 -1501 -481 -1682 -364 -105 688 735 1571 823 2592
1700 2592 1692 1038 912 1844 917 2816 2236 2178 916 1542 534 -305 1115 -1405 -560 -725 -1600 -1355
$$ packed form
1571e81m13o68M07q11J64o31l60O2K61J607j754K166m92k68J112J302j009k43
1589a49J463Q67j722O13J052K2R48j467L44J31j239k80M52m74J90j377K37j345
1607a734R15M55j815l98K31o24J296n44K94N03m73N24n42j5J022o50K041L80l49
1626E17N30m31J702j051J328r23R39j72j130J07Q82j021j015l54n70J201l74p43
1644e78j4o73Q19k186Q8J197k91k01q47K391k001N22M52J570k61Q62k91L89P07
1663A654q06J763o72j8L13o18J015o02q9J23p87k64o25l78j44l25J858k629j309
1682b540J095r5n50j510O46J948M95j002J2J020j201J318K59P93M7Q36p48J769
1700B592r00o54j26R32r27J899n80n8j262O26j008q39J420k520Q45j65q75K45
$$ plain form
1718 -1355 -2186 -1124 -703 -1887 -2007 -732 -887 -3057 -1148 -1139 -1009 -404 24 188 879 1086 293 -191 2649
1737 2649 1289 1031 1677 529 1159 2165 2585 1629 1219 1541 -228 647 -470 -850 -311 -635 -1464 -1219
1755 -1219 -1745 -537 -1382 -1493 -1536 -1334 -1006 -1526 -60 -1281 58 -670 676 13 1333 822 1777 1820
1773 1820 1966 2250 1246 1329 1969 1060 1707 1662 432 177 -786 901 563 -1493 -1334 -1372 -1585 -1949 -1350
1792 -1350 -1372 -1784 -129 -2017 -1807 -1543 -420 -623 -1002 287 633 -441 -214 1309 1320 1700 1553 1491 678
1811 678 1330 1172 1596 1166 1379 522 1029 227 -275 -839 -584 -856 -1415 -1381 -996 -2880 -552 -1071 -2295
1830 -2295 -1203 -617 -1304 -1206 -1444 -1633 94 626 -762 209 1222 1077 1773 980 1559 37 1846 1623
1848 1623 1381 2018 1967 1095 842 767 633 -271 -533 791 1193 -1061 -397 -2493 -1060 -912 -1831 -2013 -2043
$$ packed form
1718a355q31J062M21j184j20J275j55k170J909RJ30O05M28J64O91K07p93m84K840
1737B649j360k58O46j148O30J006M20r56m10L22j769Q75j117l80N39l24q29K45
1755a219n26J208q45j11m3K02L28n20J466j221J339p28J346o63J320n11R55M3
1773A820J46K84j004Q3O40r09O47m5j230k55r63J687l38k056J59l8k13l64N99
1792a350k2m12J655j888K10K64J123k03l79J289L46j074K27J523J1L80j47o2q13
1811F78O52j58M24m30K13q57N07q02n02n64K55k72n59L4L85j884K328n19j224
1830b295J092N86o87R8k38j89J727N32j388R71J013j45O96p93N79j522J809k23
1848A623k42O37n1q72k53p5j34r04k62J324M02k254O64k096J433J48r19j82l0
$$ plain form
1867 -2043 -1013 -869 -1488 -1158 -1659 -604 -694 342 630 1369 287 1344 694 1379 1575 -359 956 724
1885 724 1571 827 756 1171 583 -216 365 861 1017 622 103 -415 -728 -550 -1326 -846 -166 -848 -1357 -1726
1905 -1726 -856 -991 -1271 -842 79 -548 988 507 724 590 1773 2573 692 1620 1653 1734 -70 703 1492
1924 1492 41 727 2001 -442 296 -521 -745 -632 -1585 -323 -2154 -1365 -1673 -2279 -868 -2291 -747
1941 -747 -1232 -678 -1451 -818 -1200 -360 911 752 -308 1423 1249 901 1207 1117 1548 1260 1781 865 735
1960 735 791 630 182 -746 -497 -609 -1502 -248 -604 -854 -746 -1607 -1490 -1191 -939 -1238 -748 -2294 -997
1979 -997 -210 -364 -1054 -1258 722 890 700 751 729 1279 1453 826 682 1744 2298 1032 830 423 372 906
1999 906 394 -288 -663 -850 77 -1244 -1042 -447 -1774 -643 -1318 -1042 -993 -1354 -360 19 -881 -338 1350
$$ packed form
1867b043J030J44o19L30n01J055r0J036K88P39j082J057o50O85J96j934J315k32
1885G24Q47p44p1M15n88p99N81M96J56l95n19n18l13J78p76M80O80o82n09l69
1905a726Q70j35k80M29R21o27J536m81K17j34J183Q00j881R28L3Q1j804P73P89
1924A492j451O86J274k443P38q17k24J13r53J262j831P89l08o06J411j423J544
1941g47m85N54p73O33l82Q40J271j59j060J731j74l48L06r0M31k88N21r16j30
1960G35N6j61m48r28K49j12q93J254l56k50J08q61J17K99K52k99M90j546J297
1979i97P87j54o90k04J980J68j90N1k2N50J74o27j44J062N54j266k02m07n1N34
1999I06n12o82l75j87R27j321K02N95j327J131o75K76M9l61R94L79r00N43J688
$$ plain form
2018 1350 -223 -171 461 605 1575 2281 857 1498 1195 540 342 -24 1296 1340 570 627 1336 113 -997
2037 -997 229 -104 -936 -747 132 -1025 -583 -438 -1490 -1419 -1623 -1240 -747 -1013 -900 155 710 242 1107
2056 1107 644 187 980 1344 1571 -211 219 877 562 67 1355 844 847 889 975 531 -527 -63 44 654
2076 654 406 -500 -418 431 -959 -152 10 -1545 -756 -696 -1597 -432 -566 138 -528 -96 588 46 1547
2095 1547 246 368 1466 844 346 1835 536 1517 244 1087 574 -198 674 -256 -614 675 -293 -1000
2113 -1000 -65 -513 -1265 -1251 -438 -965 -692 -1050 -433 -382 -1386 -207 -1143 -581 201 412 -583 788 2
2132 2 1443 175 1654 834 -10 517 1669 741 -269 290 786 -379 159 -41 -143 -267 325 -379 -1064
2151 -1064 -974 -571 -413 -893 -681 -229 -68 -1468 -268 766 -873 384 873 498 1247 706 1060 1183
$$ packed form
2018A350j573N2O32J44R70P06j424O41l03o55j98l66J320M4p70N7P09j223j110
2037i97J226l33q32J89Q79j157M42J45j052P1k04L83M93k66J13J055N55m68Q65
2056A107m63m57P93L64K27j782M30O58l15m95J288n11LM2Q6m44j058M64J07O10
2076F54k48r06Q2Q49j390Q07J62j555P89O0r01J165j34P04o66M32O84n42J501
2095A547j301J22J098o22m98J489j299R81j273Q43n13p72Q72r30l58J289r68p07
2113a000R35m48p52J4Q13n27K73l58O17N1j004J179r36N62P82K11r95J371p86
2132BJ441j268J479q20q44N27J152r28j010N59M96j165N38k00j02j24N92p04o85
2151a064R0M03J58m80K12M52J61j400J200J034j639J257M89l75P49n41L54J23
$$ plain form
2169 1183 1395 63 1141 1640 484 -87 468 1396 108 307 -381 74 137 260 152 60 -725 -1301 -776
2188 -776 -1536 -843 -1510 -137 -1072 -630 -918 -1247 -1345 -349 926 362 360 1375 617 343 -145 1272 697 927
2208 927 1076 673 1096 989 11 700 -373 -206 384 -323 605 -753 -1108 -935 -1581 -531 -1229 -1401 92
2227 92 -790 -863 -471 -802 177 60 -141 628 747 -354 1002 557 871 1089 908 1621 1495 -463 91 1078
2247 1078 1553 -268 651 -616 77 -281 -723 -657 -888 -615 -927 -875 -858 -1222 -181 -678 -1035 -782 702
2266 702 -432 -1137 -842 -231 870 41 -238 240 -3 142 889 54 247 1254 692 412 -934 820
2284 820 149 669 -543 -23 -198 -911 -244 -556 -62 -1023 -921 -966 -423 -356 -1537 -363 -146 -682 -222 -762
2304 -762 -67 384 -448 588 -167 0 679 485 879 627 487 1804 590 -168 -154 -42 316 1333 744
$$ packed form
2169A183K12j332J078M99j156n71N55R28j288J99o88M55O3J23j08r2p85n76N25
2188g76p60O93o67J373r35M42k88l29r8R96J275n64kJ015p58k74m88J417n75K30
2208I27J49m03M23j07r78O89j073J67N90p07R28j358l55J73o46J050o98j72J493
2227I2q82p3L92l31R79j17k01P69J19j101J356m45L14K18j81P13j26j958N54R87
2247A078M75j821R19j267O93l58m42O6k31K73l12N2J7l64J041m97l57K53J484
2266G02j134p05K95O11J101q29k79M78k43J45P47q35J93J007n62k80j346J754
2284H20o71N20j212N20j75p13O67l12M94r61J02m5N43O7j181J174K17n36M60n40
2304g62O95M51q32J036p55J67O79j94L94k52j40J317j214p58J4J12L58J017n89
$$ plain form
2323 744 25 -407 717 -518 -878 -466 -1062 -1539 -2136 -1170 -563 -950 46 631 -1335 435 -103 -161 -121
2342 -121 825 915 -815 -184 1052 423 579 99 1084 1581 576 828 670 951 310 899 1360 -468 34
2361 34 -600 -446 -183 -282 -626 -549 -1183 -595 -2439 -1152 -103 -1757 -627 336 -252 -749 -1756 -234 469
2380 469 -733 -238 1314 -117 846 1012 650 1123 332 863 -176 -262 438 248 1248 1114 -560 578
2398 578 -558 -839 -850 -302 -426 -1204 -70 -61 -261 -598 -744 -154 -600 -842 304 -103 -20 691 -90 142
2418 142 552 605 -129 523 1155 1139 114 365 524 -3 193 145 -426 647 -363 -1179 -251 -447 -1129 -1532
2438 -1532 -819 -848 -495 -1005 -1626 -13 -943 -1955 -203 -1385 77 -309 106 842 557 -540 -284 252
2456 252 423 1708 892 -68 1525 -148 309 -109 404 583 -597 353 364 -311 -79 -683 -385 -779 137
$$ packed form
2323G44p19m32J124j235l60M12n96m77n97R66O07l87R96N85j966J770n38n8M0
2342a21R46R0j730O31J236o29J56m80R85M97j005K52j58K81o41N89M61j828N02
2361C4o34J54K63r9l44P7o34N88j844J287J049j654J130R63n88m97j007J522P03
2380D69j202M95J552j431R63J66l62M73p91N31j039q6P00j90J000j34j674J138
2398E78j136k81j1N48j24p78J134Rk00l37j46N90m46k42J146m07Q3P11p81K32
2418A42M10N3p34O52O32j6j025K51J59n27J96m8n71J073j010q16R28j96o82m03
2438a532P13k9L53n10o21J613r30j012J752j182J462l86M15P36k85j097K56N36
2456B52J71J285q16r60J593j673M57m18N13J79j180R50J1o75K32o04K98l94R16
$$ plain form
2475 137 -647 -1291 -778 -260 -1324 -555 153 525 -1412 -183 -492 846 -1055 139 888 539 856 1508
2493 1508 433 -566 757 16 1385 848 444 -582 84 244 -20 40 -612 -664 -1283 -1421 207 -301 -368
2512 -368 -375 -313 -758 -439 159 -1723 141 186 -406 339 -136 573 497 213 451 843 689 318 898 317 1514
2533 1514 535 293 914 860 -434 -130 463 188 -309 43 -174 -12 -1950 -618 -485 -99 -204 182 -432
2552 -432 -232 -93 -155 631 913 -84 511 -181 520 -848 237 386 633 572 -344 648 -763 861 -127
2571 -127 606 252 21 -1098 189 195 -540 -933 -1159 131 -842 -737 -1198 -780 -712 -178 -899 -1447 545 -287
2591 -287 198 -528 -116 470 -257 -6 1486 -434 791 292 387 215 270 634 -434 -79 3 395 314 -85
2611 -85 -539 480 512 -908 884 -172 -668 -1220 -167 -654 -276 -983 -346 281 -1519 -350 -219 -199 275
$$ packed form
2475A37p84o44N13N18j064P69P08L72j937J229l09J338j901J194P49l49L17O52
2493A508j075r99J323p41J369n37m04j026O66J60k64O0o52n2o19j38J628n08o7
2512c68pO2m45L19N98j882J864M5n92P45m75P09p6k84K38L92j54l71N80n81J197
2533A514r79k42O21n4j294L04N93k75m97L52k17J62j938J332J33L86j05L86o14
2552d32K00J39o2P86K82r97N95o92P01j368J085J49K47o1r16R92j411J624r88
2571a27P33l54k31j119J287Op35l93k26J290r73J05m61M18O8N34p21n48J992q32
2591b87M85p26M12N86p27K51J492j920J225m99R5j72N5L64j068L55Q2L92q1l99
2611h5m54J019L2j420J792j056m96n52J053m87L78p07O37O27j800J169J31K0M74
$$ plain form
2630 275 435 129 -555 -584 115 -512 484 -549 240 793 -361 -92 277 -219 1277 1530 -990 -394 226
2649 226 -485 334 -516 -553 -404 -200 -366 248 397 -473 -672 571 -421 -43 -332 285 -299 -1045 -317 619
2669 619 120 601 121 -240 491 67 -39 135 577 623 44 734 275 554 -164 -949 -132 -996 -806 270
2689 270 -1352 -357 572 -558 -905 -971 -407 92 -398 -99 163 -960 -128 309 784 -693 -813 324 1037
2708 1037 934 183 650 78 -555 -364 -577 -182 800 -622 421 -528 27 -191 -320 587 -946 582
2726 582 -906 -285 -643 -516 -63 123 93 -964 -69 -632 -942 -409 -61 -284 253 -425 -955 -423 -239 -588
2746 -588 417 719 241 333 -475 673 -618 -955 658 30 -53 -277 350 -551 -369 -504 -317 -790 -777 -611
2766 -611 463 -44 -33 668 662 -151 -746 324 222 568 476 743 -50 1001 -213 1166 246 521 -67 868
$$ packed form
2630B75J60l06o84k9O99o27R96j033P89N53j154K69L69m96J496K53k520N96O20
2649B26p11Q19q50l7J49K04j66O14J49q70j99J243r92L78k89O17n84p46P28R36
2669F19m99M81m80l61P31m24j06J74M42M6n79O90m59K79p18p85Q17q64J90J076
2689B70j622R95R29j130l47o6N64M99m90K99K62j123Q32M37M75j477j20J137P13
2708A037j03p51M67n72o33J91k13L95R82j422J043r49N55k18j29R07j533J528
2726E82j488O21l58J27M53J86l0j057Q95n63l10N33L48k23N37o78n30N32J84l49
2746e88J005L02m78R2q08J148j291l37J613o28q3k24O27r01J82j35J87m73J3J66
2766f11J074n07J1P01oq13n95J070j02L46r2K67p93J051j214J379r20K75n88R35
$$ plain form
2786 868 359 -493 56 106 -12 152 -543 -667 -834 -144 -1195 -410 -767 -1121 -123 12 -592 -1214 -1480 -389
2806 -389 429 43 411 -502 -203 -310 168 522 950 70 568 -197 -394 59 623 577 676 167 895 147 -510
2827 -510 236 242 -432 -887 -464 -70 -128 456 -578 -530 318 -458 1134 -777 1346 -309 -619 -674 1085 1107
2847 1107 504 987 570 -29 995 899 819 985 284 -985 122 -333 74 -208 1204 679 -959 448
2865 448 329 -619 -391 211 921 809 -498 428 -949 233 -361 290 572 -1511 -1154 194 -711 -594
2883 -594 290 304 765 -247 -577 859 260 748 -1208 592 1385 299 129 -354 222 782 -207 508 -66
2902 -66 -47 -449 762 -159 -285 -1146 -629 -190 47 -713 -403 -769 11 -277 -101 -66 537 -87 435 808 -636
2923 -636 -48 959 237 46 703 -286 271 552 -128 755 -214 -335 -463 646 -439 678 -559 -24
$$ packed form
2786H68n09q52N49N0j18J64o95j24j67O90j051P85l57l54R98J35o04o22k66J091
2806c89Q18l86L68r13K99j07M78L54M28q80M98p65j97M53N64m6R9n09P28p48o57
2827e10P46Oo74m55M23L94n8N84j034M8Q48p76J592j911K123j655l10n5J759K2
2847A107o03M83m17n99J024r6q0J66p01j269J107m55M07k82J412n25j638J407
2865D48j19r48K28O02P10j12j307R26j377J182n94O51K82k083L57J348r05J17
2883e94Q84J4M61j012l30J436n99M88j956J800P93j086j70m83N76N60r89P15n74
2902f6J9m02J211r21j26q61N17M39K37p60L10l66P80k88J76L5O03o24N22L73j444
2923f36N88J007p22j91O57r89N57K81o80Q83r69j21j28J109j085J117j237N35
$$ plain form
2941 -24 -640 -212 -89 -100 106 -476 261 -287 -182 -904 215 -317 -327 1042 -182 -217 1291 418 607 433
2961 433 516 673 1002 4 -256 576 627 89 -230 617 -108 569 -296 -304 1165 72 17 -462 -440 -608 39
2982 39 -110 -891 -275 488 536 -1407 -302 485 213 834 573 1487 -149 586 -314 -411 -262 44 319 -747
3002 -747 -90 85 -367 -91 90 -261 -277 344 -440 -957 -278 -1009 852 -258 333 -999 209 -843 -358
3021 -358 -275 304 -407 -945 747 666 131 -259 629 -393 206 234 -469 -104 1381 41 -175 -51 -32 -524
3041 -524 -1194 839 -284 12 84 -465 -482 620 -477 -362 18 -388 614 -498 -283 -771 422 -841
3059 -841 169 1122 -453 94 -284 797 366 -70 421 -901 490 574 -755 -17 357 -690 203 -599
3077 -599 -613 496 316 -1029 165 25 199 -458 -705 556 -565 -104 1297 -1595 -714 -664 -160 -464
$$ packed form
2941b4o16M28J23j1K06n82P37n48J05p22J119n32j0J369j224l5J508q73J89j74
2961D33Q3J57L29r98k60Q32N1n38l19Q47p25O77q65qJ469j093n5m79K2j68O47
2982C9j49p81O16P63M8j943J105P87k72O21k61R14j636P35r00r7J49L06K75j066
3002g47O57J75m52K76J81l51j6O21p84n17O79p31J861j110N91j332J208j052M85
3021c58Q3N79p11n38J692q1n35l90Q88j022N99K8p03L65J485j340k16J24J9m92
3041e24o70K033j123K96P2n49j7J102j097J15L80m06J002j112K15m88J193j263
3059h41J010R53j575N47l78J081m31m36M91j322J391Q4j329P38L74j047Q93q02
3077e99j4J109j80j345J194j40J74o57k47J261j121M61J401k892Q81N0N04l04
$$ plain form
3095 -464 -237 830 85 -316 -422 336 407 208 -6 1190 -597 1537 -276 -189 1178 -818 -259 681
3113 681 315 -139 -203 694 -92 -995 38 543 812 -529 -264 467 -588 378 790 -63 -540 392 -449
3132 -449 675 1001 292 -1030 998 1292 -286 27 -173 74 720 940 -290 268 -640 -192 378 1406
3150 1406 751 9 279 957 444 -751 -682 367 -419 281 -193 503 406 -210 781 636 368 204 156 -81
3170 -81 757 -42 833 1383 -541 523 608 62 -373 186 5 20 -296 -154 1611 227 232 -13 -522 -259
3190 -259 -1014 311 -48 174 2 1075 -134 -530 526 -90 704 154 -598 523 -145 -16 -242 462
3208 462 -935 225 375 -258 -868 720 214 233 -1 257 -263 788 -337 -1422 506 -530 950
3225 950 -342 -438 -381 -1465 -772 -512 -1075 -722 -1309 -420 169 -827 261 -19 -706 698 28 419 669
$$ packed form
3095d64K27J067p45m01j06P58P1j99k14J196j787K134j813Q7J367j996N59R40
3113F81l66m54o4Q97p86r03J033N05K69j341K65P31j055R66M12q53m77R32q41
3132d49J124L26p09j322K028K94j578L13k00K47O46K20j230N58r08M48N70J028
3150A406o55p42K70O78n13j195O9J049p86P00m74O96r7o16R91j45k68j64m8k37
3170h1Q38p99Q75N50j924J064Q5n46m35N59j81J5l16J42J765j384Nk45n09K63
3190b59p55J325l59K22j72J073j209l96J056o16P94n50p52J121o68J29k26P04
3208D62j397J160J50o33o10J588n06J9k34K58n20J051j125j085J928j036J480
3225I50j292r6N7j084O93K60n63L53n87Q89N89r96J088k80o87J404o70L91K50
$$ plain form
3244 669 1132 274 -312 -367 746 -227 563 161 520 -217 817 -28 335 -204 102 -222 -1030 -1 295
3263 295 -373 -900 572 130 37 -1759 19 104 -89 -276 -1363 -121 223 406 -407 -670 86 -320 -435
3282 -435 460 -275 -151 312 -273 1221 -464 -1234 -445 -191 -337 -355 -64 -870 -1133 -610 599 -890 -1335
3301 -1335 -925 -794 -547 -611 -55 -519 127 -430 -1102 -448 282 37 -193 -843 71 871 -336 143 -229 324
3321 324 101 14 -422 259 -1280 -117 438 0 226 -344 -916 59 -103 119 697 -646 -230 -260 -441 1263
3341 1263 489 -344 174 -506 -425 -1860 776 373 127 -31 1116 -638 -1252 493 -165 693 779 464 119
3360 119 -59 471 -298 -256 -983 310 99 -551 -267 99 -215 -1737 -533 -218 -523 -356 74 23 -510 274
3380 274 272 -950 424 144 -330 477 1542 444 484 60 454 428 224 56 914 -25 355 -253 11 -432
$$ packed form
3244F69M63q58n86n5J113r73P90m02L59p37J034q45L63n39L06l24q08J029K96
3263B95o68n27J472m42r3j796J778Q5j93j87j087J242L44J83q13k63P56m06j15
3282d35Q95p35J24M63n85J494j685p70P89K54j46j8K91q06k63N23J209j489m45
3301a335M10J31K47o4N56m64O46n57o72O54P30k45k30o50R14Q00j207M79l72N53
3321C24k23q7m36O81j539J163N55m38K26n70n72R75j62K22N78j343M16l0j81J704
3341A263p74q33N18o80Q1j435K636m03k46j58J147j754o14J745o58Q58Q6l15l45
3360A19j78N30p69M2p27J293k11o50K84L66l14j522J204L15l05J67M30n1n33P84
3380B74kj222J374k80m74Q07J065j098M0m24L94k6k04j68Q58r39L80o08K64m43
$$ plain form
3400 -432 459 -902 1443 -196 187 -289 -337 -1407 676 325 -361 -265 -518 -392 -465 -108 -788 -141 -721
3419 -721 737 -510 312 231 -447 148 1030 945 -403 72 -226 185 -142 90 629 409 -1192 -636 117
3438 117 129 434 599 -316 766 141 -782 42 -773 9 622 -638 -543 -152 112 -843 -222 -244 879 -132
3458 -132 -651 73 -86 433 828 156 108 -267 1323 -583 -517 -165 693 -615 -355 -310 -583 -87 240 -176
3478 -176 168 -67 -192 -352 -1412 -469 489 -3 279 -45 -287 195 -515 -480 -801 669 427 155 450 -255
3498 -255 1464 253 -117 306 -298 -208 -904 584 413 548 675 -376 -482 -165 86 21 -592 -513 -872 65
3518 65 1097 105 115 -128 -65 -181 492 -367 -71 -31 -522 433 -278 38 145 213 948 421 -1027 273 -300
3539 -300 -6 -411 935 207 -601 66 560 206 357 232 -542 -221 -116 1211 354 -667 -825 503 646
$$ packed form
3400d32Q91j361K345j639L83m76m8j070K083l51o86R6k53J26p3L57o80O47n80
3419g21J458j247Q22q1o78N95Q82q5j348M75k98M11l27K32N39k20j601N56P53
3438A17J2L05J65r15J082o25r23Q24q15P82O13j260R5L91K64r55O21k2J123j011
3458a32n19P24j59N19L95o72m8l75J590j906O6L52Q58j308K60M5k73M96L27m16
3478a76L44k35j25j60j060R43R58m92K82l24k42M82p10L5l21J470k42k72K95p05
3498b55J719j211l70M23o04R0o96J488j71J35J27j051j06L17K51o5o13P9l59R37
3518F5J032r92J0k43O3j16O73q59K96M0m91R55p11L16J07O8P35n27j448J300n73
3539c00K94m05J346p28q08O67M94l54J51j25p74L21J05J327q57j021j58J328J43
$$ plain form
3558 646 -541 -383 -707 -255 -519 55 -717 306 168 1142 176 -830 325 342 185 -234 1179 -569
3576 -569 639 506 716 103 -740 613 -809 -28 802 479 -924 -256 -818 -301 -578 -292 -147 -817 271
3595 271 -380 -568 -618 421 274 579 -129 503 334 -576 -254 1041 -365 475 -423 6 137 900 874 156
3615 156 -98 -452 329 835 651 348 -749 891 535 824 1158 -251 479 -1040 -16 159 -109 -283
3633 -283 -363 126 1032 -542 0 213 213 971 432 -192 984 284 -518 -8 380 -878 -244 -475 -231 40
3653 40 -390 -881 -639 -123 -161 396 407 -683 208 -507 526 -975 7 169 5 -103 453 474 36 538
3673 538 -36 639 1145 339 449 250 81 -400 1242 1460 361 1875 534 -95 162 185 483 18 -242
3692 -242 1281 -319 -411 482 597 209 -657 -703 -17 -1074 -9 437 447 157 107 346 -1793 782 740 56
$$ packed form
3558F46j187J58l24M52k64N74p72J023j38R74r66j006J155J7j57m19J413j748
3576e69J208j33K10o13q43J353j422P81Q30l23j403O68n62N17k77K86J45o70J088
3595B71o51j88n0J039j47L05p08O32j69r10L22J295j406Q40q98M29J31P63k6p18
3615A56k54l54P81N06j84l03j097J640l56K89L34j409P30j519J024J75k68j74
3633b83q0M89R06j574N42K13%P58n39o24J176p00q02N10L88j258O34k31K44K71
3653D0m30m91K42N16l8N57J1j090Q91p15J033j501R82J62j64j08N56K1m38N02
3673E38n74O75N06q06J10j99j69m81J642K18j099J514j341o29K57K3K98m65k60
3692b42J523j600r2Q93J15l88q66m6O86j057J065M46J0k90n0K39k139K575m2o84
$$ plain form
3712 56 331 575 -209 -211 -19 53 543 446 -548 -458 -568 -265 91 -526 -522 117 -349 -572 -1217 -327 354 -135 103
3735 103 17 -304 190 233 -779 -314 -348 284 -233 -767 525 1841 -718 131 202 -84 -434 -130 983 133
3755 133 -829 391 -459 594 -156 -67 445 865 -116 483 -689 -1709 -283 -1092 769 -711 -53 -382
3773 -382 59 -693 -517 -209 727 -30 -41 1145 -246 -432 -615 583 -529 -635 -853 -705 1530 1
3791 1 582 -420 -477 127 582 -32 -222 627 592 -958 587 -1123 156 224 -87 811 -196 -74 492 957
3811 957 -741 658 591 333 155 -54 -329 -726 480 1257 396 422 -372 1302 415 389 90 784 108 1008
3831 1008 -21 -204 -523 -520 -1944 -1186 -39 -691 35 -202 -1077 88 -750 -620 -207 -608 220 -1529 -513
3850 -513 -93 299 -899 -303 -363 689 689 465 478 413 169 149 145 -159 328 -96 -306 958 -118 3 -882
$$ packed form
3712E6K75K44p84kJ92P2M90r7r94R0j10L03L56o17MO39m66k23o45Q90O81m89K38
3735A03q6l21M94M3j012M65l4O32n17n34J292J316k559Q49P1k86l50L04J113q50
3755A33r62J220q50J053p50Q9N12M20r81N99j172j020J426q09J861j480O58l29
3773c82M41p52J76L08R36p57j1J186j391j86j83J198j112j06k18J48K235j529
3791AN81j002n7O04M55o14j90Q49l5j550J545j710J279O8l11Q98j007J22N66M65
3811I57j698J399o7k58j78k09k75l97J206P77q61K6p94J674q87k6k99O94o76R00
3831A008j029j83l19Lj424P58J147o52P26k37q75J165q38J30M13m01Q28j749J016
3850e13M20L92j198N96o0J052%k24J3o5k44k0ml04M87m24k10J264j076J21q85
$$ plain form
3871 -882 -297 576 -229 456 -31 19 53 -1346 714 -407 -464 -577 -260 255 88 -452 298 -351 -162 256
3891 256 1284 132 -769 -288 -152 -195 -396 202 205 167 442 674 165 168 -617 64 471 -433 -48 -432 -89
3912 -89 -404 54 779 -744 288 -167 -532 -32 260 -461 282 1598 402 -562 -166 307 133 -263 -282
3931 -282 136 739 866 -788 -419 733 193 114 758 425 -694 -446 -681 441 -369 -817 992 108 -608
3950 -608 -76 -508 105 804 -1059 135 544 -64 129 116 9 1011 -445 9 132 218 778 362 -578
3969 -578 312 684 358 243 767 533 910 275 968 134 -808 111 -381 -100 178 -778 920 -66 -1108
3988 -1108 -43 -597 199 -664 -232 -165 1377 -242 909 239 -425 244 -452 -863 233 -759 79 -600
4006 -600 360 647 -398 320 527 -761 359 -1100 -557 -709 218 -549 1167 -1349 -208 53 500 462
$$ packed form
3871h82N85Q73q05O85m87N0L4j399K060j121n7j13L17N15j67n40P50o49J89M18
3891B56J028j152r01M81J36m3k01N98Ll8K75K32n09Lp85O81M07r04L85l84L43
3912h9l15M58P25j523J032m55l65N00K92p21P43J316j196r64L96M73j74l96j9
3931b82M18O03J27j654L69J152n40p9O44l33j119K48k35J122q10m48J809q84p16
3950f08N32m32O13O99j863J194M09o08J93j3j07J002j456M54J23Q6N60m16r40
3969e78Q90L72l26j15N24k34L77o35O93q34r42R19m92K81K78r56J698r86j042
3988a108J065n54P96q63M32O7J542j619J151o70o64O69o96m11J096r92Q38o79
4006f00R60K87j045P18K07j288J120j459N43j52R27p67J716k516J141K61M47l8
$$ plain form
4024 462 292 313 611 2456 -272 -618 -474 -760 501 -392 334 410 -382 -349 40 510 42 -103 -103 1061
4044 1061 -123 -172 -166 438 393 -423 -1018 -327 -649 380 1010 1369 1080 -188 -114 -945 322 35 1660 94
4064 94 -422 1290 683 -390 169 -538 311 624 122 -596 449 -474 405 -178 -304 174 -955 35 -291
4083 -291 386 -325 -211 -135 1009 93 368 427 95 1400 -228 57 52 -455 77 46 695 -188 676 -320 593
4104 593 88 -218 806 576 -315 329 505 -399 771 614 -745 567 -1005 361 -624 -561 -561 270 -479
4123 -479 612 74 -470 -424 -261 -176 1111 -504 1010 1529 -222 117 597 -377 -1408 -300 -414 -231
4141 -231 566 -280 50 149 -460 8 -161 -1035 -758 704 -457 1277 -181 -48 -235 -172 -981 -204 -101
4160 -101 47 -276 788 -438 1661 348 35 -773 -232 -539 711 240 -1344 345 -77 161 214 -344
$$ packed form
4024D62j70K1K98J845k728l46J44k86J261q93P26P6p92L3L89M70m68j45%J164
4044A061j184m9OO04m5q16n95O91l22J029O30L59k89j268P4q31J267k87J625j566
4064I4n16J712o07j073N59p07Q49L13n02p18J045r23Q79n83j26M78j129R90l26
4083b91O77p11J14P6J144r16K75N9l32J305j628K85nn07N32l1O49q83Q64r96R13
4104E93n05l06J024k30q91O44J76r04J170j57j359J312j572J366r85O3%Q31p49
4123d79J091n38n44M6J63Q5J287j615J514N19j751L39M80r74j031J108j14J83
4141b31P97q46L30R9o09M68j69q74K77J462j161J734j458J33j87O3q09P77J03
4160a01J48l23J064j226K099j313l13q08N41l07J250m71j584J689m22K38N3n58
$$ plain form
4178 -344 91 407 357 847 -786 361 -687 -575 -441 497 295 69 -1145 -532 -88 717 -375 33 157
4197 157 -309 -634 878 153 -425 -5 -567 184 314 1151 -913 755 -153 277 -7 -559 403 -261 236
4216 236 1114 23 -46 952 -509 -980 83 548 166 -334 93 145 -251 229 -414 801 729 -233 -695 422
4236 422 199 -306 -775 -3 161 -344 -790 -416 -406 -115 -821 51 739 -230 -230 -209 -189 215 -370 -319 57 250
4258 250 -950 463 509 -3 265 -258 251 1394 724 93 -376 -426 485 -344 251 -150 -580 322 532 -328
4278 -328 -567 -1089 4 103 -157 -1500 599 1254 -561 49 897 -481 401 206 291 49 484 -526 -314
4297 -314 382 782 -307 510 -426 996 480 -78 181 -812 -629 -308 -331 -273 496 -415 -518 -131 511 178
4317 178 112 -710 404 -639 235 624 541 664 -234 361 188 229 -1015 141 77 675 -551 -83 286 -1159
$$ packed form
4178c44M35L16n0M90j633J147j048J12J34R38k02k26j214O13M44Q05j092M08J24
4197A57m66l25J512p25n78M20n62P51J30Q37k064J668r08M30k84n52R62o64M97
4216B36Q78j091o9R98j461m71J063M65l82n00M27N2l96M80o43J215p2r62m62J117
4236D22k23n05m69P72J64n05m46L74J0K91p06Q72O88r69%K1K0M04n85N1L76J93
4258B50j200J413M6n12K68n23N09J143o70o31m69n0R11q29N95m01m30R02K10q60
4278c28k39n22J093R9k60j343K099O55j815O10Q48j378Q82j95Q5k42M35j010K12
4297c14O96M00j089Q17r36J422n16n58K59r93J83L21k3N8P69r11j03L87O42l33
4317A78o6q22J114j043Q74L89q3J23q98N95j73M1j244J156o4N98j226M68L69j445
$$ plain form
4337 -1159 -1048 513 -183 -279 -1191 -190 -316 123 7 150 827 498 167 -556 214 -352 277 1103 441
4356 441 490 -72 -414 4 -188 -246 868 -572 -614 857 -605 -425 268 -16 465 -244 -667 -812 760
4375 760 -755 -396 425 -754 -536 447 107 56 -428 -928 798 -59 -68 925 139 358 616 464 552 326
4395 326 -1019 -625 809 -29 841 -280 -340 -105 345 137 243 40 284 535 182 -13 1089 -762 609
4414 609 952 -808 363 -661 611 269 908 -466 -391 -63 -209 -759 597 1115 -487 -60 -825 70
4432 70 957 -648 -1299 973 -251 1407 -174 356 -199 27 546 -1086 388 -598 -609 -836 400 199
4450 199 581 185 -214 1137 117 367 851 213 -745 -12 -261 -92 -465 -1024 -366 -718 614 439 -1545
4469 -1545 -285 230 -811 -482 -625 722 828 850 300 774 276 919 -97 -166 -747 169 308 -801 -313
$$ packed form
4337a159J11J561o96r6r12J001j26M39j16J43O77l29l31p23P70n66O29Q26o62
4356D41M9n62l42M18j92n8J114j440m2J471j462J80O93k84M81p09m23j45J572
4375G60j515L59Q21j179K18R83l40n1m84n00J726q57rR93p86K19K58j52Q8k26
4395C26j345L94J434q38Q70j121o0K35M50k08J06k03K44K51l53j95J102j851J371
4414F09L43j760J171j024J272l42O39j374P5L28j46n50J356N18j602M27p65Q95
4432G0Q87j605o51K272j224J658j581N30n55K26N19j632J474r86j1k27J236k01
4450A99L82l96l99J351j020K50M84o38r58P33k49J69l73n59O58l52J332j75j984
4469a545J260N15j041L29j43J347J06K2n50M74m98O43j016o9n81R16J39j109M88
$$ plain form
4488 -313 627 226 -390 -659 -1203 -33 -176 692 -214 328 -969 -209 528 120 193 -449 1313 -744 543
4507 543 -761 170 -264 -136 196 -403 -558 -1 552 294 55 -763 1119 -48 581 381 52 -23 79
4526 79 -372 -676 -586 -792 629 34 -166 241 -784 569 556 -1006 -698 -966 872 -1223 405 -43 -77
4545 -77 -1064 -964 -1018 -794 -590 11 -236 432 590 -1178 706 -122 293 578 -133 -728 646 135 468 -409
4565 -409 -242 -58 -342 655 -49 179 -23 -1117 -1062 190 541 550 -1198 -274 -776 429 -511 445 133 -290
4585 -290 1199 84 509 642 1192 -903 864 392 460 498 399 1334 198 -74 -147 -935 -595 391 315 319 294
4606 294 -428 148 1161 870 23 85 97 214 -173 154 1269 462 645 -552 -387 -577 79 197 95 -102
4626 -102 163 623 577 -719 -1175 -649 125 512 279 469 -145 454 -137 1356 -445 -743 -759 322 1184
$$ packed form
4488c13R40m01o16k69n44J170j43Q68r06N42j297P60P37m08P3o42J762k057J287
4507E43j304R31m34J28L32n99j55N57N53k58k39q18J882j167O29k00l29p5J02
4526G9m51l04R0k06J421n95k00M07j025J353j3j562L08k68J838k095J628m48l4
4545g7r87J00n4K24K04O01k47O68J58j768J884q28M15K85p11n95J374n11L33q77
4565d09J67J84k84R97p04K28k02j094N5J252L51Rj748R24n02J205r40R56l12m23
4585b90J489j115M25J33N50k095J767m72O8L8r9R35j136k72p3p88L40R86p6Mk5
4606B94p22N76J013k91q47O2J2J17l87L27J115q07J83j197J65j90O56J18j02j97
4626a02K65M60m6j296m56N26P74L87k33J90o14N99n91J493j801k98j6J081Q62
$$ plain form
4645 1184 -333 76 862 779 -101 86 -362 -171 918 123 36 799 -940 275 269 -273 -348 -138 -114 218
4665 218 35 450 -1500 -150 -613 789 636 -79 -100 131 660 697 59 -719 104 844 -460 467 638
4684 638 1038 -37 -270 267 -392 -493 950 -566 -632 -63 51 -412 781 1162 536 326 -443 628 -362
4703 -362 747 -860 -728 658 -627 913 290 -230 -24 578 349 485 1322 -543 -603 -258 -42 -297
4721 -297 -895 -168 -48 -274 -428 -25 332 -487 818 -1015 -1305 3 -885 880 -1240 -120 -591 203
4739 203 -57 -82 1195 845 -584 -668 -738 789 296 -833 -527 -51 266 -766 -213 141 -496 1579 403
4758 403 500 -457 247 393 931 -661 -529 1040 340 -127 638 -464 379 -329 177 483 -583 -263 515
4777 515 943 204 943 -435 -165 37 1091 314 -230 1 686 -277 -700 -290 -453 -881 602 -467 -263
$$ packed form
4645A184j517M09P86q3q80J87m48J91J089p95q7P63j739J215on42p5K10K4L32
4665B18j83M15j950J350m63J402j53p15k1K31N29L7o38p78Q23P40j304R27J71
4684F38M00j075k33N37o59j01J443j516o6N69J14m63J193L81o26k10p69J071r90
4703c62J109j607J32J386j285J540o23n20K06O02k29J36Q37j865o0L45K16k55
4721b97n98P27J20k26j54M03L57q19J305j833k90J308q88J765k120J120m71P94
4739B03k60k5J277l50j429q4p0J527m93j129L06M76L17j032N53L54o37K075j176
4758D03R7r57P04J46N38j592J32J569p00m67P65j102Q43p08N06L06j066L20P78
4777E15M28p39P39j378K70K02J054p77n44K31O85r63m23M10j63m28J483j069K04
$$ plain form
4796 -263 -191 -415 -140 1132 -315 237 35 234 164 -400 -525 1823 -408 -199 -888 29 106 129 23 1100
4816 1100 -535 -614 269 493 809 -986 -88 311 62 -377 -470 -163 -371 210 461 369 -17 655 199 228
4836 228 -1113 554 -1152 -970 119 281 -80 -1421 -630 246 -1026 -150 1002 -431 201 -680 -76
4853 -76 -574 -552 241 445 -573 130 -457 -292 409 106 -729 -878 -349 968 -52 531 -1174 167 -411
4872 -411 -361 18 -114 -247 903 561 -263 -328 392 338 -280 861 -387 488 -300 364 221 224 184 621 158
4893 158 -1032 406 797 -1006 892 360 -1155 -56 -148 -197 -569 -520 -74 -224 -85 231 345 -815 373
4912 373 -809 -861 236 643 230 613 -496 733 867 -102 1010 43 866 -629 297 17 -220 -727
4930 -727 436 -205 -201 625 -533 -37 -211 118 -428 -516 319 -303 -371 397 -695 239 -98 -132 437 33 -327
$$ packed form
4796b63P2k24K75J272j447N52k02J99p0n64j25K348k231K09o89R17P7K3j06J077
4816A100j635p9Q83K24L16j795Q98L99k49m39r3L07k08N81K51r2l86O72m56K9
4836B28j341J667j706J82J089J62l61j341P91Q76j272Q76J152j433O32q81O04
4853g6m98K2P93K04j018P03n87J65P01l03q35j49N29J317j020N83j705J341n78
4872d11N0L79j32j33J150l42q24o5P20n4o18J141j248Q75p88O64j43Lm0M37m63
4893A58j190J438L91j803J898n32j515J099r2m9l72M9M46j50J39L16J14j160J188
4912C73j182n2J097M07m13L83j109J229J34r69J112r67Q23j495R26k80k37n07
4930g27J163o41MQ26j158M96j74L29n46q8Q35o22o8P68j092R34l37l4N69m04l60
$$ plain form
4951 -327 267 658 967 551 423 -819 699 261 -217 -788 -630 -491 104 0 -406 439 719 931 467
4970 467 -201 -708 753 -491 339 -490 -594 942 -676 -696 501 75 -246 -451 58 -536 -457 535 -696
4989 -696 281 -911 685 599 811 -396 -1457 61 -60 667 -747 -260 284 -467 38 -674 338 620
5007 620 -311 403 476 43 -969 359 -739 461 -386 -351 -542 481 -949 176 159 -478 -342 10 290
5026 290 67 -1059 -297 -400 -208 613 -808 -1056 -979 25 -209 124 770 210 -426 186 946 -175 -838
5045 -838 -45 218 616 266 364 944 1262 80 97 55 402 929 292 -1025 -48 -233 733 -723 732 -748
5065 -748 625 419 -302 442 319 331 535 394 -794 1125 46 772 -385 279 551 -281 426 96 -526
5084 -526 -825 803 750 442 62 402 237 -344 -132 -36 509 43 -695 -195 -695 108 -5 -341 -356 158 384
$$ packed form
4951c27N94L91L09m16j28j242J518m38m78n71J58J39N95j04m06Q45K80K12m64
4970D67o68n07J461j244Q30q29j04J536j618k0J197m26l21k05N09n94P9R92j231
4989f96R77j192J596q6K12j207j061J518j21P27j414M87N44p51N05p12J012K82
5007F20r31P14P3m33j012J328j098J200q47L5j91J023j430J125j7o37J36L52K80
5026B90k23j126P62j03J92Q21j421k48P7J004k34L33O46n60o36O12P60j121o63
5045h38P93K63L98l50R8N80L18j182J7m2L47N27o37j317R77j85R66j456J455j480
5065g48J373k06p21P44j23J2K04j41j188J919j079P26j157O64K72q32P07l30o22
5084e26k99J628n3l08l80L40j65n81K12R6N45m66p38N00n00Q03j13l36j5N14K26
$$ plain form
5105 384 1011 688 589 425 -1095 104 385 273 301 -1346 80 -1658 -292 585 -1390 1224 -282 5
5123 5 138 2027 156 -675 -876 456 589 205 -786 267 -440 919 -348 -432 -674 -1333 973 267 -553
5142 -553 -1473 -5 -122 -695 858 -109 550 -345 360 706 37 249 -1259 -400 228 -1689 547 459 -112
5161 -112 704 -1024 -586 -1530 -1180 673 -267 148 -378 -777 348 348 476 -744 -211 -335 -483 141 -65
5180 -65 449 111 193 489 416 328 -197 1086 111 1107 -9 70 484 377 -1058 532 497 174 712 205 677
5201 677 -5 -372 -816 346 380 -249 246 439 -893 -103 -217 -107 -932 -1091 -1335 -6 -792 343 -701
5220 -701 161 570 657 305 -411 -171 34 -259 -357 -109 -487 138 335 -380 -608 781 -185 312 -11 1484
5240 1484 285 -202 -508 -325 -381 -335 605 197 -962 -369 -605 -460 -388 -438 13 -286 -127 -612 -818 674
$$ packed form
5105C84O27l23r9j64j520J199K81j12K8j647J426j738J366Q77j975K614j506K87
5123EJ33J889j871q31k01J332J33l84r91J053p07J359j267q4k42o59K306p06q20
5142e53r20J468j17n73J553r67O59q95P05L46o69K12j508Q59O28j917K236q8n71
5161a12Q16j728M38r44L50J853r40M15n26l99J125%J28j220N33j24j48O24k06
5180f5N14l38Q2K96p3q8n25J283r75R96j116P9M14j07j435J590l5l23N38n07M72
5201F77o82l67m44J162L4o29M95J93j332P90j14J10q25j59k44J329p86J135j044
5220g01Q62M09Q7l52p16K40K05k93r8K48l78O25J97p15k28J389r66M97l23J495
5240A484j199m87l06J83n6M6R40m08j159N93k36J45P2n0M51k99J59m85k06J492
$$ plain form
5260 674 -621 -212 1139 466 930 -54 -954 -451 -363 153 -68 639 762 216 -129 124 859 -217 -859
5279 -859 -163 -26 -483 518 271 -273 188 527 -310 428 166 -606 112 -1008 371 231 94 145 739
5298 739 -302 741 -57 -215 -220 -4 391 -1073 34 -533 -396 -483 -637 820 83 395 -697 -419 -224
$$ packed form
5260F74j295M09J351o73M64r84r00N03Q8N16k21P07J23n46l45K53P35j076o42
5279h59O96J37m57J001k47n44M61L39q37P38k62p72P18j120J379j40j37N1N94
5298G39j041J043p98j58nK16L95j464J107n67J37q7j54J457p37L12j092K78J95
$$ [...]
8191C52
##END NTUPLES=NMR FID
##END=
