##TITLE=1H_SAM_11.103
 CDCl3, 8 sc, 
 7.2.2019
##JCAMPDX= 6.0         $$ Bruker NMR JCAMP-DX V2.0
##DATA TYPE= NMR FID
##DATA CLASS= NTUPLES
##ORIGIN= UXNMR, Bruker Analytische Messtechnik GmbH
##OWNER= root
$$ XWIN-NMR		Version 3.5
$$ Thu Feb  7 14:05:36 2019 Russian Standard Time (UT+4h)  she@DPX200
##.OBSERVE FREQUENCY= 200.1318
##.OBSERVE NUCLEUS= ^1H
##.DELAY= (6, 6)
##.ACQUISITION MODE= SIMULTANEOUS
##.ACQUISITION SCHEME= undefined
##.AVERAGES= 108
##.DIGITISER RES= 18
##SPECTROMETER/DATA SYSTEM= spect
##.PULSE SEQUENCE= zg30
##.SOLVENT NAME= CDCl3
##.SHIFT REFERENCE= (INTERNAL, CDCl3, 0, 15.7039)
##AUDIT TRAIL= $$ (NUMBER, WHEN, WHO, WHERE, WHAT)
$$ ##TITLE= Audit trail, XWIN-NMR		Version 3.5
$$ ##JCAMPDX= 5.01
$$ ##ORIGIN= Bruker BioSpin GmbH
$$ ##OWNER= she
$$ F:/spectra/data/she/nmr/H-F/1/audita.txt
$$ ##AUDIT TRAIL=  $$ (NUMBER, WHEN, WHO, WHERE, WHAT)
(   1,<2019-02-07 14:04:28.62 +0400>,<she>,<DPX200>,
      <created by zg, POWCHK disabled, PULCHK disabled
       configuration hash MD5:
       00 E9 B6 7A A2 85 ED C7 34 08 36 98 17 FE 4E 26
       data hash MD5: 16K
       E9 53 CF 07 68 31 70 90 1C E0 BC 1E 7E 5A 0A 00>)
$$ ##END=
$$ 
$$ hash MD5
$$ E0 C1 42 94 05 FA 16 30 8A 41 09 AC D8 3E A0 56
##$RELAX= 
##$RELAX= 
##$RELAX= 
##$RELAX= 
##$RELAX= 
##$RELAX= 
$$ Bruker specific parameters
$$ --------------------------
##$DU= <F:/spectra>
##$EXPNO= 1
##$NAME= <H-F>
##$PROCNO= 1
##$TYPE= <nmr>
##$USER= <she>
##$AMP= (0..31)
100 100 100 100 100 100 100 100 100 100 100 100 100 100 100 100 100 100 
100 100 100 100 100 100 100 100 100 100 100 100 100 100 
##$AQSEQ= 0
##$AQ_mod= 1
##$AUNM= <au_zg>
##$AUTOPOS= <>
##$BF1= 200.13
##$BF2= 200.13
##$BF3= 200.13
##$BF4= 200.13
##$BF5= 200.13
##$BF6= 200.13
##$BF7= 200.13
##$BF8= 200.13
##$BYTORDA= 1
##$CFDGTYP= 0
##$CFRGTYP= 5
##$CHEMSTR= <none>
##$CNST= (0..31)
1 1 145 1 1 1 1 1 1 1 1 1 1 1 1 1 1 1 1 1 1 1 1 1 1 1 1 1 1 1 1 1 
##$CPDPRG= <>
##$CPDPRG1= <>
##$CPDPRG2= <>
##$CPDPRG3= <>
##$CPDPRG4= <mlev>
##$CPDPRG5= <mlev>
##$CPDPRG6= <mlev>
##$CPDPRG7= <mlev>
##$CPDPRG8= <mlev>
##$CPDPRGB= <>
##$CPDPRGT= <>
##$D= (0..31)
0 1.2 0 0 0 0 0 0 0 0 0 0.03 0 0 0 0 0 0 0 0 0 0 0 0 0 0 0 0 0 0 0 0 
##$DATE= 1549533868
##$DBL= (0..7)
120 120 120 120 120 120 120 120 
##$DBP= (0..7)
150 150 150 150 150 150 150 150 
##$DBP07= 0
##$DBPNAM0= <>
##$DBPNAM1= <>
##$DBPNAM2= <>
##$DBPNAM3= <>
##$DBPNAM4= <>
##$DBPNAM5= <>
##$DBPNAM6= <>
##$DBPNAM7= <>
##$DBPOAL= (0..7)
0.5 0.5 0.5 0.5 0.5 0.5 0.5 0.5 
##$DBPOFFS= (0..7)
0 0 0 0 0 0 0 0 
##$DE= 6
##$DECBNUC= <off>
##$DECIM= 24
##$DECNUC= <off>
##$DECSTAT= 4
##$DIGMOD= 1
##$DIGTYP= 9
##$DL= (0..7)
0 120 120 120 120 120 120 120 
##$DP= (0..7)
150 150 150 150 150 150 150 150 
##$DP07= 0
##$DPNAME0= <>
##$DPNAME1= <>
##$DPNAME2= <>
##$DPNAME3= <>
##$DPNAME4= <>
##$DPNAME5= <>
##$DPNAME6= <>
##$DPNAME7= <>
##$DPOAL= (0..7)
0.5 0.5 0.5 0.5 0.5 0.5 0.5 0.5 
##$DPOFFS= (0..7)
0 0 0 0 0 0 0 0 
##$DQDMODE= 0
##$DR= 18
##$DS= 0
##$DSLIST= <SSSSSSSSSSSSSSS>
##$DSPFIRM= 0
$$ [...]
##$SUBNAM2= <"">
##$SUBNAM3= <"">
##$SUBNAM4= <"">
##$SUBNAM5= <"">
##$SUBNAM6= <"">
##$SUBNAM7= <"">
##$SUBNAM8= <"">
##$SUBNAM9= <"">
##$SW= 24.9336685128492
##$SWIBOX= (0..15)
0 0 2 0 0 0 0 0 0 0 0 0 0 0 0 0 
##$SW_h= 4990.01996007984
##$TD= 16384
##$TD0= 1
##$TE= 0
##$TE2= 300
##$TE3= 300
##$TEG= 300
##$TL= (0..7)
0 120 120 120 120 120 120 120 
##$TP= (0..7)
150 150 150 150 150 150 150 150 
##$TP07= 0
##$TPNAME0= <>
##$TPNAME1= <>
##$TPNAME2= <>
##$TPNAME3= <>
##$TPNAME4= <>
##$TPNAME5= <>
##$TPNAME6= <>
##$TPNAME7= <>
##$TPOAL= (0..7)
0.5 0.5 0.5 0.5 0.5 0.5 0.5 0.5 
##$TPOFFS= (0..7)
0 0 0 0 0 0 0 0 
##$TUNHIN= 0
##$TUNHOUT= 0
##$TUNXOUT= 0
##$USERA1= <user>
##$USERA2= <user>
##$USERA3= <user>
##$USERA4= <user>
##$USERA5= <user>
##$V9= 5
##$VALIST= <valist>
##$VCLIST= <CCCCCCCCCCCCCCC>
##$VD= 0
##$VDLIST= <DDDDDDDDDDDDDDD>
##$VPLIST= <PPPPPPPPPPPPPPP>
##$VTLIST= <TTTTTTTTTTTTTTT>
##$WBST= 1024
##$WBSW= 4
##$XGAIN= (0..3)
0 0 0 0 
##$XL= 0
##$YL= 0
##$YMAX_a= 228689
##$YMIN_a= -210321
##$ZGOPTNS= <>
##$ZL1= 120
##$ZL2= 120
##$ZL3= 120
##$ZL4= 120
##$ABSF1= 10
##$ABSF2= 0
##$ABSG= 5
##$ABSL= 3
##$ALPHA= 0
##$AQORDER= 0
##$ASSFAC= 0
##$ASSFACI= 0
##$ASSFACX= 0
##$ASSWID= 0
##$AUNMP= <proc_1d>
##$AZFE= 0.1
##$AZFW= 0.1
##$BCFW= 1
##$BC_mod= 2
##$BYTORDP= 1
##$COROFFS= 0
##$CY= 11.3945322036743
##$DATMOD= 1
##$DC= 2
##$DFILT= <>
##$DTYPP= 0
##$F1P= 18.9103706918063
##$F2P= -1.10871071338519
##$FCOR= 0.5
##$FTSIZE= 0
##$FT_mod= 4
##$GAMMA= 1
##$GB= 0.15
##$INTBC= 1
##$INTSCL= 1
##$ISEN= 128
##$LB= 0.24
##$LEV0= 0
##$LPBIN= 0
##$MAXI= 10000
##$MC2= 0
##$MEAN= 0
##$ME_mod= 0
##$MI= 1.114404
##$NCOEF= 0
##$NC_proc= 0
##$NLEV= 6
##$NOISF1= 3.799351
##$NOISF2= 2.8
##$NSP= 1
##$NTH_PI= 0
##$NZP= 0
##$OFFSET= 15.70392
##$PC= 1
##$PHC0= -8857.355
##$PHC1= 11.60005
##$PH_mod= 1
##$PKNL= yes
##$PPARMOD= 0
##$PSCAL= 0
##$PSIGN= 0
##$REVERSE= no
##$SF= 200.130013532006
##$SI= 16384
##$SIGF1= 3
##$SIGF2= 2
##$SINO= 400
##$SIOLD= 16384
##$SREGLST= <1H.CDCl3>
##$SSB= 0
##$STSI= 0
##$STSR= 0
##$SW_p= 3612.71676300578
##$SYMM= 0
##$S_DEV= 0
##$TDeff= 0
##$TDoff= 0
##$TI= <>
##$TILT= no
##$TM1= 0
##$TM2= 0
##$TOPLEV= 0
##$USERP1= <user>
##$USERP2= <user>
##$USERP3= <user>
##$USERP4= <user>
##$USERP5= <user>
##$WDW= 1
##$XDIM= 8192
##$YMAX_p= 0
##$YMIN_p= 0
$$ End of Bruker specific parameters
$$ ---------------------------------
##NTUPLES= NMR FID
##VAR_NAME=  TIME,          FID/REAL,        FID/IMAG
##SYMBOL=    X,             R,               I
##VAR_TYPE=  INDEPENDENT,   DEPENDENT,       DEPENDENT
##VAR_FORM=  AFFN,          ASDF,            ASDF
##VAR_DIM=   8192,          8192,            8192
##UNITS=     SECONDS,       ARBITRARY UNITS, ARBITRARY UNITS
##FACTOR=    0.0002004,     1,               1
##FIRST=     0,             0,               0
##LAST=      1.6414764,     0,               0
##MIN=       0,             -210321,         0
##MAX=       1.6414764,     228689,          0
$$ Real data points
##PAGE= N=1
##DATA TABLE= (X++(R..R)), XYDATA
0 0 0 0 0 0 0 0 0 0 0 0 0 0 0 0 7 -68 108 -108 108 -108 109 -135 198 -216 226 -268 317 -346 399 -451 510 -567
32 -567 643 -721 803 -894 999 -1105 1224 -1354 1510 -1671 1851 -2049 2262 -2519 2793 -3106
48 -3106 3465 -3886 4385 -4976 5695 -6601 7784 -9386 11693 -15341 22091 -38928 228689
61 228689 39344 -111742 83493 16220 -92906 -55842 19704 -60886 -41022 31674 27566
72 27566 -10272 48817 62113 22096 4533 20745 -8940 -27115 -29178 -41952 -46779 -9498 -2118
85 -2118 -16924 14564 59880 31163 7750 45077 39271 -24312 -25585 1908 -37990 -63168 -18318
98 -18318 -2958 -27484 343 45576 30514 17455 43317 38660 134 -9906 -3612 -27098 -46452
111 -46452 -31874 -22714 -25454 -4873 19558 21580 26945 45523 32892 12001 13739 1079 -31558
124 -31558 -31315 -21034 -38318 -35908 -2027 7652 806 27432 46879 26276 18745 28420 9698
137 9698 -20090 -23001 -20548 -35797 -37068 -18760 -5741 302 17036 32654 31548 28970 28471 14809
151 14809 -3925 -11102 -20469 -35320 -35744 -23449 -20140 -9671 12092 22832 23231 32242 37179 18339
165 18339 5371 1933 -14433 -33103 -29204 -25823 -29481 -18127 2046 11500 17544 30804 33780
178 33780 24534 17340 10353 -6386 -21911 -24932 -29342 -30912 -23054 -9784 947 13404 26517
191 26517 29317 28288 25928 16602 1256 -10600 -18489 -29751 -33035 -26168 -18188 -9013 3727 17300
205 17300 25711 28867 29562 23451 11464 -520 -11655 -21792 -28903 -28176 -23579 -15823 -4525 9414
219 9414 19719 24651 28413 26702 17120 7390 -1572 -15577 -25501 -25420 -26248 -23737 -10498 1771 9088
234 9088 20753 28548 27078 24008 18064 5242 -8758 -17352 -23295 -29275 -25978 -18371 -9859 934
248 934 14306 22412 27131 27804 22315 12665 2470 -9561 -18930 -24912 -26945 -23727 -16674 -6399 5609
263 5609 15929 23602 26260 25574 18945 9974 -967 -11418 -19878 -25324 -26062 -22899 -14812 -3374 8086
278 8086 17226 23172 26018 23801 16384 7408 -3797 -15059 -21236 -25326 -25652 -18682 -9935 -891 11359
293 11359 19056 23305 24724 22679 14357 3662 -5790 -15749 -22838 -25123 -21432 -17472 -8740 3447
307 3447 12548 19903 24694 24716 18798 10905 1406 -9848 -17415 -22560 -23857 -20875 -13742 -4352 5258
322 5258 14242 21180 23879 22025 17685 7604 -2179 -10150 -18526 -23029 -22475 -18545 -11104 -2315 7439
337 7439 16351 21667 23934 20500 14338 5447 -4310 -13679 -20625 -24189 -21622 -16502 -9745 709 10221
352 10221 18198 21408 23448 18934 10708 2554 -7149 -14432 -21572 -21906 -19734 -15146 -6465 3259 11700
367 11700 18198 23228 22541 16269 10376 1255 -9438 -15690 -20717 -22714 -17779 -12609 -5331 6223 12563
382 12563 18458 21661 20433 15126 6822 -1138 -11904 -18623 -21291 -21159 -17417 -10174 -366 6602 15814
397 15814 21037 21164 19621 11851 4239 -4912 -12370 -19665 -20952 -20200 -14727 -8046 1228 9904 15964
412 15964 19979 20077 15448 10028 3220 -5308 -13375 -18744 -19964 -17844 -11847 -5006 3938 11750 16274
427 16274 18941 18156 14695 7759 -1467 -8957 -16652 -20383 -18366 -16828 -10314 -2154 6225 12744 17947
442 17947 18998 17501 11947 4948 -2605 -10683 -15681 -18693 -19535 -14428 -8637 140 8318 13568 18014
457 18014 19733 17745 11286 2997 -4662 -11092 -16667 -18260 -16127 -13086 -5524 2405 8537 14467 19113
472 19113 18089 13150 8962 1808 -6903 -12842 -17613 -18504 -16253 -10128 -3535 4009 10780 15966 17634
487 17634 17260 12695 6990 -483 -7997 -14086 -17529 -16630 -15337 -10315 -1332 5586 11566 16530 18707
502 18707 15935 11183 4283 -2831 -9496 -14642 -16645 -16727 -11821 -8026 67 7465 12794 16373 17231 15440
518 15440 8951 2750 -4122 -11617 -14907 -17279 -15972 -11684 -3873 2033 9535 13696 17173 16564 13766
533 13766 8438 83 -6468 -12539 -16290 -17138 -14135 -10736 -3585 3082 10825 15891 16451 14682 12167
548 12167 5008 -1018 -7736 -13820 -15348 -16484 -13492 -7345 -1865 4828 10988 14789 15786 13589 9796
563 9796 3871 -3357 -8265 -13112 -15468 -14935 -12507 -6728 652 8125 12224 15233 15599 12493 8376 2318
579 2318 -5546 -10740 -14125 -15834 -14775 -9491 -4947 1655 9107 11932 14591 14389 12059 5872 384
594 384 -7319 -12729 -14486 -14101 -13417 -8308 -1530 3716 8788 13072 14747 15070 10024 5872 -2052 -7457
610 -7457 -11176 -14312 -14004 -11752 -6118 -568 5552 11667 13308 14284 12894 8436 2214 -3947 -8882 -13221
626 -13221 -14598 -13957 -10674 -5371 711 6877 10949 14824 15455 12469 7682 2267 -4325 -9976 -13098
641 -13098 -14578 -13487 -8586 -4620 2849 8384 12304 13427 13908 10874 5570 -720 -5822 -11124 -12921
656 -12921 -13206 -11641 -7216 -480 4450 8566 12709 12833 12110 10076 4445 -2665 -7284 -10109 -13452 -13513
672 -13513 -9927 -4966 590 6727 9867 12611 14127 11652 6433 2987 -3442 -9425 -12076 -12613 -13351
687 -13351 -9448 -4247 1835 6499 10545 13202 13010 11288 6864 1258 -5019 -8695 -12727 -12786 -11561 -8407
703 -8407 -3498 2519 8341 10847 12758 11040 9996 4893 -1057 -6119 -9659 -12220 -11925 -10255 -6843
718 -6843 -1427 3653 8719 12317 12296 11120 7993 2926 -905 -6632 -10474 -12676 -12252 -9236 -5119 -731
734 -731 5051 9451 12047 11200 10452 6540 2139 -2025 -8414 -10607 -11141 -11073 -8787 -4078 581 6108 9869
751 9869 11743 10903 9358 5308 887 -4185 -7864 -10069 -11455 -10254 -8415 -1945 2146 5879 10065
766 10065 12541 10708 8678 5447 -1738 -5638 -9035 -11157 -11559 -9768 -5745 -1184 4143 8822 10433
781 10433 11065 9978 7051 3781 -1439 -6771 -9555 -11615 -10862 -9062 -4443 -1187 5011 8403 11141
796 11141 10655 9780 5491 1775 -3086 -7167 -9237 -11279 -10995 -7347 -2019 305 6298 9631 11290 10588
812 10588 9005 4739 980 -4475 -8189 -10142 -11026 -9433 -6493 -1065 2857 6932 10073 10312 10525 7909
828 7909 3379 -430 -3894 -9550 -11196 -10241 -8434 -3303 -338 3965 6939 9275 11029 9206 6562
843 6562 3055 -2413 -5633 -9341 -9462 -9820 -7857 -3346 362 4170 7976 9442 9652 8691 4569 1880
859 1880 -1934 -7691 -9657 -9661 -9502 -7149 -2122 1807 4879 8773 10619 10379 6893 4879 -845 -3766
875 -3766 -7161 -9804 -10321 -8829 -6303 -1495 3619 6073 9474 10310 8746 6317 2818 -491 -4210 -7615
891 -7615 -8618 -9838 -8968 -5208 -579 2307 6519 8761 9510 8731 5453 1931 -1611 -5616 -7964 -9437
907 -9437 -8849 -6820 -3234 -13 4187 8080 7708 10033 7640 5064 1529 -2757 -6184 -8607 -9408 -8883
923 -8883 -6087 -2156 3063 5277 8199 10118 8959 7124 3681 457 -3757 -6505 -8525 -8841 -7006
938 -7006 -5086 -1339 2176 6382 7356 8455 9057 6575 2330 -854 -4599 -7286 -8011 -8063 -7745 -3713 362
955 362 3206 6641 7771 8671 7052 5654 2470 -1707 -5750 -6053 -8754 -8722 -5661 -3615 882 4403
971 4403 7657 8287 8509 7720 4453 1068 -2460 -6255 -8645 -8417 -6577 -4318 -2351 1175 4917 6439
987 6439 8024 7054 7048 3070 -438 -3905 -6064 -7358 -7839 -6783 -5095 -1998 2981 4954 8138 7622 5569
1004 5569 6778 2907 673 -4588 -6549 -6410 -8605 -6364 -4338 -462 3020 5020 7963 7933 6563 5158
1020 5158 797 -2516 -4816 -7116 -7472 -7032 -5179 -3137 -299 3278 4943 7661 7644 6340 4612 1196
1036 1196 -2874 -5303 -6967 -7546 -6341 -4851 -989 1511 3664 6694 7035 6600 6327 3557 -404 -2621
1052 -2621 -6404 -7133 -7759 -6808 -4925 -811 1733 5102 5425 8982 6108 4581 2594 -1099 -4039 -6978
1068 -6978 -8310 -6980 -5304 -2942 -1090 2998 6661 6846 6869 5480 3784 1077 -1823 -4821 -5967 -7637
1084 -7637 -7192 -4457 -2404 1330 3153 5908 7597 6948 5129 3708 509 -2316 -5253 -6699 -5978 -6221
1100 -6221 -3394 -1773 1834 4292 5303 6721 7229 5959 2806 -1026 -2867 -5149 -6479 -6585 -5622 -3801
1116 -3801 -1545 1679 3525 6542 6540 4889 4933 2267 -1902 -2877 -5874 -6115 -6195 -4771 -2345 136 3486
1133 3486 4472 7355 6138 5530 4077 1726 -1573 -3974 -5442 -6353 -5286 -3437 -2976 355 3449 4779
1149 4779 6861 6012 4961 4220 1352 -2449 -4858 -5919 -6284 -6352 -3664 -1220 1163 3681 5831 5714
1165 5714 6233 4757 2547 -338 -2663 -4904 -5900 -5867 -5114 -3353 -442 1770 4694 6213 5731 5764 2278
1182 2278 2380 -1163 -3082 -5296 -6238 -6092 -3816 -2448 456 2675 3389 5943 6130 5734 3915 977
1198 977 -1440 -3728 -4518 -5154 -6213 -3342 -1268 501 3036 5073 6039 4864 3588 1876 268 -2507
1214 -2507 -4558 -4926 -5937 -5211 -2658 -928 -160 3852 4409 5588 5127 4399 1332 -176 -2409 -4803
1230 -4803 -4592 -5161 -5781 -2403 331 1702 3621 3725 5240 5031 3326 2388 -825 -4025 -6146 -4769
1246 -4769 -6064 -5168 -1986 1002 2680 3836 5289 4675 4979 3702 898 -1412 -3843 -4746 -5708 -5412
1262 -5412 -2337 -1721 -140 2822 4981 5389 4840 3413 1397 -682 -1244 -4258 -4710 -4588 -4325 -3081 -272
1279 -272 717 3311 4424 5173 4679 2337 1387 -177 -1691 -4063 -5157 -6272 -2948 -2012 270 2413
1295 2413 3384 5076 4426 4446 2391 643 -292 -3748 -3827 -3569 -4550 -2331 -1829 979 1024 4222 4628 4947
1313 4947 4240 2432 -390 -1116 -3245 -4274 -5111 -4216 -3278 -1465 1055 2446 3308 5403 4592 3479 1390
1330 1390 -321 -1698 -4237 -4486 -4998 -4184 -3497 -690 1271 3328 5151 4331 4907 3925 1820 452 -2601
1347 -2601 -3255 -5081 -5015 -3654 -2151 -365 1538 3027 3974 5136 4648 3300 1101 -540 -3456 -3751
1363 -3751 -4965 -3833 -2098 -1573 -996 2792 2959 3843 4047 3754 2075 974 143 -3279 -3968 -3796 -3863 -2760
1381 -2760 46 341 3453 4049 3371 3728 3780 507 3 -2136 -3686 -3264 -3742 -4456 -2440 268 494 2439
1399 2439 4178 4575 3296 1966 1250 -904 -2108 -3254 -4246 -3924 -2886 -1682 -1262 1010 2366 3502
1415 3502 4066 3567 3874 695 -1662 -2279 -3284 -3398 -3874 -2652 -847 907 1013 2660 3081 4647 3333
1432 3333 1081 739 -720 -2560 -3890 -3787 -2747 -3254 -1805 123 1463 3880 3260 4352 3185 878
1448 878 -886 -1371 -3202 -4458 -4434 -3433 -1966 -246 969 3456 3630 3848 2976 2778 2277 -1082 -811
1465 -811 -2811 -3120 -3800 -2858 -437 -420 1711 3647 3954 3611 4148 2757 1555 -940 -2671 -3313 -3539 -4044
1483 -4044 -1496 -1843 500 2320 3705 4283 3659 1999 2379 125 -1015 -1583 -3491 -3265 -2684 -1254 -1424
1500 -1424 1175 2066 3868 3509 2955 3292 1842 199 -2101 -2173 -3040 -3906 -3163 -2287 -487 1562 2749
1517 2749 2710 3154 1929 2033 1762 221 -2528 -3253 -3863 -2209 -3121 -2518 -294 -443 2264 5048 3592
1534 3592 2255 789 674 -133 -1622 -3402 -2617 -3715 -2282 -549 1214 2576 3100 2653 2436 2905 1578
1551 1578 1223 -1378 -2517 -3367 -3559 -2732 -1662 38 631 643 1501 2299 2907 1462 569 -689 -1332 -1984
1569 -1984 -2971 -2908 -1907 -2578 343 1133 1004 2981 3055 2591 2340 145 140 -1700 -2146 -2738 -3202 -1625 -1761
1588 -1761 -839 -92 1965 2565 2066 2556 2012 160 -537 -2120 -1444 -2930 -2648 -2011 -610 866 1786 2299
1606 2299 2139 3771 3431 1898 -470 -1661 -2266 -2953 -3635 -1415 -1036 61 1483 1321 2320 2955 3595
1623 3595 2892 433 52 -346 -980 -2602 -2917 -1682 -1106 -729 640 2436 3045 2604 2862 2488 112 -442
1641 -442 -1467 -1107 -3194 -2436 -1949 -1344 265 1855 2580 3563 2742 2192 2594 622 -294 -988 -2459 -2512
1659 -2512 -1660 -1409 -667 210 1179 2107 2764 2703 1756 1559 -361 -1221 -1036 -1818 -2164 -2758 -1258 -220 941
1678 941 2390 2344 2860 2417 1736 1941 -193 -873 -1157 -2104 -2780 -2592 -1257 286 -129 1475 1955 2480 1792
1697 1792 1013 330 -537 -1445 -3063 -2484 -2203 -1557 -620 -494 1677 1906 2274 2187 1679 1099 280 -67 -914
1716 -914 -1093 -2212 -2319 -1400 -1636 237 742 1469 2547 3101 1667 1425 88 -1175 -1817 -1409 -1305 -1379
1734 -1379 -2649 -1010 1366 1128 2180 1912 3058 1741 334 -932 -1622 -1358 -2308 -1616 -3759 -2172
1750 -2172 -842 565 1428 2021 1262 1451 1286 -868 -385 -1571 -2185 -3032 -1289 -588 -28 -129 1594 2200
1768 2200 1917 361 1780 646 -433 -537 -1008 -1198 -2892 -1660 -566 188 37 1750 1212 2065 1778
1785 1778 611 710 458 -1050 -938 -991 -2131 -1575 -1920 965 505 823 1943 1850 2076 1861 1393 534 -918
1804 -918 -1212 -1282 -1708 -1505 -609 227 668 667 2217 1387 1307 934 1488 -345 -2036 -2217 -2564 -753 -2294 -1463
1824 -1463 988 1135 382 2193 89 304 1229 710 -274 -2030 -699 -1312 -2007 -2169 -515 39 22 1672
1842 1672 1232 2149 1422 -395 -488 -880 -910 -1030 -2678 -1508 -456 -975 784 1260 1801 2080 2612 280
1860 280 180 -192 -180 -1047 -622 -3000 -1000 -1256 -921 1315 1403 2919 1096 1854 985 1145 437 -500 -1264
1879 -1264 -2180 -1804 -782 -967 620 -1113 1626 1726 704 1102 697 343 -1189 -757 -2218 -1236 -1614
1896 -1614 -1144 -644 -112 1863 1709 1254 1369 1192 1730 -734 -425 -1035 -472 -577 -1844 -1105 -882 911
1914 911 940 1264 1063 1407 734 840 -1021 -457 -864 -2185 -513 -1135 -718 -181 337 1961 973 1815 713
1933 713 -141 1108 -214 -654 -446 -1306 -1793 -544 -631 446 507 935 1831 1926 116 855 -272 -534 -1062
1952 -1062 -1544 -2108 -1572 -1433 -1771 -170 665 1483 1800 1190 1436 298 -157 -712 -517 -1700 -1144 -885 -1284
1971 -1284 294 746 42 1000 1028 486 1109 617 498 -652 -44 -1175 -1688 -2283 255 307 -571 1911 831
1990 831 1563 1164 -353 -894 26 316 -1 -1448 -1405 183 -990 568 1097 1893 2257 1456 1617 678 146
2009 146 -58 216 -1479 -724 -533 -1307 -477 -463 457 311 84 1061 493 2060 -371 -619 -657 -1752 -866
2028 -866 -2241 -293 -760 326 761 186 240 1185 1217 1065 -75 -784 -994 -599 -2075 -1620 -1234 78 -175
2047 -175 1182 2009 1199 1302 1011 539 -1013 -787 -2126 -538 -1785 -1563 -243 123 395 1868 158
2064 158 1034 929 -335 672 147 -944 -1022 -685 -1742 -899 -120 -852 674 916 1599 768 290 886 -865
2083 -865 231 -1068 -1891 -757 -374 -1205 -591 1247 1736 435 1176 232 1441 -580 -208 -819 -1169 -41
2101 -41 -2382 188 -445 10 1121 1381 566 1086 857 238 1032 -136 -1854 -1244 -163 -1649 40 -731
2119 -731 -656 -878 715 1176 847 667 1038 -611 662 -767 -1476 -1228 383 290 -669 -685 -182 238 1144
2138 1144 1036 808 1346 -12 -162 -474 -578 -790 -492 54 538 -315 1098 1144 591 816 826 983 1052 -1064
2158 -1064 -136 -689 -1085 -1445 -1437 -68 429 158 1164 1351 329 -318 100 -423 320 -590 -482 -1062 249
2177 249 -690 537 410 538 374 -14 -271 -1008 -382 -239 -442 -645 -1491 -1288 -1249 164 79 1383 1349 1035
2197 1035 -489 -514 1089 -232 -784 -1114 -161 -767 -704 277 -103 622 1209 721 1414 453 468 1101 444 -336
2217 -336 70 -1678 -1221 27 -228 -558 635 215 859 856 1303 300 -227 -448 -350 -1334 -1234 -202 -449
2236 -449 -1260 424 -341 416 947 1039 -39 1461 2 420 147 -390 -306 -623 864 -64 534 759 1421
2255 1421 571 657 114 125 -963 53 -1111 199 141 -185 -485 1000 -8 258 1367 209 796 1237
2273 1237 1421 562 302 -1059 -437 -136 -357 -804 95 -287 918 -35 -139 -450 -1015 1078 -513 -886
2291 -886 -494 -739 -1178 -1192 -711 -111 970 74 1063 1823 1065 750 -1097 -1220 -976 -1304 25 -513 -164
2310 -164 704 636 1203 1584 1454 93 1454 989 586 447 -760 -917 713 -1243 -560 -1096 438 2089
2328 2089 246 596 454 495 249 43 -418 -780 -290 -183 -664 533 -36 -584 898 1269 126 551 -412
2347 -412 -271 272 -1379 -632 -901 157 -1155 -801 -291 475 -805 1221 -572 1108 -31 381 733
2364 733 -173 -1423 -1007 -853 -783 -38 3 1022 -199 235 1503 252 -1 390 129 -346 -751 -701 -1289
2383 -1289 -219 703 -46 -146 508 274 -404 922 -94 -339 -561 -805 152 -642 521 -204 519 -74
2401 -74 1004 253 51 285 -124 119 -478 1085 668 -791 -220 -867 -374 978 -18 502 -1755 473
2419 473 427 -774 363 62 -1149 50 -640 -511 462 90 -18 -401 -178 136 187 499 -1324 638 -1034
2438 -1034 -219 -308 -474 -588 -575 -18 893 334 -31 -120 202 755 473 1754 560 -868 -714 -1305 -431 361
2458 361 804 51 366 -117 370 496 -305 825 147 -791 116 -526 449 -491 798 1157 967 552 230
2477 230 520 179 -72 -315 -255 754 -291 -669 -694 545 840 262 389 -734 13 -511 -491 691 122
2496 122 -581 365 -290 -871 429 129 865 139 649 904 711 394 -552 947 376 -558 -463 -365 -405 267
2516 267 -461 627 199 1028 -434 65 1298 82 -476 -350 -491 -107 -403 337 -636 88 62 352 -301
2535 -301 692 -53 -222 -455 88 -867 -785 -518 -686 -583 -258 293 508 91 563 -10 -558 -84 -767 -213
2555 -213 -897 -714 -479 223 -432 542 934 -193 -394 -90 746 842 1002 -261 -606 -94 216 -303 679 -81
2575 -81 -1381 198 28 603 502 232 77 -392 -1010 -366 461 -478 -47 -216 298 409 85 -76 1098
2594 1098 335 1087 180 -407 -448 -542 -266 -889 805 291 599 -82 -528 316 439 -865 -618 -26 131 794
2614 794 92 -577 -868 -600 -297 -398 366 -673 586 769 939 687 -235 -162 22 -623 -113 213 521 -43
2634 -43 -422 53 -321 286 901 959 15 487 38 270 213 522 -727 -1045 -635 -39 -560 1259 1221 25
2654 25 247 570 35 1829 557 21 871 -538 341 -497 -118 864 348 -106 289 714 -36 508 -57
2673 -57 -853 865 119 -403 315 -326 198 -601 346 -388 -353 -651 53 220 -534 -613 -1334 -1234 -86 -1085
2693 -1085 259 -23 484 1132 -1108 -40 -226 -450 123 -131 428 750 25 636 -66 252 -380 765
2711 765 -187 188 116 445 -250 -403 171 -721 -242 -202 -243 78 -470 124 1009 1114 276 -248 -602 273 -141
2732 -141 602 96 180 201 -161 -407 447 -16 280 -245 115 999 -162 -281 331 -1182 -440 -515 194 818
2752 818 -16 378 -327 750 -323 1139 105 -165 -121 -594 -983 -614 221 -212 835 678 233 -290 144
2771 144 558 50 10 -305 -239 -206 450 -222 -955 -1373 -637 779 932 939 -210 631 416 -349 750 -645
2791 -645 1250 341 -58 -214 337 515 80 667 914 637 -462 846 -1427 -1189 574 984 141 -1005
2809 -1005 272 591 -325 1031 -437 520 568 701 -171 21 499 -746 -108 -1298 36 -979 -107 -636
2827 -636 -17 -64 -1069 664 211 1376 1013 161 584 789 -269 -624 484 763 -339 -118 -169 321 -240
2846 -240 379 -463 -649 -698 1020 -43 69 -50 780 -333 566 -38 -600 -431 -529 -182 -1107 -152 -935 -416
2866 -416 213 266 108 -866 415 -652 -675 -542 299 -379 -32 328 -627 255 709 529 -14 -1399 -14
2885 -14 641 -128 971 657 -551 512 -272 -259 -512 88 93 -19 -428 -592 -111 -494 641 -500 221 186
2905 186 -17 -168 -821 -207 -1348 218 891 441 -785 -348 608 507 -632 826 -466 236 443 291
2923 291 77 327 77 -620 458 -411 -75 -132 421 -686 335 260 -179 -254 127 -383 -1313 279 94 -589
2943 -589 -328 -80 -105 34 -10 -533 -25 302 -331 -135 -451 -607 1069 24 -203 132 -17 908 -242 -104
2963 -104 -454 -179 845 76 -407 -72 -847 -907 -359 820 496 938 -104 108 -691 172 826 254 -523
2982 -523 -723 790 531 787 -633 751 562 717 84 -835 16 399 161 -459 138 -615 690 -649
3000 -649 -47 1778 -400 -453 28 295 -23 650 -374 151 230 -343 -812 -1266 201 -378 -189 -520 556
3019 556 -706 -724 101 -467 634 -153 -301 -563 -512 -1209 574 350 -1118 438 1210 336 231 -1 701
3038 701 -471 -822 420 -601 -562 75 55 175 895 912 127 712 1023 103 -27 -116 153 112 -140 107 -728
3059 -728 78 -816 -533 822 -402 721 659 -286 -12 12 148 235 612 -664 -1306 -685 30 -363 -77 -359
3079 -359 -271 -471 -141 -876 -1319 59 -635 -291 -541 -38 174 -786 802 -83 625 381 64 269 -679 -911
3099 -911 18 -484 234 77 501 588 -654 819 490 -320 585 -132 -526 131 -1429 -223 -479 538 -1031
3118 -1031 741 335 -185 365 344 -196 -270 190 -313 -397 -659 -346 -291 -400 114 819 -184 161 -368 -199
3138 -199 429 -661 -1380 -152 -1086 -636 386 -25 119 171 836 11 -581 -1669 108 -1484 16 26
3156 26 224 -642 -93 140 721 -16 1086 541 244 1013 -471 28 554 957 373 -245 -650 388 587
3175 587 -72 -652 -334 565 186 -604 170 194 -310 -141 297 -132 -258 762 -264 -227 761 376 605 563
3195 563 -1219 329 -696 -358 -563 345 -971 -208 -1171 -332 297 -31 155 261 -232 1062 -125 168
3213 168 386 487 -976 -449 -264 369 -81 -104 356 -7 -561 -461 16 550 -279 676 1326 -398 18 381
3233 381 1006 67 60 309 -165 663 520 16 848 475 1096 -856 -1264 -527 -1199 605 240 -38 906 697
3253 697 453 -111 -184 1223 -1164 -1249 -117 -550 -817 124 -197 457 456 -71 96 -282 390 523 -585 -446
3273 -446 -149 -842 -17 237 606 -568 1148 129 660 152 491 138 781 107 259 572 58 151 -615
3292 -615 -486 190 823 747 -500 806 -59 15 -857 864 750 -1680 253 -482 1164 -880 105 -146
3310 -146 -402 314 509 -437 734 -878 946 -822 -616 1163 73 -914 278 -370 41 -558 567
3327 567 228 -776 1054 184 -43 1137 -497 1108 -1096 -1248 -491 -463 -114 655 762 -200 2002 247
3345 247 90 -546 -209 -51 -275 -130 -384 -662 -75 285 544 96 1042 362 593 -305 532 -232 -536 -180
3365 -180 -208 605 626 177 -286 -252 343 -190 516 126 -93 87 541 -65 105 -706 416 621 -551 592
3385 592 357 -564 451 -291 94 123 -424 388 1254 897 -614 332 70 761 960 -53 -353 755 -65
3404 -65 531 555 -15 -377 -113 760 -125 -489 589 923 42 -892 780 -66 377 573 -156 -445 -28 -612
3424 -612 -445 571 -593 305 -500 -160 -235 129 -676 -347 -506 918 394 470 -12 693 -1489 -150 409
3443 409 -258 405 -1211 -533 1099 -265 380 -279 201 55 60 -78 745 -46 749 956 -1320 9 -470
3462 -470 -154 -472 -334 -723 -931 181 -372 647 111 98 -1070 808 562 94 96 325 -306 -232 401 -16
3482 -16 -166 81 -117 -1273 -520 572 430 -557 -310 1024 -1152 205 339 -411 93 239 -230 209 -426
3501 -426 -418 679 64 -304 346 -149 1151 -326 411 82 693 -309 364 -490 245 -1292 -354 545 -570
3520 -570 -228 531 -411 -211 -359 -40 -514 1173 -787 -520 772 435 652 362 -330 -410 403 -692 -636
3539 -636 -841 -1125 163 -395 885 1210 -28 -254 -425 -175 -611 8 537 288 702 -492 -1572 -623
3557 -623 554 151 -581 -837 208 -131 350 745 268 -19 -143 -850 543 -1111 939 -405 1622 -45
3575 -45 -116 946 635 -109 302 395 -48 -1303 592 355 997 159 -427 -100 233 679 566 -668 56 495
3595 495 -193 288 -332 4 -81 837 -499 775 1119 -849 -511 1078 -1132 -337 406 -441 -280 -176 -49
3614 -49 -68 727 -54 266 445 -257 57 102 90 889 -443 -398 183 -1127 -34 490 -403 47 -148 -211 -600
3635 -600 188 -1134 -200 632 -822 -38 -577 1519 -212 1221 -469 -680 -908 -164 -446 -352 366 243
3653 243 785 -588 -280 366 1175 -643 -1193 137 162 -31 -134 662 -3 270 491 305 60 -744 -940
3672 -940 327 385 -368 353 -110 -16 234 365 -492 -121 433 190 76 35 580 1055 -197 14 441 -29
3692 -29 20 127 27 567 257 -642 -642 866 202 -75 110 426 241 -1064 423 914 -77 160 -230 -455
3712 -455 704 1086 -218 -798 700 -902 754 398 178 506 -966 260 46 -117 981 76 -15 -810
3730 -810 193 146 -679 -87 40 99 1015 1011 161 -421 -394 -113 -772 -923 156 146 1076 -705 -646 -690 641
3751 641 -261 -115 177 492 952 913 -948 -470 340 343 862 -445 -156 -397 638 -23 204 606 -411 203
3771 203 23 -173 430 264 -194 -190 356 -491 -213 530 173 79 694 207 -307 -495 -1010 -1250 465 736 613
3792 613 1209 -196 -260 -194 840 101 175 404 -725 -38 788 294 -458 416 380 -222 -230 -420 430 893 -1200
3813 -1200 211 481 273 -201 -555 -443 259 96 3 -464 457 779 -1826 124 -187 407 725 -302 832
3832 832 316 -295 218 180 1322 -526 317 454 237 812 4 -457 -114 -667 1009 -1276 -54 -590 -161
3851 -161 -796 -965 -682 349 443 2 588 -263 796 -885 -328 84 35 240 -224 -362 -466 -69 -864 483
3871 483 63 272 621 454 353 408 300 622 727 -1303 -52 1282 680 37 329 914 -639 1058 -807
3890 -807 -369 110 953 -49 453 -63 -248 -313 537 84 136 -455 413 337 -46 721 292 -130 -1757 -440
3910 -440 -521 -149 508 1348 -64 -247 -2 -396 -1333 -629 373 347 175 -521 550 755 -205 -352 -207 -632
3930 -632 -498 197 -117 -485 565 -816 874 -1123 350 -145 -849 -768 38 -166 -226 -340 -89 -314 -118
3949 -118 -43 -759 402 -214 284 426 718 -498 57 -474 28 657 -173 481 1025 -832 -126 -268 -797
3968 -797 145 -250 191 1451 282 562 -57 748 237 41 -195 -444 53 -1312 -215 712 -1094 765
3986 765 -28 434 896 221 104 -59 266 508 -147 188 -338 36 250 219 -254 -20 79 -567 38 -127 -103
4007 -103 100 101 1104 -49 -617 -579 -614 273 -181 792 -512 268 -562 360 -459 146 -330 -114 962 -614
4027 -614 520 -76 -279 600 376 1035 1061 482 -405 44 212 756 -543 -179 622 665 316 -289 -247 -56
4047 -56 -191 -415 13 -485 -521 240 919 -54 408 735 -512 72 -425 486 -32 220 836 -462 -55 223
4067 223 1140 -26 922 -871 298 1045 -258 556 -91 300 631 35 -565 -440 -561 19 928 128 -939
4086 -939 347 -121 349 -8 48 606 409 527 342 -712 371 -593 -184 -136 -232 203 -48 -60 -486 330
4106 330 22 46 441 -126 -111 110 -555 -70 284 -564 909 220 -351 -374 -583 1078 -579 -477 -396 1511
4126 1511 352 54 515 -1357 -558 -632 913 -877 1444 218 603 447 98 -495 -62 -226 -150 708
4144 708 -204 422 -1325 -146 -415 578 537 381 -122 211 783 -151 -48 -995 400 -161 544 232 140 -233
4164 -233 7 875 -738 538 -1067 -236 381 513 259 -172 322 612 357 578 1697 173 318 -297
4182 -297 -626 -92 193 -387 795 525 -1485 -1132 -742 -638 84 -1268 465 379 -269 668 575 -356 -433 -415
4202 -415 220 -129 156 1550 501 180 -1601 582 112 -226 268 399 204 -884 613 695 758 51 -554
4221 -554 -1167 329 -205 421 -652 -1444 -80 332 791 926 561 -421 1215 1328 208 -218 1223 882
4239 882 -500 906 -630 -1060 373 348 563 194 144 -200 239 -687 -649 1468 -674 -476 948 262 -179
4258 -179 443 223 9 -5 -636 341 -206 202 865 531 -506 400 -184 -641 -637 -47 -718 824 512 820
4278 820 -392 192 -518 -938 -104 1332 226 -141 -596 159 459 -585 629 -387 402 -513 -340 -796
4296 -796 -223 -494 304 -70 -622 -178 378 706 298 -579 -235 46 -325 -282 -888 -882 -84 -143 -1137 173 910
4317 910 -294 -113 -410 -853 -313 -719 -1029 948 157 699 434 -166 26 -479 15 -537 -15 258 409
4336 409 -118 4 652 -481 -755 307 -21 877 -55 -212 123 1084 107 -181 62 -34 -299 -1288 -232
4355 -232 -64 -479 -268 -741 -421 -470 655 -485 -703 108 8 368 -94 -69 238 321 -121 725 -315 149
4375 149 -1172 -742 -480 -338 820 -437 -1132 -744 586 234 460 -247 -678 -372 -295 -290 -618 489 -371
4394 -371 -199 534 51 546 515 -214 -81 133 164 -442 62 -1194 -377 688 216 -656 -141 401 -87 -278
4414 -278 -319 603 -418 816 -29 -362 114 -56 1669 351 -34 -554 110 -461 590 -6 117 -879 13
4433 13 -80 930 97 -215 1562 987 875 34 435 316 -839 -641 -264 369 -977 189 813 275 194
4452 194 -1 -231 -645 -712 -131 -88 491 -633 -56 -515 -452 -329 -969 593 -309 -33 755 698 116 -160 450
4473 450 -835 -321 -312 -1003 355 -626 -63 162 -186 -330 -117 -1027 298 591 420 49 1018 -599 78
4492 78 -784 -811 -595 576 669 478 229 238 -148 -141 284 -135 -1244 189 -927 -758 615 720 -401 1209
4512 1209 -513 -229 135 -85 -77 -317 -1045 291 -397 72 -116 127 596 487 151 -752 1181 349 587
4531 587 463 -67 -492 745 -1304 641 44 -419 -786 -198 -390 -551 168 -36 -219 -234 -112 -421 345
4550 345 56 175 158 -1038 -123 -386 -377 -318 -221 -244 -554 1303 401 -181 661 -200 110 -974 128 180 763
4571 763 974 1332 779 47 -464 723 860 -189 709 -664 1000 -264 -679 295 580 80 134 387 139
4590 139 408 210 175 -441 -290 -903 1496 -62 -369 -431 515 760 22 -339 -401 526 -81 -152 -941 569
4610 569 -279 320 532 -337 1139 578 -151 700 400 913 141 -577 -661 -167 221 441 -64 841 616 -192
4630 -192 -172 -196 439 -462 575 145 -908 260 228 -1406 235 333 28 651 785 707 389 147 -681 117
4650 117 18 -167 26 212 -1045 -247 -301 982 -1039 -782 -144 1522 -580 611 -90 -655 -639 379 -545
4669 -545 830 150 103 -307 -123 -453 -257 -33 -261 -160 401 254 -541 749 -264 1193 382 179 -557
4688 -557 275 1251 -97 -572 -83 534 187 592 -405 -1035 -525 -182 -349 -401 599 374 -101 439 -69 702
4708 702 -560 -466 24 -595 -163 -502 685 -1412 692 427 -266 -79 707 234 678 336 540 -22 28
4727 28 -214 289 45 -754 -675 112 21 -157 72 29 -9 -187 1141 -868 663 204 -336 291 1001 772 874
4748 874 -350 -308 90 431 -342 343 -784 176 261 -255 -627 -478 496 -382 834 -117 -740 317 -608
4767 -608 212 52 552 -1041 68 107 -1192 -295 173 559 -887 585 86 -269 352 766 1105 606 -794
4786 -794 -170 -769 -195 -278 854 -424 -1070 740 15 590 -12 51 237 479 -62 661 -1191 31 -282
4805 -282 -990 1443 318 486 -1487 -601 109 1333 10 300 64 -815 285 669 759 705 -318 430
4823 430 -77 -289 191 1278 -175 -651 532 -5 -585 1213 475 -659 -223 -794 -839 -138 1361 -1102
4841 -1102 -258 537 -1336 103 -17 53 -179 522 -83 -221 205 612 -99 -287 -363 -479 -247 148 -203 -394
4861 -394 -214 405 685 510 -450 -392 305 49 -320 -249 -476 -909 -556 -509 -733 -31 -275 -285 291 697 -458
4882 -458 530 509 -113 -284 -461 277 -992 -959 -117 142 231 -608 376 290 23 500 342 250 -504 -878 -651
4903 -651 652 -118 623 459 -59 -356 812 -159 -366 460 790 7 -190 -193 559 -536 -817 520 213
4922 213 -362 136 -306 519 910 604 -54 -265 -867 -402 192 -491 -638 275 -203 235 1540 -525 -18
4941 -18 -501 -112 -1020 45 827 482 -614 29 -271 813 43 -379 -53 -740 1377 1198 -202 -782 14
4960 14 121 448 300 -1028 -731 1 -427 117 0 -655 -71 -570 312 -270 -53 -379 318 187 -244 510
4980 510 -440 -515 -1314 -708 108 751 -64 -408 -102 -853 -173 -490 -514 -641 381 -137 -694 146 1197 -77
5000 -77 60 765 -948 760 -687 -1025 245 121 1066 -249 143 147 -873 394 956 732 -144 627 210
5019 210 24 122 28 548 -323 1328 588 787 991 -294 -729 838 70 -1009 510 -661 547 406
5037 406 -58 534 -485 -646 -354 93 -464 144 9 200 350 -399 155 -366 -579 69 560 -1236 -523
5056 -523 -7 707 1138 -359 -503 176 -19 216 -140 395 -396 -119 -99 -760 -58 -119 -485 -980 -195 197
5076 197 518 -385 -414 -934 -423 204 -832 -578 -553 408 782 -675 560 -47 -150 684 135 159 140 -297
5096 -297 -187 -74 590 1253 742 -774 264 403 -231 111 -139 -838 512 -462 353 -918 -811 152 -1081
5115 -1081 133 479 634 -186 702 -342 324 518 556 29 71 -1230 231 -636 -151 697 -695 755
5133 755 426 223 -50 -24 -479 137 -1015 757 620 865 -346 -734 79 75 513 -66 -5 -41 83 -459 -206
5154 -206 -888 -474 -241 -53 916 -401 -379 991 435 760 529 -26 474 420 -292 551 -614 -508 -492 857
5174 857 762 144 -495 -447 152 -508 -86 166 31 -336 -603 -1268 -426 169 -680 -275 -753 -321 -818 -149 218
5195 218 979 -570 267 -141 -452 151 78 417 -342 825 -617 731 969 649 909 82 -571 551 397
5214 397 -793 -1071 370 -398 151 917 -512 65 -486 640 -801 272 353 -155 473 -516 -1299 445
5232 445 66 -772 -141 216 -23 543 791 -128 -1767 88 -139 -515 414 250 -991 1238 -424 376
5250 376 -220 979 854 29 971 104 250 240 261 594 -334 -364 -658 -964 -218 -95 520 -154 810 332 556
5271 556 -1175 254 158 692 1364 20 -933 -290 301 115 42 552 394 727 -169 -13 398 399 -641 -15
5291 -15 -68 144 -101 748 -236 -333 654 -347 236 -268 -244 -139 523 190 -284 1168 -423 395 -161 -662
5311 -662 -650 479 -589 436 174 -478 925 -210 -486 -607 189 -214 -274 1185 524 -130 264 -610 -582
5330 -582 327 196 884 846 -996 -443 -206 -173 730 -361 -825 558 278 -159 710 -10 -895 -774 -731 363
5350 363 295 559 134 -1167 1456 555 678 -226 46 47 -720 788 -599 -523 -438 1648 445 -341 212 -327
5370 -327 -210 -255 138 472 345 640 -50 -722 55 167 -448 -173 298 327 -99 217 200 -372 -610 -234 1386
5391 1386 -589 165 749 -91 88 -810 -555 1167 -903 -188 210 25 -432 -522 -26 -420 324 76 -97
5410 -97 -445 -538 372 -298 807 620 593 120 -1080 -39 -40 113 18 -904 -1340 -688 -568 145 26 -347 118
5431 118 -1154 -779 70 -226 -729 -792 638 -321 182 48 532 -362 1283 333 628 921 -884 -57 -406
5450 -406 -704 -248 1118 -1100 -108 -212 463 -268 -672 -471 -308 -868 784 91 -406 -633 -421 -118 -103
5469 -103 240 -420 470 -770 420 -598 525 734 434 -330 -284 -96 -899 351 -630 -462 1040 156
5487 156 -358 804 753 37 664 -194 -754 -43 291 618 -754 -91 -50 185 976 -196 -225 266 -1033 479
5507 479 -153 -762 437 -551 968 -89 -965 597 -85 626 -40 -228 280 487 1371 -759 539 204
5525 204 409 36 685 -580 -584 -96 88 385 767 1169 -552 252 0 346 -702 93 815 535 762 -563
5545 -563 -514 168 306 -45 -1437 -760 654 -391 499 453 1104 1069 116 -127 -388 -20 986 1354 -241
5564 -241 -29 53 500 -258 510 -96 -301 -621 194 -729 -341 273 159 612 -186 -625 -79 673 489 -181
5584 -181 -134 237 -676 -98 -1213 -26 -31 1173 214 575 -154 -979 291 -844 575 171 533 -944 -1106
5603 -1106 285 -424 944 68 522 -119 -593 381 201 -10 -558 -916 843 149 -1098 61 -272 -282
5621 -282 876 1155 1155 -501 248 760 -2 -604 168 579 -1062 -730 280 1016 73 533 504 -238 606 280
5641 280 -297 -48 -889 -734 -314 10 733 777 -110 778 660 -465 -1090 -290 -1643 -663 691 -948 -793
5660 -793 43 -19 580 -963 470 668 -168 501 363 609 -278 916 488 -391 -609 -242 359 -793 -207
5679 -207 902 -149 1091 889 -106 340 261 -6 598 -283 -96 726 -1335 708 425 780 54 606 127
5698 127 -938 -595 -106 -504 -250 -423 -1276 -636 1144 937 1294 -501 857 179 -871 -43 -507 -191
5716 -191 -55 -80 -1064 -331 -1403 198 53 55 -86 -2 -199 -681 1345 -1040 -442 -1138 80 -358 -1161 -405
5736 -405 17 -482 670 202 -1360 -307 -512 -261 614 443 -787 1600 23 108 -831 -34 -1489 722
5754 722 -247 139 97 261 -125 -556 241 -502 -406 -784 -363 -287 4 870 -852 1110 -243 -654 -399 82
5774 82 184 -188 38 -795 -12 -629 126 -246 -62 306 -65 609 -303 -329 110 -171 117 132 233 -1354 490
5795 490 -164 -10 -503 338 650 -1123 322 443 -733 462 -189 -672 453 -211 115 -1138 1011 -171
5813 -171 982 1070 -540 -724 -1284 179 -84 237 -688 85 -483 -405 -254 102 -234 -205 -194 -672 295 31
5833 31 -665 398 -320 119 -276 -347 -475 -514 -978 475 -327 988 -308 1234 78 613 64 -115 220
5852 220 -76 58 -370 -630 477 1789 -518 -141 -723 801 -433 -202 145 -993 -350 1105 1217 -449
5870 -449 -411 717 75 225 17 397 733 563 669 -1194 365 -623 -764 -3 356 1245 -370 729 -400
5889 -400 646 32 747 388 -1118 43 -43 -685 -152 -59 -3 -192 -575 764 -591 -671 40 73 -346 -470
5909 -470 -498 212 -194 324 -1295 -359 -653 26 160 724 -421 -416 840 -1130 -608 -250 245 269 -940 -452
5929 -452 731 -614 1627 -389 533 -418 344 1584 -431 -584 22 -259 -1625 460 -134 -43 -116 154
5947 154 26 -417 -337 176 5 -43 180 106 -5 -325 -397 -1348 519 655 -109 -927 57 -69 -533 -369 92
5968 92 143 -1031 -323 464 -444 355 130 716 -101 203 -176 977 421 -54 466 -1239 350 -311 -664
5987 -664 616 -282 -30 418 -578 1267 -221 -186 422 14 859 -569 113 482 -326 -323 492 717 -799
6006 -799 20 -321 -68 57 -504 -335 -252 -109 130 -1030 -837 -522 -83 -199 -584 -534 585 42 -355 -549
6026 -549 -246 -338 507 -1026 -1055 -362 1011 95 -55 308 270 -127 292 -246 70 697 -174 491 81 286
6046 286 239 80 -185 526 420 -149 450 285 -737 243 151 -272 -108 -767 284 432 -1067 -458 499 517
6066 517 193 121 -374 180 -479 -487 -61 372 -704 432 193 -152 972 1392 -171 32 -274 -161 -556 80
6086 80 -98 -42 750 -235 -450 178 696 234 793 431 -30 -965 53 202 -261 365 -100 343 982 207
6106 207 -15 902 755 694 561 -713 -379 -1410 -226 -670 582 536 -762 -358 82 -202 -222 -161 -439 -633
6126 -633 -134 169 -581 -611 -132 -583 -90 -288 -573 -489 335 922 -601 321 411 46 -562 375 243 462 -507
6147 -507 133 87 682 -7 391 -593 -549 260 -11 463 -631 179 -18 116 195 297 -348 748 753 -226 -173
6168 -173 489 130 307 -140 -92 505 -520 -727 -631 -1268 601 -355 13 400 -65 -732 11 -122 -320 227
6188 227 -426 260 -305 -380 -827 462 -209 -496 -449 92 -844 304 417 -103 267 24 -766 14 -941 1107
6208 1107 588 -119 132 -433 -200 484 252 -498 654 72 743 604 48 -366 32 -861 -1516 1140 456
6227 456 96 -85 745 -326 -996 -183 458 -149 129 235 -24 46 743 6 726 1929 -912 1487 -737
6246 -737 -341 836 -684 -687 588 -319 -119 -514 71 -57 -1857 -252 444 -150 -570 -131 927 -510
6264 -510 250 -88 -308 219 923 -1110 -730 -304 1582 501 645 896 -311 247 478 -82 708 40 120
6283 120 616 -788 -6 -607 1353 -384 -407 -152 -230 171 -20 810 30 -122 629 -246 239 -735 -926 255
6303 255 -405 -463 -524 31 -622 771 94 -65 360 -744 220 731 651 293 502 -474 49 -457 148 -1291
6323 -1291 574 -1472 -253 228 -232 1613 -70 257 -486 -114 148 330 199 -689 124 838 -335 -465
6341 -465 -70 9 -783 -259 431 528 195 535 -508 -1073 443 -1654 951 -602 -1468 -162 613 381 -145
6360 -145 429 -6 111 572 -69 322 410 -197 319 -68 174 -560 801 -556 605 92 656 304 -1055
6379 -1055 285 -267 710 442 -248 319 732 637 -234 -464 991 -317 152 362 26 1109 -76 1152
6397 1152 350 351 1152 -828 -1251 -458 805 483 461 421 -231 205 212 707 -566 -299 -811 -775 -24 -536 246
6418 246 -595 1214 -1117 -83 727 -420 -552 -352 967 907 167 -897 -178 33 -446 -537 -728 -255 175
6437 175 125 -489 -320 -107 294 220 -210 -416 -343 130 649 461 154 -1129 -240 -1101 -1140 -927 267 -445 -266
6458 -266 -575 -387 248 184 684 256 -559 121 239 181 -1362 279 -711 188 -1282 -1083 -205 448 30 -308
6478 -308 674 -388 -170 -358 736 282 -308 133 -233 -88 -613 -461 -173 659 100 288 -147 -897 -719
6497 -719 -1075 464 -383 452 -1045 1 -31 55 -354 -93 300 -11 209 -671 -508 -1425 349 231 702
6516 702 403 653 676 -411 299 689 -1031 -1102 -512 -307 -37 -207 468 639 12 -519 112 -450 -298 169
6536 169 94 -249 410 -235 -645 -190 -349 155 -1002 -150 126 267 -717 -756 719 7 556 510 -330 133
6556 133 -453 661 27 638 894 -1452 -1021 -223 -677 621 613 -360 -1463 704 811 -74 804 145 -506
6575 -506 20 540 -200 -618 -226 -115 -747 -1004 6 -76 -243 -1068 -953 1018 -300 626 -380 125 -252
6594 -252 -934 -737 -541 -402 -504 53 716 670 -635 -721 109 -885 -559 -193 -153 372 552 660 217 -298 -669
6615 -669 -12 -502 588 738 624 48 1554 205 -284 -1351 -146 1446 928 -261 -275 -129 31 686
6633 686 -602 -1145 -134 256 -516 739 428 523 818 296 1021 1024 -416 1041 94 -167 403 509 -1103
6652 -1103 90 230 387 593 -74 -229 133 571 -150 638 298 -413 186 1109 -620 480 800 1045 213
6671 213 297 1283 805 -687 639 43 411 440 318 175 191 130 -449 -698 -291 472 133 -24 1133 91
6691 91 470 -563 361 23 397 3 -709 -618 -10 -1386 -659 988 -48 -1170 -1580 -612 1513 -1090
6709 -1090 84 -253 -88 753 543 463 166 577 1313 335 -869 -478 273 -697 -301 799 -359 -361 -479
6728 -479 -849 26 528 -310 -40 -504 -341 385 -1032 -55 -172 -779 519 361 -643 -68 146 -655 -107
6747 -107 501 -800 -606 461 -319 656 -677 -1232 -212 612 -106 640 215 -863 1232 867 -21 395
6765 395 -59 84 486 913 -130 402 -460 -650 87 214 -206 -407 467 -672 -825 -214 63 513 76
6784 76 445 626 -648 275 597 -63 379 -551 380 -281 145 914 350 867 241 617 -407 -259 384 -207
6804 -207 33 29 -291 1295 -354 745 -192 498 -1157 5 -288 322 1165 338 424 -655 536 -219 -493
6823 -493 -401 -773 -56 -567 -192 680 -296 17 -258 -67 -111 529 404 -365 57 400 115 -933 -1194 628
6843 628 983 316 -1119 -722 468 -728 284 -84 -484 -822 -100 45 317 -953 126 1072 310 342
6861 342 -98 577 -244 -307 -845 898 -661 1239 43 -1010 -645 921 -1 310 665 296 633 217
6879 217 373 268 -348 -1504 -804 -346 398 -66 603 -395 257 -38 -89 896 735 666 -874 -2 348 144
6899 144 53 -383 690 -175 388 -570 276 33 80 -42 110 -182 -402 -29 -825 -499 -776 43 997 -445
6919 -445 683 -156 -752 -610 437 1219 -122 250 -26 196 137 241 784 -538 -702 -482 -186 487 486 -246
6939 -246 -364 -456 -354 1215 830 346 -585 -1363 322 -123 1143 -265 552 -536 -709 -678 -573 187 -209
6958 -209 -1222 98 -243 512 621 647 -100 -178 657 -431 206 592 801 -1069 -599 22 849 517 -224
6977 -224 -586 427 489 100 741 683 -45 -575 -453 91 -87 933 370 -266 514 -762 875 276 -595
6996 -595 -328 -289 -372 -328 -180 304 356 144 -1824 634 395 174 -70 82 -494 -206 1242 380 -298 21
7016 21 278 -1125 1142 -347 -363 17 -1123 834 449 538 -500 -187 -441 236 123 -702 375 417 367
7035 367 1454 -575 -211 559 456 -245 -182 -847 -211 -224 -240 642 504 498 708 552 -23 115 -43 -317 438
7056 438 -1024 314 -32 -731 782 311 282 570 -122 877 211 403 -871 -606 1074 393 -150 1278
7074 1278 531 334 112 398 395 -243 1124 329 -633 545 319 -196 738 282 -33 321 -102 -525 231 15
7094 15 959 -349 -297 -63 -67 -684 -937 138 621 -941 -466 -237 -290 -477 34 -641 -512 -569 -982 -688 -777
7115 -777 1207 -325 239 -1001 -419 -1078 -160 30 70 -551 418 -942 -446 799 208 -436 -1158 227
7133 227 46 436 485 -857 329 -273 -1018 630 197 964 289 250 -1041 -159 937 1338 5 -838 228
7152 228 568 598 417 778 -56 -100 -374 1139 -785 228 -48 409 -929 -1496 1007 390 -16 1494 152
7171 152 345 -356 650 -862 41 -774 1199 99 -326 -835 -494 842 -831 -761 -909 10 237 -15
7189 -15 1207 491 -326 -382 468 -178 -605 199 -32 -221 871 -209 298 666 -1192 773 123 -652 114
7208 114 92 6 1074 -75 -240 154 -375 1026 -284 -539 1394 140 167 700 -489 -453 661 -18 414
7227 414 167 434 9 -240 783 -9 288 -382 -215 -300 212 -708 -686 -249 -1133 -330 248 -968 557 119
7247 119 1222 879 -246 -689 -570 -651 560 -590 383 -604 363 -289 513 -13 1248 348 421 272 -892
7266 -892 -355 -553 172 -135 813 -226 -418 542 -371 -804 178 327 173 81 796 104 64 -684 -326 15
7286 15 -430 83 -267 -812 -308 83 176 -18 -1036 -819 -990 -16 9 389 -154 -1580 884 -318 -180 -912
7306 -912 -144 187 476 334 -490 271 137 -719 356 908 -238 286 -73 646 565 267 272 -584 1480 143
7326 143 -194 966 500 213 526 373 397 -179 38 875 -216 -478 308 -342 -535 -145 1248 735 -272
7345 -272 240 275 -355 -788 363 -453 -40 -1435 -788 109 -462 -643 -215 -670 -912 -1520 924 -189 -37
7364 -37 -398 -283 -739 83 -445 -28 -143 -812 -478 433 470 -606 -550 -567 583 657 -258 -240 -470 -131 1465
7385 1465 965 -421 250 89 -703 299 358 146 335 295 1073 -398 1228 1451 571 -1154 344 439 -60
7404 -60 -380 -316 -225 -313 134 -493 250 -84 167 -601 509 214 355 -444 -499 854 655 1207 741 -760 751
7425 751 -818 -84 -124 -626 540 66 91 -404 -1049 633 -154 -189 -91 194 82 499 350 787 447 312
7445 312 -532 39 116 -41 -149 445 -1147 -390 0 -338 783 628 902 136 304 129 -43 -361 396 -162
7465 -162 355 376 -59 998 332 188 874 803 727 308 523 -418 -601 -1030 -708 267 950 249 505 -233 -103
7486 -103 -964 266 -551 1087 100 -1165 -878 -516 -403 -526 -174 -66 -102 1117 -774 -257 266 -668 471
7505 471 600 -309 239 -347 -1130 -178 278 73 243 200 -280 -103 -986 -340 358 -1006 -162 -737 846 -227
7525 -227 867 306 -711 535 -519 -152 -301 -362 -382 -783 -689 530 1025 -470 659 -439 -403 -401 104
7544 104 -285 781 234 29 -430 249 52 -246 547 13 -56 90 446 -14 -1135 114 -542 576 160
7563 160 -351 -562 -146 -736 337 -1065 -681 685 257 -1229 -368 356 -735 -230 147 -383 -664 -988
7581 -988 532 -352 -131 207 -422 -139 -383 124 963 -35 823 265 -446 -229 306 957 589 -405 -42 -772
7601 -772 852 245 693 290 -272 -67 -249 108 -118 -16 436 933 378 -116 -264 147 1002 731 178 314
7621 314 -787 -289 -216 -408 318 645 -714 -91 136 -590 -107 -67 -602 1323 -214 223 312 -150 143 -731
7641 -731 -580 749 467 -403 303 -128 673 -56 -1282 -462 232 134 -895 221 113 286 207 1043 -287
7660 -287 -1366 1272 -510 -541 -78 208 -134 -511 -976 530 683 -296 -183 -298 -92 0 131 -382 -193
7679 -193 -659 -234 968 -174 -245 1306 64 805 660 -1222 -198 -493 -997 -434 637 -356 -3 -2494
7697 -2494 -95 66 -537 1699 71 -446 376 179 197 -83 -902 -167 203 544 -273 -712 311 -178 -485
7716 -485 -116 -269 282 216 -639 333 9 440 -507 -257 741 519 -719 566 15 1049 1034 -1191 210
7735 210 186 -82 -177 109 379 525 365 -369 -108 -90 646 -551 -188 -46 603 -461 112 -1116 -924 101
7755 101 -478 -545 143 802 156 -13 -389 -1229 -803 -163 331 142 -308 14 55 41 -313 -190 -462 157 -29
7776 -29 127 -586 -331 -1048 -274 530 10 445 35 -597 1050 143 647 231 110 -544 -187 -14 -289 -1081
7796 -1081 -401 -310 329 -384 1574 -674 -1039 772 -679 -379 -565 -416 534 930 -859 -379 -408 -507 -147
7815 -147 -1597 -818 -678 -700 243 61 -198 -522 350 222 -499 353 46 -16 -139 -856 -292 175 -582 -106
7835 -106 291 22 608 349 384 85 368 289 211 9 225 -530 -809 -205 -43 -188 -800 -479 -145 -200 -263 -87
7857 -87 117 407 -135 243 -200 113 178 -1413 448 -411 -632 -638 660 462 234 322 -187 54 649 -106 -571
7878 -571 -233 -323 -454 124 -1 -198 -61 -468 334 1120 -668 -526 -593 -178 -7 -416 567 38 -496 -457 -266
7899 -266 -609 -231 559 -527 -467 -226 3 -568 -226 352 -258 119 -108 1258 -284 1206 366 512 1803
7918 1803 -1025 363 719 483 387 623 1228 -1274 -1303 234 -48 -590 -94 260 -524 320 414 104 514
7937 514 -232 966 496 125 536 823 -583 632 -930 -249 919 -772 -23 788 -165 -86 -316 546
7955 546 943 -490 110 -808 520 -287 162 -275 418 525 581 72 -43 -520 886 235 -759 -259 -39
7974 -39 -320 203 -344 -712 -130 -413 1126 -448 19 902 205 -29 1041 332 -460 -226 -848 -672 249
7993 249 545 169 181 -383 334 460 513 133 -366 582 -511 440 -48 -575 -333 689 -822 213 571
8012 571 -1300 -451 32 194 690 39 -24 -202 -880 -812 -399 -801 715 349 -558 302 -252 605 -445 867
8032 867 -367 1397 903 354 -1229 -269 163 -420 -235 -165 -889 -614 41 332 127 -99 475 -576 246
8051 246 -264 -848 620 -437 478 410 -922 164 189 -642 -128 -63 50 490 -146 -1154 434 -670 -1488
8070 -1488 104 -540 640 -460 172 -1495 -323 229 915 -619 355 388 307 -198 722 -437 -133 -143
8088 -143 -621 -448 532 508 -40 -361 -825 -271 -308 98 -631 136 636 240 280 284 162 207 -450 480 -632 74
8110 74 171 -82 -27 -67 296 -136 327 604 748 -144 -191 -464 -850 179 1273 -356 -1088 913 411 -656
8130 -656 706 87 890 813 -207 820 546 -190 -333 221 383 1438 105 -1033 84 661 -362 -418
8148 -418 -293 -732 -117 147 -443 -287 -209 -926 451 173 512 -65 -1125 -702 656 885 -236 -70 528
8167 528 -386 162 664 -64 851 326 -444 -59 764 -79 -295 -145 412 -488 -367 -72 -1178 620 -976
8186 -976 -1011 -194 -153 307 101
8191A01
$$ Imaginary data points
##PAGE= N=2
##DATA TABLE= (X++(I..I)), XYDATA
0 0 0 0 0 0 0 0 0 0 0 0 0 0 0 0 0 0 0 31 -89 105 -107 108 -108 108 -133 178 -204 214 -242 284 -313 356 -394
33 -394 441 -497 555 -613 678 -755 832 -924 1020 -1135 1255 -1391 1545 -1710 1906 -2142
49 -2142 2402 -2708 3084 -3546 4124 -4893 5949 -7507 10022 -14835 27298 -135893 -210321
62 -210321 45295 32289 -93789 -53491 61414 -3624 -12474 66210 61301 -3633 29583 42525
74 42525 -15231 -42277 -17135 -30711 -43889 -28332 -16227 -11281 25558 38087 17978 28203
86 28203 59791 20601 -24117 1912 2493 -55157 -54225 -7159 -21477 -41223 10766 42285 11712
99 11712 23230 57825 31179 -3662 8111 4611 -37186 -45718 -22660 -27501 -34245 -6935 17133
112 17133 15938 26420 44206 33006 18750 19863 3027 -26956 -25885 -24366 -43211 -34215 -4633
125 -4633 -5259 -4010 32002 40280 21326 28158 35705 5020 -17047 -10255 -21642 -42687 -35190 -15981
139 -15981 -14980 -7828 16989 30959 27341 29692 32966 19594 2078 -7010 -19791 -32707 -33674 -26741
153 -26741 -25376 -12894 9238 17433 22237 34641 36225 19856 14555 7899 -14362 -29584 -24279
166 -24279 -27877 -34400 -18892 924 4634 15256 33317 33024 24608 22851 14508 -3720 -17238 -21261
180 -21261 -28817 -33126 -22772 -12050 -4243 9439 23033 28255 28915 28396 20056 4301 -5702 -15810
194 -15810 -27934 -33063 -26643 -22493 -13976 2296 15714 22423 28855 31708 25176 16035 4850 -7777
208 -7777 -20432 -28068 -29462 -26619 -20991 -9200 4763 16257 23975 29720 29189 21119 12308 1674
222 1674 -12717 -22584 -25179 -28701 -26876 -16445 -3786 4663 17772 27553 26397 25188 22708 7653
236 7653 -5375 -12836 -22245 -28340 -26750 -20007 -14457 -2196 11250 18979 25760 28240 23711 16346
250 16346 6793 -5473 -17613 -25837 -26548 -26250 -19282 -8535 1311 13066 22069 26078 26843 22107 12275
265 12275 3191 -8493 -19073 -23748 -25457 -22483 -16585 -6010 3894 14076 22155 26041 23648 18333
279 18333 10246 -289 -11211 -18950 -24475 -25842 -20387 -13118 -4524 6740 18737 23016 24111 24253
293 24253 17060 5917 -4422 -13122 -21663 -25558 -22964 -18909 -11753 -163 9468 18305 22687 26110
307 26110 21522 13856 4757 -6228 -15822 -22055 -23956 -22479 -15988 -8536 1906 11399 19891 23138
321 23138 23786 18908 11998 1662 -8365 -17157 -21594 -22628 -19794 -14341 -4694 4921 13641 21123 23447
336 23447 21187 16314 8671 -2609 -10378 -17808 -23245 -22765 -17187 -12996 -2132 7846 15794 21593 23464
351 23464 21556 13781 6501 -2824 -13254 -19239 -22865 -22562 -17694 -8873 910 8809 16283 21085 21840
366 21840 18333 12527 2868 -5902 -15003 -19224 -22347 -20002 -14793 -6462 2333 11472 18188 21661 21893
381 21893 15899 9095 925 -8467 -15862 -20861 -20917 -18992 -12005 -3815 5728 12528 19134 21254 19369
396 19369 14732 7050 -1260 -10596 -17096 -21545 -20563 -16404 -9904 -1385 7800 13594 19602 21607 17590
411 17590 11544 4847 -4732 -11853 -17436 -19686 -19499 -14901 -7323 -852 9186 15542 19263 19718 17032
426 17032 10591 2246 -5883 -13773 -18341 -19481 -18528 -13838 -5657 3429 11409 17017 20136 18769 13801
441 13801 8355 1195 -7528 -15028 -17909 -19314 -16515 -10928 -2244 5592 13232 16950 19885 18379 12471
456 12471 6190 -2346 -9413 -14915 -18130 -17767 -14208 -9515 273 6210 13319 17486 17826 14681 11388
471 11388 3960 -4692 -11499 -15850 -17012 -16811 -13301 -6543 1972 8836 14793 16549 17148 15057 8641
486 8641 2629 -6697 -13019 -16396 -18446 -16737 -11476 -2925 3524 9531 16024 18501 17096 13813 5391
501 5391 -1049 -8167 -12778 -16752 -17353 -13690 -9528 -2694 5512 11717 14529 17267 15873 11247 4482
516 4482 -2726 -10172 -15117 -16671 -16014 -13472 -6331 360 7254 13031 16450 16447 14166 10724 2908 -5703
532 -5703 -10448 -15778 -18005 -16722 -11243 -5210 548 7665 13716 16397 17177 13472 7034 935 -6521
547 -6521 -13525 -14550 -15992 -14938 -10049 -3709 3310 8315 14096 15443 15815 11451 5750 -1757 -7597
562 -7597 -12346 -17394 -15102 -13741 -7614 -1962 5083 10116 14361 15396 12444 10634 4252 -2418 -8489
577 -8489 -11656 -15997 -15867 -11365 -6581 -623 6597 12190 14812 16175 12901 7805 2204 -4354 -10661
592 -10661 -14018 -16606 -14087 -10458 -4251 2681 7722 12500 14295 13490 11013 6478 -50 -6013 -10563
607 -10563 -13485 -15962 -12728 -8909 -2175 3877 8890 13972 15003 14291 10173 4335 -1096 -6571 -12011
622 -12011 -14963 -13817 -11552 -7883 -935 4606 10562 14255 14891 12223 7703 3613 -2246 -9352 -11512
637 -11512 -15628 -13901 -10704 -5644 50 6390 10900 12358 13603 11592 7361 1838 -3527 -10362 -11865
652 -11865 -14484 -12998 -9484 -3916 2147 6953 12479 13809 12585 10544 6473 431 -4537 -11352 -13646
667 -13646 -13881 -12205 -6994 -2764 3806 8424 12961 14458 12764 9768 5960 -1761 -6713 -10412 -12996
682 -12996 -13169 -10956 -5520 -397 4362 10472 13022 12619 12030 8050 552 -2236 -8215 -11579 -13623 -11915
698 -11915 -9365 -3646 1085 5159 9983 12364 12602 11158 6064 1865 -3605 -7784 -11317 -13880 -12145
713 -12145 -7919 -3921 2378 7281 11877 13307 11222 9541 4651 215 -7433 -10608 -12121 -12468 -10258
728 -10258 -7309 -809 4092 7584 12203 11875 11802 7490 3969 -1881 -6831 -9660 -11220 -12466 -8842 -4388
744 -4388 -1649 3955 8081 10909 13140 10502 6341 2229 -1919 -7099 -11382 -12288 -10607 -8725 -4807
759 -4807 912 4802 9343 11702 12455 9321 5671 1802 -3879 -8014 -12159 -12069 -10088 -7146 -2639 1770
775 1770 7099 10282 11593 11484 7063 4497 1510 -4313 -9121 -10946 -11547 -9746 -6620 -41 3194 6971
791 6971 11997 12124 10767 6507 4103 -2526 -5611 -8672 -12128 -11058 -8855 -4976 -819 4452 8013
806 8013 10331 11063 9649 6970 2553 -2896 -6613 -11074 -10455 -10231 -7289 -4110 808 6000 9986 10945
822 10945 10221 8548 6054 -465 -2921 -7812 -9435 -11152 -9393 -5517 -1792 1521 7712 9991 11459
837 11459 10161 7959 3924 -1183 -4383 -7914 -10143 -10561 -8628 -5359 -1413 2903 6944 9926 10086
852 10086 9186 7176 2980 -2175 -5906 -8623 -9882 -10231 -7356 -3507 790 3531 7271 9503 10287 9147
868 9147 5353 1973 -3727 -5913 -8968 -8893 -9411 -6790 -2733 -585 5056 9070 10861 9220 8119 4967
884 4967 152 -4967 -7404 -10203 -9063 -7927 -7000 -2487 1708 5988 7872 10158 8910 6351 3258
899 3258 -993 -4690 -8547 -9041 -9534 -6586 -5194 646 2750 6306 9987 9668 8030 5568 2527 -1603
915 -1603 -5519 -9535 -9341 -8654 -5707 -4323 613 3983 6985 9027 8226 7769 5669 643 -2652 -5856
931 -5856 -8284 -8181 -8586 -5572 -3594 544 4986 6839 8822 8562 5446 4481 -452 -3162 -6480 -8755
947 -8755 -9973 -8271 -6039 -1983 2076 5273 7363 8229 8800 6703 3637 -1152 -4017 -7812 -8542 -7595
963 -7595 -6683 -5280 -258 3335 6538 8587 9456 7147 6182 2801 -1237 -4901 -7486 -8754 -8161 -6341
979 -6341 -3387 161 3493 7106 8384 7508 7596 4860 1460 -2580 -5864 -7427 -9028 -6679 -4704 -3111
995 -3111 1567 4791 6913 7788 7941 6685 3125 790 -4311 -6727 -8181 -8775 -7609 -4386 -1522 1920
1011 1920 6007 7005 7831 7490 5651 2699 -1983 -3953 -5650 -8933 -7291 -5712 -3429 -1812 2779 5346
1027 5346 7590 8826 6511 4098 1654 -1327 -4109 -6807 -7583 -7104 -5575 -1394 34 3794 5948
1042 5948 6632 6109 6218 3244 458 -2869 -5897 -7325 -7069 -6691 -4836 -1729 1540 4250 5934 7936
1058 7936 7566 5480 2395 25 -2769 -5912 -7833 -8406 -5332 -3634 -1376 1237 5395 5260 6849 6829
1074 6829 4438 2718 -963 -3419 -5350 -6322 -7827 -5501 -3113 298 1846 5061 7225 7163 6568 4146
1090 4146 1036 -1033 -4571 -5683 -7364 -5934 -5356 -3110 985 3323 4192 7093 7022 6098 3909 1160
1106 1160 -2071 -4942 -5442 -7210 -6410 -3982 -1180 177 4542 6091 7548 5634 4687 3120 -235 -2991
1122 -2991 -5756 -5106 -5424 -5274 -3418 -1309 1877 4635 5813 5930 5939 4896 2243 -1123 -3705 -5030 -6359
1139 -6359 -6167 -3687 -2941 -1443 3032 5341 6297 6082 5699 3784 1274 -2081 -4934 -5047 -6363 -5690 -4418
1156 -4418 -2195 1850 3554 5674 6630 7067 4696 3014 605 -1435 -3493 -6272 -6464 -5861 -3871 -2279
1172 -2279 1023 2827 5382 6373 5686 4349 1419 -123 -2817 -5171 -4783 -5871 -5397 -3115 -680 1043
1188 1043 4109 6313 5399 4191 4071 1885 -1192 -2711 -6752 -5997 -6356 -4896 -2184 -727 2402 3548
1204 3548 6231 6203 5059 2869 1318 -1282 -4504 -4586 -5327 -6333 -4022 -920 1039 1769 4886 6285
1220 6285 5717 4457 3464 104 -2644 -3569 -5267 -5626 -5676 -3212 -1034 739 3141 4701 6064 4849
1236 4849 4497 1776 -216 -2472 -3785 -5459 -5592 -5638 -3137 -446 1811 3519 4653 6107 5495 3736
1252 3736 2199 -891 -3325 -4724 -6077 -5126 -3407 -1236 -70 1986 4199 4878 5593 5044 3004 636
1268 636 -1441 -3539 -3784 -4937 -4521 -3177 -1794 256 3040 3657 4626 3866 3364 1849 259 -1813 -3122
1285 -3122 -4695 -4626 -4596 -2807 -2064 2116 3666 4172 5577 4526 3665 2206 72 -1599 -4243 -5472 -4715
1302 -4715 -3416 -2261 -396 2001 3774 4626 4319 4337 3035 1553 -922 -3103 -3625 -4408 -4120 -3268 -1575
1319 -1575 -75 1751 3195 4768 4773 3539 2280 -151 -1859 -3190 -3760 -3853 -4186 -2456 -1232 708 2592
1336 2592 3666 4310 5017 2645 875 267 -307 -3121 -4596 -4376 -3685 -2605 -308 1385 1718 4063 4107
1353 4107 4077 3867 1642 -1131 -1974 -3350 -4120 -4363 -3472 -1732 -352 1685 1404 4040 4442 3085 2391
1370 2391 2313 72 -2014 -4774 -4219 -2956 -3513 -1999 109 2095 2674 4892 4335 3755 1878 -91 -1377
1387 -1377 -2531 -4401 -4076 -4343 -2463 -625 946 2099 4162 3282 5177 2869 1077 -273 -3303 -1585
1403 -1585 -3390 -4170 -3539 -2991 311 867 2540 4467 2916 4361 2214 927 -1355 -2179 -2800 -3407 -3930
1420 -3930 -3092 -1403 -1247 1030 2800 3083 4084 3997 1762 377 -905 -2989 -3545 -3668 -4025 -2321 -2650
1437 -2650 -666 2152 2473 3393 3088 2589 1074 -420 -819 -2688 -4063 -5211 -2771 -1724 -492 1367
1453 1367 2217 4336 3839 4235 3602 1687 -38 -988 -1938 -3863 -4202 -2987 -1790 -1748 1460 2824 2700
1470 2700 3568 3828 3161 1184 -1123 -1514 -2378 -3697 -3044 -3662 -1973 -333 1156 3723 2895 3334 2118
1487 2118 2174 1519 -1911 -1323 -3076 -3649 -3143 -2716 -970 -87 298 1971 4438 3326 1962 1016 -420
1504 -420 647 -2157 -3266 -3421 -2894 -2057 -1716 150 1664 2987 2925 3657 2392 1113 -387 -1605 -3283
1521 -3283 -2988 -3098 -3313 -1041 -229 -101 1600 2174 4020 2210 1967 831 -1117 -1979 -2723 -3515 -3079 -2494
1539 -2494 -411 1011 1219 2324 3545 4176 2167 2621 694 -1339 -974 -3530 -2890 -2507 -3040 -1692 -837
1556 -837 1042 3098 3040 2454 1890 1024 595 -1832 -1952 -3692 -3271 -2500 -2396 -637 391 2722 1676 2460
1574 2460 3986 2923 2695 1259 -900 -2702 -2605 -2952 -2609 -779 -1212 876 2460 3079 3153 3698 1837
1591 1837 716 -39 -1439 -2545 -2330 -3026 -2629 -2422 -1135 1960 2589 3935 3246 2510 2426 734 -2135
1608 -2135 -1669 -2367 -3251 -2699 -2376 -1689 752 637 1899 2869 2845 2688 1442 643 -529 -1983 -3311 -2666
1626 -2666 -1920 -1136 -235 739 1147 1925 2383 3241 1623 1021 1 -636 -1758 -2230 -2539 -2099 -1250 -1042 571
1645 571 2313 3242 877 1908 1801 1383 -924 -1500 -1284 -2179 -2883 -1326 -1014 -545 64 2467 2665 2320
1663 2320 2542 1819 283 -529 -1957 -3008 -3430 -2016 -1931 -1242 444 1750 2068 2075 2208 2294 2047 452 -1323
1682 -1323 -2438 -2242 -2413 -2342 -1339 -321 -278 1352 1219 2758 2123 566 1932 -628 -1674 -895 -1982
1699 -1982 -2047 -1739 -489 -516 40 1991 3208 2649 2117 2464 1284 -663 -941 -1947 -2626 -1549 -2311 -1605
1717 -1605 246 1705 1773 1858 2269 2711 1844 1205 -753 -2153 -2487 -2136 -2025 -2462 -966 -634 751 1843
1735 1843 1675 3358 1094 269 116 -1206 -1122 -1522 -2578 -1995 -1533 -421 800 1553 2327 2216 1879 1632
1753 1632 1540 1140 -680 -2095 -1329 -3125 -2338 -1929 -242 843 1178 1611 2798 2838 1452 900 -1054 -721
1771 -721 -2480 -2985 -1403 -2259 -623 -450 967 1782 2349 2471 2596 1775 222 -592 -1481 -1724 -3070 -2236
1789 -2236 -1364 -1653 -89 1738 1493 2073 2395 1318 657 -390 -406 154 -1653 -2666 -1758 -741 -612 502
1807 502 45 994 1613 1563 2018 -615 -449 -616 -1124 -1613 -1548 -2141 -1491 -741 500 498 1196 1377 1889 608
1827 608 645 247 -1457 -2512 -2066 -1593 -2044 46 367 1494 1913 2396 918 2419 899 215 435 -1264
1845 -1264 -720 -1977 -946 -579 -1211 -497 618 1147 1694 1181 369 980 -200 -327 -2192 -1353 -749 -1449
1863 -1449 238 -1356 1674 632 2606 1715 1023 1408 387 -1028 -771 -1059 -273 -1718 -1317 -518 160
1880 160 1018 2148 708 725 973 1319 568 -466 -237 -849 -639 -649 -1128 -16 810 177 1533 1509 1591 532
1900 532 482 -180 -525 -638 -1181 -1628 -786 -430 -1249 192 -808 255 1362 378 339 421 479 194 -898 -1869
1920 -1869 -2456 -672 -1738 -1237 -4 1039 2719 1083 978 665 787 -92 -319 -658 -2251 -1471 -1099
1937 -1099 -364 -382 -443 718 955 876 813 269 335 -245 73 -1619 -1442 -1832 -1201 -514 293 688 1545 2654
1957 2654 1202 2497 589 661 -132 -1063 -1560 -1244 -213 -1222 -651 296 1856 1080 1739 1317 229 1024
1975 1024 -112 -441 -489 -1292 -1896 -1183 -1536 212 -126 1298 1927 1751 1654 333 871 -245 -439 -1559
1993 -1559 -857 -1657 -1151 -164 64 547 2328 1171 1665 1386 650 343 332 52 -1261 -780 -1684 -1482 -563
2012 -563 205 1373 704 1127 1098 1065 0 -541 -728 -26 -231 -1504 -1309 47 823 1248 1145 1057 689 877
2032 877 -102 855 597 -668 -667 -1289 -816 -1309 2 -210 238 1219 483 1531 2002 1322 -324 -361 -595 276
2052 276 -1176 -511 -249 163 320 521 1384 361 1109 786 -190 419 -203 -497 -333 -1151 -783 -379 -2663
2071 -2663 376 212 740 374 979 1442 558 -369 -425 55 -1502 -410 -787 -531 -1061 -246 1203 729 1929
2090 1929 624 665 462 699 -500 -350 -1031 237 -1442 -1158 226 -239 -21 1294 1354 615 29 -394
2108 -394 -91 -856 -151 -1358 -954 -761 -79 -400 470 -55 579 723 1608 392 -2 94 -604 -1463 -864 -1020
2128 -1020 -1158 -508 549 1057 359 603 812 1084 102 -181 823 -1079 -722 -233 -1006 -234 -495 -449 302
2147 302 2080 1199 359 318 268 410 369 -1024 39 -537 -1614 -909 345 -78 939 -28 807 628 987
2166 987 -542 -679 706 -684 -1456 -1237 -94 985 57 187 605 685 1086 770 1349 -537 -446 -1499
2184 -1499 -1479 -576 -1776 -694 -409 -152 447 600 1724 1352 555 325 -1052 -100 -140 -194 -931 -1967 287
2203 287 -162 -807 622 809 139 1287 1009 -4 -113 -122 -740 549 -453 -437 -249 961 -10 281 1376
2222 1376 269 1265 -189 1235 143 -257 -230 -1339 -1393 -415 -465 80 1058 263 1433 550 461 -76 -987
2241 -987 854 -568 -1549 -1428 -914 -112 951 -72 655 416 130 976 -417 311 -275 -443 -805 -237
2259 -237 -419 -1049 299 -71 842 518 906 638 1628 933 -31 -643 722 574 -931 -1579 -1081 -173 -164 -455
2279 -455 389 1078 237 711 433 555 -89 494 -780 -1298 -1609 -1039 -247 238 771 864 254 749 901 575
2299 575 -797 -78 -241 90 -1182 595 -1362 -747 -623 -174 181 905 46 -554 -59 -1180 -489 -128
2317 -128 -7 -38 -1138 -546 -556 -168 54 87 942 413 1112 300 769 1035 -131 -790 540 -701 -224 -657
2337 -657 54 -16 345 1055 1151 358 199 -331 -320 322 279 91 -598 96 367 711 628 889 714 700 -389 -334
2359 -334 -1118 -36 -1244 -190 627 -838 -194 -328 601 404 381 -662 1128 1526 -22 254 -343 -572
2377 -572 -722 -961 -253 -841 453 -194 -232 528 1052 -240 346 -454 -1557 -326 -35 -919 -793 -41 -103
2396 -103 -669 106 312 -54 638 -935 -30 -846 100 -1345 324 -980 418 -347 969 270 214 967
2414 967 741 -321 600 -587 1317 375 -1093 69 -622 -238 -255 -667 637 142 731 1134 -146 361
2432 361 -205 441 -919 -385 -538 49 594 654 307 510 207 656 486 245 -566 -955 -640 -242 140 589
2452 589 788 329 -247 1082 1129 227 447 -494 -215 -67 -1384 64 260 -926 -259 1054 132 533 -621
2471 -621 1008 -390 511 -299 925 610 -1258 -613 -775 344 135 -188 430 206 1139 735 -547 1118
2489 1118 -132 189 -666 761 -335 9 -387 -637 -688 -637 -473 368 835 -254 1077 -342 791 -790
2507 -790 -1117 -1084 168 -908 -625 -152 573 -810 433 -465 -98 230 -388 552 -187 230 -1675 -515
2525 -515 -138 -437 242 480 925 -389 23 -423 336 244 -357 615 1227 -1026 341 176 -668 -1122 -502
2544 -502 387 682 228 -469 674 388 368 1133 57 -1131 -700 -823 2 524 1034 1043 -429 966 519
2563 519 -517 471 -700 -174 21 -10 -825 -227 499 -1457 -277 453 466 -477 -58 135 448 680 -329
2582 -329 44 68 -1556 403 175 382 918 -591 240 690 -1 -669 -246 336 -309 -458 -4 422 1141
2601 1141 654 -670 502 5 282 -1246 -460 18 -303 644 342 624 -57 793 1048 -539 380 -386
2619 -386 439 381 350 1051 299 185 -231 404 -1095 -521 -750 -36 657 356 432 63 773 -630 609 -806
2639 -806 -1158 -1377 -909 328 -1030 227 574 367 273 808 -334 1265 -674 -178 394 -477 -180 -473
2657 -473 59 -487 1004 -140 581 -129 193 35 -514 454 310 893 240 -503 -224 359 110 -1316 49
2676 49 -349 786 758 465 -431 -13 451 627 186 -2356 899 -22 -517 273 -743 55 265 577 810
2695 810 -205 -892 -81 -332 60 204 -513 746 295 -161 669 -154 367 434 681 -80 218 803 90 168
2715 168 389 -708 -1157 1475 1026 -968 1258 84 -157 798 344 -627 -169 694 206 -657 1232 155
2733 155 -892 -452 819 80 86 -604 159 -264 -1704 -942 -598 304 196 -829 474 495 557 732 -615
2752 -615 844 -70 -203 -15 109 1282 -513 760 -480 394 879 927 -428 -27 70 595 -36 883 234
2771 234 67 272 -193 -973 170 85 -11 -6 33 756 -387 426 -453 1311 146 -348 231 -801 25 581
2791 581 -1115 538 -996 267 -198 300 -52 229 -505 -352 -756 -810 -626 378 -423 -104 -295 848
2809 848 -59 580 81 -67 654 -174 249 381 473 -586 414 -331 619 398 -618 -114 465 -602 546
2828 546 377 -135 -884 -174 283 1191 248 -232 947 268 -165 -94 1337 240 659 353 32 222 -954
2847 -954 -60 -239 -1211 -607 -142 -251 351 201 776 -271 -471 221 -42 -16 22 317 433 402 -124 533 189
2868 189 222 -122 -196 160 472 66 -112 173 -218 -932 169 -114 165 736 -163 568 839 504 -177 -1516
2888 -1516 185 -499 -16 -239 -248 200 96 522 -405 1116 187 915 -325 -221 -752 -56 -759 234 -577
2907 -577 -324 -897 -731 -656 635 -1327 443 450 -655 192 -308 883 69 -321 -721 257 -433 651 -1214
2926 -1214 662 482 159 257 -769 -792 -170 635 186 -566 -357 -1055 -162 14 826 899 580 -816 -141 704
2946 704 81 458 321 -744 284 1036 301 -376 60 709 -234 -822 209 -368 -621 -369 -244 -92 -610
2965 -610 -133 -2 -18 -534 -513 774 -434 310 797 433 189 763 -426 -1186 -546 -449 -827 -569 -93 760
2985 760 170 -106 574 -521 -973 -330 -409 -333 783 -511 -88 901 824 750 -478 539 5 666 295 -328
3005 -328 854 71 -1050 175 71 -441 -39 217 -88 151 782 -81 -1314 -1319 -706 -996 265 -630 -281
3024 -281 26 -975 100 -63 66 -381 1496 1253 706 -467 -30 -161 179 -244 248 89 -969 -189
3042 -189 -757 -644 -333 242 86 794 -217 545 638 255 -152 262 -732 -630 804 455 -736 -153 552
3061 552 294 -945 -407 21 -436 -147 -379 598 -942 -646 803 416 155 -153 1205 -632 -1239 478
3079 478 124 937 -24 -51 -48 301 -292 -133 -392 -1236 -179 -145 -703 -313 -636 -687 -322 -931 -682 -805 160
3100 160 647 -445 386 852 -527 -1344 -1037 -298 -526 792 -576 -69 245 -283 111 -4 -246 -147 211
3119 211 647 626 262 110 -785 126 -446 -70 -818 1162 -92 -422 64 -557 775 -790 -424 182 -677
3138 -677 -16 979 -830 1233 -178 111 898 367 -153 64 555 1484 -165 827 312 70 -497 -931 -260
3157 -260 722 469 -348 1072 61 66 161 496 -328 -351 -406 -377 837 378 614 557 -705 508 -371 -80 304
3178 304 759 -368 -386 55 -566 -137 -36 -60 -685 202 498 238 132 662 -878 595 -492 581 -518
3197 -518 -326 -1528 -242 -125 445 558 103 -411 -760 -1037 -1306 44 559 468 -496 335 -855 492 713
3216 713 -63 -649 1448 644 -180 16 492 -758 1233 -1193 -580 -249 -440 -788 427 -682 -138 383
3234 383 -401 543 1129 -45 -170 -243 -413 540 705 -216 145 -246 14 -399 88 581 -134 -111 439 -964
3254 -964 -454 -861 -1376 93 229 -133 381 -271 116 1083 -703 245 -242 -69 958 830 -675 -213 422
3273 422 -750 647 439 -156 -302 -405 352 573 -406 320 -689 185 -827 263 724 406 901 444
3291 444 -245 -388 136 332 1116 860 -173 324 710 1245 -46 -60 515 654 -109 87 447 -570 827
3310 827 640 479 -60 -322 -817 101 -139 -152 -836 -389 294 34 664 -577 486 -1312 1181 538 -599
3329 -599 922 66 -566 194 -358 -928 505 435 221 181 -177 -169 897 -35 711 -30 -625 96 19 521 16
3350 16 -1261 -76 -513 51 -199 -64 -237 258 -480 -290 208 1192 951 455 185 -401 -586 492 -432
3369 -432 784 -887 188 489 -762 -207 -367 -776 -183 -110 -405 393 25 -124 -61 47 -662 -202 -331
3388 -331 188 541 -1014 -665 348 90 -187 219 -456 -1050 218 -431 -1409 -358 -370 189 790 90 -292
3407 -292 -194 -91 -366 782 444 53 -998 -830 250 574 -411 -598 -758 507 375 459 -684 -996 -106
3426 -106 -490 599 -898 -650 -362 161 336 587 -285 -25 272 -254 -598 344 117 262 -332 -43 -26 -839
3446 -839 503 -290 174 -137 -1131 429 -175 875 189 -370 308 -1234 -459 318 -448 -745 -704 -1424 190
3465 190 365 4 527 -763 38 40 -577 225 61 -464 -321 -523 2 -1254 707 -387 49 1091 665
3484 665 142 -208 -387 498 241 229 -521 787 444 -670 184 541 -562 -335 1007 -862 -525 -27 -392
3503 -392 47 -31 -817 893 316 165 434 51 111 -105 -595 940 -149 -1011 -596 -129 549 1538 441
3522 441 -1400 66 -667 318 122 1105 -295 378 103 -145 -1133 -1382 -542 59 -664 171 1012 -220 21
3541 21 -604 208 219 -449 -77 951 393 101 1134 -414 -69 13 1232 -1052 68 -872 -184 -107 -224
3560 -224 546 863 -579 -557 76 -740 260 -388 640 -521 -485 -441 -291 458 17 -500 269 -1115 104
3579 104 -306 -470 -788 43 179 1536 -558 -692 122 129 231 749 -14 -52 554 42 -303 90 305 -582
3599 -582 -754 -471 -1207 290 -626 -59 -113 -571 198 272 174 496 499 -172 28 -1009 357 15 175 456 937
3620 937 -68 -833 -282 1449 397 814 363 -369 -135 -573 471 -790 592 1043 -256 881 576
3637 576 -408 -182 -699 -615 514 -255 586 -734 -166 903 296 -224 177 836 -686 516 467 -405 299
3656 299 -182 292 166 422 -170 541 -421 58 -578 -631 249 288 -110 -461 -234 37 -786 -31 37 67 -433
3677 -433 520 707 -720 -604 652 -26 -280 49 -837 -553 -611 -670 17 935 817 -391 -94 -438 95 -653
3697 -653 245 -841 -296 407 -51 -1836 -208 -1622 -494 -98 484 116 129 -68 -225 491 365 327 122
3716 122 -1634 -854 -504 -894 624 -413 636 -448 -157 2 -712 -532 -1382 -633 814 -264 -919 26
3734 26 40 621 -677 -851 -502 118 596 515 829 7 -559 350 312 -936 -189 850 -994 236 399 -707
3754 -707 221 137 -207 -75 1263 -276 -368 10 400 629 185 673 -613 -626 -367 -834 554 657 739 -43
3774 -43 336 3 -221 -97 1085 -1301 -35 -302 -778 747 -16 911 -1213 1032 -375 873 152 604
3792 604 -352 659 1388 1052 -801 -11 565 -680 -183 -843 208 436 -400 516 -825 335 253 641
3810 641 -159 151 169 63 -255 -526 -706 11 578 361 -365 1014 144 89 439 -1035 173 1113 358 -1031
3830 -1031 239 -1413 -420 864 202 -204 -402 388 279 153 -152 661 -1025 358 -360 -432 682 -739
3848 -739 141 -644 740 -35 -995 -146 104 -1025 -225 -359 -359 -625 -332 -349 328 357 82 334 -445 -437 -394 324
3870 324 -589 533 45 -510 239 -675 1126 871 -32 185 375 -659 345 -462 -254 9 -242 -669 460
3889 460 -325 -357 -196 689 431 1411 543 -457 1734 3 484 642 -412 -204 -243 -208 -1151 -447 384 -164
3909 -164 585 20 -1070 353 926 428 843 401 659 -457 -178 -385 -597 -278 1198 300 750 118 180
3928 180 297 -17 -248 -818 -47 247 -140 106 571 -1645 158 -313 331 -1319 299 -366 61 250 10
3947 10 -146 323 -183 388 -1009 557 443 -685 -294 -197 -444 -21 375 -1484 233 414 -202 -592 -979
3966 -979 67 123 279 777 95 -962 648 -1016 656 -195 578 611 -177 891 -1179 366 -530 197
3984 197 -383 -628 -604 -210 350 663 40 -1028 166 489 -852 -136 926 -318 -188 -823 170 1115 -810
4003 -810 1214 -196 -259 -627 -296 183 815 -411 -359 -1015 920 95 -286 -321 -924 916 -510 479 -158
4022 -158 -795 325 585 -187 -462 818 326 218 106 8 -104 -179 -714 -978 357 -31 -995 844 46
4041 46 -827 -744 -23 -331 50 106 -138 136 -426 -20 106 -710 -95 351 644 723 404 206 857 -129 482
4062 482 -1295 -669 554 156 -1182 4 1080 -172 -182 -318 -493 -104 110 452 -529 198 867 -1673
4080 -1673 -935 372 15 751 -333 139 -436 727 -1328 -112 -331 146 -251 -476 473 -1213 -202
4097 -202 152 -228 212 994 -222 -695 56 1208 -455 -478 -438 923 589 790 345 535 149 259 1065
4116 1065 102 610 -1313 894 -319 1137 766 -647 -396 352 -504 -560 -333 400 -600 239 60 -175
4134 -175 -675 289 329 -458 -923 -946 191 -105 1319 56 -812 141 58 -89 -2277 -503 117 297 401
4153 401 -311 1119 -257 283 226 596 -379 -92 -183 680 729 -517 628 -95 37 76 652 -643 376
4172 376 223 -648 480 -143 509 288 -96 641 -518 845 -789 -318 812 -415 239 1011 -223 -266
4190 -266 -312 879 -581 93 889 -199 41 752 -981 -165 -1146 484 -920 -105 -1071 127 -335 -180
4208 -180 -350 53 154 21 291 -1001 492 -518 565 444 -270 328 -115 190 178 -951 -111 189 -342
4227 -342 -170 -270 761 -2 826 -126 -155 821 658 -815 -767 118 562 -287 343 -621 -848 269 458 225
4247 225 -399 -275 -758 -93 527 -48 -140 57 318 -33 897 360 -805 483 454 947 326 -1313 -726 -170
4267 -170 379 -556 254 270 267 -222 279 646 -596 -941 370 -452 -59 -692 -479 517 616 667 -544 70 403
4288 403 551 134 87 -177 -614 -127 1131 -180 413 -130 -300 -11 -899 319 258 -161 388 -1154 301
4307 301 427 13 -399 984 -821 -74 484 164 927 -822 -32 892 -287 214 534 226 -190 241 -133
4326 -133 422 573 -423 518 875 831 1185 1471 54 30 4 -287 293 -828 -139 -336 319 -665 62 163
4346 163 40 113 741 661 -729 -144 -577 661 983 245 -535 -273 903 -169 583 -798 -247 -352 -177
4365 -177 -93 369 394 -51 -472 150 -778 -72 -97 -26 143 -376 -1629 198 118 198 -1347 635 -1395 -570
4385 -570 270 279 1402 -227 -771 468 90 104 167 405 394 652 -46 -380 828 -33 -299 -423 128 244
4405 244 965 856 173 925 766 -325 206 707 135 -281 684 -198 -553 -901 508 399 -283 -22 -1195
4424 -1195 123 -830 -738 -147 -433 1296 188 -657 182 -680 -632 132 9 584 242 270 454 -978 -719
4443 -719 467 -1027 -263 -1026 -610 486 677 1369 1234 118 -637 612 -16 218 -224 -504 -272 -158
4461 -158 -313 454 -652 -80 487 193 -40 816 501 -35 -354 251 -869 1039 -276 336 -514 149 -1122
4480 -1122 -1139 -636 -378 -293 944 -798 877 -378 405 -289 690 -700 330 883 1338 575 -273 -295 192
4499 192 651 -7 -473 664 -888 406 784 -857 -110 -167 100 -795 295 -1462 515 -566 -344 -195
4517 -195 956 -152 -213 -829 21 27 98 287 288 99 -1191 -286 938 -305 307 397 -1107 150 674 -70
4537 -70 195 -158 -201 -27 417 485 -329 386 -170 258 357 -349 757 575 -58 -112 -87 -335 233 205 526 -159
4559 -159 463 130 71 -297 -901 -877 -606 -106 997 -715 799 -272 127 178 -557 -1130 1205 -1555 -21
4578 -21 -12 43 -168 824 -530 -1031 605 -5 121 214 -83 -665 145 936 17 -200 -500 588 508 -548 -680
4599 -680 -864 -325 -1115 -734 -178 -1128 -36 -122 -985 383 -243 -750 597 408 800 -366 685 -231 -574
4618 -574 117 -1091 -1036 403 -1227 -87 -213 2 -244 -465 632 350 734 -679 141 925 1061 -988
4636 -988 577 149 215 -356 422 343 -375 263 -926 -217 -891 42 -344 -401 -738 208 -627 -692 -1123 233
4656 233 709 -685 641 -729 -605 -171 -304 -570 -596 -176 -554 -1254 1188 135 -656 112 549 -259 -490
4675 -490 977 -246 -468 17 664 707 -452 620 198 169 167 155 -29 683 490 -423 333 862 -7 -311
4695 -311 -556 169 -877 -648 388 -743 -903 -559 -134 -1294 712 740 717 -527 -670 773 -153 -943
4713 -943 336 58 879 -336 -202 92 -298 -47 -724 69 167 -416 -870 479 83 -1065 -300 49 -751
4732 -751 551 -270 -561 311 614 -158 -374 585 -556 -28 658 -416 610 -586 601 137 48 352
4750 352 -147 257 542 -105 406 -761 -406 -405 183 482 -479 580 189 78 -755 120 -877 414 -166 600
4770 600 -565 -381 320 -64 -617 178 515 105 1004 219 -594 -468 -117 -297 276 -513 1235 772 -839
4789 -839 205 -81 598 -690 339 -1118 105 -297 -1220 -392 836 123 -669 88 634 709 340 430 -717
4808 -717 -1297 -1473 1099 -393 -23 -38 -837 47 -569 -783 -881 32 258 -45 361 551 44 -279 -485 -241
4828 -241 102 500 -107 138 340 -784 223 -75 192 -356 465 -92 66 -363 -1000 -607 -816 -441 628
4847 628 819 -726 31 -1077 -551 -35 -434 -827 -534 238 452 -39 9 -334 855 355 340 -452 -880 -269
4867 -269 1022 -261 1192 132 -334 619 -1209 -833 -332 393 647 -296 519 423 -203 -147 168 -275 -506
4886 -506 355 -664 -212 -221 -249 507 195 -529 1322 365 -475 37 185 47 -158 196 -811 -302 -804 -182
4906 -182 1252 -132 -215 -749 777 -792 -1105 42 166 -1208 -716 -627 1248 -266 -322 255 -554 1118
4924 1118 -334 -100 325 -735 292 911 -950 86 -596 191 -411 642 69 -225 -635 -1346 775
4941 775 -179 -294 -728 412 522 -944 253 159 89 298 -696 -278 760 -860 -742 433 783 1381 310
4960 310 155 -241 -329 166 -416 -1136 264 494 379 470 -335 -38 -48 627 202 317 -129 350 308 -473 202
4981 202 -470 -169 828 262 181 -395 -622 67 5 -1 268 -53 204 259 323 -121 842 732 -279 507 -321 136
5003 136 141 -101 -181 -741 -629 -120 96 -582 546 -327 -623 305 747 413 -775 -360 589 -101 -564 -34
5023 -34 489 1052 768 495 -1007 -403 758 544 1034 -655 -299 -231 -444 -189 -51 31 -152 449 -1250 691
5043 691 -251 839 -602 958 611 -694 660 644 544 461 257 -712 -254 107 884 -438 -337 -1195 -831
5062 -831 -147 -588 -1350 -816 -433 -865 388 183 503 350 -245 418 398 618 247 -791 1367 -340 60
5081 60 112 1488 -174 -626 -474 -1202 493 -624 -1147 -146 114 -1 533 211 -381 1081 139 140 -70
5100 -70 -428 272 -1121 -567 1118 -278 550 152 304 694 563 285 -119 -372 -507 478 1411 157 355
5119 355 -81 -549 54 503 162 -13 -774 170 169 1272 334 603 871 -415 244 -519 -240 -88 -128 116
5139 116 985 -369 343 86 -615 323 1117 765 -148 -439 -1089 -467 -802 289 100 499 426 809 -245
5158 -245 -975 -111 522 45 938 -322 -438 -738 -898 -41 -257 -341 288 330 422 360 -257 -386 -366 134 -994
5179 -994 37 -23 139 -77 -216 -208 768 282 -934 484 -8 290 225 66 -822 582 -1263 804 -288
5198 -288 443 -942 -687 -127 500 314 -157 268 625 769 -806 93 -390 -95 -46 236 400 225 -1503
5217 -1503 337 -236 506 681 216 -1094 -462 42 1048 -244 22 74 -248 -396 7 530 -206 -517 853
5236 853 -157 -8 643 629 -21 1280 1257 255 807 -918 -87 -634 82 491 -470 -963 -1261 -426 -362 265
5256 265 -75 -226 397 -27 858 585 246 352 1186 -181 -742 469 -400 713 1179 -231 -489 -54 -311
5275 -311 -245 -215 240 144 35 269 217 301 -339 233 -867 875 -68 -18 -1146 60 594 128 51 174 105
5296 105 772 -724 -1380 -265 502 -591 120 -569 -360 68 -364 -46 108 -814 -462 1002 819 -995
5314 -995 130 43 -134 -617 -678 -89 -305 729 387 19 -183 -277 491 -713 259 126 56 564 -168 528
5334 528 162 223 1042 964 -738 926 -1365 -133 -294 66 129 -283 -666 676 147 -397 453 -448 -126
5353 -126 -16 504 404 -93 460 387 485 -444 -248 459 -90 225 494 -1143 51 98 72 -733 897 1210
5373 1210 726 896 -838 1399 52 290 -703 -344 -32 53 248 910 211 336 591 -31 -41 334 236 1171
5393 1171 44 -730 1109 -13 215 289 -57 109 234 -1316 227 -623 224 468 -171 268 282 -238 510
5412 510 53 1361 1004 -404 -579 -601 151 71 651 -480 -27 -15 176 -841 12 514 -5 -782 -695 163
5432 163 -186 -563 -1206 -942 -933 -839 825 545 312 1073 -239 -599 343 888 -47 279 -280 564 541 911 92
5453 92 -150 -269 -341 239 -235 -32 -575 -650 -147 608 59 533 557 8 450 -101 20 -563 911 769 311
5474 311 774 776 -426 108 395 -242 559 -985 396 -289 -656 1009 574 436 -1231 1027 657 167 -89
5493 -89 434 -388 -532 1190 890 255 448 -482 381 491 948 -254 -648 495 -189 307 -699 -774 -11
5512 -11 -230 -379 -699 206 190 969 -906 713 86 119 -243 163 -582 -860 165 -353 382 274 1362 -60
5532 -60 63 -391 -650 183 -504 -263 -959 -840 977 466 70 282 -1359 923 438 858 274 113 -912
5551 -912 514 -1063 27 -458 521 -135 765 1294 -1029 1318 838 724 275 279 766 -410 623 -245
5569 -245 282 906 1941 268 416 99 269 -430 172 392 -149 -1199 511 256 42 579 -178 645 419
5588 419 -417 -139 685 825 115 -285 -372 -474 -474 -344 856 -114 477 -1303 206 -328 -617 -94 -577 -296
5608 -296 509 -675 358 964 -980 -494 -27 340 -82 -466 595 224 77 392 -67 -291 150 -1077
5626 -1077 -213 -778 126 315 679 -93 -417 -247 -678 440 -95 190 218 -30 12 -1329 -386 -660 186 129
5646 129 347 199 -469 -37 -93 1246 -658 140 -38 -22 -718 365 518 448 376 93 255 784 -205 -582
5666 -582 -1062 -301 47 -1205 876 58 -1284 -460 89 -578 -786 427 -138 374 -568 -1287 555 -356
5684 -356 -242 -1461 -45 858 -87 -108 -91 150 658 -362 782 -72 -328 -159 -759 -82 636 -481 -51
5703 -51 -70 401 -357 759 1054 -356 433 83 256 575 302 -323 658 -544 -586 -422 263 659 -90 -175
5723 -175 848 -168 -51 -151 184 -248 -729 523 66 1073 440 -661 63 858 547 1 -281 216
5741 216 -489 435 -1499 310 -5 747 537 562 118 138 1193 496 885 231 88 -1330 -492 756 440
5760 440 97 -948 114 -460 421 -589 -345 1125 284 -341 5 -48 311 1064 -515 524 -198 633
5778 633 417 79 -70 909 340 -1061 663 -217 -817 218 368 166 -1149 296 1152 -196 -358 856
5796 856 40 49 389 294 1213 -574 -637 418 617 293 22 -958 -812 -273 1188 -17 -683 793 -88 91
5816 91 -175 539 14 -686 -62 497 541 119 -1070 -295 186 681 -117 -1572 30 439 -1281 81 -568
5835 -568 590 377 -400 -249 -40 -955 -396 -125 292 433 -669 86 -484 409 -159 734 -697 -637 -2
5854 -2 -790 120 211 528 -532 239 -1102 -115 275 -457 112 201 -251 -398 -441 -236 49 856 -45 -460 231
5875 231 -125 313 214 322 1063 428 128 163 -645 331 669 -67 1006 -145 -995 235 368 -79 -562 605
5895 605 460 -178 411 65 -68 753 -69 544 624 192 -917 -192 -75 -323 -187 -1131 364 159 -494 95
5915 95 250 -6 -424 -603 538 -1507 -292 -445 -596 559 -363 564 15 433 454 -362 246 87 -2115
5934 -2115 160 908 -752 223 -158 452 524 77 174 183 -280 1729 368 -958 466 -1 -1499 -101
5952 -101 120 -443 298 238 27 35 499 -205 -85 -844 -302 528 566 -99 570 -489 976 253 1155 -621
5972 -621 518 760 -488 -180 -549 131 -1372 863 -422 41 275 44 879 -540 -542 189 299 -69 -783
5991 -783 365 547 1985 248 -336 517 734 -162 263 -305 -306 -571 679 -1248 -378 279 -658 -951 -798
6010 -798 -143 172 -302 576 505 -326 -311 -408 -773 -325 -45 -91 -759 -185 -749 -729 -709 -698 587 -199 -262 -102
6032 -102 -119 1117 113 -500 617 -410 498 -933 240 22 555 712 393 10 -387 583 1431 289
6050 289 -603 339 -46 422 -540 -377 -682 -264 -62 663 -703 -37 351 459 -610 451 -510 -426 -397 811
6070 811 6 138 341 -894 -420 -181 560 146 275 286 -695 107 288 264 -104 -726 1175 -330 35 452
6090 452 -508 1047 -521 -896 194 -179 -215 -747 -285 -455 -339 -237 235 999 -94 -226 466 671 477
6109 477 221 51 1204 474 -771 60 394 415 -111 -457 974 227 -604 335 -5 -487 -447 -1004 738
6128 738 -8 -537 139 -341 -777 357 515 1 708 -461 -670 134 528 -684 -889 1198 -495 -1219
6146 -1219 428 447 -319 269 434 683 -24 -239 409 1395 598 -247 299 -833 -644 901 995 -449 73
6165 73 976 241 1297 -1 -821 570 53 859 1761 752 894 218 -125 -155 791 -1257 906 -418
6183 -418 47 -113 930 473 885 -237 -525 -578 -94 979 844 161 269 -1141 473 -72 -325 60 -479
6202 -479 201 -122 -312 -551 167 -531 -845 -356 -127 -81 632 -1182 -148 -535 652 -1282 -73 -485 -42
6221 -42 322 26 174 80 -160 -624 428 -687 531 -1232 412 -384 -916 -472 -1029 448 -404 248 -653
6240 -653 -222 861 182 -31 -276 -637 -576 45 -212 -117 440 -353 -221 445 191 -448 -25 -652 -1280 166
6260 166 -1442 -217 647 -350 -788 -136 -267 98 -594 257 -51 -378 279 124 -1096 714 365 -196 -10
6279 -10 -1221 645 598 647 -249 -880 -269 861 611 472 514 -1155 -633 573 716 705 -56 519 292 327
6299 327 -186 -996 201 453 494 163 -424 0 -1502 -772 505 -870 -638 -575 -265 786 733 -1174 1202
6318 1202 4 1030 233 -37 235 126 749 -1189 1354 -276 686 63 -1396 -591 115 128 97 -14
6336 -14 146 -272 348 303 88 736 -8 370 239 63 334 89 -395 131 310 36 899 432 -737 -146
6356 -146 392 98 241 364 285 291 343 -347 623 -165 117 -121 -403 1901 -186 467 -1061 -411 -438 102 642
6377 642 -355 -261 -1132 437 -435 -361 461 -221 -62 -106 -670 -260 159 -149 -60 767 751 -899 -356 -376 42
6398 42 230 398 -21 -127 205 946 156 -605 217 -715 -1186 -14 799 602 -304 -426 -1416 285 -432 358
6418 358 282 -906 -283 -542 -273 -265 -189 -385 -742 518 881 181 694 143 576 467 16 764 -233 -1210 1614
6439 1614 -751 -327 -40 -767 -39 -1109 -59 -593 -562 -480 22 23 -206 -134 1087 -132 -274 -357 69 -545
6459 -545 -533 -757 -1 573 892 828 400 -676 139 -682 -896 -343 -43 -114 166 993 -632 411 -73 325
6479 325 234 -424 -1297 235 127 588 -384 626 213 1479 479 1232 -751 837 810 77 357 273 -662
6498 -662 40 -114 60 -298 -507 430 1031 -503 911 804 -18 379 415 -348 -967 427 663 -549 327
6517 327 -119 -162 -547 -101 45 -750 -204 -557 1400 249 445 -761 -467 -1459 401 -771 162 56 898
6536 898 -931 -736 -322 316 164 291 8 -169 -885 188 -63 -1241 543 174 -78 -1429 857 -852
6554 -852 -467 -1007 998 53 -807 -226 725 99 796 821 263 1388 -432 82 -301 -11 -345 -152 -81 524
6574 524 322 1317 338 337 -397 -253 387 625 -345 -722 145 193 -207 -239 327 -74 -238 40 -241 -170 445 -126
6596 -126 -163 723 64 342 -168 895 79 291 204 89 456 1721 -10 -118 -616 -331 213 -378 167 -610
6616 -610 414 -127 742 131 413 170 396 -487 304 237 -209 -245 -237 601 12 624 -265 342 -13 220 546
6637 546 250 933 -180 -81 378 161 -199 -559 -1200 241 -1157 95 400 -1056 145 -737 -715 -253 -539
6656 -539 -898 -39 210 44 -55 505 -512 174 625 610 697 -762 995 -409 -544 -1106 -1035 666 -204 -639
6676 -639 781 433 777 -341 -227 850 -553 92 163 79 -263 958 -327 882 -122 -101 1392 -198
6694 -198 137 404 -195 702 -867 -626 383 -595 503 -748 -490 556 -229 -57 -432 425 373 -1830
6712 -1830 346 -974 893 442 -891 199 -429 -575 240 252 577 -671 206 1051 -486 -236 -49 -54
6730 -54 977 -408 -177 -729 594 -183 -1499 1555 -312 -161 146 389 1104 -67 -547 -1139 882 -1530
6748 -1530 39 1017 552 261 789 646 -1210 81 -267 73 -597 416 -255 -30 -163 -788 114 -59
6766 -59 146 891 675 -509 -408 1334 -323 379 51 490 199 -938 6 -848 661 128 1393 301
6784 301 -1360 -515 477 -934 240 -1072 -28 -528 -1519 714 -43 -1008 -346 -540 693 296 411 -1341
6802 -1341 -73 375 361 -262 793 515 -517 139 176 89 -211 447 411 -876 -917 63 220 -195 -477 -397
6822 -397 -345 93 -375 -1161 -707 617 267 40 609 -323 -252 170 387 -194 -588 -609 214 1167 553 117 236
6843 236 184 454 82 -516 -154 -904 -216 -433 13 8 -731 -1059 1161 137 91 283 297 1187 -111 -122 705
6864 705 -1426 -454 611 -239 -742 196 1073 524 10 -647 335 485 1375 5 822 -739 309 -975
6882 -975 -26 -940 -518 1131 -619 1239 -508 -282 199 899 -736 -233 -276 -74 -199 -192 -433 646 971
6901 971 174 353 64 -67 -64 -31 45 423 127 -40 -1161 538 -219 -108 -630 214 471 -573 -169 955
6921 955 -1 36 276 14 -1221 126 -1 -157 -273 509 327 -550 -370 841 351 -15 -566 -1090 -95
6940 -95 -863 -894 -423 515 546 760 -679 236 120 -482 478 -127 -363 587 337 -586 137 235 -557 -223 995
6961 995 739 -317 1045 1389 -267 -631 123 1259 -125 -365 -560 23 634 175 170 -84 -878 -436 100
6980 100 308 -191 -458 -659 -355 1 -463 -400 -412 -831 609 353 -253 -198 -325 -691 -1114 -113 -177 68 217
7001 217 993 -169 124 -610 -323 -277 -351 -1 166 622 73 1201 -29 434 862 -1 553 -112 156 -141
7021 -141 -430 322 54 -762 1318 -1013 -161 74 -454 195 523 1021 -466 434 392 -972 723 -445
7039 -445 76 129 -508 -384 -306 -974 432 549 -688 -167 -51 530 225 -129 38 721 258 240 389 -148
7059 -148 -423 -1167 417 -378 -868 -161 -1 -227 -286 -730 352 600 -98 -906 -301 -245 637 -67 -499 1022
7079 1022 1750 -62 520 -82 187 830 1149 127 104 -802 63 -582 -320 -431 418 256 -761 -809 -205
7098 -205 979 845 -260 187 1106 -734 -760 74 344 59 122 900 372 -412 -54 1500 371 -365 389
7117 389 -587 112 -497 19 -836 394 -250 220 -117 17 553 -480 -468 7 -22 111 12 473 -473 -162
7137 -162 961 -63 -1230 -129 -545 -1205 -153 -118 -214 -808 136 269 -427 568 378 163 -25 704 323
7156 323 -340 -66 91 742 -552 246 -555 -493 196 723 742 -600 -562 434 555 -347 -974 -598 -709 241
7176 241 -368 -62 -934 -402 163 571 185 617 -49 -111 654 -211 693 1398 588 752 531 402 -124 148
7196 148 521 658 -68 75 284 -407 -407 95 -532 -102 272 -183 -352 -645 -565 227 368 -926 -280 256 1159
7217 1159 -457 -795 -1000 -126 -455 -242 1389 -363 433 -830 708 -51 -194 520 32 1854 -179
7234 -179 590 -270 -1067 242 -156 111 -448 -214 -438 -954 -1003 216 160 26 64 549 -549 278 -840 -535
7254 -535 1152 -502 -868 847 537 378 84 -140 -966 1013 739 359 77 299 972 -807 -277 -405
7272 -405 -301 565 271 316 -718 -464 130 306 311 -387 -793 -373 -648 -212 -64 -36 607 578 400 -102 -647
7293 -647 350 262 -256 -827 15 102 858 -338 -441 -591 -1001 507 -38 -102 -861 -63 22 635 179 -47 521
7314 521 282 -851 -80 82 820 454 417 -489 -729 -445 -144 -708 -686 23 -331 -525 -88 798 -919 778
7334 778 -686 130 741 1422 -1076 -349 -91 -648 979 208 -334 560 127 -242 -603 413 -177 -1106 330
7353 330 -168 -670 219 -373 458 5 121 -791 276 -307 -484 183 -517 474 47 -646 -660 -248 41 -257
7373 -257 73 360 -48 221 949 404 -679 587 551 103 -259 -1236 1062 -176 -242 -659 66 76 -347 565
7393 565 86 -257 104 -471 -870 122 175 205 -613 797 -511 -433 -277 -203 312 -304 -319 -121 -122 -642 1076
7414 1076 -302 12 545 -1175 -140 -774 207 129 -24 298 -858 551 698 163 464 -330 -253 -20 1056
7433 1056 -1583 -603 -315 -165 -385 688 -89 -82 876 -341 -376 3 -116 -270 753 -383 -93 -196 -1269
7452 -1269 62 15 218 54 -377 -998 171 787 -830 -144 358 -219 -43 310 159 -613 252 -712 -435
7471 -435 245 696 130 -232 -971 -64 494 -690 928 -457 328 274 744 -1045 500 -214 -52 -779 -373
7490 -373 -382 676 354 118 -158 -424 -324 146 -442 -148 451 1 -489 -258 14 -622 50 -345 -585 783
7510 783 -1285 -185 358 1201 102 693 -119 -476 948 -966 -818 403 1062 717 406 -878 334
7527 334 254 -492 475 950 459 -521 -270 170 -101 431 -141 570 394 235 -628 -288 -619 139 781 -191
7547 -191 -875 290 48 -7 -823 -800 -158 640 683 -836 214 -455 242 60 309 665 371 358 379 73 -453
7568 -453 457 -1066 208 -246 163 -332 1228 349 -376 18 -273 91 -704 1607 -1197 410 371 -503
7586 -503 -574 -373 -646 -904 -668 -789 810 -772 538 47 314 395 -327 74 -107 314 11 380 197 -970
7606 -970 589 -184 339 679 199 95 -797 504 1198 -168 1086 8 278 -111 491 -72 -604 991
7624 991 175 354 -108 -602 -72 -387 182 295 -225 -163 48 -592 -629 -5 -454 -461 827 -432 -531 -764 -802
7645 -802 -108 252 -992 -47 466 346 293 549 451 784 -156 8 -253 280 528 713 -878 -506 349 -729
7665 -729 -94 55 990 -155 -308 -982 547 -431 1349 117 312 -415 -786 -411 -658 -474 -105 -1008 -322
7684 -322 -88 439 70 231 274 335 75 -180 -501 701 130 -462 223 -644 505 -117 165 973 -79 -119
7704 -119 180 673 -753 -69 221 -259 -683 302 -104 -473 -464 -353 336 -100 -543 868 832 -389 -207 1132
7724 1132 -340 -364 111 331 245 -496 -148 -85 -626 589 -515 -380 375 143 101 -450 218 291 558 -566
7744 -566 -544 -340 -175 -74 -398 -222 -108 708 225 -465 -423 378 -560 1021 -142 186 721 -467 182 440
7764 440 -446 -610 -856 -126 177 -94 366 325 -230 92 52 1195 -484 -823 8 -121 -162 -290 1321 -538
7784 -538 -638 500 -295 -181 201 125 -309 -374 515 898 -624 -752 183 -26 -10 -335 71 -918 -89 -662
7804 -662 845 88 610 192 -367 -754 -366 261 -459 -316 200 -397 73 469 191 -256 -919 991 -580
7823 -580 560 -268 -1790 -342 167 -708 75 257 376 -201 -943 604 99 -550 149 696 -577 393
7841 393 -652 388 -869 128 -480 -812 353 686 -7 214 66 -319 359 -240 945 -673 311 -413
7859 -413 100 -591 188 -709 1149 -657 -576 -636 -284 205 -156 71 -167 -315 -27 921 -816 390 -482
7878 -482 534 -818 -1234 -392 754 39 1132 -380 -528 216 390 -168 -447 -83 -139 711 48 -2 -482
7897 -482 -300 -759 -968 -1265 736 92 -819 -48 232 486 282 -830 321 357 -77 56 -651 -921 140
7916 140 -511 -498 -1024 -516 -830 -125 111 -511 -97 -233 35 -420 761 836 800 -592 689 612 1037 1317
7936 1317 -125 1077 906 -983 40 40 114 -291 1155 100 -508 246 -117 -172 389 373 512 -432 -192
7955 -192 259 3 -35 199 688 1100 142 458 -125 431 165 1125 967 488 -134 -87 491 -1142 -317 -378 597
7976 597 1289 732 553 -30 191 -892 -516 -354 -275 -180 874 -36 -320 -482 189 283 -271 240 -135 575
7996 575 -760 -293 92 -160 314 -858 -188 -827 376 -598 1348 -174 876 -640 -667 537 317 365
8014 365 -361 -529 530 346 -330 1452 -343 -214 -382 256 216 233 299 302 -821 -296 234 323 -373 -229 -1095
8035 -1095 -255 172 2 366 191 -386 -827 -152 -356 -873 -339 -427 440 124 -794 135 177 -710 52 -206
8055 -206 239 -229 -686 -364 -215 -826 343 233 -84 14 1284 -433 -71 -997 688 518 345 -463 -636
8074 -636 -12 158 -212 -71 243 -703 -536 -442 293 -289 257 304 572 -345 -11 95 134 711 -176 -327 -44
8095 -44 -732 74 -519 837 187 129 875 25 237 830 -65 -115 1350 17 5 322 73 -524 350 -327
8115 -327 -71 209 -39 -304 -445 246 -118 748 109 -284 -346 41 681 604 -429 46 32 69 -101 -162 455
8136 455 -1114 808 -453 666 -366 -1261 -109 -7 169 -153 943 670 175 273 -286 694 86 343
8154 343 -169 59 -345 696 -410 -148 606 206 -61 332 -670 -659 -186 -158 -613 522 1015 1329 -10
8173 -10 81 -198 -938 -10 681 -174 -584 -131 -241 -101 117 -742 -134 -930 326 170 -1530 -472
8191d72
##END NTUPLES=NMR FID
##END=
