##TITLE=1H_SAM_11.103
 CDCl3, 64 sc, 
 8.2.2019
##JCAMPDX= 6.0         $$ Bruker NMR JCAMP-DX V2.0
##DATA TYPE= NMR FID
##DATA CLASS= NTUPLES
##ORIGIN= UXNMR, Bruker Analytische Messtechnik GmbH
##OWNER= root
$$ XWIN-NMR		Version 3.5
$$ Fri Feb  8 15:38:24 2019 Russian Standard Time (UT+4h)  she@DPX200
##.OBSERVE FREQUENCY= 200.1313
##.OBSERVE NUCLEUS= ^1H
##.DELAY= (6, 6)
##.ACQUISITION MODE= SIMULTANEOUS
##.ACQUISITION SCHEME= undefined
##.AVERAGES= 64
##.DIGITISER RES= 18
##SPECTROMETER/DATA SYSTEM= spect
##.PULSE SEQUENCE= zg30
##.SOLVENT NAME= CDCl3
##.SHIFT REFERENCE= (INTERNAL, CDCl3, 0, 15.7039)
##AUDIT TRAIL= $$ (NUMBER, WHEN, WHO, WHERE, WHAT)
$$ ##TITLE= Audit trail, XWIN-NMR		Version 3.5
$$ ##JCAMPDX= 5.01
$$ ##ORIGIN= Bruker BioSpin GmbH
$$ ##OWNER= she
$$ F:/spectra/data/she/nmr/H-F/1/audita.txt
$$ ##AUDIT TRAIL=  $$ (NUMBER, WHEN, WHO, WHERE, WHAT)
(   1,<2019-02-08 15:37:22.06 +0400>,<she>,<DPX200>,
      <continue with go, POWCHK disabled, PULCHK disabled
       configuration hash MD5:
       00 E9 B6 7A A2 85 ED C7 34 08 36 98 17 FE 4E 26
       data hash MD5: 16K
       56 B5 B5 F7 52 E1 B4 D9 05 8D EA C5 4F D7 26 6C>)
$$ ##END=
$$ 
$$ hash MD5
$$ AE AC E8 33 C8 72 6F 73 C5 D0 91 53 CC B8 1A 45
##$RELAX= 
##$RELAX= 
##$RELAX= 
##$RELAX= 
##$RELAX= 
##$RELAX= 
$$ Bruker specific parameters
$$ --------------------------
##$DU= <F:/spectra>
##$EXPNO= 1
##$NAME= <H-F>
##$PROCNO= 1
##$TYPE= <nmr>
##$USER= <she>
##$AMP= (0..31)
100 100 100 100 100 100 100 100 100 100 100 100 100 100 100 100 100 100 
100 100 100 100 100 100 100 100 100 100 100 100 100 100 
##$AQSEQ= 0
##$AQ_mod= 1
##$AUNM= <au_zg>
##$AUTOPOS= <>
##$BF1= 200.13
##$BF2= 200.13
##$BF3= 200.13
##$BF4= 200.13
##$BF5= 200.13
##$BF6= 200.13
##$BF7= 200.13
##$BF8= 200.13
##$BYTORDA= 1
##$CFDGTYP= 0
##$CFRGTYP= 5
##$CHEMSTR= <none>
##$CNST= (0..31)
1 1 145 1 1 1 1 1 1 1 1 1 1 1 1 1 1 1 1 1 1 1 1 1 1 1 1 1 1 1 1 1 
##$CPDPRG= <>
##$CPDPRG1= <>
##$CPDPRG2= <>
##$CPDPRG3= <>
##$CPDPRG4= <mlev>
##$CPDPRG5= <mlev>
##$CPDPRG6= <mlev>
##$CPDPRG7= <mlev>
##$CPDPRG8= <mlev>
##$CPDPRGB= <>
##$CPDPRGT= <>
##$D= (0..31)
0 1.2 0 0 0 0 0 0 0 0 0 0.03 0 0 0 0 0 0 0 0 0 0 0 0 0 0 0 0 0 0 0 0 
##$DATE= 1549625598
##$DBL= (0..7)
120 120 120 120 120 120 120 120 
##$DBP= (0..7)
150 150 150 150 150 150 150 150 
##$DBP07= 0
##$DBPNAM0= <>
##$DBPNAM1= <>
##$DBPNAM2= <>
##$DBPNAM3= <>
##$DBPNAM4= <>
##$DBPNAM5= <>
##$DBPNAM6= <>
##$DBPNAM7= <>
##$DBPOAL= (0..7)
0.5 0.5 0.5 0.5 0.5 0.5 0.5 0.5 
##$DBPOFFS= (0..7)
0 0 0 0 0 0 0 0 
##$DE= 6
##$DECBNUC= <off>
##$DECIM= 32
##$DECNUC= <off>
##$DECSTAT= 4
##$DIGMOD= 1
##$DIGTYP= 9
##$DL= (0..7)
0 120 120 120 120 120 120 120 
##$DP= (0..7)
150 150 150 150 150 150 150 150 
##$DP07= 0
##$DPNAME0= <>
##$DPNAME1= <>
##$DPNAME2= <>
##$DPNAME3= <>
##$DPNAME4= <>
##$DPNAME5= <>
##$DPNAME6= <>
##$DPNAME7= <>
##$DPOAL= (0..7)
0.5 0.5 0.5 0.5 0.5 0.5 0.5 0.5 
##$DPOFFS= (0..7)
0 0 0 0 0 0 0 0 
##$DQDMODE= 0
##$DR= 18
##$DS= 0
##$DSLIST= <SSSSSSSSSSSSSSS>
$$ [...]
##$SUBNAM2= <"">
##$SUBNAM3= <"">
##$SUBNAM4= <"">
##$SUBNAM5= <"">
##$SUBNAM6= <"">
##$SUBNAM7= <"">
##$SUBNAM8= <"">
##$SUBNAM9= <"">
##$SW= 20.0189088683792
##$SWIBOX= (0..15)
0 0 2 0 0 0 0 0 0 0 0 0 0 0 0 0 
##$SW_h= 4006.41025641026
##$TD= 16384
##$TD0= 1
##$TE= 0
##$TE2= 300
##$TE3= 300
##$TEG= 300
##$TL= (0..7)
0 120 120 120 120 120 120 120 
##$TP= (0..7)
150 150 150 150 150 150 150 150 
##$TP07= 0
##$TPNAME0= <>
##$TPNAME1= <>
##$TPNAME2= <>
##$TPNAME3= <>
##$TPNAME4= <>
##$TPNAME5= <>
##$TPNAME6= <>
##$TPNAME7= <>
##$TPOAL= (0..7)
0.5 0.5 0.5 0.5 0.5 0.5 0.5 0.5 
##$TPOFFS= (0..7)
0 0 0 0 0 0 0 0 
##$TUNHIN= 0
##$TUNHOUT= 0
##$TUNXOUT= 0
##$USERA1= <user>
##$USERA2= <user>
##$USERA3= <user>
##$USERA4= <user>
##$USERA5= <user>
##$V9= 5
##$VALIST= <valist>
##$VCLIST= <CCCCCCCCCCCCCCC>
##$VD= 0
##$VDLIST= <DDDDDDDDDDDDDDD>
##$VPLIST= <PPPPPPPPPPPPPPP>
##$VTLIST= <TTTTTTTTTTTTTTT>
##$WBST= 1024
##$WBSW= 4
##$XGAIN= (0..3)
0 0 0 0 
##$XL= 0
##$YL= 0
##$YMAX_a= 634772
##$YMIN_a= -698672
##$ZGOPTNS= <>
##$ZL1= 120
##$ZL2= 120
##$ZL3= 120
##$ZL4= 120
##$ABSF1= 10
##$ABSF2= 0
##$ABSG= 5
##$ABSL= 3
##$ALPHA= 0
##$AQORDER= 0
##$ASSFAC= 0
##$ASSFACI= 0
##$ASSFACX= 0
##$ASSWID= 0
##$AUNMP= <proc_1d>
##$AZFE= 0.1
##$AZFW= 0.1
##$BCFW= 1
##$BC_mod= 2
##$BYTORDP= 1
##$COROFFS= 0
##$CY= 11.3945322036743
##$DATMOD= 1
##$DC= 2
##$DFILT= <>
##$DTYPP= 0
##$F1P= 18.9103706918063
##$F2P= -1.10871071338519
##$FCOR= 0.5
##$FTSIZE= 0
##$FT_mod= 4
##$GAMMA= 1
##$GB= 0.15
##$INTBC= 1
##$INTSCL= 1
##$ISEN= 128
##$LB= 0.24
##$LEV0= 0
##$LPBIN= 0
##$MAXI= 10000
##$MC2= 0
##$MEAN= 0
##$ME_mod= 0
##$MI= 1.114404
##$NCOEF= 0
##$NC_proc= 0
##$NLEV= 6
##$NOISF1= 3.799351
##$NOISF2= 2.8
##$NSP= 1
##$NTH_PI= 0
##$NZP= 0
##$OFFSET= 15.70392
##$PC= 1
##$PHC0= -8677.035
##$PHC1= 9.800191
##$PH_mod= 1
##$PKNL= yes
##$PPARMOD= 0
##$PSCAL= 0
##$PSIGN= 0
##$REVERSE= no
##$SF= 200.130013532006
##$SI= 16384
##$SIGF1= 3
##$SIGF2= 2
##$SINO= 400
##$SIOLD= 16384
##$SREGLST= <1H.CDCl3>
##$SSB= 0
##$STSI= 0
##$STSR= 0
##$SW_p= 3612.71676300578
##$SYMM= 0
##$S_DEV= 0
##$TDeff= 0
##$TDoff= 0
##$TI= <>
##$TILT= no
##$TM1= 0
##$TM2= 0
##$TOPLEV= 0
##$USERP1= <user>
##$USERP2= <user>
##$USERP3= <user>
##$USERP4= <user>
##$USERP5= <user>
##$WDW= 1
##$XDIM= 8192
##$YMAX_p= 0
##$YMIN_p= 0
$$ End of Bruker specific parameters
$$ ---------------------------------
##NTUPLES= NMR FID
##VAR_NAME=  TIME,          FID/REAL,        FID/IMAG
##SYMBOL=    X,             R,               I
##VAR_TYPE=  INDEPENDENT,   DEPENDENT,       DEPENDENT
##VAR_FORM=  AFFN,          ASDF,            ASDF
##VAR_DIM=   8192,          8192,            8192
##UNITS=     SECONDS,       ARBITRARY UNITS, ARBITRARY UNITS
##FACTOR=    0.0002496,     1,               1
##FIRST=     0,             0,               0
##LAST=      2.0444736,     0,               0
##MIN=       0,             -698672,         0
##MAX=       2.0444736,     634772,          0
$$ Real data points
##PAGE= N=1
##DATA TABLE= (X++(R..R)), XYDATA
0@%%%%%%%%%%%%%%%Lo7J28j28J28j28J86k50K56k86L50l87M51n54O20p06Q31r52
33e05J074j208J345j502J692j897K116k357K623k912L228l572L948m357M803n294
49b775N835o428P086p812Q612r509J0519j1665J2969j4474J6241j8349K0908k4084
63a2926K8175l3659M1421n3419P4559j23003M71143R340o29852Q3959L54157M02346
75F12241r6271l99614m47913n1017K56227K91997o1778l38250l35141J6089L00486
86b52944L19034K9550k10523k02725P7565L06481K98285M2649j86845k01181J4555
97C3901K10283J91474m1477k50681k52964m9139J33452J23299o8051k32034k00559
108d02496K712J71657J63373O279j23767r1603P7038K13497J86508K9734r7985
$$ plain form
0 0 0 0 0 0 0 0 0 0 0 0 0 0 0 0 0 3 -64 64 -64 64 -64 122 -128 128 -158 192 -195 256 -298 322 -384 447 -505
33 -505 569 -639 706 -796 896 -1001 1115 -1242 1381 -1531 1697 -1875 2073 -2284 2519 -2775
49 -2775 3060 -3368 3718 -4094 4518 -4991 5528 -6137 6832 -7642 8599 -9750 11158 -12926
63 -12926 15249 -18410 23011 -30408 44151 -78852 392291 401631 -228221 -144262 209895 612241
75 612241 515970 116356 -331557 -382574 -126347 165650 103872 -234378 -569519 -553430 -252944
86 -252944 66090 95640 -114883 -317608 -240043 66438 364723 407372 220527 19346 33901
97 33901 244184 435658 394181 143500 -109464 -158603 -25151 98148 30097 -201937 -402496
108 -402496 -399784 -228127 -64754 -58475 -182242 -273845 -196807 16690 203198 232932 134947
119A34947p9428M8751J43956J04313m2989j57012j35640k0923O0728K9943p5765
130A0881j53123j22896r196Q4111P2324j4732p5210l7405O5912J37759J16989
141G5414K9839l3791j8972N9214J03584O6202k3625q9958p5997j1646K8084j168
153A07180p4363j15003q5180j2272L5354J8979l0122n1279j5287N0758Q9912P0197
165a1126K2846m445J7517N9930P7553M6906q263m1287l3665j224J1538j4218o0051
178F2011q1436o2980k1041J952r564l2976m1399j4042L0446N7046M6036J8548
190d7399Q289K8585N6061O3027M0913L129j5285q355R139Q601j6310m6477n7803
203B6115m3608k1888j4551k3425l6509l5302j3895J4743K7985K3989J2700J4947
$$ plain form
119 134947 55519 104270 248226 352539 309550 152538 16898 -4025 56703 86646 10881
130 10881 -142242 -265138 -274334 -190223 -117899 -132631 -207841 -245246 -179334 -41575 75414
141 75414 105253 71462 52490 111704 215288 281490 257865 167907 91910 80264 108348 107180
153 107180 32817 -82186 -167366 -179638 -144284 -125305 -155427 -206706 -221993 -171235 -81323 -11126
165 -11126 11720 7275 24792 84722 162275 209181 200918 159631 125966 124742 136280 122062 62011
178 62011 -19425 -82405 -103446 -101494 -111058 -144034 -185433 -199475 -169029 -111983 -65947 -47399
190 -47399 -39110 -10525 45536 108563 149476 152605 137320 128965 138104 146705 130395 83918 26115
203 26115 -17493 -39381 -53932 -77357 -113866 -149168 -163063 -148320 -120335 -96346 -83646 -68699
215f8699K7868M5406N0374L7488J4054L466Q233J4174Q944r181l0946l9690l3795
228B7696k1334j8648k8134l7252l4168j6430K568J2022R309O047J0016K4786L7613
241b5909L8672K9470J8196J3224J7545J8524J2626l714j6295k4452k1161j8224
253C8502j9198k8171l1753l0232j9820o646j628r19n70O150J6282K7602K9933
266b0468K5583J8904J6846K0645K0710J4644L777p774j1593j1497j2129j6065
278D1583k4198k7134k5746j7350j2165r897q081o165J715R511J7678J8304J8422
291b3523J8430J8749J9994K0304J5874Q948J025k061n903n989j2181j7229k1980
304A4458k1283j7296j4083j2079j1720r278l726L504R217J2865J1269J4232J5793
$$ plain form
215 -68699 -40831 4575 54949 92437 106491 109957 118190 132364 141308 132127 101181 61491 27696
228 27696 6362 -12286 -40420 -77672 -111840 -128270 -125702 -113680 -104371 -98324 -88308 -63522 -25909
241 -25909 12763 42233 60429 73653 91198 109722 122348 118634 102339 77887 56726 38502
253 38502 19304 -8867 -40620 -70852 -90672 -97318 -98946 -99865 -100435 -94285 -78003 -50401 -20468
266 -20468 5115 24019 40865 61510 82220 96864 100641 92867 81274 69777 57648 41583
278 41583 17385 -9749 -35495 -52845 -65010 -74907 -82988 -89153 -87438 -77927 -60249 -41945 -23523
291 -23523 -5093 13656 33650 53954 69828 78776 79801 77740 71837 65848 53667 36438 14458
304 14458 -6825 -24121 -38204 -50283 -62003 -71281 -75007 -71503 -62286 -49421 -38152 -23920 -8127
317h127J7880J7818J5368J0034N787L710J246j205p282j1542j4389j5520j5541
330a763j3961j2916j1682j1910n772k021J904O556O730R744J1737J4854J5602
343G102J3710J0967R030O481L784L145k655p171r549j0249j0798j1556j2101j1776
357b1636j0662q047m022k069J234L001N401P612J0064J1138J1646R755J0313P523
371C1251O265M276J362j891m675o701q591p457r564j0432j0458p926n958k996
385c3495k657o03J396M629O004R300P543P858Q699Q264N986M805L391J180j091
400C1209k247m760n643o424p469p824p279o455m815m024j818p74J052L285M305
415a9681N858O423N145P156O877M839M216K010J032l14j555k578m367n703m673
$$ plain form
317 -8127 9753 27571 42939 52973 58760 62470 63716 62511 55229 43687 29298 13778 -1763
330 -1763 -15724 -28640 -40322 -52232 -58004 -60025 -58121 -51565 -44835 -35091 -23354 -8500 7102
343 7102 20812 31779 40809 47290 51074 54219 51564 44393 34844 24595 13797 2241 -9860 -21636
357 -21636 -32298 -40345 -44367 -46436 -45202 -42201 -36800 -29188 -19124 -7986 3660 13415 23728 31251
371 31251 37516 41792 43154 41263 36588 29887 21296 13839 4275 -6157 -16615 -24541 -30499 -33495
385 -33495 -36152 -36755 -35359 -30730 -24726 -15426 -7883 -25 8674 16938 22924 27729 31120 32300 31209
400 31209 28962 24202 18559 12135 4666 -3158 -10437 -16892 -21707 -25731 -27549 -28323 -27271 -23986 -19681
415 -19681 -13823 -7400 -2255 4901 11778 16617 20833 22843 23875 23561 22006 19428 15061 9358 4685
430D685o005n513l958n386k289q95j255P37J917L404K819N019L847N961M325K950
446A0363L279K600Q23O50j128k570k545k340n008m297l346l144k440l711r05l75
462a4094k10Q35K540J913K977L743K816L087L159K339J241J963j171k26j61k544
478H207j953k526j840l539j339k626j664j857l77j34J137P45J598J216K481J510
494i61J742K215J559J014J141R11r46p01j7n65j577j876q66k017n97j103j171
511c815l12r91n41J271j00J263M27R89J337L74Q31J167Q61L20K15L88j09j145
529B430N18o28j020K10m83j181j19j549j26L49J29j066M04k98j54O11p62J692
547a043j074J474R1M80J103l4Q59J9L24Q69m54N62q64O07r47q69q89m92n82j213
$$ plain form
430 4685 -1320 -6833 -10791 -16177 -18466 -19361 -20616 -19879 -17962 -14558 -11739 -6720 -2873 3088 7413 10363
446 10363 13642 16242 17065 17715 16587 14017 11472 9132 4124 -173 -3519 -6663 -9103 -12814 -13719 -14094
462 -14094 -14304 -13469 -10929 -9016 -6039 -2296 520 3607 6766 9105 10346 12309 11138 10912 10751 8207
478 8207 6254 3728 1888 -1651 -2990 -5616 -7280 -9137 -9514 -9648 -8511 -7766 -6168 -4952 -2471 -961
494 -961 781 2996 4555 5569 6710 7621 6675 5974 5957 5392 3815 1939 1073 -944 -1541 -2644 -3815
511 -3815 -4127 -5118 -5659 -4388 -4488 -3225 -2798 -1809 -472 -98 733 1900 2761 3081 3296 3684 3575 2430
529 2430 2948 2320 1300 1510 1027 -154 -273 -1822 -1948 -1599 -1470 -2536 -2132 -2430 -2584 -1973 -2735 -1043
547 -1043 -2117 -643 -552 -72 1031 997 1856 1875 2199 3068 2614 3176 2312 2919 1972 1103 214 -278 -860 -2073
567b073k11q7q40l72J17p19J237K86P42o1K085N41J274N20Q6J837L23m24j148
586C113J639j332j71j979r56p85j827k15r31j395P8p6m58q2P41J352K213L86M79
605b06J815J260J759M20R89N3n65j60p79r29j214k372r49j829p94j792j254m6
623f593k80Q52L83J945P23P70J751J326J901K878j84J556L32K27j500m55r81j411
641C240j328k529j226k097r41j566q77j27k33J020Q71J582K178Q50K652R25K108
658D502J662J267R2L17o68m54o79k695k539o89k472j461k378j61r69%o81R09N50
677f547K459N63K913J389K137K040J296J249Q87Q06j312q06j062j459j803j673
693A077l686j059j400j846j411k59l46R10J068J342K015K270K000K092J519J684
$$ plain form
567 -2073 -2284 -2371 -3211 -3583 -3466 -4185 -2948 -2662 -1920 -1981 104 645 1919 2439 2525 4362 4685 4261 3113
586 3113 4752 3420 3249 1270 314 -471 -2298 -2513 -3444 -4839 -4761 -4837 -5295 -5377 -4636 -3284 -1071 -685 -206
605 -206 1609 2869 4628 5048 6037 6090 5525 5365 4586 3657 2443 71 -878 -2707 -3501 -5293 -6547 -6593
623 -6593 -6873 -6021 -5638 -3693 -2970 -2200 -449 877 2778 5656 5472 7028 7360 7587 6087 5632 4651 3240
641 3240 1912 -617 -1843 -3940 -4881 -6447 -7324 -7451 -7684 -6664 -5793 -4211 -2033 -1183 1469 2394 4502
658 4502 6164 7431 7523 7840 7172 6718 6039 3344 805 116 -2356 -3817 -6195 -6356 -7325 -7325 -8006 -7097 -6547
677 -6547 -4088 -3525 -612 777 2914 4954 6250 7499 8386 9192 7880 7074 6012 4553 2750 1077
693 1077 -2609 -3668 -5068 -6914 -8325 -8584 -8930 -8020 -6952 -5610 -3595 -1325 675 2767 4286 5970
709E970J843L0m1J22N18k046j618j139k569j949k562j432j538j305j223O30R20
726g389J73J711J551J873J991K705J432J872Q53J906m16L33p6j802j450j911k892
743D64j757j703j319j659j923n37j93J51J082J977Q84K346J316K200K878J571
759E778K94K184J1j21J58j143j499j744k058k175k118k152p47j695j388M55k3
776g983J017R47K149K079J046K006J920J762J420J192K35l88l8j054j027j241
792D042k193j230l105j455j694j506q06O88k14Q69J090P36J725K413K344J522
808C226J082K189l25J493R9l43j023q99j193j552k792j348j672j364j599r94k17
825g232K21M99J70J903J022K275J440J778J763J278R69J326o14M82j073j161r76
$$ plain form
709 5970 7813 7843 7802 7924 8442 6396 4778 3639 1070 -879 -3441 -4873 -6411 -7716 -8939 -8309 -7389
726 -7389 -7216 -5505 -3954 -2081 -90 2615 4047 5919 6772 8678 8262 8595 8519 6717 5267 3356 464
743 464 -1293 -2996 -4315 -5974 -7897 -8434 -8627 -8476 -7394 -5417 -4533 -2187 -871 1329 4207 5778
759 5778 6072 8256 8267 8146 8304 7161 5662 3918 1860 -315 -2433 -4585 -5332 -7027 -8415 -7960 -7983
776 -7983 -6966 -6019 -3870 -1791 -745 1261 3181 4943 6363 7555 7790 7402 7364 6310 5283 4042
792 4042 1849 619 -2486 -3941 -5635 -7141 -7947 -7259 -7473 -6604 -5514 -4778 -3053 -640 1704 3226
808 3226 4308 6497 6172 7665 7764 7421 6398 5499 4306 2754 -38 -1386 -3058 -4422 -6021 -7015 -7232
825 -7232 -7011 -6512 -6342 -4439 -3417 -1142 298 2076 3839 5117 6086 7412 6798 7280 6207 5046 4070
842D070k035j044k335j519j183j271j308J39L49k5N79J229J292J352J771J909
858A970J823O02J484P20K0M34j369l53r45j685j480k001j240m85k155n25j629
875f814Q10l21R02J124N75J750K344J016J544M62K274n6M22n0j188n73q35k39
893C147k534q60j146j860J94k132J95p21J57O33J061M71J625P51J994J280J003
910C258L18J570j37J510j733L54j587j675m81o30j897j476p20q84o90n03M97K73
928d633J757J62O50J410M62K325L50O97O19j79J292l9p26p58p52j746p86l09j633
947a837k60j523q39m44O01K04P21J53J071J016J166J659K55R96Q68J71p7O04q55
966C650o57j323j21q69q37r96j324m52l16m07l15j21M73J61R84P66J695R26R07
$$ plain form
842 4070 2035 991 -1344 -2863 -4046 -5317 -6625 -6486 -6137 -6162 -5583 -4354 -3062 -1710 61 1970
858 1970 3793 4395 5879 6599 6619 7053 5684 5331 4386 2701 1221 -780 -2020 -2505 -4660 -5185 -6814
875 -6814 -6004 -6325 -5423 -4299 -3724 -1974 370 1386 2930 3392 5666 5610 6032 5982 4794 4221 3386 3147
893 3147 613 -247 -1393 -3253 -3059 -5191 -4996 -5717 -5560 -4927 -3866 -3395 -1770 -1019 975 2255 3258
910 3258 3576 5146 5009 6519 4786 5140 3553 1878 1397 767 -1130 -2606 -3326 -4210 -4900 -5403 -4906 -4633
928 -4633 -2876 -2714 -2064 -654 -192 2133 2483 3180 3799 3620 4912 4873 4147 3389 2637 891 105 -204 -1837
947 -1837 -2097 -3620 -4459 -4903 -4302 -4098 -3377 -3224 -2153 -1137 29 1688 1943 2939 3807 3978 3901 4505 3650
966 3650 2993 1670 1549 680 -157 -1153 -2477 -2929 -3245 -3652 -3967 -4088 -3615 -3454 -2470 -1704 -9 917 1824
985A824P48l92K074n19r8p35J05l33j604K16p84k166m23l33n90p4m63r9L42O36
1005b668N18J216M03J386j72J335n6J251m71n64Q66l84J88j018n56j199n86o36
1023a147k51j103r9O64j18q97N54R60m93Q37J022L90P74J659p54L88l7k41o77
1042A431M18p1l60j195p70N3m80m87o33M21n57m0L77N51j72O60O07k3J008Q56
1062A594o74J650n94q3k56L58j017K53k95p66k27q11J95k61r80N52j069N09J77
1081a745p0P38L33J139L96k09Q91P5k40K64q22Q13j47l43m85J38q53l08j333l57
1101b125Q20N06j530Q97k2O78M1J05L49J86O96J43k73J227m71N31k89l21K67q26
1121E89R65j290N08j106O0j244j90J96P00j009P20J89L92k81M13MR96l00r1J105
$$ plain form
985 1824 2572 2180 4254 3735 3637 2902 3007 2674 1070 1286 502 -1664 -2087 -2420 -3010 -3084 -3547 -3646 -3304 -2668
1005 -2668 -2150 -934 -531 855 683 2018 1962 3213 2742 2178 3044 2660 2848 1830 1274 75 -511 -1147
1023 -1147 -1398 -2501 -2600 -1936 -2054 -2951 -2397 -1437 -1930 -1093 -71 319 1093 2752 1998 2386 2349 2108 1431
1042 1431 1849 1778 1418 223 -547 -494 -974 -1461 -2094 -1673 -2230 -2270 -1893 -1342 -1514 -854 -247 -270 738 1594
1062 1594 920 2570 1976 1893 1637 1995 978 1231 936 170 -57 -868 -673 -934 -1914 -1362 -2431 -1922 -1745
1081 -1745 -1815 -1077 -744 395 791 582 1473 1548 1308 1572 750 1563 1416 1073 588 726 -127 -435 -1768 -2125
1101 -2125 -1305 -799 -2329 -1432 -1454 -776 -735 -630 -281 -95 601 744 471 1698 1227 1758 1469 1148 1415 589
1121 589 1554 264 772 -334 -274 -1518 -1708 -1512 -812 -1821 -1101 -912 -520 -801 -388 -384 612 312 221 1326
1141A326m32k39K02K82l98n75j59j40N42j86j646P55j34j11J90p0p05R68j3O4
1161d79K66P05j54N11k79N78n26N02L20J35o7n10r77L72r81L67J21k72k55r88
1181a611R69o12K52m20P47K62M61J4k25N10o2Q49n79J62J7L05J49l07Q4k23j143
1202d01L37l78J80j9o55p85J774n76n78N94M11o69J32L22O50L45j69J72L6N56
1222A279J62o86j88n82P91n12M8k28j403K70m84K14K17K21J99m21M74K08N21j09
1242iK03L55M16J2l56J7O24k0R2k66k28n89q99P83o50l22n95O29pM45j886J866
1264c85l04K96n04J050K91j47L36K65m83J155j153L38k66M37j135k09K15j23m10
1283g36K13p92M81M62r73O48j14J08Q1J141m58K56M53k5j37L29O86n56k9j48K52
$$ plain form
1141 1326 894 655 857 1139 741 166 7 -133 409 223 -1423 -668 -802 -913 -723 -793 -1498 -530 -543 -479
1161 -479 -213 492 338 849 570 1148 622 1124 1444 1579 1512 1002 25 397 -584 -217 -96 -368 -623 -1611
1181 -1611 -642 -1254 -1002 -1422 -675 -413 48 62 -163 347 285 1134 555 717 734 1039 1188 881 965 742 -401
1202 -401 -64 -442 -262 -281 -936 -1721 53 -523 -1101 -507 -96 -765 -633 -311 339 684 515 687 723 1279
1222 1279 1441 755 567 -15 776 264 312 84 -1319 -1049 -1533 -1319 -1102 -881 -682 -1103 -629 -421 100 -9
1242 -9 194 549 965 977 621 638 1262 1242 1334 1068 840 251 -648 135 -515 -837 -1432 -803 -810 -365 -2251 -385
1264 -385 -689 -393 -897 153 444 297 633 898 415 1570 417 755 489 926 -209 -418 -203 -326 -736
1283 -736 -523 -1315 -834 -372 -1345 -697 -811 -703 -622 519 61 317 770 745 608 937 1623 1067 1038 890 1142
1304A142r94m1j90m40J25mj067o4J97J179j321Q84oK7J709o21o97R19K16N22k09
1325A266n50N09p20k28j8J036j299J66p12o14n19N00m73P02m63Q40q1M02Q6L7
1345a33N90n7P73l26J10J10m9K98n21J37m08p67O05p95J38j173P97o21K84M05
1365f03n93M85L89K07J3M58K86l47J085L1Q1p24P77q19L69j014J7Q7n52Kj174
1386a539P84l23o38Q71K6k67J65L11J179o73R97q26P95M70j99L75O3r06J83r9
1406G49j28R3j171j00L57k75L95j372L12O37n35M34m90P59Q01L39L06j046J044
1425A109j23L21L2l43k83%p58M57j92k15j61o14J35q64K11M0N27j74O92l76q5
1446f64R22L47m08J266l81M21r10J5P0K89l6q84L6p50M56q09o51Q68N16m06P9
$$ plain form
1304 1142 148 107 -83 -523 -398 -402 -1469 -1533 -1336 -157 -1478 -594 -600 -573 1136 515 -182 737 953 1475 1266
1325 1266 716 1225 505 277 259 1295 -4 162 -550 -1164 -1683 -1183 -1656 -954 -1417 -577 -658 -256 -170 -133
1345 -133 457 400 1173 847 957 1067 1018 1316 795 932 524 -243 362 -433 -295 -1468 -671 -1292 -1008 -603
1365 -603 -1196 -711 -322 -115 -102 356 642 295 1380 1411 1492 768 1545 726 1095 81 98 185 -367 -365 -1539
1386 -1539 -755 -1078 -1716 -845 -819 -1086 -921 -610 569 -104 893 67 862 1332 1133 1508 1571 665 848 749
1406 749 621 714 -457 -557 -200 -475 -80 -1452 -1140 -503 -1038 -604 -1094 -335 466 805 1111 65 1109
1425 1109 986 1307 1339 996 713 713 -45 412 220 5 -156 -770 -635 -1499 -1288 -1248 -721 -895 -203 -579 -664
1446 -664 258 605 197 1463 1082 1503 593 608 678 967 931 47 83 -667 -211 -1020 -1671 -803 -287 -693 -614
1467f14K14N05q36L82M68k68Q67J14O9o09N80j48L55p6n03K01j539J601q80m69
1487e86K08j217P99K33K57o14O85N21omj009N72M14r5J048q9M1L50j223Q41r03
1508B23K16j12j124J008j138J13L00k01l41K46N19k71L61k00J030m42J019q03
1526D03P03m56K5J02J69k8m06K24q43j66J14p60o5M00K58M8j325J336q40J035
1546g2m09j29O60J70N18k23P02p4m84o85R31k7o41L81p41m1q43M37L53j201Q03
1567f15o00M82k0R88P6N07m73l89P23N28J24j59p25O69l73j109N9R21r74j98k41
1588g99Q46o78L77J76j005J186j060N15J44j28R72K27m09K78q8j68J61k8M48j44
1608H23l70o07P3l00R6M06p28j87K06L24P3r0m73Q76J42j03l59O83m18R57K39
$$ plain form
1467 -614 -400 105 -731 -349 119 -149 718 832 901 292 872 724 1079 1003 500 701 -838 763 -117 -586
1487 -586 -378 -1595 -796 -563 -306 -920 -235 286 280 276 -733 -161 253 158 1206 1117 1158 1508 285 1126 223
1508 223 439 327 -797 211 -927 -814 -514 -715 -1056 -810 -291 -562 -201 -401 629 187 1206 403
1526 403 1106 650 675 777 946 918 512 736 -107 -273 -159 -919 -984 -584 -326 -278 -1603 -267 -1107 -72
1546 -72 -481 -610 50 220 738 515 1217 1143 659 -26 905 878 237 618 -123 -164 -1007 -570 -217 -1418 -615
1567 -615 -1215 -733 -753 235 311 818 345 -44 679 1207 1331 1172 447 1116 743 -366 -307 614 -360 -558 -799
1588 -799 47 -631 -254 -78 -1083 103 -957 -442 -298 -426 546 773 364 642 554 386 547 519 967 823
1608 823 453 -154 -81 -381 -285 121 -607 -794 -588 -264 -191 -281 -754 122 264 161 -198 485 67 1024 1263
1629A263j223J95K36J15j69L74p48L14j162P11J15o93r1k23q9M93P91m81LP3J59
1650c7j89J092m51K64q26p1J138m03m16j78J21j86o6p5J45j50k71K88j01M34j32
1671g0p34O24M18l67L67m37R46q36N24k9K1k18J52p37O43l64p0j21k08J89l18
1692f25J080q68M67p07L84M66n67J19k08L7Q40n05n80Q14O64j073K65n6o07Q08
1712A48j16J35o82M3O87k01n64j20j31K24l5K64P2l91P90l31R5L71N98l47o85
1733a76J40P49n85o64J019k49r08N53O6K24K47m52j83O1k47R39l42N24K06j190
1753b68K88O14m90L90n53M59q10L08N18o52L36j080R58j50M37j249N37M73L44
1772D10J72m78j74Q99r2n15l68K57M98j75l89l3K73p06K71j87L64j06n17M96j03
$$ plain form
1629 1263 40 235 471 586 417 791 43 357 -805 -94 21 -672 -763 -986 -1075 -582 209 -272 -269 -196 -37
1650 -37 -226 866 415 679 -147 -218 920 517 101 -77 44 -142 -208 -283 -138 -288 -559 -271 -372 62 -70
1671 -70 -804 -180 238 -129 238 -199 747 -89 435 406 427 209 361 -376 267 -97 -167 -288 -496 -307 -625
1692 -625 455 -413 54 -653 -269 197 -370 -251 -459 -422 418 -87 -667 147 811 -262 3 -53 -660 148
1712 148 32 167 -515 -472 215 14 -550 -670 -801 -577 -612 -348 -276 -667 123 -208 -113 258 856 509 -176
1733 -176 -36 713 128 -536 483 234 -674 -121 -55 169 416 -36 -219 -158 -405 534 192 716 922 -268
1753 -268 20 634 144 534 -19 440 -370 -62 456 -196 140 -940 18 -132 305 -944 -407 66 410
1772 410 582 104 -70 829 737 222 -146 111 609 434 45 12 285 -421 -150 -337 27 -79 -596 -100 -203
1793b03l85J136l12m71N76k99J02K11L14o11n9L20m87K97m8k99N50r85J428o16
1813A59j6n6j61p45J139n05L61R1k14j06L97k1k25K26K3n18L24P9j43o25O28n88
1835d96R05on77K78k7M6j69K65J15n1J80j89k69r9j44Q80o29n07j64O65l00j5
1857c08P41n05k4O9P5l48M45j69N81n56k64L38k11j65J76J02K61K37n61J22L09
1878C45m70L65r4o75P46m53N41J58p64l78L66K89L66j56m55N40o92N36n95N88
1898A08J27k29n86P52j85R8J40o19P91k38p64P87j31m23L36k62J74O6L20j062
1918h00R50Q9K2ql86k30P29q26q2Q55n2p35J17J043r21N58l88j93J80j45m7K23
1940d7J16L1m30L56po70Q94m53J33O87j40o68p50N16L92l70Q89j521R54L09l37
$$ plain form
1793 -203 -588 548 236 -235 341 42 144 355 669 58 -1 319 -168 129 81 -218 332 -653 775 159
1813 159 143 87 -74 -819 320 -185 176 267 53 -53 344 323 98 324 347 -171 153 232 89 -536 92 -496
1835 -496 409 403 -174 104 77 123 -46 219 334 283 463 274 5 -94 -238 642 13 -494 -658 7 -293 -308
1857 -308 433 -72 -96 -27 48 -300 145 -24 557 1 -263 75 -136 -301 -125 -23 238 475 -86 36 345
1878 345 -125 240 146 -529 217 -236 305 463 -301 -679 -313 -24 342 186 -269 271 -421 115 -480 108
1898 108 235 6 -580 172 -13 85 225 -394 397 159 -605 182 51 -372 -36 -298 -124 -58 262 -800
1918 -800 150 239 261 253 -133 -363 366 -460 -542 313 261 -474 -357 686 -235 323 -65 -258 -78 -223 -270 -47
1940 -47 69 100 -330 26 19 -651 243 -210 -77 610 470 -198 -948 -432 -40 -410 479 -1042 -88 221 -116
1961a16Q96p37j21P85r31J34J8K32K12ln5m94k0j2L16k80L32k94L73j216J84N37
1983b60O8m09L04N18j185L62R83l71K00M93m25j00o84O79j57RP18j293P57n33
2003c26N30p01L96o4L63k61l47K39j03J42r76J612r08O78j7k68N8L09n47L49J87
2024C45Jp48P60j54j54l71N56j86K73Q8r1N0r43O96p24J055j002N71k6K66m20
2045a58N14k39M6m99P9O24n99N78J17k97m2j92O0l76J55M7l82O26k04j08J92P80
2067G22m01k12j14L17n26K45O29p49J78O18q02K53k99j04Q00j457P06K86M54J09
2087F53n23Kj67l64M42k93J103n53p38Q65R6j65m33O8J87j06OL83j004K95n0N05
2109B09j60n45Q08M47J5q91M36l35K00J25l82K2M5O73r31p1M28K84K01j086J156
$$ plain form
1961 -116 780 43 -78 707 -224 -90 -72 160 372 369 314 -180 -200 -212 104 -176 156 -138 235 -981 -797 -260
1983 -260 -192 -601 -297 221 -964 -602 381 10 210 703 278 178 -506 173 16 25 743 -550 207 -326
2003 -326 204 -497 -101 -165 198 -63 -410 -171 -274 -132 -1108 504 -404 274 257 -11 47 356 -191 158 345
2024 345 346 -402 358 204 50 -321 235 49 322 410 319 369 -574 122 -602 453 -549 22 -4 262 -158
2045 -158 356 117 163 -336 -257 367 -232 346 463 166 124 -68 -8 -384 -229 -182 -564 62 -142 -250 -58 722
2067 722 321 109 -5 312 -214 31 660 -89 89 707 -95 158 -141 -245 555 -902 -196 90 544 653
2087 653 130 132 -35 -399 43 -250 853 300 -438 427 523 358 -75 -7 180 74 80 463 -541 -246 -296 209
2109 209 49 -496 312 759 774 -117 319 -16 184 309 -73 -51 -6 667 -264 -335 93 377 578 -508 648
2130F48j265J015n86N21n47l9J33L5mj66L7P6o79l13J069J83Q5L55m42k43pN4
2152h0j33n40M77J48J83M14n69k99K54r9J37m05L23J82J63j9L11p9k75j61J63
2173I6K88J60p28k12K9M35m68p99R60n12J67J54L81j05q0J59m47M66O4M96o38
2194a34N60r82Q71j56j58N1l84K79M74m66J62j72L1k2J92L10p49O23n21P1n12
2215f32L59R14j146J118j214J236j048J013q39N87k24k2J38l60n09P07k84M81
2233B75n05l04K05j41J028j196L46L22J83q41L08R50l26K09o3j31M82o74K14m27
2253h6N87m06m53N18l52j41k93M04M72p41J257p95Q19j79o5Q2n32j01M60l70N19
2274F04r00k52M76J56j44r52J096o06j98M88P54p19l34K04P54l80J88J71j07L47
$$ plain form
2130 648 -617 398 -188 333 -214 -253 -120 -85 -89 -255 -218 -142 -821 -1134 -65 118 203 558 116 -127 -134 -80
2152 -80 -213 -753 -276 -128 55 469 -100 -399 -145 -244 -107 -512 -189 -7 156 137 448 369 94 -67 96
2173 96 384 544 -184 -396 -367 68 -400 -1199 -239 -751 -584 -430 -49 -154 -234 -75 -522 -56 8 504 -134
2194 -134 426 -556 315 159 1 52 -332 -53 421 -45 117 -55 -24 -46 146 456 -293 330 -191 -120 -632
2215 -632 -273 641 -505 613 -601 635 -413 600 -239 348 124 102 240 -120 -629 78 -206 275
2233 275 -230 -534 -329 -470 558 -638 -292 30 213 -628 -320 630 304 513 450 319 801 127 341 -86
2253 -86 501 95 -358 160 -192 -333 -626 -222 250 -491 766 -29 790 611 546 628 96 -5 455 85 604
2274 604 -296 -548 -72 84 -60 -1012 84 -522 -720 -232 522 -197 -531 -327 427 47 235 406 299 646
2294F46p23J118o70o08O72M7n93j04Q22o39r9K50k9p4k35l8j67J11L53j99J5L71
2316B27m35J80k48K84J09l56k8O3M58k44J89oN99%j132L06m55M57p94N76M81j30
2338A01Mm29j9p25Q94j74j36j15P88j44m05Q32n28O78n25l02M44j09K29l03o8
2359a2o10J026o73n38J441k17o11N11q76Q73l91q0P8J208j218L06K66o31N05m63
2379a06l53n7Q84m61j067R68O19p00N93n46m54L47N66o32L28j34R73q89L4L49
2399B62N61j106N38l0O0J05q16O11p94J084j279K69n0M4J364j243N05j65l94R1
2419c83L4Q19K47k90m05K61m21k0N60m44l5j55L09m4n45N26n57kL42J00k22L25
2441@m94Q05o06J202o66l07O12L5k34q3j38O34n99L29o41k54P33o8k04j2r20J309
$$ plain form
2294 646 -77 1041 371 -237 435 482 -111 -215 607 -32 -131 119 90 16 -219 -257 -424 -313 40 -159 -144 227
2316 227 -208 -28 -276 8 117 -239 -267 -204 254 10 199 193 792 792 -340 -34 -489 -32 -826 -250 231 101
2338 101 105 -324 -343 -1068 -174 -348 -484 -599 189 45 -360 472 -56 622 97 -205 239 130 359 56 -12
2359 -12 -622 404 -269 -807 634 417 -194 317 -559 314 -77 -157 -79 1129 -89 217 483 -148 357 -106
2379 -106 -459 -516 368 -93 -1160 -192 427 -273 320 -226 -680 -333 233 -399 -71 -205 768 -121 -87 262
2399 262 823 -283 255 225 285 390 -426 185 -609 475 -804 -535 -585 -541 823 -420 85 -80 -474 -383
2419 -383 -349 470 717 427 22 283 -138 -158 402 -42 -77 -232 77 33 -512 14 -543 -545 -203 -103 -325 0
2441 0 -494 311 -295 907 241 -66 546 581 347 264 126 760 161 490 -151 -405 328 260 56 44 -876 433
2463D33J27q38L46j76j34L01o04Q0K63N85o7k33N26j375J07Q72m29J100j523Q0
2483e59N81l35j96Q14J8p87m30O77J0P42p68l88J576j150K43r0O86n46J03k41
2503d0n58P13L40m39l6M97p90J34k04J04k43J194j75k39l96P47j91q42P37p52
2523d39P75m62k26Q82q28L31N06q06M19m5J41l4l47k21L7P00n46O59k88r6J48
2544B60l47O41k23o48J182j141J11N69k62Q70o55q89L64p64J210m00J11P89q18
2563d0K8l11j5R45l14m54Q27q31J16J25n2M37j093J004n13O45l21l3K57m80R03
2584H30m85P45j025j78J62k72O89q52J07J083j18o9k04n34N50j40k44L64p01O96
2604D04KQ8k87m32j19M40n46Q56l53j00K52L1K00l06k51j94L37O1l04L9P91j041
$$ plain form
2463 433 560 -278 68 -108 -242 59 -545 -465 -202 383 316 83 609 -766 -659 213 -216 884 -639 -559
2483 -559 22 -313 -509 305 323 -464 -894 -217 -207 535 -233 -621 955 -195 48 -42 644 98 201 -40
2503 -40 -598 115 455 16 -20 477 -313 -179 -383 -279 -522 672 497 258 -138 609 418 -424 313 -439
2523 -439 336 -126 -352 530 -298 33 539 -267 152 107 248 214 -133 -354 -317 383 -163 496 208 112 260
2544 260 -87 554 331 -317 865 -276 -165 404 142 1012 357 -532 -168 -932 278 -122 -11 778 -40
2563 -40 -12 -323 -338 607 293 -161 666 -165 -49 76 24 461 -632 372 -141 504 183 150 407 -73 830
2584 830 345 1090 65 -113 49 -223 466 -386 -279 804 686 617 413 -121 429 289 45 409 -292 404
2604 404 406 494 207 -225 -344 96 -450 406 53 -47 205 236 436 130 -121 -315 22 83 -221 -182 609 -432
2626d32J074k97o84L51NO6p17R74n31Q9K78K22j8Q5k04P07j362L83l10K8n98J703
2648H12r72j4L41k4n06L44Jk58L08q36R54o87P67j04l07M94m00K80o6r8Q50k515
2670a636K018p86M37l10P14m36o6o01M55J386j556L84p16M58k24j57J109m92k78
2689b97L84j73p10N16j13P64l66M69m27m52l2P05o58L51p38J184O01p98j52K08
2709B66p48N30P20j063r0Q5J369l47m11m32L17p2j99L57q25N29N24k13K39J76
2729G12k19Q18j324N99J56J54o65o57N79K34m63j4K81k74j262J597j052R96j53
2748D3n6M16j119M44j25L52L11L65k40j32j185R58N25m45l23J08k99j95N97k45
2768b45p3O53m37l67J348j138l30O95n35K89k98N33R28n42p15Q53K18p77n98O53
$$ plain form
2626 -432 642 345 -339 12 17 83 -634 340 -191 -102 176 398 380 465 261 968 -394 -11 -321 -293 -891 812
2648 812 -160 -174 167 143 -363 -19 -18 -276 32 -804 150 -537 230 126 -181 313 -87 193 127 29 879 -1636
2670 -1636 382 -404 33 -277 437 1 -65 -666 -211 1175 -381 3 -713 -255 -479 -636 473 -19 -297
2689 -297 87 -86 -796 -280 -393 371 5 474 47 -405 -437 268 -390 -39 -777 407 1008 210 58 266
2709 266 -482 48 768 -295 -385 -300 1069 722 311 -121 196 124 -75 282 -543 -14 510 297 536 712
2729 712 493 1311 -13 586 742 896 231 -426 153 387 -76 -90 191 -83 -1345 252 -800 196 43
2748 43 -13 403 -716 -272 -397 -45 266 631 391 259 -926 32 557 112 -211 -103 -402 -597 0 -245
2768 -245 -318 335 -102 -469 879 -259 -589 106 -429 -140 -438 95 1023 481 -234 619 837 60 -538 115
2788A15k48j34K00M66n19M59l7j193J298r81P06J29l60M75l83L05k38k12L96o32
2808c88N20M31r33L86k30k83K4M23J20J08J30k65M0l01K25l59J22O60l66K31o30
2829c35N20k5o76N28M5j40N03j101N24k42J54J35K87p06Q80o06N80j81m5J47q51
2850f05K13M07K61j027j59P77J41m13J89l3L1J055r63K96l15J23l39K01q0Q19
2870E79r13J132p80m4p0J34K26L0k75l2K48k52j78R79j79o95K85m54K5N31l00
2891cK86O09q47o5l64R04k94q4m87J93m68N59k13L24q4J61n29J664j714Q11k33
2912A26k07l02K3K57M04J23p81N93L8L47j503Q77J92j99q1o7J91r52M26N60n62
2933d97L45J103p22Lj36o7L55o71n36P37k8n5N40K16o81K47r13L92k0P8J71P3
$$ plain form
2788 115 -133 -267 -67 399 -120 339 302 -891 407 -574 132 261 -99 376 -7 298 60 -152 244 -388
2808 -388 132 563 -370 16 -214 -497 -473 -50 70 178 308 43 83 -218 7 -352 -230 430 64 295 -335
2829 -335 185 160 -516 12 57 -83 420 -681 -157 -399 -245 -110 177 -529 351 -255 325 144 99 246 -605
2850 -605 -392 15 276 -751 -910 -133 8 -405 -216 -249 -218 837 -126 170 -145 -22 -361 -160 -240 579
2870 579 -334 798 18 -26 -96 38 264 294 19 -13 235 -17 -195 784 605 -90 195 -259 -234 297 -3
2891 -3 283 892 45 -20 -384 520 226 142 -345 -152 -620 -61 -274 50 -34 127 -402 1262 -452 359 126
2912 126 -81 -383 -360 -103 301 424 -357 236 274 621 -882 -5 187 -12 -93 -160 31 -921 -495 65 -497
2933 -497 -152 951 229 232 96 29 384 -287 -823 -86 -114 -169 371 587 -94 153 -760 -368 -388 -310 -139 -66
2955f6n7J00P1M4j08J27q52P30k55Q18j029K61j86k70J401m01n22n40K39Q57m79
2976a17P5N99k38o54N76l30O75n41n25N71r8R7n36P72q0l98q5Q90j094L60O4q9
2998a06N20K83l41m50L19n53N4k5L68Q88j299P36q84K94P32k66k02O6k17m67J45
3019d05j09Q95o56N08K26r2k93J99R37r21k46l70M64l20O72J19o31l14K76L04
3039B43n29J68j2l57P73N66n28j64Q7l79o88O13k40P43l57o48O00P29o02j2P58
3060G64p77K29l57k8m31K01J40L95K93n82n09P94r1j99K24m06L98N60r16J71J76
3081D9L94j202O30j20M71p17J06j50N30K05k10L20K69Mk58m30J70K61n17l39L76
3102a58k34L09k03m87J154k32J17n31O32j261J014k78Q4m60M85n13J83N9Q29p02
$$ plain form
2955 -66 -123 -23 48 92 -16 111 -741 -11 -266 552 -477 -216 -402 -672 729 328 -194 -734 -495 362 -117
2976 -117 -42 557 319 -335 241 -89 586 45 -480 91 -7 90 -446 326 246 -152 -237 653 -441 -81 -17 -106
2998 -106 414 697 356 -94 225 -328 -274 -299 69 957 -342 394 -490 -196 536 270 68 134 -83 -550 -405
3019 -405 -514 381 -275 233 459 367 74 273 1210 289 43 -327 137 -183 489 608 -23 -337 -61 243
3039 243 -286 -118 -130 -487 286 852 324 160 247 -132 -820 -207 -447 296 -61 -709 -109 620 18 6 764
3060 764 -13 216 -141 -169 -600 -399 -259 136 429 -153 -662 132 41 -158 66 -340 58 618 -298 -127 49
3081 49 443 -759 -129 -249 222 -495 -389 -539 -9 196 -14 306 575 579 321 -109 61 322 -195 -534 -158
3102 -158 -392 -83 -286 -773 381 149 266 -265 367 -894 120 -158 -74 -534 -49 -562 -379 -320 509 -193
3122a93L96K56K03k09m24n6L41j30N9L49m98N0q38J524p47k31q65J308j418Q76
3142b47m04R38J16N08j381J158n03l58J46p33J384m36k79l57L39J31o1K31K46
3161D38p77R31m40K92j114J060q68K77K08K14K39K05l94k73K20l57L91L61n08
3180A05n98N99Q6q11J168j092J042j122O38j98p6M55L59k49r38N29J46P3k81M08
3200B43l7m31N20j04n56O52o93J017m05J60j96J69J34l30N71k07o19K2o46R14
3220A78n35K31M20J20o21m97L10N53K2m3M3o0o51Q02n56K75n54J244p71l59K82
3241a67J76m0k31K5N32n29N22j88k20J59m66M66n64Q79o85P3J63K37N83o48L56
3262D33K3r13K76L9J148m44m27M61r46m3j2L91j72N2J54l30L75M24m21N90j6o57
$$ plain form
3122 -193 203 459 662 453 29 -27 314 184 243 592 94 144 -694 830 83 -148 -1013 295 -1123 -247
3142 -247 -651 287 403 911 -470 688 185 -173 -27 -760 624 188 -91 -448 -109 22 -39 192 438
3161 438 -339 592 152 444 -670 390 -478 -201 7 221 460 665 271 -2 218 -139 252 613 105
3180 105 -493 106 192 -619 549 -543 499 -623 15 -183 -259 196 555 306 -632 -103 43 116 -165 243
3200 243 206 -225 295 191 -365 287 -406 611 206 366 170 339 473 143 714 507 -112 -90 -736 178
3220 178 -357 -126 294 414 -207 -704 -394 159 181 138 181 121 -530 272 -284 -9 -563 681 -90 -449 -167
3241 -167 9 -31 -262 -237 295 -234 288 100 -120 39 -427 39 -525 354 -331 -258 -95 142 725 77 433
3262 433 456 -457 -181 -142 1006 562 135 596 -350 -393 -405 -14 -186 -134 20 -310 65 489 68 658 642 -15
3284a5L1k08O19o59J76K14l69L95l41J23r9k19N32j76k98N88j41m85N56k72K02
3305A54N0n71N92n82P50m67q68J122j42K84l66k6p02J47N24L16p62N84N69q14
3325b08j2m00J222p43k77J30n33P24k69R16n88O7n39J16Q27o21K90M0o65M20k28
3346c31N5L56l71j66R66q49k03j14R2K45J85P07j224N30m32P48O4L7k56J40J27
3367C06K30j115nJ031kJ07j41n32o91Q34J65o13Q40k70K75j221N36J67n1M96m15
3388f9L55L2r8k7k69N08j30L80p46n03O31J40p09Q30j61J4l48m95J487m96k10
3409A16l08R1K8k32M27J42J91p33q93J327J28n82L37l26K71M7M61J15j20Pl92
3430A02j01kp44P09J00K55m56l19J55L34m3Q96j387J075l89l37M31n60J19j1l13
$$ plain form
3284 -15 16 -192 427 -232 -56 158 -211 184 -157 -34 -133 -352 180 4 -294 294 153 -332 224 -48 154
3305 154 204 -367 225 -357 393 -74 -942 180 38 322 -44 -70 -772 -625 -101 215 -547 37 606 -208
3325 -208 -220 -620 602 -141 -418 -288 -821 -97 -366 550 -38 29 -510 -394 433 -188 102 142 -523 -103 -331
3346 -331 -276 80 -291 -457 509 -340 -543 -657 -565 -320 -135 572 -652 -122 -554 194 258 295 39 179 306
3367 306 536 -579 -584 447 445 552 411 -121 -812 22 187 -426 414 144 419 -802 -266 -99 -150 346 -69
3388 -69 286 318 220 193 -76 432 302 682 -64 -567 64 204 -505 325 164 178 -170 -665 822 326 116
3409 116 -192 -101 -73 -305 122 264 455 -278 -1171 156 284 -298 39 -287 -16 31 492 607 487 494 102
3430 102 1 -1 -745 -36 64 319 -137 -456 -301 33 -10 886 -501 574 185 -152 279 -281 -162 -173 -486
3451d86j27O03o57K58Q30N0j159J183l39j29N98l67J18p00K71m65K59K49J39J23
3471B52J47n65Q03p06q79J259o03K77L19p37Q30J57n74k83M10m25k66O51J00k59
3491i2L41j75n2N48o01M21m54Q22q17J73o03R04l05l48Q44o28Q41p40k37J98L3
3512G3P3K61j86L08m33P39j778J214k75l25J47n19O55J2N61j79K14l96n27L63
3532BO80l98q29N88M83j014L30J40m58O58k33n17K61N62k64M44o30M04j83K22
3552B48M4m53P77j55j002L16K62J75P8m78N6n86J447o42j3J46np1J60Qk2m62j5
3575a87N00j276J102m89K00n66L84q2j10Q55Q4m42K1J81J39qp50R36Q47j007p16
3596c84O96k43J82r2j79N87m31j75j77J41l68J0K23O33p65j20N56l28J82J17L22
$$ plain form
3451 -486 -613 -10 -667 -409 421 471 -688 495 156 27 625 258 376 -324 -53 -518 -259 -10 129 252
3471 252 399 -166 637 -69 -948 311 -292 -15 304 -433 397 554 -20 -303 107 -318 -584 67 167 -92
3491 -92 249 74 22 570 -31 390 -64 758 -59 114 -489 415 110 -238 606 -22 819 79 -158 40 73
3512 73 146 407 221 529 96 835 -943 271 -4 -329 -182 -701 -46 -34 527 348 562 166 -361 2
3532 2 682 284 -545 43 526 -488 -158 -18 -476 182 -51 -568 -307 255 -9 435 -195 209 26 248
3552 248 292 -161 616 461 -541 -225 37 212 290 -188 -132 -718 729 87 74 220 215 144 304 312 290 -172 -187
3575 -187 313 -963 139 -350 -150 -716 -332 -414 -524 331 415 -27 -6 175 314 306 -444 492 1339 332 -384
3596 -384 312 69 251 159 -20 567 136 -39 -216 -75 -443 -433 -210 423 -342 -462 94 -234 -52 65 387
3617C87p03R6k79Q0J60N44Qn64p4P75k36m04M98n00K80O29J06p70J70n89p37O74
3639d49K89R44k8l73o44Q68k41n14N55m61J76K52m95M50q43Q66K33l21l32k75
3659c43p6M83J72L77o01J6j91n8N97l15m96j77J141m20p3P8n54N34nk97p00O22
3681b86K51k01L80J38m09K30K07l49lm64K27J94J52p61L45O6m05J262p76j99M3
3702c58O6R1j67O03o90P64j007N35j34O15k1l21j55L90L67n84M56k03l31M55q35
3723d64k8O03n97J45P19J14m11l09k39K91L38o3l60N97o74K39M56K61o01J71J96
3744C84j8k00l29q1j73l20J214L68q14L4M86J85r83m10J040K9n50L83Q11r72n29
3765d45m7K06j10N99q30R0J25Q74%l90l54N84j61p4k24q62J726o62j91P35n33
$$ plain form
3617 387 -316 -220 -499 -419 -259 285 293 -271 -345 430 194 -210 288 -212 68 697 803 33 203 -386 -1123 -449
3639 -449 -160 784 756 383 -261 607 366 -148 407 -54 122 374 -121 329 -514 352 585 264 -68 -343
3659 -343 -419 64 236 613 12 28 -163 -221 376 61 -435 -612 529 109 36 114 -440 94 89 -208 -908 -286
3681 -286 -35 -236 144 282 -127 103 310 -39 -42 -506 -279 -85 67 -694 -349 -283 -688 574 -202 -401 -358
3702 -358 -292 -201 -368 235 -455 309 -698 -163 -297 318 297 -24 -179 211 578 -6 450 247 -84 371 -464
3723 -464 -492 111 -486 -341 378 492 81 -228 -467 -176 162 99 -261 336 -338 -99 357 618 17 188 384
3744 384 366 166 -163 -244 -417 -737 477 845 31 65 551 736 -247 -657 383 412 -138 245 1056 84 -445
3765 -445 -492 -286 -396 203 -627 -537 -412 462 462 72 -282 302 141 67 -157 -1019 707 45 -146 589 56
3786E6M28p11j0k3K88O5m80K47K8j86n8Q53l79r5M14n22L50p22M96P1j35j21N24
3809C78l77M13k23O0j24m5M72J66m93Q74r76L86p24L37R5MK99r69O34o55L81O61
3831E74m7j202N58J99p15P98l48N13l75J44n27K74O72l30p38J102j061J76J13
3850b20J13K84Rm84M21j63o3j8k72L16L88j247O39O03j76L40m3m79J0Q0q10K0
3872g52J199R0Rn42P05o83J09L30o49K9q72J530m45K19l69J69q90P91M1j27l22
3893d30J204m64j25k06q35P86r38J169j262P25K25p0Q4J85J73n62Q39m93l20Q73
3913E58j072Q31K4p78J296n25n95p6N05N72r41K8j04j01K69k56O38m20J48L99
3933D00m99O21K24j028Q9O64k76m89M35P32j422K84N61q70M82p4P02J75n78n64
$$ plain form
3786 56 484 -227 -237 -260 28 93 -387 -140 -112 -298 -356 497 118 23 437 -85 265 -457 39 110 -25 -146 378
3809 378 1 414 191 251 127 82 554 720 227 1101 125 511 -213 124 219 223 522 -447 187 -468 -87 574
3831 574 527 -675 -117 82 -633 165 -183 330 -45 99 -428 -154 518 188 -550 552 -509 -333 -220
3850 -220 -107 177 186 -298 123 -40 -103 -121 -393 -77 311 -936 -297 306 130 470 427 -52 -42 38 -772 -752
3872 -752 447 537 546 4 709 26 135 465 -184 -155 -1027 503 58 277 -92 77 -813 -22 19 -108 -430
3893 -430 774 310 185 -21 -856 -70 -1008 161 -1101 -376 -151 -221 -137 48 221 -341 498 5 -315 558
3913 558 -514 317 341 -437 859 334 -261 -337 168 740 -201 -173 -277 -378 -109 -365 273 -147 1 400
3933 400 -99 522 746 -282 -193 471 195 -294 141 873 -549 -265 296 -574 -92 -166 536 711 133 -431
3953d31n7P81J18j266J209K26m43l67J26m33R33j55j30r9R0J90l44N09K66j073
3973c50P6J21N44n23k58K83J67K69m51K0o5L49j11j10j89k2Q68o87m21L63Q2K86
3995B41n17K15k56m37M16J30O94r9J23n53k03P14k56o16M43k99J20O95q19L68
4015A04M06l04r01M97J106q70K67m71K76k64O2J10j85O10k14p49J193k91l96O7
4035E3J30k37L89J84n31K54l68M88n77N84K46p05J99o16R61q0k8R00r90p34m35
4056i13R83j91o18J184N55j576R96k79J19K99J38n62l89N9P37m57M9k71R2k48
4076b93k02N70l04k63L78J45p17Q70R19p25l88l99K43l13P2K60K61j71j32j97
4096c86N20P49j461J224m98J08j186R17l23Q46m88l00J01N13l24Q9L56q69m72
$$ plain form
3953 -431 -488 293 411 -855 354 580 137 -230 -104 -537 396 241 111 12 102 292 -52 457 723 -350
3973 -350 -274 -153 391 -132 -390 -107 60 329 -122 -102 -167 182 71 -39 -228 -250 618 -69 -490 -127 -45 241
3995 241 -276 -61 -317 -754 -338 -208 486 387 510 -43 -246 468 212 -404 39 -260 -140 555 -264 104
4015 104 510 206 -695 -198 908 38 305 -166 110 -154 -92 18 -167 443 229 -520 673 382 -14 53
4035 53 183 -54 335 519 -12 242 -126 362 -215 369 615 -90 109 -507 454 374 346 1246 256 -478 -913
4056 -913 70 -121 -739 445 1000 -576 420 141 260 559 697 135 -254 -195 542 85 134 -137 -45 -293
4076 -293 -495 75 -229 -492 -114 31 -686 184 1103 378 -10 -409 -166 -479 -407 -147 114 -57 -189 -386
4096 -386 134 883 -578 646 148 256 -930 -13 -336 510 22 -278 -177 336 12 101 457 -412 -884
4115h84R59P73j380P93j62j7l9M30n61k16j21Q5M35j95k61O56o80q3L09M2l34
4136d51N54p9l5Q8j55o04N03K26N2j8L29m93Q14r87M68m56P07q43N28J83n34J11
4158i2K78L93j005P96n95K96K95J44o37M25l69n8N14l53m18k91N11J1l32J48L44
4179EJ09qq80J333o85L33l30P9q1K20k77L98l26M18N4l34l93j36J49R29n72Q47
4201H52j91k52m48p32J115k85J75l64l2O27j74r00J75l16R60R65j492K80o5k47
4221c49j02L19k4j05K92n53k84J718r84K60J46n5k33J21K9N61n02r34P04K63l71
4242h3n01J328r36p03Q44M87p49L02M91o73O60J84m33L76l99M07r23N0l82J118
4262D65n42k8j93O75m23Q5j96N47j130J319j230J109j165M12O46l79k11l59J361
$$ plain form
4115 -884 75 848 -532 261 99 82 43 473 -88 -304 -425 -340 95 -100 -361 295 -385 -468 -159 -117 -451
4136 -451 103 24 -11 77 -78 -682 -179 47 99 81 410 -83 731 -256 212 -244 463 -380 148 331 -203 -92
4158 -92 186 579 -426 370 -225 71 366 510 -127 298 -71 -129 385 32 -386 -677 -166 -155 -487 -339 5
4179 5 114 106 -774 559 -126 207 -123 -44 -125 95 -182 216 -110 308 362 28 -365 -501 -352 577 5 852
4201 852 661 409 -39 -771 344 59 234 -130 -162 465 291 -609 -434 -750 210 1175 -317 -37 -102 -349
4221 -349 -451 -132 -156 -261 31 -522 -806 912 -72 188 334 279 46 167 196 757 255 -679 25 288 -83
4242 -83 -584 744 -192 -895 -51 436 -313 -11 480 -193 467 651 218 594 195 602 -321 -271 -653 465
4262 465 -77 -105 -298 377 -46 39 -157 390 -740 579 -651 458 -707 -295 351 -28 -239 -598 763
4281G63p52o24O37j36N61m8q53Q12j220K47N60j19J42m5K63J9l33J90J57K51j59
4302C13j9j97J18o9q87K48J98K65j007O99P6J01l53k25O22P4L04o54O26jq20N83
4324em30k10K87J084m38l26j28M6J30o9l15O37l57k16N93M68l35J55q69R81j61
4345E22l07j40M5k45O57j059l24R75n7J54j42j05M72p43L05k6m11J049r91n1o1
4366d83J082p17L78mq52O60M33q39Q04r72M75l22J17m80K99J47J36M35m51K94
4386A40M28J40p23l88N98Kk23J57m30N79O70j032K35l85J513j427M5L35p17J20
4406c63O6N22n88R37Oo62M17o68M79Nl42M86K86r17N15l01J35J10l77L9p99J204
4428A90J87l42q01M44l8J58J44K31k50O57j013L33O05m67o67N38o03M37J033j065
$$ plain form
4281 763 11 -613 24 -112 449 401 -452 360 -860 -613 -53 -172 -30 -75 188 207 -126 64 221 472 313
4302 313 294 97 215 146 -741 -493 -295 -30 -1037 -338 -262 -161 -514 -739 -117 -43 261 -393 233 232 -588 -5
4324 -5 -435 -645 -358 726 288 -38 -166 -120 10 -59 -374 263 -94 -310 283 751 416 571 -298 683 522
4345 522 215 75 120 -125 532 -527 -851 124 67 221 79 -26 446 -297 8 -18 -429 620 -371 -422 -483
4366 -483 599 -118 260 256 -596 64 497 -342 462 -510 -35 -357 -240 -720 -421 -274 -138 297 -154 140
4386 140 568 708 -15 -403 195 197 -26 131 -299 280 950 -82 153 -232 1281 -146 -101 234 -483 -363
4406 -363 -297 225 -363 574 580 -82 335 -333 146 151 -191 295 581 -336 179 -122 13 123 -254 -215 -1014 190
4428 190 377 35 -766 -322 -360 -202 -58 173 -77 580 -433 -100 505 38 -629 -91 -694 -257 776 -289
4448b89Q79n40M75l44n93Q76r78j37M13j7QN1L68j88L17l11R65j596O72q8O89
4469F32p65m60N57k10k90J21L88j81N76p48M34k38l68K67R60j256J090m13M75
4488E71L10r48P3J6L0Qk90K57O11j266L62K72L2j028J012k32L61o69N56l11L32
4509E9m74J713j273k45k9J50k79j20O34m34J188p90j65L60l11l48P9J42O4N36
4529D57q37O65P1J86m92j46N41p81j19N64R33j120l22M86L13q2L8k54p0K48k27
4550E2N85r61M38l36l92Q17M65q63J20k68N98k46M70j019J63M57k90k06L89L18
4570B91l27M08k54k05o6l38L32m88m1R14l60O7R8Q89j483O65p61J38M60Q2K97
4591C18l52n16L02L23J88l71K14m35K90O48l96k8J00L56l28J29o92m37P21L49
$$ plain form
4448 -289 590 50 525 181 -412 464 -514 -651 -238 -255 -247 -196 172 -16 301 -10 955 -641 31 -57 632
4469 632 -133 -593 -36 -246 -536 -415 -27 -208 368 -380 54 -184 -552 -285 675 -581 509 96 571
4488 571 881 -67 6 22 52 60 -230 27 638 -628 -266 6 38 -990 22 -210 151 -518 38 -273 59
4509 59 -415 1298 25 -220 -249 -99 -378 -498 136 -298 890 100 -65 295 -16 -364 -285 -143 -79 457
4529 457 -380 285 356 542 50 -96 445 -336 -455 109 1042 -78 -400 86 399 317 355 101 31 279 52
4550 52 637 -324 114 -222 -614 203 668 -195 -75 -343 255 9 479 -540 -377 80 -210 -416 -27 291
4570 291 -36 372 118 -87 -153 -491 -159 -647 -688 226 -134 -67 31 920 -563 102 -659 -521 -61 21 318
4591 318 -34 -550 -248 75 263 -108 106 -329 -39 609 213 185 285 641 313 442 -250 -687 34 383
4611C83O2r46M63O6n6n43K29J82N56j174O25n58P34n90J844r71N37k34o08j8m06
4632d23q2J21p9M16K29K03p94j33O50R13j554P0J225r25O9k25l98O43K95L1k71
4653a9N01q05K03k43O46O60q49l01L55N6L91p24l67J190o25j35J76j23J40K45
4673C72k83m80n27J154K01K53m82J99L47n5r26k46J33M63N29M1n36J85n31LQ02
4694F16j186M45O0r2Q7m9K52M67n66o20K70J0L65p67Q7Q03OK44p29j35M44K34
4716B46j42J7n25M40j23J66j0R1j54r5J38k75O73j155P44P0P54l8Nq22N0N92q40
4739a93J75n2k09j6M85r1L17l02k85r90J225j54L99L00p69K10J61K76l69N36k8
4760F26j134J387j574K31N29k50J326j081r1L76j030Q63N7p16M81P4m5n20O39
$$ plain form
4611 383 445 -501 -38 28 -28 -571 -342 -160 396 -778 -153 -711 23 -567 1277 306 843 609 1 -17 -423
4632 -423 -505 -384 -463 -47 182 385 -409 -542 108 1021 -533 -463 762 -163 -94 -319 -717 -74 221 252 -19
4653 -19 482 -323 -120 -363 283 943 94 -207 148 204 595 -129 -496 694 69 -66 110 -13 127 372
4673 372 89 -391 -918 236 437 690 208 407 754 699 -227 -473 -340 123 652 693 157 342 -189 -186 616
4694 616 -570 -125 -65 -157 -70 -119 133 600 34 -586 -316 -306 59 -708 -621 182 188 432 -297 -432 12 246
4716 246 104 121 -404 36 -87 79 69 160 6 -89 49 -226 447 -708 36 106 860 822 827 5 55 647 -193
4739 -193 -18 -70 -279 -295 190 99 416 114 -171 -1161 64 -90 309 609 -160 50 211 487 118 654 626
4760 626 -508 879 -695 -464 65 -185 1141 60 -31 345 -685 178 235 -481 0 74 29 -491 148
4779A48N36p49L44l42O94J2m06o19J58PL38M38r5R2K93j260K72J22J91K7m02P54
4801E53p50M79q28P20l35L28K15k23L88o26M21j07n07N26n65j71L88J87L46J25
4821E64j068N92m95L02K06J78j19j61M04l85K64l25r4K81m34O6K89p76M36K76
4841AP1n87J011p65J96K79M66r26j37N45n54m3L17J016j757Q31K78j65m59J107
4861G25J0n62O5m47L18J34o60N03P32m44m34L4Q23j120P13j149O93J2J71l36N41
4882C22O4O09q59n06N21r0k27K46l73l6J24l16N59j13M71j95L68m67j8n71K11
4903b76K15k66j98Q00jN95j511J29O76J49J27j56k66m88N84k24L98k16l96R44
4923F19r66J049r39O27j58M9o87O84o28K42p94J310o61J129q48K46q7p73M79l6
$$ plain form
4779 148 684 -65 279 -63 631 643 237 -382 -224 -217 121 559 464 556 849 -411 -139 -17 174 201 -201 553
4801 553 -197 282 -546 174 -161 167 382 159 547 -79 342 235 -272 254 -311 -482 -94 93 439 564
4821 564 -504 88 -407 -105 101 279 160 -1 403 18 282 -43 -137 144 -290 -224 65 -711 -275 1
4841 1 72 -515 496 -269 -73 206 672 -254 -391 154 -400 -443 -126 890 -867 -36 242 77 -382 725
4861 725 735 173 238 -209 109 243 -417 86 818 374 -60 -26 797 -323 390 -759 -66 -54 117 -219 322
4882 322 386 995 136 -370 151 61 -166 80 -293 -329 -205 -521 38 -75 396 201 569 102 84 -487 -276
4903 -276 -61 -327 -525 275 274 869 -642 -513 163 312 439 283 17 -471 113 -111 287 71 -325 619
4923 619 -347 702 -237 390 232 281 -406 278 -350 -108 -902 408 -253 876 28 274 187 -586 -107 -143
4943a43K28K81o5j54j95n6K28K61l22j46j26j2j24J10mJ152j399J04M00J45om01
4965b44L45J99L52K03l43o04K56L74O9n46L65j18j55j59M45j72o74R20o93K06
4985B6j92M77m88K19p66R42j36j35L24m44K93p17L8O30r58R34K16o69O55K56n97
5006i2NJ42m16J000o70K6j42M1O52j032L43l0N5L99m45o7J0r0j30K74l46N34q9
5029f8N71K8j197R49L9N23q05J27o6n93P63r93N10M09J12q27M18K54j06r3Q9j82
5051a38P59r83M43p78J046m14M4K06J1o1n59P55j72rk81L2N66j37Q4q05m40R19
5073H8j55n37J367m47L09j053K2J080o12J15k91k47J75M33p39Q04L1j164P8Q64
5093A21J1p8n24K25M60Q3J29o38P21m96K24K63n79k59N44n4m53L08k03J88O1M78
$$ plain form
4943 -143 85 366 301 147 -48 -104 124 385 63 -83 -209 -221 -345 -235 -239 913 -486 -382 18 163 157 -244
4965 -244 101 300 652 855 512 -92 164 538 607 61 426 308 153 -6 439 267 -407 513 -180 26
4985 26 -166 311 -177 42 -724 218 82 -53 271 -173 120 -597 -559 71 -887 47 263 -406 249 505 -92
5006 -92 -87 55 -361 639 -31 -5 -147 -106 546 -486 -143 -173 -118 281 -164 -231 -221 -311 -441 -167 -513 21 -68
5029 -68 503 531 -666 283 322 845 40 167 101 -492 271 -722 -212 197 309 -518 -100 154 48 -45 44 -138
5051 -138 621 -362 81 -697 349 -65 -21 185 196 135 -424 331 159 150 -131 -99 467 330 414 -391 -831 88
5073 88 -67 -604 763 316 625 -428 -406 674 62 177 -114 -361 -186 247 -492 312 343 -821 -743 121
5093 121 132 54 -470 -245 215 298 427 -211 510 14 238 501 -78 -337 207 153 -300 8 -195 -7 54 532
5115E32j98Ko32j07M3l23J030M11m13m3N5J49m39m90M24N22r9m28K29J97r92M89
5137h1j90q2J107n9j172Q01j29J78o52m37L48P24l17L06j024J377k04q05R00n13
5157G6r3k0j85l82O76K89p00M22O55j31o17R8K24o01P43Q73j219p55Q13o33O81
5178B14J78l10J99n16k77K41L06l62J239m51n12k7j015P88j85Q35o64o39Q07O74
5198E23k03J88p15M63j59j24P67r85M98k91N81j10n75L53n69L06m22Q32l19m68
5218d29J42M73j96j22L97j086Q93l15J77k22P24Q9m10l39O60p85P91k26l88p2
5238b44l89Q27rJ18l2l55M7L64J26K07o69O9m96J068j544J180K63r54L93j94J015
5259G91n78m83J00M79l7K37m17k91K47O4j20l39n37K36N38N50j44o79L83O44j397
$$ plain form
5115 532 334 336 -296 -403 -360 -683 347 758 345 302 357 506 67 -423 1 523 424 -4 225 422 -570 -81
5137 -81 -271 -353 754 695 -477 324 195 373 -279 -716 -368 356 39 345 -679 698 494 -311 589 76
5157 76 -17 -37 -222 -604 72 361 -339 83 738 607 -10 88 312 -289 454 1327 108 -647 166 -467 214
5178 214 392 82 281 -235 -512 -271 35 -327 912 461 -51 -78 -1093 -305 -490 345 -319 -958 -151 523
5198 523 320 508 -207 256 97 -27 740 -245 253 -38 543 433 -142 211 -358 -52 -474 358 39 -429
5218 -429 -287 186 -10 -132 265 -821 72 -243 -66 -288 436 525 115 -224 436 -349 442 216 -172 -244
5238 -244 -633 194 185 303 271 -84 -37 327 453 660 -9 60 -436 632 -912 268 531 -423 -30 -224 791
5259 791 213 -270 -170 309 272 509 92 -199 48 112 -8 -347 -884 -648 -110 440 296 -383 0 644 -753
5280g53P11M01o70Q6l77j66R99n87J93O39j36p81l48Q76N21m10M58m34r52J286
5300E56j017N69J52m48O06r08O11L6O3n23J241j099L3n9M19L55o21o56N31k58
5320d17P05K62l13M16m20k09R1k45k5N84l58j01R0j07j70J73k55P87j69n63K62
5341A8OJ3J03L6j27k2J58l28l85K88k12P80k22l63M10m17k7K27Q41p48p18M41
5363b48j0N77m79O6l17K1j5R32K12j76l49j070J610p62k11q8K52l42L73J43l62
5384b43l12M76n7J7j0l94N07L60n64J155j302O62M1q0p55J041m33j45j64K17l72
5405c55l93R98k82j82J91N28m01q10R70p6j90L35j64M44r80N84q55J30J052k31
5425C13k35k87m15N78o87N27J92K55l03J43M55o28l29J000m57j50R20n38k75M9
$$ plain form
5280 -753 -42 359 -311 -225 -602 -768 231 -356 -163 476 340 -441 -789 87 608 198 656 222 -730 556
5300 556 -461 108 260 -188 418 -490 121 157 220 -303 938 -161 -128 -187 232 587 -34 -690 -159 -417
5320 -417 288 550 237 653 233 24 115 -130 -155 429 71 -30 60 -47 -217 -44 -299 488 319 -244 18
5341 18 24 37 140 176 49 27 185 -143 -528 -240 -452 328 106 -257 153 -264 -291 -64 777 29 -689 -248
5363 -248 -258 319 -160 -94 -411 -390 -405 527 739 563 214 -856 754 -8 -219 -307 -55 -397 -24 119 -243
5384 -243 -555 -79 -136 -119 -129 -523 -16 344 -220 935 -367 295 336 256 -499 542 109 -36 -200 17 -355
5405 -355 -748 250 -32 -214 -23 505 104 -706 264 188 -2 333 169 613 -367 217 -638 -508 544 313
5425 313 78 -209 -624 -46 -733 -206 -14 241 -62 81 536 -92 -421 579 122 -28 892 354 79 128
5445A28k96M53P55k63k1n12o12O36l83J80l81k33O01l91m86J136m94P5N97j481
5465i92R86J54k82j22P53o92k28M21j7K91j58N17p78L70Q1o79o2O31K35K79q79
5486a71p3J24j34K5K72j79m03R64o51l30Q67m63Q34j330O38M74o95R55j098L97
5506B3J96n70O21M35r53m6J032o23R0o49O35N35j58k62q21j17M84Q6J50j10p77
5527g99J087N84q59p37J82O07M20q2n06m2L17m6K96o07l88P51l52N03n29J063
5547H63r21L77m38K04k65k87N36p65J059p41P49p88j89R82l24l85K48O26p21L02
5567A22O74p84j38m38Q23p37L26L05k85O97j134N41M3L28K45k20r98Q05p95J245
5587F25l86k3j2m53N56j326L94O07k92L57ol02O01j046P20m18Q12l75K32K46j157
$$ plain form
5445 128 -168 285 1040 777 756 244 -368 268 -115 65 -316 -549 52 -339 -825 311 -183 -108 489 -992
5465 -992 -6 148 -134 -256 497 -195 -423 -2 -19 272 114 631 -147 223 304 -375 -437 194 429 708 -171
5486 -171 -244 -120 -254 -229 43 -136 -539 425 -226 -556 311 -152 682 -648 -10 464 -231 724 -374 23
5506 23 219 -351 270 705 -248 -294 738 115 205 -444 191 726 568 306 -515 -632 -148 -62 88 -22 -799
5527 -799 288 872 13 -724 -542 65 485 403 -103 -145 172 126 422 -185 -573 178 -174 329 -200 863
5547 863 -58 319 -119 85 -180 -467 69 -696 363 -378 371 -417 -606 376 52 -333 -85 541 -180 122
5567 122 796 12 -126 -564 259 -478 -152 153 -132 565 -569 -28 15 343 588 368 -630 175 -620 625
5587 625 239 216 204 -249 307 -1019 -625 -18 -310 47 41 -261 340 -706 14 -404 408 33 265 511 -646
5608f46J134p88Q71k32m40L13n3l40o6L28l19K18K01O8Q26q64j3j49K27n6o42
5629d22Q15m78L72J41o70O62O49j429J1l01J44J4n6L20J5j75O8O66M47n65K20
5650D48m10J1l05N93l17m03L7K38P87j8m08o99o3N80j48l01l87Q72o91N39m66
5671e11N1N97j129J437l51k45n38P77l21M50J40p02N91n2n92O51M7j90l55J58
5691h7P57l58l68J97k25k45Q57l27q72J34Nk11O25m13J93P30l76P55j497N84N05
5712C63k40L26M03m44k60j095P23K88n47M35k23n7J76j54M29l01M8K20l04K52
5732C8N50o41J39k39R7K78J80l42j74q88J40Q05j17n5L63o53N62k09L0O09k92
5753A81p16N22J191o55J20j55n96L20n9k90k85j30P86p73m4L94M33m99k74M17
$$ plain form
5608 -646 488 -300 571 339 -101 212 159 -181 -247 81 -238 -20 181 249 1075 211 198 49 276 220 -422
5629 -422 393 -85 287 428 -242 420 1069 -360 -349 -650 -506 -492 -548 -228 -213 -388 -320 346 793 228 448
5650 448 38 49 -256 337 20 -383 -346 -108 679 661 253 -446 -509 71 -77 -378 -765 107 -584 -45 -511
5671 -511 -460 137 -992 445 94 -151 -689 88 -233 217 357 -345 246 194 -398 253 300 110 -245 -87
5691 -87 670 312 -56 141 -84 -329 528 201 -671 -537 -532 -743 -118 -531 -338 392 16 771 -726 -142 363
5712 363 123 449 852 408 148 -947 -224 64 -483 -48 -271 -328 -152 -306 123 -178 -130 90 -214 38
5732 38 588 -53 86 -153 -56 222 402 60 -114 -1002 -862 -57 -174 -229 134 -519 43 -166 -136 473 181
5753 181 -535 -13 1178 523 643 488 -108 212 153 -137 -422 -552 234 -539 -583 -189 244 -255 -529 -112
5773a12L28n57l56J499r90r87J239J18N97j101J31N09l5m75O44q71O04pJ89j180
5793h13J133p43M18M77n93O91r78P54r55K49N98m74M28j99M77l74n19L6j64Q51
5813C00p59R33q41J97M95J6k07J39j017J448p15N74J85l45j95k58K69l13M58j89
5833A75j25o88O50M79m35J54n38k20K61M20M99o74M57l43K31r85K22N76J62l99
5853a21M4o36M79M50K98p78K83MJ64l74l2L69j424N63Q81l26L1k4K45L72j013
5874e45Q28l65l98L32L57m99K4Q42J90m10p49j53l35M08J71j03O32N67l48m42
5894DJ94p56J64K71K60m82P77j126M88R7j38L86K3K9l08N58p6L07l30q53N99O39
5916G27m42n23K64q9J60j8K33l17n41K40K73M62r78R6J90m8J85K93n16N04k31
$$ plain form
5773 -112 216 -341 -697 802 -188 -1175 64 182 779 -322 -191 318 283 -192 452 -419 185 178 367 -813
5793 -813 320 -423 -5 472 -121 570 -408 346 -609 -360 238 -236 192 -7 470 96 -423 -387 -551 300
5813 300 -459 474 -367 -170 325 341 134 273 -744 704 -11 563 748 403 208 -50 219 -94 364 175
5833 175 50 -638 12 491 56 210 -328 -548 -287 133 632 -42 415 72 303 -682 -460 116 278 -121
5853 -121 -77 -713 -234 216 514 -264 19 23 187 -187 -219 150 -1274 -711 170 -156 -125 -149 96 468 -545
5874 -545 283 -82 -480 -148 209 -290 -266 576 766 356 -393 -546 -881 -473 -302 -405 227 794 446 4
5894 4 198 -558 -394 -123 137 -345 432 -694 -206 -109 -247 139 162 191 -117 441 365 672 342 -511 88 727
5916 727 285 -238 26 -63 97 79 312 -5 -546 -306 -33 429 -549 -453 -263 -311 -126 167 -349 155 -76
5937g6m9J193q76o26j54J163l68n43o8P32m64P27L40k6r43p8P26o75J31J94n67
5958c07R49r00M86M26j290K84K91J18p66J153l4m46K66ml4j6K62m73M5P61j151
5979c80Q28q2r55O88j63k82L56N87o22L14J8n27J27N95k76j37L24o67P03o70O8
6000a53K22l95P4L96m43P17m85K03q6M36k6l28m75K5K93q91J161m13n10P91q4
6021B9L1J22K35o51O8L81p69P47j99P2J93p94K71R8Q43l06n18L98k54j11K86K3
6043A95p58M60L73l00L87j04M4q4L93m55r05J329j159M96M50n18J56J00n70L95
6063g5M50j277J296n3r84J107p05j40P98j53J02k02p1j67M5m5m64j84J010l71
6083h3o2L58J79K07p79q2K02j19r8R79n48r6k49N62r8p74Q77p24Q05n57n38L76
$$ plain form
5937 -76 -125 1068 192 -434 -588 575 207 -336 -404 328 -136 591 931 905 -38 -116 610 -65 66 260 -307
5958 -307 642 -258 228 654 -636 -352 -61 57 -709 444 410 -36 230 226 192 176 438 -35 10 771 -380
5979 -380 448 366 -589 99 -64 -346 10 597 -25 289 307 -220 -93 502 226 89 413 -254 449 -221 -153
6000 -153 69 -326 -252 144 -299 418 -67 136 50 486 460 132 -343 -318 -25 -916 245 -168 -678 113 29
6021 29 60 182 417 -234 -166 215 -554 193 -6 66 259 -535 -264 -166 677 371 -147 251 -3 -114 172 195
6043 195 -563 -103 270 -30 357 253 297 213 606 151 -754 575 -584 -88 362 -156 0 100 -470 -75
6063 -75 375 -902 394 341 -643 464 -241 -381 417 264 366 164 93 -74 -29 -74 -538 -722 288 -83
6083 -83 -145 213 392 599 -180 -262 -60 -179 -277 702 154 58 -191 371 273 -501 376 -348 457 -100 -638 -262
6105b62L71n65O93l82K0K02j63R74n26LM7j17K6m92L47q52O95L11l2p6m28M77
6127B71j61n8j95p70N65J132m4j207P96p19J99Q16k59k63J35k99J8Q2n79P71l80
6148a49q34K298k040n4J220k76j80O19m94o72O69l7j35k04J38q38J336m14M6M95
6168D94o14j68O74m36j00l29N56k5M21p47j20P14n97L14J99m20PJ18L67q44M19
6189a17J77qj65K36j03l41O18m63O41O19j192o67Q89J6M9o8N07n69q3Q5J88k14
6211C5o3Pj86q6J62K6M11j11n94M93l49M99j68l45M60J98j69P5o18j15m42R80
6233A00n3On20O31m8P2k88j96J01O23L4j160K74J46J96K85o56K91O16o56O17k13
6255B02L08k22l05M37q17O03n41Q64J77l21k92L11q23Q58N5n21n91M33P59P0p59
$$ plain form
6105 -262 109 -456 237 -145 -125 77 -86 888 362 365 412 295 321 -171 176 -676 19 330 298 222 -206 271
6127 271 110 52 -143 -913 -348 784 740 -467 329 -390 -191 625 366 103 238 -61 -43 39 -540 231 -149
6148 -149 -983 1315 -725 -779 441 165 -15 604 110 -562 107 70 -65 -269 -131 -969 367 -47 -1 494
6168 494 -120 -288 386 -50 -150 -479 77 52 473 -274 -394 320 -277 37 236 -184 -177 -59 308 -536 -117
6189 -117 60 52 -113 123 20 -321 297 -166 475 1094 -98 -765 124 140 189 121 628 59 -24 61 249 35
6211 35 -28 -21 -207 -293 -131 -105 306 195 -399 94 -255 244 76 -269 191 389 220 295 -323 -438 -880 100
6233 100 47 53 -467 164 116 188 -100 -296 -195 428 462 -698 -424 -278 -82 203 -453 -162 454 -202 415 202
6255 202 510 288 -17 420 -397 206 -335 529 706 385 93 404 -419 439 494 -27 -618 -185 574 644 -115
6276a15K99M96m33R15j321Q73o21j1K93k63m8l80Q48o02l31J16K60j6l12K49M25
6297C21m70k63M27q5m41O16J02l55N54o2p67k65J087q00L05J34n7O05j172K85
6317c01j054J040O82J14j081N14n3M57l09p42P8Q66k19P5J68j019J165l20J5o32
6337e56L2O39n79Q55o0j40k11L55k79K30r0k86l39J032p43j53Q03o83LM18K13
6358D61k51R5P9j56n87k76l91J184k79M08J24j17l90j57j11K27K79J73p44r43
6378a372J858q69j64K10L21N72q62O43l48K53P36j097J42O33j259Q58k20M59l11
6397A83j86R0Nk18O86j9m98J1J21M28r92K53N55O06j369J22O25l71K54K52r74
6418d36M81m34P02p95P15L6M11r80Q63q8p32p3k44J117j239J270l84j48l99M52
$$ plain form
6276 -115 184 680 247 1162 -159 714 93 82 375 112 64 -316 532 -70 -401 -285 -25 -41 -353 -104 321
6297 321 -149 -412 15 -70 -511 105 207 -148 406 344 -423 -688 399 -401 -96 38 -19 586 -586 -301
6317 -301 -1355 -315 367 481 -600 -86 -139 318 9 -733 -655 211 -8 67 235 -784 381 61 76 -556
6337 -556 -524 115 -464 391 331 191 -20 335 56 286 196 -90 -429 603 -140 -293 510 -173 -170 248 461
6358 461 210 305 384 228 -359 -635 -1026 158 -121 287 411 294 -96 -253 -364 -137 142 315 -429 -1372
6378 -1372 486 -383 -547 -337 -16 556 -306 337 -11 242 978 -119 23 656 -603 255 35 494 183
6397 183 -3 87 92 -126 560 541 43 54 175 603 -389 -136 419 1025 -344 -222 403 32 286 538 -436
6418 -436 45 -389 313 -482 233 269 680 -300 563 475 -257 -330 -574 543 -696 574 190 42 -357 95
6438I5M57n96O08K08q80M6L00j83N57m66k91L74m20L37P6m0o09K18M01Q17j343
6459c34k56P59K23p44P70p88J30p4J22j89N50j01p7Q6L66p49P95j220R44k41J95
6480A67J60r43p1N45J41P8P13r28k5N60o60r53J350j109P64N53o08l26J124l37
6500A95p30k0J366j269Q88k78J42l13l44n26M97J3j21N55M90m09p9J61l54k30
6520c66jL07Q40m55K8m31K6J2m06K18K9L49K2j42n38J56L6L53n69M61N74q67Q12
6543D48j24l19J13k08K67o96M78L47l65n54N15m30Q21j04L8l75Q4P87j77o40Q4
6564a0J00j203R09M3M94m03J5K90j5k23J0j7J04P90r26o9k6N73p57Q72p27Q36
6586F60l02l49lK34k79J29q92L63L04J66L8n80j44M76p5l96Q58k72o20J306j155
$$ plain form
6438 95 552 -44 564 772 -108 -62 238 55 612 146 -145 229 -191 146 222 182 -427 -209 192 1009 -334
6459 -334 -590 169 392 -352 418 -370 -240 -314 -192 -381 169 68 -9 77 443 -306 489 -731 213 -28 167
6480 167 327 -616 -687 -142 -1 77 790 -138 -163 397 -263 -1216 134 -975 -211 342 -266 -592 532 195
6500 195 -535 -555 811 -458 430 152 294 -19 -363 -889 -392 -379 -500 55 545 136 57 218 -136 -366
6520 -366 -367 -60 780 325 353 -78 -52 -40 -446 -228 -199 150 172 30 -508 -352 -316 37 -532 -71 503 -364 448
6543 448 324 5 118 -90 177 -519 -41 306 -59 -613 -98 -528 293 189 227 -148 -64 723 546 -94 -10
6564 -10 90 -1113 -204 -161 333 -70 -55 235 220 -3 7 -10 94 884 -42 -111 -137 436 -321 551 -176 660
6586 660 358 9 6 240 -39 90 -802 -439 -135 31 69 -511 -655 -179 -254 -650 208 -64 -684 622 -533
6607e33J5Q62J54o56J16k04J27O25l63o62Q04P40n17o33l6N33j48l50k96J33J4
6628b75R57m74n83L92M03r50Q05r3l12P69p88M34K51j219O60j53M11P6k94L18
6648C35q67N20p45Q37N31q15M82K69j351J139j451J520p33O47n04k96O35J89l75
6667c3j80O97p60J30k22N15p78Q39J08j71N9q14J454j212O83n07j42L13J198j615
6687d38k07O25M82L05o03k21j09N73o05J207r52J66n4q88N36P21q81L13M11p18
6707c37L5r4K45m75K10N09L15l34M50q59l29K61M19m54O89j482J230R27p46M68
6727F48l00j89K60l69j54j07M08p9l82O05K67j476O67K03L77q00j05R31K53k79
6747C79n11N84k50J12k3j76jl84j8M82j97%j04N45m17p3J71l81P74n7K42k22o05
$$ plain form
6607 -533 -518 344 498 -158 -42 -246 -119 506 143 -519 285 1025 508 -125 -161 372 224 -126 -422 -289 -275
6628 -275 682 208 -375 17 420 -530 275 182 -130 639 -149 285 536 -683 -23 -176 235 311 17 335
6648 335 -532 -12 -757 80 611 -204 278 547 -804 335 -1116 404 -329 318 -186 -482 153 342 -33
6667 -33 -213 484 -276 -146 -368 147 -631 208 316 145 204 -610 844 -368 315 -192 -334 -21 1177 -438
6687 -438 -645 -20 462 767 164 -57 -166 407 -198 1009 57 223 169 -719 -183 538 -343 -30 381 -337
6707 -337 -302 -396 -151 -626 -416 93 408 74 524 -335 -664 -403 16 -438 251 -1231 -1 926 180 648
6727 648 348 159 419 50 -104 -211 197 118 -264 341 608 -868 -201 2 379 -421 -526 405 658 379
6747 379 -132 452 202 314 291 115 114 -270 -288 194 -3 -3 -107 438 21 -52 119 -262 512 455 697 475 -130
6770a30K7p4m24N76n33k36J089k83n63J104n33M24q25l7K40L87k02R8L12l69J01
6791A49m4K04n41J23L69m41l68j69Q16K17p99Q91m80n60R59n37J46M50r09J33
6811c91N88o20O29k80l76O16n0N6m62l07Q20N7M6m00m10M87J49O7l05N99l70J92
6833C35n7K77j401M97R69j119J006l75o1M5J071p29m72O12r52R2kK29J38L09m33
6854b1L2K48r36R50l1p27M94l76j37J089n62l01J83L51p19M91l67N03P1j87L85
6875D33p86O28o5l14o54Q77o7R7n91M15N37o48m07J710j204k73R0J43M76j075
6895f78J60L13P1L08K7j043O40K55o4p98M40O13M87m15m26j60N63L20q73o82R01
6916d1l67Q3P26l33J40j71O89n49q82K90P81m53J66O05j50q92R7N69l65j35M01
$$ plain form
6770 -130 -103 -177 -601 -25 -558 -794 295 12 -551 553 20 444 -381 -418 -178 209 7 105 417 48 149
6791 149 105 309 -232 -109 260 -181 -549 -718 98 315 -484 407 -73 -633 326 -211 -65 385 -524 -391
6811 -391 197 -423 206 -74 -450 166 116 172 -290 -597 223 280 326 -74 -484 3 152 219 -86 513 143 335
6833 335 278 555 -846 -349 620 -499 507 132 71 116 1187 458 -14 598 -354 -262 -264 -35 103 412 -21
6854 -21 11 259 -677 273 242 -485 9 -367 -504 585 23 -278 -95 256 -463 28 -339 164 235 48 433
6875 433 -353 275 210 -104 -758 119 52 149 -442 -27 510 -138 -545 1165 -39 -312 -222 -79 397 -678
6895 -678 -518 -205 -134 174 201 -842 -202 53 -11 -809 -369 244 731 316 -110 -270 293 613 -260 -942 -41
6916 -41 -408 -325 401 68 208 37 726 177 -705 -415 366 -87 79 684 534 -358 -261 308 -57 -192 209
6937B09j27P79n25K94j154Q25L06p78m04L60P1j76K02K83l58O24j596J080l83
6956d68J053l79k38O5J77j62P91m06l57l14j80P21q07P04k91M20j38K92n39l32
6976c88k9L56R6l75K27N27k17M6m50O90o02m02Q89j038J209m95n68M62q90O54
6996b98K90k68Q67K21j308N63k47k06o6O56p68J63O69j87N5J31k54J1r0k46K99
7017a3K05q71M78m89K97J70l04K52j14M77k83j0j22P6k50N18m68N66m5j2l20R12
7039F50j049J249j107k91M03O17o23K82m40M91n5l04p1P81k99k00L27n67j48P28
7059C74n75J508j567p83Q02M68m3J55j22j45j177J029K10n54O78l83j58K24o10
7078f69K44L33k52O16J3j15r0M46l58l38N36m13l14J04J17M20n1n47L52J6J31
$$ plain form
6937 209 82 861 336 630 -524 301 607 -171 -575 -215 -144 -320 -118 165 -193 431 -1165 -85 -468
6956 -468 585 206 -32 33 210 48 839 433 76 -238 -418 303 -504 200 -91 329 191 483 -56 -388
6976 -388 -417 -61 35 -340 -113 414 197 243 -207 483 -119 -521 368 -670 539 44 -524 -62 -952 -298
6996 -298 -8 -276 591 812 -496 67 -180 -386 -452 204 -564 -401 268 81 136 267 13 24 -66 -312 -13
7017 -13 192 -679 -201 -690 -393 -223 -527 -275 -389 88 -195 -205 -327 -251 -501 17 -451 115 70 58 -262 650
7039 650 -399 850 -257 -548 -145 472 -151 131 -309 182 127 -177 -248 533 234 34 361 -206 -354 374
7059 374 -201 1307 -260 -1043 -241 227 184 339 217 72 -1105 -76 134 -420 258 -125 -283 -59 -669
7078 -669 -425 -92 -344 272 285 170 80 526 168 -170 366 -47 -361 -257 -140 280 229 -318 34 50 181
7099A81L53j028J66J166q74j2k4j00O72j10q7M2q41n38J070k45l3K67o17N48M55
7120D11m98k67M1N78m68N69n23m45O67r94J104l61o9M33J8rp20K01k20J001j76
7141B73j75k29K2j92n4K25M70k78l63o18M88M96j04m5K55k46p4N73r65K30M13
7162A02k25j1k51K90L45n34l79Q45q87O00j34m6K0j00J01J03N62j37j69l80p92
7183a077R68J7l36K58O48j58l84J49r8M62m27j28j47M40m4k09L57l66p35J029
7203B19j92nk12k38L97J3K29n34L52j66K54L99J06o23k13P3J2j67M17K19l30k24
7225b14J93m05Q63o96K23L04j68L58J05l69l62N70J94q66k32N80l76j83J068q28
7245b41r6N44J06m03p1M03m22l45j69L23M68l15K82q17O63P0p04J08M44J11j67
$$ plain form
7099 181 534 -494 -328 838 -36 -48 -72 -172 500 390 303 345 -496 -1034 36 -209 -242 25 -592 -44 411
7120 411 -87 -354 -313 265 -203 366 -157 -602 65 -929 175 -186 -255 178 196 187 -533 -332 -552 449 273
7141 273 98 -131 -109 -301 -355 -130 340 62 -301 -919 -431 65 -39 -84 171 -75 -149 424 -541 -311 102
7162 102 -123 -134 -385 -95 250 -284 -663 182 -705 -105 -239 -285 -265 -365 -264 -161 401 264 95 -285 -1077
7183 -1077 -109 -92 -428 -170 478 320 -64 85 -13 449 22 -106 -253 187 143 -66 291 -75 -810 219
7203 219 27 22 -190 -428 -31 -18 211 -323 29 -137 117 516 622 -1 -214 -141 -129 -296 121 340 10 -214
7225 -214 -21 -426 437 -259 -36 268 100 458 563 194 -168 402 596 -270 -502 78 -298 -481 587 -241
7245 -241 -337 207 313 -90 -161 242 -180 -525 -694 -371 97 -218 64 -753 -90 -20 -724 -616 -172 -61 -228
7266b28k92P99k46k17q7P54n5o30Q4L54P3m91l07P36j88o6L33n81l72M98M24j059
7288g64j19J631l46n94K54l2N08j387J007L06K20n84K8k40L83o5m45J54j38j90
7308d13M74L33O8r93N27K75p86P98m06O93j50r13L24k71J61J85K35o10P4Q80l57
7329A28k73N20K15o86N9K93o0m16Q79n53K42k69L38J96k69L80q44L79j60m42k70
7350f13R74p71J36Q94q18J123j026M17J58J79q39L23r52M22K53L77r37N65k0L33
7370A78k88j25r4N31j8M2K28k82n86J96Q70p13N41k14r29N68Q0J91q91M78M56
7391B19n86N28j78k41K91j08L4k27J28J70K29j04n06J453o60r68M95J79l29O4
7411a17L32o44Q51j348J014J27j89j44J73N55q69J99j04r3r0p1R4J33n38M27M70
$$ plain form
7266 -228 -520 279 33 -184 -271 483 428 -202 -118 236 309 -182 -489 247 59 -7 326 -255 -627 -129 295 -764
7288 -764 -883 748 402 -192 62 30 538 -849 158 464 684 100 128 -112 271 206 -239 -85 -223 -413
7308 -413 61 394 462 -531 -4 271 -515 283 -123 570 420 -493 -169 -440 -279 -94 141 -469 -395 485 128
7329 128 -145 375 590 -96 -37 256 196 -220 659 106 348 79 417 613 344 724 -120 259 99 -343 -613
7350 -613 361 -410 -274 620 -198 925 -101 316 474 653 -186 137 -815 -393 -140 237 -700 -135 -155 178
7370 178 -110 -235 -329 202 184 226 454 172 -414 -218 652 -61 480 266 -663 -95 -15 176 -715 -237 219
7391 219 -367 161 -17 -258 33 -75 -41 -268 -140 30 259 155 -351 1102 442 -526 -31 148 -181 -117
7411 -117 215 -429 422 -926 88 215 26 -118 55 610 -259 -60 -164 -257 -347 -418 -324 -191 -729 -302 168
7432A68No33l6R26J32M61k22m32l23k7K12j66O0p96M87k87j57K56M13P3N1o33
7454d68J52O57ol13l9J91k74K38L30q51O5L79n30R61r04K0J05K13N33n21o44J284
7476E78k98j069J52J139l52p03P90k10j24j27O88j008N14l65R8N14K1l05l22j39
7496e28r6K32J76O16q14P9R47q61K45l42O01j88p74R16n41O16q74N24M1p9R55
7517H51n34l54K66rn11J00M27M7n68M92M03m12m12M66k15J63j65k15P38n33N0
7538G5p22L91j57K10p1K45n75P40o87L92k19K82J83l84M30k33O64m36j057N75
7558c54R63n87M8J72l99P68m54m4n11O6kO27m74k78N64n00M79J08k98M69q14J381
7580I30j052J26Mp4k5M67k29K19l28M57n18l52J3L25R61k17j051J10l69L85n66
$$ plain form
7432 168 173 -460 -496 430 562 1023 801 369 46 19 231 65 125 -671 -184 -471 -628 -372 41 114 165 -468
7454 -468 -316 341 335 22 -17 174 -100 138 468 -383 -318 61 -469 492 -412 -392 -287 -74 459 -62 -706 578
7476 578 280 -789 -637 502 150 -553 237 27 -97 -224 464 -544 -30 -395 -297 217 238 -67 -389 -528
7496 -528 -624 -392 -216 400 -414 -335 612 -249 -4 -346 255 67 -707 209 -332 284 -590 -66 -25 -104 851
7517 851 317 -37 229 220 -291 -191 236 283 -285 207 610 198 -214 252 37 200 35 -180 558 25 75
7538 75 -647 -256 -413 -203 -274 -29 -604 136 -551 -159 -378 -96 87 -297 133 -100 564 128 -929 -354
7558 -354 609 22 70 242 -157 611 157 113 -398 -332 -334 293 -181 -459 105 -395 84 192 -106 363 -451 930
7580 930 -122 4 8 -66 -91 376 147 366 38 495 -23 -375 -362 -37 924 707 -344 -234 -603 -218 -784
7601g84P19q2K70k5j94J9j20L22J68j30l12J71n73O38p50K43P27L49k36l30J03
7622A93q7Q36j124m3m29K31K47k82Q60n85q0J00O16j60p2r41Q96K72o53k02P23
7643C16o16N92l09J05p0O3k98K86m89j39J252j136P04l72M29m9Nn28N26l36n21
7664e85R31m09k49N52o82N59O06p17l26J37K40p09N02M08k04r3O0N49r73P4n12
7685h41P50M2j03j71P03o01M95k70l65K47K91j30q7M70r07P94O10m05L15q92K64
7706B09j58L24M9p54M85m71k28j53N98N58o32O17l93L08N00j419P53o01K88k87
7726d07j01P51j00p28J100k77o69J68O20q71N66l94L46n95O34l50%M21K72j33
7746B53n19L68J06R4m22o77P88L58k58L19o62n2P66j00n99N66p11L97k88j09L50
$$ plain form
7601 -784 -65 -147 123 98 -96 -77 -197 125 293 163 -149 22 -551 87 -663 -420 307 656 420 90 193
7622 193 106 942 -182 -225 -654 -423 -176 -458 402 -183 -263 -163 453 293 221 -720 176 448 -205 -407 316
7643 316 -300 292 -17 88 18 81 -217 69 -420 -559 693 -443 261 -111 318 269 274 -254 272 -64 -585
7664 -585 346 -63 -312 240 -442 117 723 6 -320 -183 57 -652 -150 258 54 -39 21 570 -403 -329 -841
7685 -841 -91 -49 -152 -323 380 -221 274 4 -361 -114 177 47 -40 430 -477 317 927 522 837 -55 209
7706 209 51 375 424 -330 155 -316 -544 -697 -99 459 -173 444 51 359 859 -560 193 -408 -120 -407
7726 -407 -508 243 143 -585 515 238 -431 -263 357 -514 52 -342 4 -591 43 -307 -307 114 386 253
7746 253 -266 102 208 302 -120 -797 -9 349 91 410 -252 -304 462 362 -237 329 -382 15 -273 -382 -32
7767c2o52N61J07k3L70o85J092p42N81m48n80P30m49J345j235M81m23j05l53J74
7787b86J4r9R76k89k40k24QJ70j52l19J10N36m99R67n18P6L37j398J84O81j83
7808a48m64O03p7n95L66R19n28m08Q4q3k19Q80o77O10n36K76J08q00O57J06J7
7829I1k12J42L23l59m73K66N86j72k40K15L01J99n85l8o1L9l11m35J613m58j052
7850f21N90M85o26r23J083l4k54P99l05j029J592p13p4n18n7J060n05N55o95N8
7870a32M69j195J55O97P06j494L91Q77j002Q5K3j4K59J147j441R20l61m61O60
7889B89q11J64J59M68r54J065j102M52K23m0K80n80N46k9o78O07K50j36J04j55
7909A22m43R4L05l60J66L49j66N93m78p97R24l37n13M90l35K30P7M05m41m66M1
$$ plain form
7767 -32 -684 -123 -16 -39 331 -354 738 -4 577 129 -451 279 -170 1175 -60 421 -2 -107 -460 -286
7787 -286 -272 -371 605 316 76 -148 -140 30 -122 -441 -331 205 -294 673 155 231 568 -830 -646 35 -148
7808 -148 -612 -9 -86 -681 -315 604 76 -332 -248 -331 -550 330 -347 263 -273 3 111 -689 -32 74 91
7829 91 -121 21 344 -15 -488 -222 364 192 -48 167 468 667 82 44 -17 22 -289 -724 889 431 -621
7850 -621 -31 454 -172 -1095 -12 -46 -300 499 194 -835 757 44 -30 -548 -605 455 -50 505 -190 -132
7870 -132 337 -858 -703 -6 700 -794 -403 474 -528 -443 -420 -434 -175 972 -469 451 90 -371 289
7889 289 -522 -358 -199 269 -685 380 -722 -270 -47 -87 193 -387 159 130 -548 59 309 173 277 122
7909 122 -321 -227 78 -282 -116 233 67 660 182 -615 309 -28 -541 -51 -386 -156 -79 326 -115 -581 -540
7930e40O58l07L62k59P8P76n02n8k35Q2n89K48O7J80M78q77L10j61j38M88J29
7951A90j36j19L69j79o14O76L1jj75k24M90j129J050Pk31j19q0N92l87J34J85
7972C30l11K70o14K54J61K83k71Q9K32nk51o35K39j00J32P09j98K18k67q2r98
7993h15J196O8K62j337N14q12R70m78K38k51Q86p23n48J465r9p00L59m27Q91l70
8013B89R9k9N3m4j99k80M59q14K01Q01o49J81p9R65p63j20M93l56m85P91M8j176
8035f14K92k41R6M07L65j92j60j39l13P36l02L01l73l3j09j04r6q3l06P84j02
8056a86L48m5l89N49m8m37N14M81p38K08R4o54R81o40l7L0o51Q23m76J27J50J37
8078A41j49j39K34M1p7j8l78N90mj260J835r76n67O43k66j42K00P4N73j041J404
$$ plain form
7930 -540 118 -189 173 -86 -8 768 266 208 -27 55 -534 -286 -219 -39 439 -438 -128 -289 -427 61 190
7951 190 54 -65 304 125 -489 187 218 217 42 -182 308 -821 229 236 5 -114 -194 398 11 145 330
7972 330 19 289 -325 -71 90 373 102 191 423 418 167 -468 -229 -329 -197 512 314 532 265 183 -815
7993 -815 381 449 711 -626 -112 -924 46 -432 -194 -445 441 -282 -830 635 536 -164 195 -232 659 289
8013 289 388 359 412 368 169 -111 348 -466 -265 536 -113 68 -11 954 191 71 564 208 -277 514 562 -614
8035 -614 -322 -563 -467 -60 305 113 -47 -186 -499 237 -65 236 -137 -170 -279 -383 -479 -562 -868 -84 -186
8056 -186 162 117 -272 277 229 -208 306 787 49 257 351 -303 678 38 1 31 -620 203 -273 -146 4 141
8078 141 -8 -147 87 128 51 33 -345 245 241 -1019 816 -160 -727 -84 -350 -492 -292 -218 355 -686 718
8099G18N4j069O18n97O54j82Q2k02J051j027j42L9R6l23n41J065K80o28M7k80
8119b87j32N3K68J51j75O64k16j394N25P80l85J00j1l9j21k16N00m62M4M32J03
8140A82n50O11l57L56j38k66J01J99r34J393n17l99M20N69j455J042K41q85O6
8159c21Q87L25q40N81j13j11k02J55m50L26l48J2J6N20j035N63j07J10n10N43
8179Aj71m57J087j071J167p00L49K30l50N68m37r2
$$ plain form
8099 718 772 -297 321 -276 378 196 278 76 1127 100 -42 -3 93 -230 -771 294 574 -54 -7 -287
8119 -287 -419 -366 -98 53 -122 542 326 -1068 -543 237 -148 -48 -59 -98 -219 -435 65 -397 -353 79 182
8140 182 -368 243 -114 242 104 -162 -61 138 -796 597 80 -319 101 670 -785 257 498 -387 -321
8159 -321 566 891 51 632 519 408 206 361 -89 237 -111 -99 -83 437 -598 -35 -142 -32 -542 1
8179 1 -170 -627 460 -611 556 -144 205 435 85 653 216 124
8191A24
$$ Imaginary data points
##PAGE= N=2
##DATA TABLE= (X++(I..I)), XYDATA
0@%%%%%%%%%%%%%%%%%%N6j20J28j28J28j28J44k08K56k59L14l75M01m65N29n96
34c23O85p61Q53r66J085j211J343j489J649j828K025k239K474k725L005l312L648
51A913m019M431m889N399n972O623p373Q243r267J0499j1999J3873j6310J9620
65A0772k4409L1959m5763P9316l25471m25076M25307N61539L26758k09858l72319
76C2755j95191K25280L81994J89934k33680m15981k44388J24098K74973J04870
86B44664k30503l62421j88560J39928K84232J48944j20391k28428q2254J90919
96b03870L13536J87066o7331j86773o9655J52319K39496J02056j37072k43136
106H6636j33516O4172J38044J7844j69716k34364j18091P0163J49719N6052r3827
$$ plain form
0 0 0 0 0 0 0 0 0 0 0 0 0 0 0 0 0 0 0 0 56 -64 64 -64 64 -64 80 -128 128 -131 183 -192 209 -256 273 -323
34 -323 362 -399 454 -512 573 -638 705 -784 865 -963 1062 -1177 1297 -1428 1577 -1735 1913
51 1913 -2106 2325 -2564 2835 -3137 3486 -3887 4356 -4911 5588 -6411 7462 -8848 10772
65 10772 -13637 18322 -27441 51875 -273596 -698672 -273365 288174 614932 405074 32755
76 32755 -162436 62844 444838 634772 401092 -14889 -259277 -135179 139794 244664
86 244664 14161 -348260 -536820 -396892 -112660 36284 -84107 -312535 -394789 -203870
96 -203870 109666 296732 229401 42628 -27027 125292 364788 466844 329772 86636
106 86636 -46880 17292 155336 173180 3464 -230900 -348991 -278828 -129109 -73057 -166884
117a66884j35324j9652J40132J96237J05305l3182q0913O105J24555J48839M8766
128C33984p7519j23201o0243L5011O1300j7268j24875j52985p7303K6087N8257
139a18755M432p0751q2851o018R0746J20504O5000r679k3037L3259R9723J06414
151B08987M0569l9915o4190k0219L1412K7622l2002r4599j00802n3256K891J2722
163h0780k5768o3619n4435j295N5088O5377L4697J744L942M2123P8262P6412L5137
176A66885r793j9380L585K5221J6607k5918o4618p0326m1290j2958j0132l5639
188g7756n6759m6583p205K9600L4247J6984J983J0742M1357O3337N8558K9656
200I8161O126L831J9997K5813J0490j6894m0432m3465k9065j6295k1122l9909
$$ plain form
117 -166884 -302208 -321860 -181728 14509 119814 86632 5719 11824 136379 285218 333984
128 333984 256465 133264 73021 108032 169332 152064 27189 -125796 -203099 -177012 -118755
139 -118755 -114323 -185074 -267925 -273943 -183197 -62693 2307 -7372 -30409 2850 102573 208987
151 208987 249556 209641 145451 125232 156644 184266 152264 57665 -43137 -96393 -93502 -80780
163 -80780 -106548 -170167 -224602 -225897 -170809 -105432 -70735 -68991 -65049 -22926 55336 131748 166885
176 166885 157092 137712 141297 166518 183125 157207 92589 22263 -19027 -31985 -42117 -77756
188 -77756 -134515 -181098 -188303 -158703 -124456 -107472 -105489 -94747 -53390 9947 68505 98161
200 98161 104287 108118 128115 153928 164418 147524 107092 63627 34562 18267 -2855 -42764
212d2764m7349l7623j4215O096J0794M741O8J0869L2942M6672M4180K9493J6886
225F0790J6165K4337K7842J5564p611k4606k6671j7754j5613k2813l5290m1698
237d7358l3693j7141m034l408o872m561O210K3566L2567L0816K4811J9181K1151
250D1235K7410K6634J6818J860q863j1080j0310j1652j9844l0048l2446k9533
262c9819j9268j3434j1010j1771r427J034J2257K1485K2047J8776J8133K0449
274I452K7728K4295J8025P833K0qm465n767j3633k1702k5028k2874j8157j6334
288d0615j5109j6326j1827m053M805J0285J1921J3502J4968J8327K4139K0822
300C0839J7700J1711P656N789J960q85p614j4287j7960j7896j5885j5740j5792
$$ plain form
212 -42764 -90113 -127736 -141951 -135855 -125061 -120320 -120252 -109383 -76441 -29769 14411 43904 60790
225 60790 76955 101292 129134 144698 137087 112481 85810 68056 52443 29630 -5660 -47358
237 -47358 -81051 -98192 -102226 -105634 -112506 -117067 -110857 -87291 -54724 -23908 903 20084 41235
250 41235 68645 95279 112097 113957 105094 94014 83704 72052 52208 22160 -10286 -39819
262 -39819 -59087 -72521 -83531 -95302 -104729 -103695 -91438 -69953 -47906 -29130 -10997 9452
274 9452 37180 61475 79500 87333 87353 87345 82880 77113 63480 41778 16750 -6124 -24281 -40615
288 -40615 -55724 -72050 -83877 -87930 -83125 -72840 -60919 -47417 -32449 -14122 10017 30839
300 30839 48539 60250 67906 73695 75655 74770 67156 52869 34909 17013 1128 -14612 -30404
313c0404j6635j2971p101m98K784M846O673J0876J4128J7294J8029J6051J2224
326C5296R863Q249P229K555j983p891j0632j1270j2694j3733j5135j4566j3577
339c8289q962n944r62o79K506O173R441J2932J3324J3683J1460J0780J0047Q217
353D3727N812R75l368m657o381q569r479j2180j2923j2066r164o611n663k420
367d2967j517K189N441P518R664R262R654J0332R175R618O032M100J384j146l524
382C5215m459p144q112j0564r133q588o823o017n700l110m41K285L840N547O345
397a6859O577Q784P593P566O538N596L110J173K1k350k540n300o899o719p525
412a234o685n295n678m467k474o62J293J777M110M847N305O143N975O056L968
$$ plain form
313 -30404 -47039 -60010 -67111 -67609 -64825 -59979 -53306 -42430 -28302 -11008 7021 23072 35296
326 35296 45159 53408 60637 63192 61209 53318 42686 31416 18722 4989 -10146 -24712 -38289
339 -38289 -47251 -53195 -54157 -54836 -52330 -46157 -36716 -23784 -10460 3223 14683 25463 35510 43727
353 43727 49539 50514 47146 42489 36108 27539 18060 5880 -7043 -19109 -28273 -34884 -40547 -42967
367 -42967 -44484 -42295 -36854 -29336 -19672 -10410 -756 9576 18751 28369 34401 38501 39885 38739 35215
382 35215 30756 23612 15500 4936 -4197 -12785 -19608 -25625 -31325 -34435 -34876 -32591 -28751 -23204 -16859
397 -16859 -10282 -1498 6095 13661 20199 25795 28905 30078 30099 27749 25209 19909 13010 6291 -1234
412 -1234 -7919 -13214 -18892 -23359 -25833 -26495 -25202 -23425 -19315 -14468 -9163 -3020 2955 9011 12979
427A2979L947L327J802k28o26k878m132l167n251m766n750n269k515l783k007
442a8317k43l50J355L026K672L622M842M958K932L427L790K166J870O43j829j137
458A3427k049l201l073l888l814l069l053k634k64j405n23P65K076J870L111K366
474c358L396K464K711K692J278J423m09O24j942p28j976j889k522j225k458l347
490e266l00p73j937N50l99Q62J259J310K217Q78K83L199R84J628J517p81J79N15
508E925p18o52j210j487j67j768j014j2j564j364K74q74M76L29P25o76J311L86
526b080Q82J901P14K76o42J060M47R81j17p11j79j133M11l69p41m84m18j1r03
545a116n72m63J08l81Q72j015O19n18K39J19Q03J61Q02Q81Q11N83j0R24qO64p94
$$ plain form
427 12979 16926 20253 22055 21827 21201 18323 14191 11024 5773 1007 -4743 -10012 -12527 -16310 -18317
442 -18317 -18560 -18910 -17555 -14529 -11857 -8235 -3393 1565 4497 7924 11714 13880 15750 16393 14564 13427
458 13427 11378 8177 5104 1216 -2598 -5667 -8720 -11354 -11618 -13023 -13546 -12781 -10705 -8835 -5724 -3358
474 -3358 38 2502 5213 7905 9183 10606 10197 10821 8879 8151 6175 4286 1764 539 -1919 -5266
490 -5266 -5566 -6339 -8276 -7726 -8125 -7263 -6004 -4694 -2477 -1599 -1316 1883 2867 4495 6012 5231 5410 5925
508 5925 5207 4555 3345 1858 1691 -77 -1091 -1103 -2667 -4031 -3757 -4631 -4155 -3826 -3101 -3777 -2466 -2080
526 -2080 -1198 703 1417 1693 1051 2111 2558 3539 3422 2711 2532 1399 1810 1441 700 216 -202 -213 -1116
545 -1116 -1688 -2151 -2043 -2424 -1552 -2567 -1948 -2466 -2227 -2108 -1305 -1144 -342 539 1350 1933 1923 2847 2839 3503 2709
566B709R9l53mp29n04j384r26m22r87j181J47p44J009o65L31J150j31J408O53
585e24J838O38P72J075O76k05N71j91l84k086K98n02k324j233q97p32j045n24
603d779n09J99K05k23J725M50J174J631K155K85J969J205J293m47M82j109k26
620E480q41k002j513k151m05k423p98j048j493P71J23R4J028J245J863J181J501
637F12Q99L154J098K93J330k94Q7m95j150k018j544j575k244k734j019j14k027
654g741L3nN99O18K120J333J672J800J878K130J232J361Q87o61Q67j228p21j138
672E036k329k587j134l206n02j462j217o08l73K86Q61J215K065K701M43L047J721
689C957K045R95J550m91L30q56p44j612j362l122k263j469j787j120j413j129
$$ plain form
566 2709 2808 2455 2451 1722 1218 -166 -1092 -1514 -2501 -3682 -3535 -4279 -3270 -3935 -3604 -2454 -2585 -1177 -524
585 -524 1314 1952 2724 3799 4475 4270 4841 4650 4266 2180 2478 1976 -348 -1581 -2478 -3210 -4255 -4779
603 -4779 -5288 -5089 -4884 -5107 -3382 -2932 -1758 -127 2028 2313 4282 5487 6780 6333 6815 5706 5480
620 5480 4639 2637 1124 -1027 -1432 -3855 -4653 -5701 -7194 -6423 -6300 -6206 -5178 -3933 -2070 -889 612
637 612 1511 4665 5763 6056 7386 7092 7179 6684 5534 3516 1972 397 -1847 -4581 -5600 -5714 -7741
654 -7741 -7708 -7713 -7114 -6496 -4376 -3043 -1371 429 2307 4437 5669 7030 7917 7256 8123 6895 6174 5036
672 5036 2707 120 -1014 -4220 -4722 -6184 -7401 -8009 -8382 -8096 -7235 -6020 -3955 -1254 -811 2236 3957
689 3957 6002 6997 8547 8056 8386 7530 6786 5174 3812 690 -1573 -3042 -4829 -5949 -7362 -8491
705h491J089p55J025O57J907K022K244K188K150J979R01J226K40p51k19j346m94
722E572r42l082k236j866k192j626j240j211K78L47O09J338J708J597J925K178
738A157K822J510J112J085P41k86n70q03j580r46j668l394j572k325j212o54j194
755g777p35L92K51J507R51K139J847K714K078J931K205J06R83k18o22p51j167
772E834j970j544l154j473j562j212j603p14L7q08R43J020O22L291Q84J901J847
789B339K331R32J665N79M77o88j415j90j679k099j244k749k049j089j487p15n3
806g134k66O32N37N96K283J930J308K017J351J705J657N63Q95j145J58j735r72
823D380k071j850j914j047j937n98k092L79q21k8J743Q90J216J859J412J609K100
$$ plain form
705 -8491 -7402 -8157 -7132 -6475 -4568 -2546 -302 1886 4036 6015 6916 8142 8382 7631 7412 6066 5572
722 5572 4630 1548 -688 -2554 -4746 -6372 -7612 -8823 -8545 -8198 -7589 -6251 -4543 -2946 -1021 1157
738 1157 3979 5489 6601 7686 8427 8141 7571 6768 5188 4242 2574 -820 -2392 -4717 -5929 -6583 -7777
755 -7777 -8512 -8120 -7869 -6362 -5411 -3272 -1425 1289 3367 5298 7503 7609 8592 8374 7752 7001 5834
772 5834 3864 2320 -834 -2307 -3869 -5081 -6684 -7398 -7361 -8169 -7226 -6206 -5584 -2293 -1409 492 2339
789 2339 4670 5602 7267 7846 8323 7635 6220 6030 4351 2252 1008 -1741 -3790 -4879 -6366 -7081 -7134
806 -7134 -7400 -6768 -6231 -5635 -3352 -1422 -114 1903 3254 4959 6616 7179 8074 6929 7087 5352 4380
823 4380 2309 459 -1455 -2502 -4439 -5037 -7129 -6750 -7571 -7599 -5856 -4966 -3750 -1891 -479 1130 3230
840C230J878Q31M95J321n97m99j218r01j993j662j775j081k235l75k413L59N74
857f061l96M94J633J093J632J254K275J22K753K29N07J283j60j92o08j692j941
874B225j386p28j534j274j408j369n38k96O83M37M25J122J373J651J279J791J759
891D212L25L34P80L25L05r22j010j826j294n72j857r11j197j151m6j132r3NJ163
910d562J339M53J101J483J209K478P92O29m25Q10l21M74p68j180j952q48j614
927i02o28j552o94q02j25L48k46Q01K91O67J672J480J62J589Q32R73M02j09L34
946D493m06j63r16j636o01j256q43j229r76m5m22l90K28L30K04J056K77J694J010
965D09R91J264M58N79j96J112j180L24l89j347q60j494l16j320p9o51m93j295
$$ plain form
840 3230 5108 5939 6434 7755 7158 6659 5441 4540 2547 885 -890 -1971 -4206 -4581 -6994 -6635 -6061
857 -6061 -6457 -5963 -4330 -3237 -1605 -351 1924 2046 4799 5028 5535 6818 6658 6466 5858 4166 2225
874 2225 839 111 -1423 -2697 -4105 -5474 -6012 -6308 -5625 -5188 -4763 -3641 -2268 -617 662 2453 4212
891 4212 4537 4871 5651 5976 6281 5359 4349 2523 1229 657 -1200 -2111 -3308 -4459 -4505 -5637 -5730 -5725 -4562
910 -4562 -3223 -2770 -1669 -186 1023 3501 4293 4922 4497 5307 4986 5460 4692 3512 1560 712 -902
927 -902 -1530 -3082 -3776 -4578 -4703 -4355 -4601 -3800 -3509 -2842 -1170 310 472 2061 2893 3866 4268 4159 4493
946 4493 4087 3924 3008 1372 771 -485 -1328 -2557 -3533 -3578 -4000 -4390 -4162 -3832 -3628 -2572 -2295 -601 409
965 409 1400 2664 3122 3701 3505 4617 3437 3761 3372 2025 1165 -329 -645 -1965 -2044 -2695 -3188 -4483
983d483N33K72J017R22r5R07P85J348Q33K92J219l65J81N8m11J32m04r15j910
1002h4o08k09j282k52m23q7n03J452j410J478M11J61K115k78Q59N02J121m72M80
1021B971M13j029k51q30O63j114j225q67k75o53k44K51m09N48q48J296P5R44K26
1040c58R4R69Q7J617p91J073k42p50R21p12o63m26k11j800M40r99R0p0m08n82
1060b721Q72k41Q80P0P83L92M84M54N34N21p38L54K64L87l91p73p85J46k34n46
1080b88j18j164l74K41l30K45j14r9L67J270j64L52O46J54Q10m8O03n4q37J109
1100B207n59j68mj405l23p83K33l47L78q10P90l5J5m68k40N46O27Q06M29l85K78
1121G82R64j117L65J433j986J035r63o40N4l93J76j21l60l91j44l5R09j08M39
$$ plain form
983 -4483 -3950 -3678 -2661 -1739 -1834 -927 -142 1206 2039 2331 3550 3185 3366 3424 3013 3145 2741 1826 -84
1002 -84 -692 -901 -2183 -2435 -2858 -2945 -3448 -1996 -3406 -1928 -1517 -1356 759 481 1340 1842 2963 2491 2971
1021 2971 3384 2355 2104 1274 1937 823 -402 -1269 -1544 -2197 -2441 -2190 -2599 -2051 -2899 -1603 -1528 -584 -358
1040 -358 -264 705 792 2409 1618 2691 2449 1699 2620 1908 1245 819 608 -1192 -752 -1751 -1661 -1731 -2139 -2721
1060 -2721 -1849 -2090 -1210 -1140 -357 35 519 973 1507 2028 1290 1644 1908 2295 1904 1131 346 492 258 -288
1080 -288 -406 -1570 -1944 -1703 -2033 -1788 -1902 -2001 -1634 -364 -528 -176 470 624 1434 1386 1989 1935 1098 2207
1100 2207 1648 1480 1476 71 -252 -1035 -802 -1149 -771 -1581 -791 -826 -811 -1279 -1519 -973 -346 460 889 504 782
1121 782 1746 629 994 2427 441 1476 513 -127 -73 -466 -290 -411 -771 -1162 -1306 -1341 -432 -540 -101
1140a01j608R72J73O79M62j10L59o35J292l24r5L8Lp85P43O0j933N44j41k9j09
1161e45o75L9o12Q54M89K68m22N25L67q77J316L81J2J79L27J40q64L97l78l15
1181F06o23Q8K8r6j436M31O44j86l10p9L95K9nL2k94O60J704o87o67J007J0j07
1203A144l53N28o56J3p31O02j036R5n62o5O57j020M78K41L7J5m5Q02M15p30J31
1224d0M33P82m24J96q40K35J028o94m45M80l31o62pj316J486j67r86n2L17k00
1244a207j01P94J63P73r90J074J43L22K84K63r66O3J079p46p40k68N65l29o57
1263d81m92J69K82o17P5K49n19J69N33P43n30J020k65K56j67P71k24P15p95r2
1283H00O40q22M45j373P06r38n78m08O12j03M81j67k35N57M61o07J118P0l68N0
$$ plain form
1140 -101 -1709 -737 -564 115 577 467 826 191 1483 1159 1064 1102 1105 320 1063 1123 -810 -266 -407 -436 -545
1161 -545 -1220 -1181 -1793 -939 -450 -182 -604 -79 288 -589 727 1108 1120 1299 1626 1766 902 1299 921 606
1181 606 -17 71 99 3 -1433 -1002 -358 -544 -854 -933 -538 -509 -514 -482 -776 -116 1588 901 234 1241 1251 1144
1203 1144 791 1319 663 676 -55 547 -489 -394 -956 -1021 -364 -1384 -906 -665 -628 -613 -658 144 559 -171 -40
1224 -40 393 1175 751 947 107 342 1370 676 231 711 380 -282 -289 -1605 -119 -286 -1272 -1324 -1007 -1207
1244 -1207 -1308 -514 -351 422 -568 506 649 971 1255 1518 552 615 1694 948 208 -60 505 176 -481
1263 -481 -973 -804 -522 -1139 -1064 -815 -1334 -1165 -632 111 -419 601 336 592 425 1196 972 1687 892 800
1283 800 1440 618 1063 -310 396 -542 -1120 -1528 -916 -1019 -538 -705 -940 -383 78 -529 589 659 291 341
1303C41O57q5Q40l76n79K1q1qJ12j027l90l27L9L9J72p04N76m9m67Q8J397l74
1325a85k11J092L64l11L08N43p81j98J042p31P97j653N5l87n0m10k93l59N9J33
1345a176N49j99R78q02K46Q11k85NQ41K88Q3o1k93m77L48k06k82j59l61M6p67
1366h73K50j032j11j09P91N16l49J49J50N57K67j99N48L75j39p40O94m43M82J077
1386A861j447l02N76o96n28k07l92M20j78M85o56L55L37M39ml94N29J16J196m70
1406A040J30n98P98m16j90q86L75k70J84p39m80J71l27R98j114l34J391m57O71
1425e3j29k40J032m03N00J61K11K6k35J243j306o57K68op08Q6p7p27L93P52j354
1446a223l91Q02j95J83O44l82J03R27J63J78M83J9k33k4J71j99n51K01p15j13
$$ plain form
1303 341 998 913 1753 1377 798 819 738 730 842 -185 -575 -902 -863 -824 -652 -1356 -780 -829 -1296 -1208 189 -185
1325 -185 -396 696 1060 749 1057 1600 819 621 1663 932 1729 76 131 -256 -306 -716 -1009 -1368 -1309 -1176
1345 -1176 -627 -826 152 -650 -404 407 122 127 968 1256 1339 1278 985 508 856 650 368 209 -152 -106 -873
1366 -873 -623 -1655 -1766 -1875 -1084 -568 -917 -768 -618 -61 206 7 555 930 791 51 745 302 784 1861
1386 1861 414 112 688 -8 -536 -743 -1135 -715 -893 -408 -1064 -709 -372 67 63 -331 198 314 1510 1040
1406 1040 1170 572 1370 954 764 -122 253 -17 167 -572 -1052 -881 -1208 -210 -1324 -1658 -267 -724 -53
1425 -53 -182 -422 610 207 707 868 1079 1105 870 2113 807 150 418 412 -296 -210 -287 -1014 -621 131 -1223
1446 -1223 -1614 -812 -1007 -824 -180 -562 -459 468 631 809 1292 1311 1078 1054 1225 1026 475 676 -39 -152
1466a52K99j220M68J85m73NJ46j82M51M8M92J78K09p31L06P96N68o32j96L67J59
1487A091j71j068l3J93J62k47j39r56L88P51j301N09L89j91L56J20k8K72N05J3
1507F15K19J97K57m51o60J88N36q33J0j46o71k6l42N87n96K0M89K69M21l24P12
1528D71p35O94K18j52K77O1N59r38P05N51j616r8j17N54r83L30q79M60m46N14
1548e70M17j21o60L98J45O06k96M89p2J025p83m14J033r87L39l12K0J73r84N0
1568e04p9Q40o03k79J78J46r50j09J221L89r1j77M01K68j96L55l20K83L78k76
1588H75q64O21l20q12K84m73J08O80q5L94j041o1K00k16Q16r08P54k50O96p06
1608c08R71o35o36J294K29q55P9j37M15m38n32O91j107O04p50J277l88M75K15
$$ plain form
1466 -152 147 -1073 -605 -420 -893 -888 -742 -924 -473 -425 67 245 454 -277 29 825 1393 761 565 932 1091
1487 1091 920 -148 -181 12 174 -73 -212 -1168 -780 -29 -1330 -821 -432 -623 -267 -147 -175 97 602 615
1507 615 834 1031 1288 837 177 365 901 68 78 -68 -739 -765 -1107 -520 -1116 -1096 -607 -338 83 -241 471
1528 471 -264 430 648 496 773 834 1393 455 1160 1711 95 -3 -120 434 -549 -219 -1098 -638 -1084 -570
1548 -570 -153 -274 -934 -536 -391 215 -81 408 336 1361 578 164 1197 210 549 237 257 430 -554 -504
1568 -504 -583 257 -346 -625 -447 -301 -1251 -1360 -139 250 159 -18 383 651 455 810 490 773 1151 875
1588 875 11 632 312 -500 -216 -689 -581 99 14 408 -633 -694 -494 -710 106 -802 -48 -298 398 -308
1608 -308 663 28 -608 686 915 60 139 2 417 -21 -553 138 -969 -365 -1115 162 -226 249 464
1627D64l54J31j43P18J68j181P42l19l98O36j51J56l3K70k69l06l68J0o4P25k39
1648A95p41L22m17L93M27q98P45L60n77P80j0n19M8L88J95j75q42j44K83M36m18
1669a69k46L42p04M78m69N93m06M84o71M09R84o71l52r9L72M68j8O36n14n6J78
1690E69n13j5j21n82J81O51j005M52l6K40q77N72O69J19n5l87o5n79J062K4q2
1711B22P0Q82l17m57j6J24j34r0j12p23J014j169R81j72k32J58m18L33l95M62
1731A1K4P22n45k74M10k38l61P73m74R9K68n96L82n72K16K49J50l04l41l93R47
1752A53n90k17J145j97m88J60q3L44L35m7J98m44M45j31p7o25Q2q2K27O60o60
1773A08r12J93N77O6j87l17K69J95K72p90N27N65l7m08k93L28K61n73l88q0Q10
$$ plain form
1627 464 110 241 98 816 984 -197 545 226 -172 464 313 469 436 706 437 131 -237 -227 -291 434 195
1648 195 -546 -224 -641 -248 179 -719 26 386 -191 589 579 60 108 496 691 516 -326 -470 -187 249 -169
1669 -169 -415 -73 -777 -299 -768 -175 -581 -97 -768 -359 625 -46 -398 -497 -125 343 325 961 447 391 569
1690 569 56 41 -80 -662 -481 170 -835 -383 -419 -179 -1056 -484 185 304 249 -138 -203 -782 280 304 222
1711 222 292 1174 857 400 384 508 374 284 172 -551 463 -706 275 103 -129 29 -389 -56 -451 11
1731 11 35 757 212 -62 348 110 -251 522 48 147 415 -181 201 -371 -155 94 244 -60 -401 -794 153
1752 153 -437 -654 491 294 -194 -34 -117 227 562 515 713 269 714 583 506 -119 -37 -119 108 768 108
1773 108 -804 -611 -34 32 -155 -472 -203 -8 264 -526 1 566 529 121 -172 156 417 -156 -544 -624 186
1794A86l64N59p75J053k34j33j67k38l0j46Q34J08q30O11p65J53J058r36N19Q8
1814E51k39l58K47o5K16m71j39M96O1M3l9q00l78J94P59o4o3p73L73N81q5j62
1836a15L84P7m76N6j74J11j99K14j85O51N2q1Jn42j97Q33m96j54j02R0M46j91
1858CN35k55r61O78Q6L65n14L74j41J54K13n39O35q43M06N81r30j7M26m86P67
1879E37l32o8K40p16M41p0O79r60K85O67p29O0L92k75l69o39J475q28J38k7O24
1900E25k4n16k35J271k86j200K41K62nj82L51n27J84N87q54J04P07k08K91k34
1920B52q13O06N62l57K5n51p1P23j58K20o72K35l85L22M63k68O0k59N77j231R48
1941B28m84j16K07k52N55k49K76n10l5O43O61q85M06k88P25j462N15k93n6K86
$$ plain form
1794 186 -178 381 -394 659 425 292 125 -113 -143 -289 545 653 -177 434 -331 -178 880 -56 463 551
1814 551 312 -46 201 136 352 -119 -258 238 299 342 303 -497 -875 -681 78 14 -49 -822 -449 132 47 -115
1836 -115 269 346 -130 -74 -248 -137 -336 -122 -307 344 396 315 316 -226 -423 410 -86 -240 -342 -252 194 3
1858 3 538 283 -678 0 86 451 -63 311 170 324 537 -2 633 -210 196 777 -153 -170 256 -230 537
1879 537 205 137 377 -339 102 32 711 -249 36 703 -26 34 426 151 -218 -857 618 -210 -72 -99 525
1900 525 501 -15 -250 1021 735 -465 -224 38 33 -149 202 -325 -141 446 -408 -304 403 195 486 252
1920 252 -561 45 607 250 275 -276 -347 376 218 438 -234 1 -384 -62 401 133 193 -66 511 -720 228
1941 228 -256 -372 -165 -417 138 -111 165 -345 -380 263 924 39 445 157 882 -580 -65 -358 -414 -128
1961a28l63K56P07p0p08m6L3P71l65j45M59n62N23M65p47J03J7L5J18m95k4K80
1983A14l08k5L2M19J60n75M67j331Q01J42N3Q64n04j97P6k23L09N78j631N72L60
2004A53j08l41j591J921k23J81O49o01k85L78K14O3n12m56K97K96M76m01qJ1M97
2025F10n80n27L26M17p59M85l64R19o43k08J42P6N87r20K9O11j003J010k21po96
2046g16J032J58k17j02M13k52q26O27L86K92j295J187k0j069N90o03J047l52m24
2065a44O3m58N77l3j06p52Q33O91j42m79m42Q41j11r70O50r7K42O72j072L79n30
2086c88L1K96J040j500Q45K80j024J67K81J56m24M95k68m66O98R0l8M06o65L83
2106C95j28k97k60P6M43p16N80n24P39N9o87k74K74K65o66N20Q3o4R73j063J066
$$ plain form
1961 -128 -491 -235 472 402 -306 -352 -319 452 87 -58 401 -161 362 827 80 183 200 235 353 -142 -166 114
1983 114 -194 -219 -187 232 392 -183 284 -1047 -246 -104 -51 813 309 112 188 -35 274 852 -779 -207 153
2004 153 45 -296 -1887 34 -189 -8 641 40 -245 133 347 410 -102 -558 -261 35 511 110 102 113 610
2025 610 30 -497 -171 246 -513 -28 -392 527 -116 -324 -182 -106 481 -439 -410 201 -802 208 -13 -20 -716
2046 -716 316 474 257 155 568 316 -510 117 503 795 -500 687 667 -402 188 -415 632 280 -144
2065 -144 -81 -539 38 5 -101 -853 -20 671 529 50 -392 449 338 -632 18 -79 163 835 -237 142 -388
2086 -388 -357 -61 979 -521 324 604 -420 -253 28 184 -240 255 -13 -479 219 309 271 677 12 395
2106 395 267 -30 -290 -214 229 -487 93 -431 308 367 -320 -594 -320 -55 -721 -201 -118 -182 791 -272 794
2127G94q49K77K85o97q2K95m26P70q36J94Q11j057N4K96L98K85q87M38p6k41q0
2148c34M87O6j69j70O50m25Q2k58j5R81j365M11J31p69R8j8M78j02J40o07J206
2169D98J65m80o94k18J530j228P26M99o09j60J45J21l5m10P8P3K43j148R25n93
2189e72O26L51p37R22m70p4k34k09L54N4j86J56J7L93n43j9K54M61p19L77n75
2210c73J16k97Q7L12k63M21j99L4l66J49K63K34p3O19p38NK31L60m9m82P01p21
2232b9o93L99J11j0l6J60k09K06l33Q93k27J07k23j075J204J0J1j62L75p31N58
2253C06P93n84j011O36o9O03l34K66m75k79L14n47M44M7m1j33r0M3n5j42J232
2274I24o07m84R38o42n97j91M51j16J94l84K1J039n07L81m78K9J95J1O9r08k27
$$ plain form
2127 794 -55 222 507 -190 -272 23 -403 367 -469 -275 536 -521 -467 -171 227 512 -375 63 -13 -254 -334
2148 -334 153 219 50 -120 530 105 187 -71 -86 895 -470 -59 72 -697 -599 -617 -139 -241 -101 -708 498
2169 498 663 183 -511 -729 801 -427 299 798 189 29 174 295 260 -150 -72 1 244 -904 21 -572
2189 -572 54 405 -332 590 120 46 -188 -397 -43 11 -175 -19 -2 391 -152 -171 83 544 -175 202 -373
2210 -373 -257 -554 -467 -155 -418 3 -196 -162 -528 -379 -116 118 45 664 -74 -69 162 522 473 -9 692 -29
2232 -29 -722 -323 -212 -222 -258 -98 -307 -101 -434 459 232 339 116 -959 245 255 266 104 479 -252 306
2253 306 1099 515 -496 140 71 674 340 606 131 -148 166 -381 63 110 69 -64 -154 -111 -166 -308 924
2274 924 317 -167 771 129 -468 -659 -208 -324 -130 -514 -493 546 39 420 -58 -29 166 177 246 -662 -889
2295h89P45M29j75J076j089L55j119N54L60j6k00M77r1l14j35k75n6n1M59p20
2315f75O48L46k03L01l05l6L08n66j75P22L51o80N13M3j16k0J59o06J81l2r5N7
2337A20J97m04P30j585J436p33L4o2m1O68o01M9M13n36P30k91K35j05n50m65O29
2358a32K35L5K98o15M9k50J69Q12n98O50p80J5J91K44lm94j84qJ28K96K26O10
2380H94r11l47p33J634q71Q66j0j246M34J038p24m3M31m62N16n46P0n55Q09j17
2400A27m58J333n61l26L25n93N88o04J070j040n2L3P89j273L0K68K04L69l45L5
2420h1j94l22L65O81q67k35n04J049l13N71p26j67N61P30j159O96p42M17m00O45
2440Ek52n86N02j08L98L05j35j62L86o30J67J79K3l66j15l8L89j44n29Q76p07
$$ plain form
2295 -889 -144 285 110 1186 97 452 -667 -113 247 231 31 508 417 103 -32 -307 -363 -414 45 -675
2315 -675 -27 319 116 417 112 76 384 -182 -357 365 716 36 549 592 476 456 615 9 190 158 63 120
2337 120 317 -87 643 -942 494 -239 -205 -267 -308 360 -241 -192 221 -315 415 124 359 254 -296 -761 -132
2358 -132 103 138 436 -179 -130 -380 -211 601 3 653 -127 -112 79 323 320 -174 -358 -366 -238 58 284 894
2380 894 -17 -364 -1097 537 -334 532 522 -724 -290 748 24 -19 412 -50 466 -80 -10 -565 244 127
2400 127 -331 1002 441 115 440 -153 435 -169 901 -139 -191 -158 631 -642 -612 -344 -140 229 -116 -81
2420 -81 -275 -597 -232 449 -418 -653 -1157 -108 -421 150 -576 -743 -182 548 -611 85 -657 -240 -640 5
2440 5 -247 -833 -331 -439 -41 264 129 -33 353 -277 -110 69 92 -274 -389 -427 -38 -182 -711 165 -542
2461e42N52J18P8K09m4k98o88M69K26N18l87n47l11M21j96J119p61l62Q23m45
2481d8N71j034M64j69L71K09l54l01M96L52o49o20M8L36K90j50K19j58K25l13
2501b15N89k70j14L79O5m34n82O48r98R59Q46n98m31N78n91M25j37k40k91K31
2521a81K46J49m9k5k4J78k30r4N33k40K10l7k15P4j62p46N00j89O89n98K79J83
2543B51r37M08M41j79m71ON3Q32m43j11m10r3Q16N05j351N74m8R4l64P42n54N42
2565C03n58N96K5j68J62q55J86M14r8p62O79Qj50K50J42l55O91n46k31M14k61
2586a14k35L99R6n82J37K91j67O13m72q22O71N15j043J188o50k5P38J9k73j63
2606A21k41O11j089R18l90k57P78j72r3p33J90J27K99L75m68Q1k2m41K64j67k56
$$ plain form
2461 -542 10 128 206 415 371 73 -615 -146 80 598 211 -336 -647 -226 -422 697 -64 -426 397 -48
2481 -48 523 -511 -47 -216 155 364 10 -291 205 557 -92 -712 -664 -328 -38 -188 31 -127 98 -215
2501 -215 374 104 -10 369 434 0 -582 66 -932 27 873 275 -156 422 -169 256 119 -121 -412 -181
2521 -181 65 214 165 140 116 294 64 -30 503 263 473 436 221 295 133 -613 -113 -302 387 -211 68 251
2543 251 -686 -278 163 -16 -487 -481 -428 404 -39 -150 -560 -653 163 668 -683 -109 -157 -63 -427 315 -239 303
2565 303 -255 341 366 198 360 -495 -309 105 7 -755 -76 -68 -218 32 174 -181 510 -36 -267 147 -114
2586 -114 -349 50 146 -436 -299 -8 -175 438 -34 -856 -185 330 -713 475 -175 -200 538 557 284 121
2606 121 -120 491 -598 320 -70 -327 451 279 186 -547 -357 -230 69 444 -24 57 35 -406 -142 -309 -565
2627e65P92p49L16K80N94n33J7J70j87Q63j393N31J56m44l92J212n00m29L12N64
2647F15j098R05p45p8k08Q93l43k68N13m98O69ok03J08r2j258Q81P70j21l49K81
2668C68j47p0k45J66l73O61m65L26j003R13J17j01J48M98n81o4J36r24O04j63
2688a99N30j68o33O55l39M40r60M92o41R07m82n4K01q4n9O69K29o85J98l01K49
$$ plain form
2627 -565 227 -522 -206 74 668 135 152 322 135 998 -395 136 292 -152 -544 668 168 -261 51 615
2647 615 -483 422 -323 -401 -609 284 -59 -327 186 -312 357 351 148 256 164 -1094 -213 557 436 87 368
2668 368 221 151 -94 72 -301 360 -105 221 -782 131 248 147 295 793 212 148 284 -640 -36 -199
2688 -199 331 163 -470 185 -154 286 -674 -182 -823 84 -398 -452 -251 -335 -394 275 504 -181 17 -284 -35
$$ [...]
8191i6
##END NTUPLES=NMR FID
##END=
