##TITLE=1H_SAM_10.110
 CDCl3, 108 sc, 
 11.3.2019
##JCAMPDX= 6.0         $$ Bruker NMR JCAMP-DX V2.0
##DATA TYPE= NMR FID
##DATA CLASS= NTUPLES
##ORIGIN= UXNMR, Bruker Analytische Messtechnik GmbH
##OWNER= root
$$ XWIN-NMR		Version 3.5
$$ Mon Mar 11 17:52:21 2019 Russian Standard Time (UT+4h)  she@DPX200
##.OBSERVE FREQUENCY= 200.115
##.OBSERVE NUCLEUS= ^1H
##.DELAY= (6, 6)
##.ACQUISITION MODE= SIMULTANEOUS
##.ACQUISITION SCHEME= undefined
##.AVERAGES= 108
##.DIGITISER RES= 16
##SPECTROMETER/DATA SYSTEM= spect
##.PULSE SEQUENCE= zg30
##.SOLVENT NAME= CDCl3
##.SHIFT REFERENCE= (INTERNAL, CDCl3, 0, 15.7039)
##AUDIT TRAIL= $$ (NUMBER, WHEN, WHO, WHERE, WHAT)
$$ ##TITLE= Audit trail, XWIN-NMR		Version 3.5
$$ ##JCAMPDX= 5.01
$$ ##ORIGIN= Bruker BioSpin GmbH
$$ ##OWNER= she
$$ F:/spectra/data/she/nmr/H-F/1/audita.txt
$$ ##AUDIT TRAIL=  $$ (NUMBER, WHEN, WHO, WHERE, WHAT)
(   1,<2019-03-11 17:50:55.93 +0400>,<she>,<DPX200>,
      <continue with go, POWCHK disabled, PULCHK disabled
       configuration hash MD5:
       00 E9 B6 7A A2 85 ED C7 34 08 36 98 17 FE 4E 26
       data hash MD5: 16K
       21 7B 3C 79 06 ED 7F B6 3D F4 D0 B5 C7 F5 32 A3>)
$$ ##END=
$$ 
$$ hash MD5
$$ 1E FC 33 F6 68 03 F8 BF 37 F8 92 E8 8C 87 51 58
##$RELAX= 
##$RELAX= 
##$RELAX= 
##$RELAX= 
##$RELAX= 
##$RELAX= 
$$ Bruker specific parameters
$$ --------------------------
##$DU= <F:/spectra>
##$EXPNO= 1
##$NAME= <H-F>
##$PROCNO= 1
##$TYPE= <nmr>
##$USER= <she>
##$AMP= (0..31)
100 100 100 100 100 100 100 100 100 100 100 100 100 100 100 100 100 100 
100 100 100 100 100 100 100 100 100 100 100 100 100 100 
##$AQSEQ= 0
##$AQ_mod= 1
##$AUNM= <au_zg>
##$AUTOPOS= <>
##$BF1= 200.13
##$BF2= 200.13
##$BF3= 200.13
##$BF4= 200.13
##$BF5= 200.13
##$BF6= 200.13
##$BF7= 200.13
##$BF8= 200.13
##$BYTORDA= 1
##$CFDGTYP= 0
##$CFRGTYP= 5
##$CHEMSTR= <none>
##$CNST= (0..31)
1 1 145 1 1 1 1 1 1 1 1 1 1 1 1 1 1 1 1 1 1 1 1 1 1 1 1 1 1 1 1 1 
##$CPDPRG= <>
##$CPDPRG1= <>
##$CPDPRG2= <>
##$CPDPRG3= <>
##$CPDPRG4= <mlev>
##$CPDPRG5= <mlev>
##$CPDPRG6= <mlev>
##$CPDPRG7= <mlev>
##$CPDPRG8= <mlev>
##$CPDPRGB= <>
##$CPDPRGT= <>
##$D= (0..31)
0 1.2 0 0 0 0 0 0 0 0 0 0.03 0 0 0 0 0 0 0 0 0 0 0 0 0 0 0 0 0 0 0 0 
##$DATE= 1552312035
##$DBL= (0..7)
120 120 120 120 120 120 120 120 
##$DBP= (0..7)
150 150 150 150 150 150 150 150 
##$DBP07= 0
##$DBPNAM0= <>
##$DBPNAM1= <>
##$DBPNAM2= <>
##$DBPNAM3= <>
##$DBPNAM4= <>
##$DBPNAM5= <>
##$DBPNAM6= <>
##$DBPNAM7= <>
##$DBPOAL= (0..7)
0.5 0.5 0.5 0.5 0.5 0.5 0.5 0.5 
##$DBPOFFS= (0..7)
0 0 0 0 0 0 0 0 
##$DE= 6
##$DECBNUC= <off>
##$DECIM= 2
##$DECNUC= <off>
##$DECSTAT= 4
##$DIGMOD= 1
##$DIGTYP= 9
##$DL= (0..7)
0 120 120 120 120 120 120 120 
##$DP= (0..7)
150 150 150 150 150 150 150 150 
##$DP07= 0
##$DPNAME0= <>
##$DPNAME1= <>
##$DPNAME2= <>
##$DPNAME3= <>
##$DPNAME4= <>
##$DPNAME5= <>
##$DPNAME6= <>
##$DPNAME7= <>
##$DPOAL= (0..7)
0.5 0.5 0.5 0.5 0.5 0.5 0.5 0.5 
##$DPOFFS= (0..7)
0 0 0 0 0 0 0 0 
##$DQDMODE= 0
##$DR= 16
##$DS= 0
##$DSLIST= <SSSSSSSSSSSSSSS>
$$ [...]
##$SUBNAM2= <"">
##$SUBNAM3= <"">
##$SUBNAM4= <"">
##$SUBNAM5= <"">
##$SUBNAM6= <"">
##$SUBNAM7= <"">
##$SUBNAM8= <"">
##$SUBNAM9= <"">
##$SW= 260.267013134115
##$SWIBOX= (0..15)
0 0 2 0 0 0 0 0 0 0 0 0 0 0 0 0 
##$SW_h= 52083.3333333333
##$TD= 16384
##$TD0= 1
##$TE= 0
##$TE2= 300
##$TE3= 300
##$TEG= 300
##$TL= (0..7)
0 120 120 120 120 120 120 120 
##$TP= (0..7)
150 150 150 150 150 150 150 150 
##$TP07= 0
##$TPNAME0= <>
##$TPNAME1= <>
##$TPNAME2= <>
##$TPNAME3= <>
##$TPNAME4= <>
##$TPNAME5= <>
##$TPNAME6= <>
##$TPNAME7= <>
##$TPOAL= (0..7)
0.5 0.5 0.5 0.5 0.5 0.5 0.5 0.5 
##$TPOFFS= (0..7)
0 0 0 0 0 0 0 0 
##$TUNHIN= 0
##$TUNHOUT= 0
##$TUNXOUT= 0
##$USERA1= <user>
##$USERA2= <user>
##$USERA3= <user>
##$USERA4= <user>
##$USERA5= <user>
##$V9= 5
##$VALIST= <valist>
##$VCLIST= <CCCCCCCCCCCCCCC>
##$VD= 0
##$VDLIST= <DDDDDDDDDDDDDDD>
##$VPLIST= <PPPPPPPPPPPPPPP>
##$VTLIST= <TTTTTTTTTTTTTTT>
##$WBST= 1024
##$WBSW= 4
##$XGAIN= (0..3)
0 0 0 0 
##$XL= 0
##$YL= 0
##$YMAX_a= 358116
##$YMIN_a= -120088
##$ZGOPTNS= <>
##$ZL1= 120
##$ZL2= 120
##$ZL3= 120
##$ZL4= 120
##$ABSF1= 10
##$ABSF2= 0
##$ABSG= 5
##$ABSL= 3
##$ALPHA= 0
##$AQORDER= 0
##$ASSFAC= 0
##$ASSFACI= 0
##$ASSFACX= 0
##$ASSWID= 0
##$AUNMP= <proc_1d>
##$AZFE= 0.1
##$AZFW= 0.1
##$BCFW= 1
##$BC_mod= 2
##$BYTORDP= 1
##$COROFFS= 0
##$CY= 11.3945322036743
##$DATMOD= 1
##$DC= 2
##$DFILT= <>
##$DTYPP= 0
##$F1P= 18.9103706918063
##$F2P= -1.10871071338519
##$FCOR= 0.5
##$FTSIZE= 0
##$FT_mod= 4
##$GAMMA= 1
##$GB= 0.15
##$INTBC= 1
##$INTSCL= 1
##$ISEN= 128
##$LB= 0.24
##$LEV0= 0
##$LPBIN= 0
##$MAXI= 10000
##$MC2= 0
##$MEAN= 0
##$ME_mod= 0
##$MI= 1.114404
##$NCOEF= 0
##$NC_proc= 0
##$NLEV= 6
##$NOISF1= 3.799351
##$NOISF2= 2.8
##$NSP= 1
##$NTH_PI= 0
##$NZP= 0
##$OFFSET= 15.70392
##$PC= 1
##$PHC0= -8858.104
##$PHC1= 160.0001
##$PH_mod= 1
##$PKNL= yes
##$PPARMOD= 0
##$PSCAL= 0
##$PSIGN= 0
##$REVERSE= no
##$SF= 200.130013532006
##$SI= 16384
##$SIGF1= 3
##$SIGF2= 2
##$SINO= 400
##$SIOLD= 16384
##$SREGLST= <1H.CDCl3>
##$SSB= 0
##$STSI= 0
##$STSR= 0
##$SW_p= 3612.71676300578
##$SYMM= 0
##$S_DEV= 0
##$TDeff= 0
##$TDoff= 0
##$TI= <>
##$TILT= no
##$TM1= 0
##$TM2= 0
##$TOPLEV= 0
##$USERP1= <user>
##$USERP2= <user>
##$USERP3= <user>
##$USERP4= <user>
##$USERP5= <user>
##$WDW= 1
##$XDIM= 8192
##$YMAX_p= 0
##$YMIN_p= 0
$$ End of Bruker specific parameters
$$ ---------------------------------
##NTUPLES= NMR FID
##VAR_NAME=  TIME,          FID/REAL,        FID/IMAG
##SYMBOL=    X,             R,               I
##VAR_TYPE=  INDEPENDENT,   DEPENDENT,       DEPENDENT
##VAR_FORM=  AFFN,          ASDF,            ASDF
##VAR_DIM=   8192,          8192,            8192
##UNITS=     SECONDS,       ARBITRARY UNITS, ARBITRARY UNITS
##FACTOR=    1.92e-05,      1,               1
##FIRST=     0,             0,               0
##LAST=      0.1572672,     0,               0
##MIN=       0,             -120088,         0
##MAX=       0.1572672,     358116,          0
$$ Real data points
##PAGE= N=1
##DATA TABLE= (X++(R..R)), XYDATA
0 0 0 0 -5 7 -14 2 2 7 -9 10 -17 12 -20 25 -29 29 -40 42 -45 53 -69 74 -81 97 -103 121 -139 151 -172 191
30 191 -211 237 -268 297 -333 374 -419 470 -536 605 -685 783 -876 925 -875 99263 -120088
47 -120088 -40984 28735 5237 64414 20331 -96180 -52512 60820 37521 -15729 -8724 -10045
59 -10045 -19508 10546 29520 10700 -4566 -6087 -10310 -2330 7714 -9102 -41318 -35337 10359
72 10359 41294 4669 -47537 -33406 5772 9419 6334 -16725 -46626 71 63023 24162 -14596
85 -14596 12871 -2091 -24670 15372 18231 -13701 4871 547 -38841 -47 50671 10780 -28656
98 -28656 -12551 12647 41482 54774 3597 -38757 -6089 26235 7650 -18896 -29601 -16209
110 -16209 19479 20682 -12200 -16473 -468 -812 2212 3174 -15488 -6269 15379 -3455 -8087 15317
124 15317 -9019 -37912 -8415 10129 1806 9365 -8083 -38722 -405 36162 -1241 -24850
136 -24850 -4478 4316 19886 32749 4113 -10473 14591 9946 -16521 -9273 6565 6811 6470
149 6470 -6964 -15195 13428 29496 -450 -15053 -1031 10781 22988 18356 -15234 -16569 12779
162 12779 1113 -24722 -10356 -2060 -6124 9342 808 -20360 2490 15544 -17230 -17139 9583
175 9583 1660 -4283 3569 -7750 -43 21601 -5135 -35770 -9674 15421 11803 4422 -12815
188 -12815 -19752 12314 27422 -273 -9236 1303 3732 13671 21926 3937 -2623 2896 -10744
201 -10744 -15287 12393 12155 -11361 -8206 1162 5457 20508 7139 -26919 -11547 22693 13226
214 13226 -5956 -8801 -11718 2842 18131 -9383 -32769 -7284 9869 3033 4659 -5269 -13451
227 -13451 4689 7844 -9729 -1135 7862 -6020 -6320 10085 7530 6917 4888 -20420 -20090 15347
241 15347 19724 -3861 -7115 -3747 593 20597 15479 -13158 -6715 11571 4733 3782 12307 -1850
255 -1850 -8431 1094 -5967 -6866 7777 -1499 -15960 2333 15405 6170 -1165 -11811 -14635 11793
269 11793 20727 -10238 -21536 -2924 8035 11994 2144 -25362 -22709 12831 15649 -4335 -5552
282 -5552 -3509 -2751 11643 8698 -8834 -2489 8148 -3804 -1199 12158 5248 -4948 -1971 -7684
296 -7684 -3228 13126 3450 -10005 3059 11005 4963 4682 -598 -6195 6566 9002 -7183 -3494
310 -3494 7309 -230 -5128 -1596 -9622 -3553 6483 -6018 -11507 10138 10884 -5788 -6462 -5237
324 -5237 -3000 12396 6789 -19680 -13565 12309 11532 -557 -7335 -15739 -5597 15842 7804 -9700
338 -9700 -641 5518 1155 6326 5372 -5286 760 3845 -3107 3113 10031 -1340 -7381 -72 -1334
353 -1334 1873 4547 -6486 -7046 11884 11022 -4212 -3901 -934 -1312 7040 2242 -13058 -4430 8032
368 8032 -1278 -4741 110 -5578 -4788 3374 -3529 -2332 10972 4108 -10295 -2917 4065 2309 3263
383 3263 -3184 -12814 1850 15703 877 -7543 -3430 -2591 2846 8721 -2024 -6140 7150 7315
397 7315 -1840 3159 2566 -4348 1148 2433 -3451 2626 4882 -6357 -5480 5816 874 -4312 -2690
412 -2690 -3199 2109 11750 1881 -10641 -2631 3392 2272 2164 -4891 -9239 1001 7110 -2231 -3520
427 -3520 1858 -4002 -3147 3176 -326 1822 6897 -2003 -7456 4318 5958 -2913 -2616 -1524 -2544
442 -2544 6951 5817 -7897 -4825 6192 1317 -2333 644 -849 1603 9520 1152 -5335 2229 3842
457 3842 -3327 -1194 -297 -3459 2806 1647 -6323 -1488 5920 -1868 -4651 -956 -529 2178 6460 -2005
473 -2005 -8209 1708 2256 -3638 -330 -1194 -4445 2011 3105 -3704 305 4690 -4378 -4833 4079 3192
489 3192 819 1687 -3494 -3221 6372 3817 -5848 -3677 2635 1040 4551 199 -6714 472 7524 361
505 361 -3459 1112 313 2628 4604 -1195 -4037 2870 314 -4633 467 2223 -3163 -816 110 -4430
521 -4430 2960 4577 -4427 -5067 2529 1630 1466 2917 -3595 -3709 4523 2762 -4289 104 586 -2565
537 -2565 2851 2598 -1708 101 2106 -3426 -899 6054 2708 -2315 444 -545 948 4658 -2378 -7207
553 -7207 692 5282 873 -558 -2981 -3182 4166 5233 -4175 -5430 652 1132 2328 1849 -3668 -4505
569 -4505 2564 169 -2159 1166 -255 -4380 353 3782 13 762 135 -4772 200 5429 882 -3460
585 -3460 -253 -41 490 3483 -2892 -4226 942 2019 -2441 495 578 -1288 1358 909 -2643 228
601 228 3926 -960 -1446 2412 967 -294 -51 -3321 -2079 3981 2328 -3949 -1226 974 859 3107
617 3107 -141 -5675 -1467 3669 66 -1029 -333 -1674 -982 2169 -509 -1418 1217 -329 -3058 645
633 645 2373 -1466 -475 54 -742 3441 3018 -2418 -1861 3380 824 -631 269 -2096 -718 3755 530
650 530 -3372 -19 1976 -1168 940 297 -2196 663 3037 -2144 -1016 2221 -178 -2087 -309 -1571
666 -1571 -515 2489 -813 -2981 1409 2305 -998 479 -351 -2982 509 1435 -1893 -1290 2569 -534
682 -534 -1385 49 -1500 -1013 1461 8 -1939 2006 2124 103 -446 496 -679 1233 2040 -2427 -865
699 -865 1786 185 428 312 -1178 -74 2109 465 -1487 1382 1447 -1272 914 940 -1695 749 -16
716 -16 -1883 525 1986 -1236 -2239 -556 -572 367 859 -1536 -1717 1826 1921 -117 -330 -98 -1597 1724
734 1724 511 -1307 -89 2156 -764 -111 1022 -786 -1162 565 -741 -1410 1548 612 -2006 219
750 219 1003 -39 314 -148 -1758 807 1862 -1194 -101 1057 -273 482 912 -991 -731 1474 -347
767 -347 -1533 1290 257 -1954 -521 360 404 1047 -12 -1465 -1307 2145 150 -1209 728 -326 68
784 68 3474 638 -1843 -881 450 154 667 557 -1165 1334 1911 -568 -1298 -239 -34 -894 339 392
802 392 -542 897 -1366 -489 674 1287 -1439 -111 -30 763 1223 800 -429 -447 1125 -304 -657 625
820 625 759 -1353 1283 -343 -750 1371 851 -2299 -179 -340 -118 103 423 -2024 -451 1529 496
837 496 -577 -405 342 683 987 -1205 -1468 1175 1355 -81 -431 -274 155 916 1347 -1513 -317 559
855 559 -376 25 971 1109 -966 -149 -503 -204 1577 -486 -1535 323 257 571 1426 355 -892 -583
873 -583 1025 -634 -450 168 175 -332 802 -163 -605 527 -93 -863 -156 173 -82 877 804 -816 87 1452
893 1452 -240 -243 1105 -71 -89 -78 -168 122 550 223 -1050 537 -366 -556 1484 -304 -735 662 1470
912 1470 78 551 858 6 447 832 1169 -656 -401 -456 -902 780 275 -1109 -558 -46 -554 315 334
931 334 -631 -174 649 572 221 -688 596 168 474 -140 13 -431 473 -563 -89 1336 225 24 813
950 813 -1135 680 366 -628 -452 1091 -301 166 361 -778 -707 796 701 -513 710 573 -530 372
968 372 634 8 830 860 -1688 -845 404 -886 3 -122 -1001 -1010 -499 -685 -653 -88 59 96 251 -622 -755
989 -755 60 539 -89 -727 450 -47 -743 147 -508 446 -714 -35 46 497 915 -695 928 -387 -468
1008 -468 -15 293 89 -160 544 -790 287 -59 -611 -424 827 -562 -1391 853 470 -625 617 586
1026 586 -485 361 1024 -375 -382 454 -170 -1182 842 -798 312 619 35 -400 114 257 -538 296 -817
1045 -817 -1274 771 -506 205 393 284 0 31 566 -28 145 623 561 -9 -496 -369 146 124 585 -927
1065 -927 834 -67 -110 -389 1091 428 134 963 -192 469 808 39 -867 123 133 446 85 -699 -1175 -101
1085 -101 1404 -356 177 32 85 -286 232 -74 42 84 769 -226 306 -376 -49 -203 -407 -320 1333 -18
1105 -18 -416 385 1351 -646 -1561 1087 -388 -552 35 492 -106 111 220 -343 83 662 -1087 237 -264
1124 -264 248 256 -996 910 505 202 -358 850 381 -133 -517 -350 176 -897 811 59 -264 -304 776
1143 776 -439 842 -834 -432 -259 927 145 739 377 -259 -200 368 174 -320 360 -760 -701 278 -10
1162 -10 347 753 -805 -228 -162 378 -733 -501 -105 356 -780 1209 -579 222 -431 -257 -452 558 -61
1181 -61 -105 850 799 -460 410 764 52 -369 -607 167 -440 418 -616 500 -235 553 -89 -315 485 -67
1201 -67 588 319 -146 -200 381 -673 -91 1236 235 222 271 -71 -89 40 -159 90 -448 31 942 250 196
1222 196 177 471 -123 -776 -565 -182 617 82 306 457 -116 1269 -322 683 -28 -176 -290 727 302
1241 302 -667 -363 -13 5 -789 430 -50 1019 -394 594 -376 187 299 -106 283 -58 -746 172 201 202
1261 202 -357 -17 -115 570 -46 -175 -158 352 -596 -514 268 610 -345 -358 226 23 254 112 229 51 384
1282 384 332 -611 15 144 440 474 307 -377 234 -833 197 -72 -899 269 -230 108 416 -547 279 -789
1302 -789 -370 859 -313 297 626 -305 -410 565 -1047 -765 101 -610 -606 186 366 -603 -459 35 139 65
1322 65 310 661 -163 1338 -94 -511 -42 -961 433 -40 185 732 370 -614 -87 -38 525 -253 -418 -851
1342 -851 -335 6 494 25 238 436 -733 -287 707 -129 -675 -135 -118 63 155 851 -203 34 -328 178
1362 178 -550 41 423 -110 -407 -272 -879 122 -298 -577 -239 -68 284 -478 -463 -306 -270 970 -694 -1035
1382 -1035 156 -260 -193 -110 -595 -336 -313 4 157 -201 -450 363 -378 -918 265 127 -409 659 -979
1401 -979 -909 372 -568 -321 -155 97 574 728 -130 1126 228 854 236 -406 -100 -129 89 1017 1222 265
1421 265 -125 400 54 33 151 246 -825 -642 -1057 247 411 -459 1163 -498 -569 216 -550 599 153
1440 153 -196 -103 -11 -135 825 33 -191 -322 848 -1092 -277 307 -980 -169 -570 524 -17 -306 336
1459 336 128 494 340 -441 -231 -437 339 -502 -544 85 186 542 -35 -215 380 30 335 174 726 -69
1479 -69 595 214 -139 -155 13 -488 420 -391 -691 -347 -77 96 -443 -211 -243 59 -104 244 781 551 85
1500 85 358 -285 486 236 80 493 -486 916 276 -349 -412 -813 -396 -124 658 -31 237 701 404 -482
1520 -482 -219 -63 207 14 -332 -163 164 736 1110 21 -623 203 -172 -162 780 -144 1065 -416 -653
1539 -653 -290 377 190 287 188 272 -198 388 440 -663 -894 -291 758 -302 14 -19 498 -447 1274 1270 1018
1560 1018 1029 223 -646 -304 316 -245 12 -82 -372 375 543 -98 204 -497 770 -364 681 -152 131
1579 131 235 -275 -113 246 -1599 85 -352 -1262 -647 -37 1485 166 444 -48 -25 783 781 -721 425
1598 425 385 519 729 -82 437 -513 392 531 -1324 -1232 628 28 218 -987 -1461 453 -24 114 -402
1617 -402 462 763 -357 278 340 -226 49 111 131 725 -161 302 246 -275 -93 164 -274 -169 -313 -405 -322 -607
1639 -607 -244 -1020 218 671 144 552 671 -546 -132 608 -232 75 -268 186 54 -492 416 921 -365
1658 -365 -246 15 -549 -223 9 190 -657 -287 -789 -256 -324 -56 191 334 -95 409 -434 231 -704 56
1678 56 -310 -525 1229 -495 518 -638 649 29 589 -51 -369 223 -750 371 -617 114 82 209 -685
1697 -685 -48 18 -211 -291 541 182 996 -556 1045 604 19 -810 188 262 -334 -112 -660 -466 510 -112
1717 -112 -117 -78 311 618 -616 -273 -232 575 150 -283 529 -365 -100 673 417 179 257 400 -183 646 -888
1738 -888 950 -355 435 487 -893 442 156 782 146 -536 400 132 -270 -227 -884 723 606 314 256
1757 256 -87 1061 916 298 -413 -741 -640 -441 221 -33 61 -141 -228 -164 -154 -791 -134 86 -775 409 465
1778 465 71 -454 -268 477 144 -404 -477 -265 541 559 691 -372 -140 -210 633 -22 -726 -358 -207 -174 361
1799 361 -43 899 -54 119 291 -352 456 -597 78 -122 -932 -218 203 154 1054 -75 765 837 253 -1016
1819 -1016 413 631 202 -19 -263 -633 -112 -896 921 -622 -559 192 -37 -242 -575 -161 -636 306 459
1838 459 -573 567 -135 149 106 -392 552 -52 646 -849 404 -513 310 754 -800 430 -634 698
1856 698 -328 -590 1213 214 247 -712 -833 -61 -197 -104 -952 -704 30 -175 -353 -217 540 66 462 -20
1876 -20 -779 -493 814 135 699 113 -956 508 420 411 911 -236 286 -998 -310 -80 -207 255 433 59
1896 59 484 1691 -97 236 -805 -357 682 -883 734 25 47 -160 29 100 -768 49 -54 -203 -337
1915 -337 506 -441 715 -425 772 150 84 1212 395 92 316 792 -263 129 -42 116 958 239 -554
1934 -554 686 -169 -353 -1136 130 -27 214 677 500 152 305 -426 -482 -73 -860 -185 443 -11 1052
1953 1052 -192 190 590 -288 -34 -280 -156 -433 509 -672 -469 22 -174 -155 582 -251 27 -19 -897 128
1973 128 -572 -79 4 351 -838 105 306 118 -294 -524 -96 -780 212 178 144 -43 528 417 -489 -434 -443 413
1995 413 64 306 -678 246 -8 366 -1205 123 -273 320 728 140 444 -55 -251 -65 -572 -944 93
2014 93 -73 -377 291 -70 554 -102 -149 -417 -34 -724 -312 354 -404 -925 516 -304 -925 781 949 329
2034 329 123 -187 531 -152 -205 -537 -358 -375 1390 -261 873 -90 190 416 -720 -145 -301 450 -676
2053 -676 485 -183 -77 903 -186 -1096 -67 148 -134 910 233 83 -185 291 -112 -255 995 0
2071 0 83 633 -843 802 205 778 -183 -118 -172 755 161 -653 249 -602 721 -530 182 -79 -284 515
2091 515 -523 234 -689 697 37 -1072 151 868 954 507 99 280 230 -458 235 -526 23 -694 1139
2110 1139 708 67 121 -645 35 -256 -529 74 908 780 1164 616 -601 -7 351 -55 -686 400 1068
2129 1068 159 547 -706 -242 513 286 -207 -240 -487 738 -436 -269 -384 -700 -111 -159 -413 510 -281
2148 -281 -12 365 -334 64 -137 -1212 -708 -195 -493 371 -3 370 -897 169 423 -336 34 92 152 -173
2168 -173 154 -365 310 -420 -126 815 -235 451 -194 -91 187 -630 522 1436 -338 -367 -481 1010 140
2187 140 -42 -520 -273 1014 736 189 180 -111 -785 -143 -93 -383 -694 410 1639 -57 966 539 46
2206 46 170 320 -328 -157 4 575 160 -22 -527 170 134 -340 -452 -697 -129 -523 -104 26 250 -387 -110
2227 -110 516 -312 -745 598 -651 -675 579 948 750 -864 -79 588 692 104 -342 -294 523 -56 1124
2246 1124 41 219 406 753 -586 -242 239 127 -857 -852 46 -423 188 -150 -325 516 -2 490 95 -442
2266 -442 -17 79 -71 955 582 433 -461 194 -549 -165 316 1239 427 347 732 409 784 719 183 438 1072
2287 1072 663 -380 -553 -361 -731 21 -207 -508 165 19 357 -348 -192 336 -4 441 478 -482 576
2306 576 697 726 -655 -119 18 63 -126 192 -953 92 -73 -782 -336 -958 -315 -32 -420 152 -6 177
2326 177 398 -344 -292 278 -93 -156 360 -725 793 786 -294 -62 -305 837 1064 -147 -735 204 -20 1107
2346 1107 -189 -208 -511 -470 -377 -174 113 311 378 -379 -45 -690 -846 -357 192 881 -285 -327 -33 -975 -797
2367 -797 -233 38 348 213 -322 -587 -520 -277 158 320 78 945 60 -777 920 652 9 471 -741 -113
2387 -113 417 183 700 -734 -269 82 385 103 300 396 -495 -315 338 528 -5 786 15 -947 -338 -136
2407 -136 -178 -378 199 -364 22 -607 -1086 505 -158 1232 190 -13 -826 -444 -32 -261 31 60 -439 -429
2427 -429 428 -379 -859 -94 500 127 1211 140 519 711 -62 261 441 855 252 493 35 474 663
2446 663 710 -165 -38 -463 537 413 -292 -573 -129 477 -366 -267 -1263 1096 439 57 -103 -63 40 -14 42
2467 42 -79 -601 434 1094 2 191 103 408 -275 -89 -45 -355 147 451 25 418 -828 512 395 -321
2487 -321 -340 674 1414 -101 -159 473 -250 478 11 148 522 -90 -203 486 -87 33 -244 -167 9 -177
2507 -177 -477 580 200 -284 505 603 -538 12 -594 -950 -362 -237 846 15 -1256 222 -504 522
2525 522 -276 555 1042 711 -545 777 -158 144 -735 -156 52 49 -160 654 -457 -968 1065 -474 -857
2544 -857 -164 -546 -114 287 -148 -369 153 -460 -1000 -355 -335 -1086 275 -461 -522 -101 -417 -553 -590 763
2564 763 940 386 1075 50 -748 -662 -9 383 11 -305 8 440 -211 -3 -332 -90 433 -240 6 43
2584 43 422 448 156 370 -1948 140 640 -31 641 35 8 664 -795 -573 364 726 1240 707 329 480
2604 480 10 197 974 -1089 18 843 1056 877 -274 549 776 -860 -776 754 933 532 851 -703
2622 -703 19 287 521 938 321 -549 733 565 -270 -348 132 -583 14 -658 -734 -465 116 33 491 1025 -140
2643 -140 958 -625 -136 -585 853 453 558 454 -862 586 -537 162 33 -45 833 397 23 742
2661 742 159 279 -437 -734 758 288 162 344 199 293 -306 132 -468 -548 107 -535 -599 247 -192 -835 157
2682 157 110 542 -669 623 657 -478 731 33 24 63 -486 -440 -499 476 530 -1190 -399 593 1081 -739 15
2703 15 185 -531 303 -76 834 240 -112 -89 -415 -4 -194 28 326 7 -792 -700 505 329 739 -171 188
2724 188 600 -54 -66 204 -397 132 285 176 150 204 542 94 -165 -503 -297 207 -15 -945 11 1161 498
2745 498 -27 -282 -764 21 -736 -23 -1011 -427 -125 -322 209 -379 -789 365 -349 125 721 -283 -40
2764 -40 739 -608 -369 -400 430 334 271 276 -44 676 351 -585 -665 296 -215 693 -163 -92 1129 92 99 -227
2786 -227 90 675 39 -908 361 602 -674 -426 -368 424 221 58 176 358 -65 -58 830 -486 18 462
2806 462 511 -584 34 140 -337 -25 -221 -660 -271 11 204 -565 27 232 -52 532 -398 -266 177 416
2826 416 1122 19 452 -185 -511 821 -107 -896 65 452 948 -1265 -36 -468 646 221 129 -403 -28
2845 -28 -416 158 -48 -194 435 707 148 396 692 815 309 -1254 176 180 -132 -595 -756 2 -702 14
2865 14 -494 -825 520 -839 210 401 -152 417 514 -699 -110 -684 -468 326 -30 613 -40 725 -315
2884 -315 -544 870 -431 -577 909 48 -80 -3 392 -307 -873 -432 -37 460 -43 -98 365 -57 -572 -372
2904 -372 -246 -259 -393 840 835 385 505 -25 333 -286 -225 179 -331 592 364 -514 229 155 384 -895 -994
2925 -994 -374 429 381 -687 182 339 510 1432 -362 -848 384 427 105 -576 241 327 1294 269 -13 -538
2945 -538 -105 141 -298 -188 -26 195 -1143 -548 198 -248 -331 335 544 -112 -109 331 508 -1060 -180 117
2965 117 315 345 -2028 -1245 -15 335 259 -11 413 648 256 -779 -891 322 432 44 -139 333 -263
2984 -263 545 -599 -309 -782 -874 0 1085 -252 1128 401 -40 -610 58 -304 -266 206 -867 234 -947
3003 -947 123 680 -214 -378 178 -388 329 -255 157 -20 -453 465 97 554 -669 889 399 -186 160
3022 160 917 -15 -375 26 17 -30 1136 291 -816 -112 -897 1027 25 -151 514 870 -283 -59 727
3041 727 -42 619 324 -370 2 866 696 -200 -279 194 177 -149 -743 -1558 -164 353 153 -137 -342 -335 -99
3062 -99 610 610 -276 66 408 -872 -1143 67 -677 158 -507 -1172 1137 590 649 150 -692 -424 -435 299 -395
3083 -395 -141 -624 658 76 516 -411 155 362 -165 69 130 -580 -39 533 1448 -500 166 -102 430 -26
3103 -26 232 231 -369 -484 116 695 -59 248 1041 685 497 94 254 129 -329 1048 -1087 466 -514 -433
3123 -433 969 1579 164 -169 -789 -1164 992 392 -241 100 195 1171 0 -453 278 1495 -641 146
3141 146 78 148 -1010 -126 -425 580 -382 -706 340 -77 -458 1179 122 -565 202 -255 675 -588 1241
3160 1241 27 619 -845 207 -8 655 2 -799 -236 38 215 308 -516 -518 -554 -228 467 259 85 -563
3180 -563 425 259 177 93 -94 508 295 278 357 -103 414 -145 188 218 100 -558 -621 -278 69 -548 -213 348
3202 348 35 -216 31 1353 103 -59 48 -60 142 337 -78 -588 209 343 382 181 -431 -97 355 395
3222 395 -238 -949 1122 472 -455 -527 -455 30 340 -646 68 633 -709 -478 -993 694 363 284 -622 434
3242 434 116 806 50 -273 -46 27 1060 -109 55 117 210 193 314 557 430 310 876 80 -568 -90 387
3263 387 603 -591 -1143 -107 410 929 -153 927 279 161 453 -404 -459 66 846 -461 230 276 -561
3282 -561 -48 49 451 -559 -361 1056 967 987 515 368 -553 -614 227 -990 19 527 -274 140 276 -78
3302 -78 121 -753 122 -252 -552 -2 -601 -894 18 -51 223 -100 -46 421 342 393 441 -18 64 57 -540 223 -513
3325 -513 1626 493 -144 -385 11 -301 6 156 -190 451 972 0 -428 -711 196 -238 -1247 23 200
3344 200 723 421 -753 168 -181 -322 291 673 426 1614 -192 -389 640 446 -572 -188 101 -631
3362 -631 -276 246 850 447 -837 473 -605 -337 91 -80 26 353 25 -425 -302 478 833 262 -484
3381 -484 -720 -894 337 637 7 69 931 668 191 -490 384 415 -181 97 78 636 -201 -212 166 215 445
3402 445 433 187 -891 402 -73 112 890 136 -503 -413 314 -1459 -388 -575 -689 377 298 267 480 -137
3422 -137 -870 131 -378 299 158 -324 563 112 478 -833 -479 -545 -527 485 580 613 -978 108 -65 75
3442 75 -94 -24 -319 251 -726 372 -673 -896 417 -463 -324 -550 245 449 607 431 -645 -428 504
3461 504 -188 154 525 518 236 398 -507 30 -25 -402 411 -6 -274 292 84 -99 114 -632 551 607 -826
3482 -826 337 468 -61 548 131 366 -320 -500 354 -241 698 65 102 176 -60 -245 -303 514 406 -46 -379
3503 -379 244 -584 -750 -22 1083 -584 376 4 884 765 394 -226 574 111 281 -170 -286 161 601
3522 601 1035 347 139 763 508 -310 44 -354 -199 1299 425 650 -80 145 384 -393 248 -663 -369 535
3542 535 -313 -367 -678 -386 156 -632 247 -226 228 766 52 345 -713 -990 -256 -108 -138 310 -507 223
3562 223 -391 -620 -479 -58 -725 989 410 136 140 -509 550 441 -244 40 1804 410 693 914 -26
3581 -26 375 403 -606 305 76 -95 1331 -61 44 -338 -346 -146 -176 -203 -424 827 -374 751 -461 -867
3601 -867 -79 41 111 -534 -300 1307 -7 329 768 -330 -172 1064 210 1054 176 -791 -170 -112 32
3620 32 -11 405 740 627 138 493 69 -557 599 -183 223 -781 490 1031 -87 725 -202 -32 -305
3639 -305 -7 274 638 14 338 -27 710 59 247 -389 873 707 157 -689 -255 -29 -408 -103 76 60
3659 60 -283 412 131 457 -168 -710 -505 -409 -75 443 -100 217 -542 -411 -322 -785 -125 53 377 -655 258
3680 258 1565 939 -211 288 81 -84 1032 860 -298 -533 302 1304 448 136 -124 227 -332 176
3698 176 466 -1155 137 -291 -763 297 274 1105 562 -170 13 177 -388 159 -638 -190 11 198 52
3717 52 629 827 598 -134 89 -202 -2 989 320 38 623 -20 -420 102 -1464 88 54 -341 -269 1717
3737 1717 -202 -945 -46 -548 -591 117 767 -80 -258 293 -196 308 26 -271 142 347 84 76 309 -742
3757 -742 538 -46 482 225 110 440 182 698 -1382 334 -575 -381 607 14 126 362 686 205 -247
3776 -247 -1 98 966 828 -735 452 697 -634 -796 86 101 -6 -964 -636 -373 801 505 245 482
3795 482 -1033 658 151 -621 -138 282 -136 213 183 584 -217 421 -286 531 101 448 -600 -730 -1155
3814 -1155 -54 357 224 314 -736 755 -197 -732 -632 -152 398 -79 -546 -141 320 100 839 70 -54
3833 -54 -401 -104 -138 -655 -853 184 -223 -102 738 -826 -377 587 410 93 -87 160 673 -381 -101 524
3853 524 -571 64 1078 -90 101 -315 1075 527 -1286 168 613 166 232 270 -501 41 427 467 -291
3872 -291 424 1039 694 -248 638 -162 717 53 -87 409 152 -416 -80 -324 -149 -358 -107 -817 -404 578
3892 578 510 -209 -564 -561 -46 -54 700 -204 384 -499 144 330 277 40 -299 -390 -74 78 374 936 303 341 -131
3915 -131 561 832 916 404 -93 -332 -713 741 -194 -1045 770 456 -262 451 -875 153 -696 -545 513
3934 513 34 -297 -285 -136 -103 1156 -17 -452 0 -225 -166 45 -25 298 855 398 771 -245 -379 -790
3954 -790 -72 -94 -155 303 -629 -368 526 664 -188 47 -579 578 389 73 -565 1188 -122 -911 357
3973 357 -748 -615 77 -330 -334 829 358 221 -149 -1256 -47 -205 -430 -75 -734 206 -281 661 -361
3992 -361 -788 683 71 587 328 -387 -12 -149 -178 200 74 -285 139 -264 583 838 -908 -1040 -663 140
4012 140 5 1131 -169 -248 -723 -280 -680 400 507 632 1093 327 -115 -347 -463 -881 -1262 -717 290
4031 290 995 648 486 633 -668 648 -813 345 -122 314 -15 622 144 -150 570 -82 390 -955
4049 -955 -212 596 321 -460 230 264 649 714 293 724 -229 -236 -920 434 -553 -695 299 51 379 305 -507
4070 -507 642 146 -305 672 163 626 261 79 822 -645 492 851 126 -285 -896 649 -549 565
4088 565 -110 257 763 -525 -544 -185 553 503 702 -895 700 -538 355 -400 -444 559 -159 743 -1087
4107 -1087 89 261 345 -316 298 -220 124 -392 129 -863 -255 618 -875 -481 -382 -498 -576 157 -290 722
4127 722 549 147 832 -98 -601 310 587 242 1192 171 -478 -243 58 -338 -636 482 696 -207 -103
4146 -103 -442 -47 -16 -323 -800 -339 179 541 669 -605 -548 296 -219 111 -200 -460 816 -318 288 -567
4166 -567 -370 -613 -429 -66 -755 167 1021 -228 -410 -138 361 1086 -162 -278 1658 297 78 278 52
4185 52 506 309 116 432 947 -1113 267 -9 -570 -242 866 -52 -1116 11 532 -173 -559 581
4203 581 -247 -444 211 157 240 249 -97 636 395 -693 -123 524 146 261 -353 245 532 -286 -115 -114 129 952
4225 952 571 -237 646 -518 -34 114 -312 -42 -153 879 1147 -418 -452 1028 613 -53 -423 33 -64
4244 -64 -539 692 307 -115 991 -719 -663 186 135 687 828 400 188 672 595 -216 -492 -561 -277 -582 1168
4265 1168 -726 -135 -73 875 -358 -311 -722 -128 -51 458 -157 918 -323 187 -34 -511 182 -299 5
4284 5 738 169 -763 -1028 -689 -875 -1118 516 20 440 -209 87 507 144 -685 325 1019 343 624 -221
4304 -221 -1084 -142 958 -345 -790 -765 278 277 436 -476 244 -986 668 -734 -702 736 755 574 -285
4323 -285 -169 75 993 635 84 -524 257 708 457 -608 58 -135 441 -309 -473 965 -703 -105 204
4342 204 -466 518 -267 782 128 222 -250 195 -86 -292 -86 86 371 161 531 -410 -55 808 186 143
4362 143 -772 -173 341 -378 -24 -551 455 256 -358 -910 -8 272 -210 145 -260 -785 -277 875 -685
4381 -685 -207 -844 -248 155 -510 -64 535 329 -782 594 769 222 -528 -510 51 -39 -662 149 463 -286
4401 -286 -600 -601 -84 533 -517 -743 608 -926 -298 -605 -157 203 701 -487 532 -1046 -49 222 -89
4420 -89 680 -175 49 -230 -129 446 -125 1 481 149 -435 -930 -29 307 1125 175 291 403 179 493
4440 493 233 407 -24 -592 -376 465 -263 363 14 -291 -2 225 -281 -609 -268 230 54 -680 -244 858
4460 858 427 166 -5 -313 5 -61 816 393 -329 491 68 160 266 -56 -574 -147 -408 226 259 507 999
4481 999 -650 155 320 310 67 184 -489 -293 1326 203 725 114 -154 20 -180 -174 155 -4 -501 -594
4501 -594 -65 -69 -441 503 -762 642 439 351 -792 -513 -290 -278 534 297 75 568 139 714 -38 571
4521 571 -336 617 -515 -80 95 349 -652 -265 333 -1392 -178 416 74 -55 -715 -466 -405 -26 -113
4540 -113 145 -284 289 475 -233 -97 761 375 245 -720 -60 408 190 442 -324 -172 -181 206 -104 -304 271
4561 271 -453 404 -1011 522 523 972 -29 -115 93 126 178 446 -267 -99 241 -389 106 -213 309 120 109
4582 109 -158 257 188 220 -77 167 -935 639 -146 -337 192 293 61 -415 34 628 35 897 -290 -950
4602 -950 265 -361 222 -21 -208 -484 -62 62 -526 -639 521 425 329 -72 34 -205 333 329 -212 217 -712
4623 -712 409 87 10 -394 556 -133 435 -547 -1627 -333 445 55 388 488 63 575 -116 -1011 274
4642 274 5 -98 -51 157 -895 -586 -53 -181 -464 -456 -253 -361 -475 -132 427 378 560 -515 -95 142 189
4663 189 815 -68 -650 -397 223 298 -222 -219 -34 -600 -852 -665 -14 -676 -160 -392 -714 85 597 -102 -684
4684 -684 374 -7 -164 -788 -52 75 1211 39 -300 397 -596 643 -240 -548 -1353 186 99 11 264
4703 264 300 -113 -764 139 168 -356 -500 122 -22 -473 231 -1027 66 -214 110 849 116 -69 415 594
4723 594 624 -449 411 594 -117 -188 496 35 718 19 -190 1197 -378 -18 -394 -348 272 483 -149 -186
4743 -186 -746 -143 -53 597 48 204 256 -357 562 444 -336 619 -10 475 28 750 230 237 -404 -59 654
4764 654 254 -183 -150 -601 -382 16 -733 -368 264 139 -355 477 212 333 361 -322 38 -385 -107 162 468
4785 468 447 150 601 3 -576 -911 931 259 -10 687 408 1120 321 -246 -445 -174 919 43 -251 262
4805 262 -130 352 398 -568 -298 550 248 -219 -100 -715 375 -382 -317 188 226 737 -78 137 -110 502 855
4826 855 260 464 -53 97 556 414 -726 -241 59 32 418 113 -383 1292 153 -134 -754 37 132 -309
4846 -309 354 -484 545 1216 339 819 -160 491 970 15 -1313 -458 -384 404 310 -420 -589 -539 26 -615
4866 -615 -235 -83 961 257 -613 -377 388 -70 298 -227 52 225 -173 173 -121 -693 592 176 -54
4885 -54 34 307 265 552 795 294 -314 -152 -160 -24 -186 -745 206 -609 -571 -1398 -153 676 -98 -242 975
4906 975 222 -14 602 524 -218 473 12 -588 327 213 346 -305 -235 -157 166 572 252 -152 -257 276 693
4927 693 -323 103 -483 72 384 -224 712 827 191 -170 -634 585 600 613 380 -112 190 856 577 -118
4947 -118 -553 -858 -118 771 -176 -749 532 326 111 -752 503 -828 128 550 911 -162 -343 -476 445
4966 445 -175 -406 -491 222 1133 -170 -103 199 665 539 -577 -4 -702 -182 498 -796 -43 -261 -83 -720
4986 -720 636 141 418 452 332 -562 -673 149 1012 -119 -433 -263 -105 -28 -146 116 -924 588 -115
5005 -115 156 -43 -380 151 236 132 -485 -308 375 -554 -339 773 -1817 446 997 -263 69 -702 -545
5024 -545 617 -153 -125 216 167 -738 -278 278 917 -621 256 -541 147 -388 -578 219 -340 10 697 598
5044 598 -44 260 1366 341 -272 -1151 -38 790 962 -2 -10 641 -366 170 -917 -488 -548 414 -105
5063 -105 639 -471 -1100 660 482 6 5 357 256 -112 1050 -691 149 86 -313 426 -945 176 455
5082 455 35 355 617 877 429 -52 386 1347 517 797 -180 508 -22 -482 -316 -1436 264 866 813 -410
5102 -410 316 761 121 977 -26 618 869 -443 -102 155 318 682 -1038 -509 -335 -46 873 339 830
5121 830 -280 125 1064 86 -846 -295 26 1129 -1404 -146 -92 -628 1055 -3 -824 408 26 639
5139 639 330 430 -280 -862 1053 459 -417 188 395 182 290 -499 -225 -572 -1136 -250 -248 -496 175 -731
5159 -731 -529 -258 849 -327 -1011 234 72 213 69 276 20 -166 451 408 -614 228 -173 531 -98
5178 -98 -72 3 -303 122 453 -35 204 -94 -343 64 -367 -94 574 236 -561 87 -964 -143 104 -105 445
5199 445 73 592 -1029 -124 -533 -65 186 597 -94 401 929 556 279 -998 -864 490 33 256 476
5218 476 -100 -410 925 126 -206 -105 214 150 -1174 223 -501 632 480 -654 -432 190 -101 195 74
5237 74 -861 267 -120 1198 50 -150 -84 166 -781 -662 324 676 -157 -743 -344 205 515 283 -765
5256 -765 170 51 240 -445 -318 588 726 -815 258 316 -330 -278 476 141 -513 -328 -355 -107 185 -420
5276 -420 548 689 560 -367 107 144 488 -85 -805 568 623 -50 -182 -472 483 -233 623 989 170 821
5296 821 209 -379 510 -111 353 -18 418 47 -253 611 -377 327 -624 -536 866 391 449 133 -289 131
5316 131 -83 630 392 -276 325 1063 -446 -883 848 373 1087 587 -152 -703 -462 293 332 -129 -249 612
5336 612 420 -32 518 883 -23 -140 -804 437 -69 415 -177 -244 -423 282 184 -341 -506 341 335 -434 -422
5357 -422 454 358 933 212 416 -694 20 368 -3 -503 -849 218 1058 706 -140 274 365 438 169 -662
5377 -662 416 122 594 -636 -1318 -625 444 367 -61 500 779 407 -461 315 -50 255 -144 -38 -661
5396 -661 -72 -691 300 -44 -310 -1454 -57 314 -614 -432 -395 334 439 346 675 844 -29 159 776 108
5416 108 1082 37 235 85 -50 -27 11 -118 326 1196 20 868 -30 204 9 -340 497 -934 471
5435 471 265 -17 -417 74 -334 47 687 -611 769 963 -804 734 -185 -847 223 378 430 84 467
5454 467 949 -49 -851 -218 -168 841 -171 584 -361 -280 -224 334 -152 424 426 785 672 227 -723 638 159
5475 159 350 33 -259 80 153 231 -134 -172 -171 383 15 -117 -391 -326 406 231 41 -36 730 236 344 -806
5497 -806 -141 944 -141 -939 223 -434 -144 -91 -738 -270 -135 950 139 -557 -273 395 -566 -309 -495
5516 -495 552 -437 365 105 -1137 282 131 -137 -167 -297 197 67 0 -499 -344 1046 261 654 78
5535 78 66 -67 -84 -515 309 426 90 176 314 -424 -375 416 691 -880 -53 194 -621 -721 -63 -280 763
5556 763 -612 -273 38 -54 -96 573 453 -84 -114 -86 593 91 -265 -324 737 -97 179 -300 995 579 -551
5577 -551 -169 -403 167 10 30 572 -520 252 395 103 -543 569 -267 680 212 112 -902 284 -57
5596 -57 -823 -747 -356 513 1017 228 237 -319 313 9 -390 372 2 775 957 -120 -283 976 -1210 -229
5616 -229 12 -294 -69 854 65 439 33 -142 -91 -86 544 314 229 69 394 289 -188 -568 396 -572 794
5637 794 632 713 -623 -222 -77 902 -350 -362 456 -917 290 479 -217 -290 -1009 -364 349 -989 102
5656 102 127 617 602 -72 -675 76 353 -51 -101 -788 479 104 434 -1231 -801 35 371 -458 313 -633
5676 -633 893 218 -304 -566 -812 625 462 -702 -902 386 360 258 81 248 157 382 -1137 -304 -226
5695 -226 197 450 -329 -38 294 250 481 -186 -187 208 -528 677 -294 230 325 264 481 280 169 -22 -308
5716 -308 -904 257 -83 473 759 -509 852 267 -275 -395 517 -628 107 527 149 110 -292 995 845
5735 845 -31 147 710 -115 -210 251 301 168 436 343 -371 -819 -174 435 36 923 -968 -610 304 -315 452
5756 452 -70 841 1024 565 -90 -229 665 388 -181 173 239 509 388 349 -88 231 149 251 -393 18 398
5777 398 409 350 -358 -166 441 1058 90 594 -138 161 -75 381 163 -849 -141 459 415 125 331 27 -890
5798 -890 455 -32 -659 637 -304 -672 -91 244 304 18 589 -215 -297 -365 -789 -135 -2 836 -396 61
5818 61 -762 28 -180 1222 199 371 287 -166 156 -275 -410 -516 484 246 526 1099 1362 129 -736
5837 -736 -196 -434 184 112 1010 -617 478 198 109 -180 -364 -934 3 221 61 -382 -248 -48 -534 -218
5857 -218 -1610 -664 -46 1250 217 486 -861 1058 -11 -779 -39 273 -110 158 -85 13 298 599
5875 599 -802 -534 -176 -1581 323 -435 1198 -313 -901 -371 -177 -382 -558 -190 -295 161 -1017 819
5893 819 211 -689 -253 -58 140 -413 182 442 206 13 345 15 405 -1492 -231 347 -202 -478 -339
5912 -339 -675 -837 346 -686 802 -531 89 -812 376 11 -542 202 129 -198 -532 495 343 -36
5930 -36 -399 -571 488 -388 -614 412 773 -494 -920 460 732 874 -66 -677 -17 520 -287 177 263
5949 263 -229 204 415 -548 -1094 203 656 902 -502 -1618 421 161 392 354 540 246 1 101 2
5968 2 -189 421 290 -973 242 210 756 -446 -19 -927 -284 -30 704 -1037 -506 593 615 369 422 -330
5988 -330 -565 573 296 63 -246 185 83 -82 -190 -432 -106 -101 105 -78 -66 -128 613 34 990 -311 -297
6009 -297 261 -135 586 818 326 503 -220 -768 -908 85 -475 -942 -409 332 656 -292 -372 102 -706 591
6029 591 461 -522 280 356 417 -426 546 1007 1141 773 524 -911 -506 265 574 -701 1508 645 987 -398
6049 -398 -342 289 -657 721 -309 -238 -3 -57 435 -547 616 -243 384 305 -258 52 931 106 -440 -800
6069 -800 -723 435 -725 485 -788 -170 613 -312 -550 -578 205 -351 147 -294 483 198 500 266 -1210
6088 -1210 458 -516 -147 -103 -158 -547 534 -190 -94 -713 66 610 -636 881 -360 155 -604 103 441
6107 441 -130 -487 153 331 624 751 540 -23 32 52 238 766 349 559 -384 -391 792 -431 -91 -125 -422
6128 -422 -192 252 502 -70 127 -729 -152 -1315 -94 86 376 587 96 235 226 202 425 268 173 102 153
6149 153 -294 536 -30 -750 72 -71 -544 529 866 -189 799 -336 -373 -47 159 -542 373 -121 -197 -29
6169 -29 44 -207 673 405 121 -302 740 273 452 -377 -382 -140 570 -582 -670 -921 -652 -179 -254 695 -308
6190 -308 -38 928 -45 1004 104 809 -24 -99 -173 -538 -676 -54 157 -283 -123 554 258 -378 -111 740
6210 740 -619 -492 303 -115 436 -504 -132 -428 -1093 -36 1162 -339 249 -199 -409 1225 172 83
6228 83 399 -179 741 -487 -129 90 -758 -399 -220 -543 49 -19 708 -94 353 -19 -236 -844 929 95
6248 95 -251 -208 60 595 437 -158 122 -246 -136 -228 278 -422 -741 -364 -667 310 87 383 -131 -1234 779
6269 779 765 -419 -544 -298 -672 415 -154 1262 -838 242 -720 -675 73 -542 295 900 -73 606 883
6288 883 540 513 -840 415 913 -114 -13 1172 266 114 -344 -68 -36 -621 -842 -885 258 850 940 -660
6308 -660 -173 -631 992 -275 -51 237 357 165 854 139 -627 -1272 -74 348 -274 869 321 576 79
6327 79 62 352 116 464 -212 -640 84 172 -78 -358 -179 -257 82 604 822 420 -312 -68 407 -384 -288 31
6349 31 -885 327 81 -23 359 -107 51 -416 -52 969 64 -644 -405 182 -96 -372 292 -509 -204 1105
6369 1105 817 384 196 253 375 -380 -122 244 65 338 193 547 -218 -127 438 -1343 -1213 -116 508 326
6389 326 -235 -94 -215 -557 17 130 -188 904 997 -74 772 409 967 -106 1192 67 -330 -1 438
6408 438 -206 -297 -149 335 -72 382 -1103 189 112 468 132 289 -121 52 571 -133 -133 297 -533 10 325
6429 325 32 -261 -918 484 -466 565 -23 -23 -561 529 7 -283 -73 -400 760 -309 -98 -50 53
6448 53 -31 -292 64 1459 175 -163 -174 734 1433 436 873 -284 969 466 -444 -82 665 756 366 -508
6468 -508 555 -943 392 -714 -552 132 1063 -655 -754 -790 -391 -12 -24 -1141 62 136 30 291 659
6487 659 896 -113 -862 504 -174 120 307 706 826 708 -371 -18 664 -488 -55 1158 198 1187
6505 1187 109 383 -200 632 290 569 1259 -14 -857 -258 495 251 627 -292 586 1009 156 -157 -435
6524 -435 -929 508 496 226 -82 721 4 477 -535 -610 522 93 180 -216 -451 1094 324 203 183 -45
6544 -45 -1012 -163 43 143 409 -55 14 -614 62 -759 -210 435 44 462 252 -101 -426 340 -73 -464 -371
6565 -371 151 510 448 -777 -354 445 123 576 -668 81 421 1150 -73 -184 -245 287 9 707 195 700
6585 700 891 -561 -167 -304 -268 71 -999 -282 145 -646 -219 467 -228 71 648 61 403 -155 180 -75
6605 -75 643 328 -112 371 -427 414 -411 99 409 -248 111 887 949 279 -58 -681 -186 522 -820 -229
6625 -229 700 -1305 471 1091 -185 -116 -633 -773 261 705 211 194 -630 -68 241 154 941 143 486 -54
6645 -54 132 56 -233 398 -213 242 485 -333 218 -419 22 -471 466 551 -662 -92 863 -151 743 -785
6665 -785 -937 768 354 -270 170 448 -132 500 -790 125 253 600 136 -437 -578 686 369 -184 1008
6684 1008 -160 -54 -460 1180 -102 -869 -203 135 -959 -353 -398 1625 -399 -111 -89 -89 241 434 458
6703 458 110 1280 366 1211 -560 324 238 285 -315 124 343 -293 134 -868 111 -482 -61 735 363 -420
6723 -420 593 832 348 146 -233 -128 553 172 211 -488 1431 585 20 30 -146 -207 -133 335 151 58 -27
6744 -27 1002 229 -707 -106 747 -172 266 828 128 -80 -178 358 -1194 119 436 -741 533 -950 -967
6763 -967 62 775 -1243 -1264 -28 877 270 -238 115 280 -189 -10 212 -579 -473 894 54 -170 -121
6782 -121 414 -101 -1127 -183 -195 478 151 542 -384 28 -315 -264 -197 -282 439 143 584 -415 253 151 -240
6803 -240 -31 -275 634 384 145 -860 -934 248 711 -48 264 -438 127 291 418 -261 -175 294 -455 -196
6823 -196 724 1 -215 574 626 -357 -168 84 181 -769 -165 779 914 1011 -328 3 -148 32 -849 357
6843 357 314 189 389 1108 -566 -233 934 -9 -325 69 -385 173 613 783 -267 1098 -29 64 23
6862 23 618 -552 436 90 -193 499 432 -430 -138 101 619 25 -962 -501 -434 -336 269 260 -90 -260 -416 -1211
6884 -1211 401 -168 -56 173 -579 207 -333 52 92 603 -270 712 574 817 1285 1045 -617 271 1264
6903 1264 -302 193 -462 -7 -290 684 -21 -101 -612 271 290 48 -935 -129 821 -346 705 676 492 -473
6923 -473 -687 -165 -1196 350 203 -259 451 318 275 -26 -241 56 270 -450 -164 -77 -106 579 -796 359
6943 359 -290 308 81 -965 -590 -1133 199 -26 30 -271 47 697 166 870 102 127 -537 -275 153 -1236
6963 -1236 -261 486 714 667 41 -71 -696 -1044 181 -628 425 581 -100 -431 -25 -305 263 222 -373 -1003
6983 -1003 -923 619 -206 -14 -618 -69 -177 646 805 59 1113 546 -452 -625 -581 -256 -700 -420 251 -343
7003 -343 157 390 31 579 125 363 -151 534 -632 92 948 92 -230 292 198 206 -1061 -289 807 589
7023 589 440 -366 -2 -407 136 -538 -239 -45 321 864 190 -23 36 -362 -93 557 378 -655 1181 405
7043 405 589 -170 -19 256 438 201 -326 123 360 -199 222 -500 -384 328 280 715 -766 425 -41 -727
7063 -727 -276 75 36 502 -479 -574 -156 -160 -636 -123 55 28 1004 112 216 262 -428 -250 -341 -217 -613 130
7085 130 50 99 -746 -666 -772 647 -277 -694 412 -371 256 194 -755 -900 -342 370 451 834 58 -314 42
7106 42 -599 -594 -276 48 135 -822 -66 641 453 331 -109 -206 337 214 -590 -411 865 531 922 -222 166
7127 166 -1018 -207 -67 -52 -992 -175 978 110 477 -721 270 -224 387 -722 399 435 431 462 108 -633
7147 -633 211 454 -56 269 373 446 -156 -740 -320 148 475 1296 -161 538 -95 783 28 -783 -495 -913
7167 -913 194 362 -886 730 722 475 -65 187 -768 429 -150 -662 156 -35 327 202 -390 755 -66
7186 -66 583 588 -410 468 243 214 -797 -249 215 -58 1071 -27 -106 -455 -151 120 -449 -792 -286 304 803
7207 803 -272 -533 941 -714 211 -107 -144 635 1115 -108 854 145 66 119 -454 -310 -81 691 276 356
7227 356 -1203 -299 347 -890 -551 639 1089 400 -168 -345 -826 -456 418 249 15 -435 -318 -616 214
7246 214 -170 -125 -525 1 -90 383 453 282 -588 -379 354 -328 680 674 -583 -326 806 605 511 -31 -410
7267 -410 23 -89 -1215 301 367 -243 86 835 59 -538 -656 303 96 90 1103 320 614 617 -188 -277 290
7288 290 12 205 1208 971 377 -94 -765 187 968 -494 -866 -1259 453 524 -412 -305 387 -43 -523
7307 -523 397 -946 573 390 -134 -780 -150 -524 -471 -855 -361 -306 -682 230 769 -5 215 110 103 -689 -59
7328 -59 -551 -214 -1 545 -421 -361 452 226 -200 660 432 74 -262 -443 -366 335 662 14 490 -414 -944
7349 -944 53 -686 509 -260 -514 -193 -144 -536 308 258 264 -448 337 -609 -477 296 -363 466 39 227 515
7370 515 492 37 438 164 80 92 -338 -57 732 261 -235 173 187 653 408 -463 311 471 -574 -559 -899
7391 -899 334 1074 256 -87 -400 191 -302 384 309 -550 161 148 -920 -615 -1040 -360 63 437 -39 -31 1513
7412 1513 337 307 717 777 620 -267 54 1338 196 -1021 354 -764 -354 600 901 153 -260 154
7430 154 612 324 -230 -19 -473 620 479 -82 904 -481 -302 328 -54 -795 270 -341 888 -379
7448 -379 -811 891 861 150 265 420 -346 -14 -26 -211 360 104 534 -183 -1097 -437 893 1128 -114 601
7468 601 677 493 -232 -389 388 -137 274 884 -602 561 753 185 -242 27 -78 -666 673 -8 -1136
7487 -1136 679 -516 104 -318 668 337 849 1461 327 129 136 353 -37 -228 170 489 297 -533 119
7506 119 123 323 380 27 -88 -33 -192 -642 1286 34 -405 402 -112 -560 328 -271 433 -440 134 23 -690
7527 -690 -129 -206 -3 -146 -33 714 147 369 -369 310 -167 -469 -69 376 921 303 -667 -818 -426 118
7547 118 -42 -691 -314 -363 72 283 -534 -197 -202 1078 484 698 -151 -56 -95 -489 -388 16 395 -275 -204 87
7569 87 -234 419 -315 -56 -293 -736 840 10 -3 690 259 563 -442 -467 -510 584 -651 177 673 -485
7589 -485 425 833 -605 -336 -526 99 466 -364 706 -383 683 658 -403 -421 131 254 271 -275 538
7608 538 780 262 259 -993 -441 514 735 613 50 -536 -287 890 326 -426 159 -300 -834 224 510 -101
7628 -101 -680 -383 -121 -704 -220 207 494 -615 -1186 204 -51 70 -270 -349 283 294 150 -179 -103 395
7648 395 -366 -92 -769 459 629 20 -84 -1046 301 211 -660 -381 -1021 355 488 1110 160 -125 -438
7667 -438 164 753 354 741 70 -519 -621 -482 687 -665 -314 0 784 203 -30 -507 -75 -88 -413 562
7687 562 -774 503 377 -1042 577 575 182 234 683 -402 -239 976 -740 393 -300 -543 -499 930
7705 930 276 171 -453 -32 -13 616 -700 -447 -419 -579 10 375 603 -23 -428 -476 808 -272 -284 748
7725 748 -105 -1213 252 74 -543 -103 -124 560 -444 290 1179 -64 -363 -4 -167 -95 -103 467 349 -7
7745 -7 -98 3 225 104 15 206 -809 292 668 356 -789 -540 -12 -317 -50 -64 717 -389 -90 -450
7765 -450 169 210 -550 128 338 623 90 483 705 -924 583 -605 -1054 721 -442 -73 -77 614 330
7784 330 -18 -796 59 -675 612 -13 -24 83 264 -34 -254 473 408 -406 -75 6 -148 282 1804 -99
7804 -99 -194 -211 -106 -295 -246 -515 -367 176 -31 -1020 -41 -1066 558 -68 -241 -342 168 503 317 12 -273
7825 -273 -554 59 357 -506 882 -90 -638 -552 -823 507 276 -203 -399 -14 939 -65 -374 -32 122
7844 122 -405 130 -104 -63 -358 -401 110 40 -349 244 1086 263 736 1292 212 -234 376 -439 -49 179 -79
7865 -79 -75 -744 -891 86 -559 -646 182 46 502 46 339 -265 10 -196 -3 -27 124 841 -808 270 -264
7886 -264 -255 -122 689 316 -302 216 86 232 -427 113 -44 -652 -79 276 -277 -459 -737 -344 -708 -734 21
7907 21 693 -32 88 -186 424 860 -597 -273 -750 210 629 972 -284 149 -297 320 -405 -427 -801 642
7927 642 855 -43 133 30 158 420 -45 -1613 339 962 -81 340 465 156 -743 320 156 302 -165
7946 -165 394 -393 -351 1275 984 -183 435 251 543 587 996 -15 -6 43 163 -483 -137 -426 -368 -141 -1308
7967 -1308 -14 335 1393 -43 -215 -9 336 620 334 -551 -347 -440 56 681 -45 -1168 167 751
7985 751 -520 -13 -234 -246 -274 -107 10 372 -152 42 -18 -409 -170 -273 -396 269 349 589 323 470 -533
8006 -533 -255 -208 110 -168 -55 -660 -1294 1000 21 -1008 301 -43 -117 -324 523 829 -147 1744 188
8025 188 180 -456 -89 131 -359 -38 763 -448 508 -1005 714 537 783 310 160 -136 152 -572 -613 -313
8045 -313 88 -119 -481 -347 360 397 -319 345 558 133 -479 -914 -223 479 797 336 -400 -674 37 -172
8065 -172 -168 -33 879 203 12 -427 -469 736 -348 316 182 -670 950 -83 552 1143 1020 -454 -319
8084 -319 660 801 135 -455 -299 -240 -316 408 -744 -759 -818 653 242 -349 421 694 537 582 -264 -283 668
8105 668 327 42 14 537 -233 59 -869 -474 -1035 187 -965 167 -360 663 87 -163 697 -715 -180
8124 -180 -696 535 -24 365 346 670 -984 78 -17 137 9 -31 -169 177 -415 -555 -226 410 182 2
8144 2 1156 -391 -64 -494 -66 -685 -784 -141 -154 -619 -5 -173 -189 108 141 493 223 399 -13 237 -150
8165 -150 528 818 505 -652 708 -568 -189 332 795 -79 80 556 -543 -582 -610 -485 -140 330 157
8184 157 -307 -646 -377 -340 397 -152 -190
8191a90
$$ Imaginary data points
##PAGE= N=2
##DATA TABLE= (X++(I..I)), XYDATA
0 -21 0 -9 29 -40 53 -73 80 -105 129 -153 178 -221 260 -302 353 -401 465 -527 606 -693 784 -887
22 -887 996 -1126 1262 -1409 1590 -1776 1989 -2231 2499 -2806 3155 -3565 4042 -4621 5316 -6198
38 -6198 7340 -8890 11135 -14719 21326 -37534 127031 358116 69143 -42093 -27126 6393
50 6393 -5675 96428 48526 -75388 -56500 51596 22407 731 14029 -10770 -32222 12502
62 12502 20193 13845 17561 5352 -6269 20096 26994 10918 -23662 -43814 -635 52416 15605
75 15605 -30952 -22066 -9251 4961 22456 -23077 -70028 -17571 32777 6526 -422 18360 -10026
88 -10026 -22031 11652 8484 -7424 15239 -2969 -50226 -12735 39672 8232 -29189 -28693 -21239
101 -21239 21994 61353 17729 -26242 4885 30925 22315 5151 -24668 -21405 20148 22206 -6902
114 -6902 -4003 -716 -3997 12112 5615 -18248 552 13726 -7192 5887 27694 -2842 -26441
127 -26441 -8775 -3411 3983 20754 -8790 -41495 -5897 25963 -3434 -24425 -19090 -19535 4499
140 4499 23174 -417 -8665 19762 11068 -13562 -6938 -37 2539 10855 -11867 -25450 7982
153 7982 24458 -754 -10724 -8646 -2566 25592 26445 -8496 -548 25979 7212 -9143 -896 -7411
167 -7411 -3577 14805 -2066 -16856 11368 15574 -15475 -11553 6015 -2080 -2083 -196 -12246 3978
181 3978 28925 963 -31711 -15692 3497 8459 8566 -17222 -30464 2820 17921 -4069 -10516
194 -10516 -6855 -10336 6289 19487 5376 8375 13800 -13006 -13757 14081 10118 -8035 -6667 -9304
208 -9304 735 28061 11229 -23822 -10586 17410 14464 6491 -2950 -12825 10304 28915 -1296
221 -1296 -23418 -9247 261 3137 7803 -6609 -14082 4032 3437 -11108 -309 5851 -10928 -8587
235 -8587 2041 1919 14596 13685 -20127 -23741 7692 10870 -2139 -5493 -15020 -9118 17994 13138
249 13138 -12322 -5606 5646 -1338 6774 14052 2101 1689 6911 -6337 -3081 11587 -1785 -15502
263 -15502 -1505 10204 10980 8434 -10774 -16970 12366 23870 -3415 -14825 -7458 3527 21337
276 21337 13435 -22586 -23799 6564 7979 -2005 -2120 -11443 -9361 9483 4743 -10033 -350 3389
290 3389 -10867 -1467 11832 4266 1823 1446 -11861 -5261 11505 -956 -11763 -633 3374 3115
304 3115 7881 -2308 -7684 7969 9341 -3947 448 8282 2042 3076 2918 -7758 -610 7546
318 7546 -9170 -11793 8821 10037 -1008 -1928 -8946 -5186 16427 9371 -18523 -12997 6522 8433
332 8433 6954 -2900 -18481 -9885 10311 2490 -8327 -2236 -1932 -3141 6065 2386 -5221 4124 271
347 271 -6975 4017 10961 623 -3019 -1121 -3274 3460 5518 -10868 -8460 10232 8715 -331
361 -331 350 -2800 -1411 11491 4530 -11419 -399 7561 -532 65 2707 -6038 -2773 1564 -8615
376 -8615 -3644 11506 3537 -9173 -3685 1200 3586 9362 -4106 -15756 -136 12758 2054
389 2054 -3404 -4945 -8207 1315 7058 -5697 -7928 4896 1667 -1608 4509 1284 -2741 2157 1456
404 1456 -3822 5584 7251 -5949 -2520 4656 1510 -313 -1769 -8626 655 13241 4082 -8082
418 -8082 -1462 1845 3934 5697 -3158 -9236 2795 5724 -3009 -177 637 -5212 -3261 752 -4618
433 -4618 1025 7087 -3293 -6895 4863 3426 623 39 -5054 -5599 7065 6553 -6664 -3517 3711
448 3711 -1088 12 552 -5848 3 9160 951 -5489 3605 2908 -2005 2200 -887 -3054 4447 2579
464 2579 -5232 -945 4834 -1852 -3174 -1596 -3800 3116 8546 -2191 -6002 3836 2031 -889 2974
479 2974 -2140 -4823 2522 1184 -4340 1857 4215 -5094 -4133 1288 -205 2062 3233 -5543 -3774
494 -3774 7332 4423 -4236 -2056 -1276 400 4940 135 -5861 1077 5054 -580 -1943 357 -3131
509 -3131 2080 6275 -1402 -1396 4336 -92 -2949 1620 1042 -2535 2330 -1270 -3807 4542 5766 -4511
525 -4511 -4013 993 -596 2404 3496 -4308 -3843 4167 585 -3116 1914 -1199 -3744 815 1435 -1931
541 -1931 2250 453 -5491 -1774 4477 982 -135 -244 -2196 2869 7085 -1258 -6783 -988 2923
556 2923 2114 1628 -3787 -4026 5548 5706 -2672 -3115 249 -557 3263 3487 -2620 -1928 2803 -820 -1811
573 -1811 2427 -629 -4323 -135 1213 -348 3187 -1095 -6299 -619 4757 -584 -1598 92 -1757
588 -1757 1386 3842 -3730 -6170 1390 1192 -1696 1714 -1819 -1991 3088 1165 -4185 72 2530 -2117
604 -2117 -891 2269 260 1460 2144 -3772 -3211 4369 2501 -2554 -1022 -583 790 5107 712 -5607
620 -5607 -1325 3105 931 566 1041 -2026 939 2641 -1098 -2411 801 -989 -2006 1315 906 -639
636 -639 489 -1270 -1799 1556 1588 -2187 -1426 2063 295 391 518 -3508 -1677 3919 862 -2962 530
653 530 -1072 113 1651 -479 -2618 1325 1415 -1783 630 2685 -384 -179 561 -1966 299 2909
669 2909 -662 -2473 1616 660 -358 2047 -315 -1293 556 860 -1690 -139 1532 -1254 -326 1150
685 1150 -1186 293 2517 -1744 -2264 2615 1284 -1684 100 -1085 -875 1974 902 -2089 392 2274
701 2274 312 18 561 -2093 -547 2542 -248 -1030 1587 642 -1773 837 1183 -721 59 -828 -3284
718 -3284 1551 3498 -1166 -1371 337 -636 31 1502 -2430 -2330 2109 745 -358 -86 -205 -1004 1432
735 1432 435 -2270 749 1891 -737 -608 1472 -715 -21 1201 -2256 -805 2527 142 -2115 -177
751 -177 33 -86 1391 -426 -2051 1279 1690 -430 -17 -160 -1384 1352 898 -531 -860 2045 -278
768 -278 -864 765 649 -861 -348 -535 -1145 1077 1058 -2147 -484 1095 -319 476 104 -1579 -647 3218
786 3218 163 -2330 21 749 175 1073 -788 -1285 1238 990 -352 -846 -479 -1304 -387 658 -114 -384
804 -384 904 -1490 -1115 1856 842 -988 333 -919 -388 1268 331 -1794 510 167 -1343 398
820 398 809 -791 -310 2025 95 -559 1329 34 -491 -494 464 -1327 766 1073 -1111 642 1492 -264
838 -264 -191 419 -285 -91 1730 -501 -1205 1430 168 -402 608 58 -1502 1828 667 -661 -558 1278
856 1278 -1151 612 664 -631 139 595 -700 274 2197 -774 -1083 442 -226 -284 951 -67 -814 850
874 850 1067 -1900 -730 -533 -680 260 1263 -1176 -926 848 700 -1262 -142 -106 -718 142 524 -782
892 -782 266 -114 -225 -840 -296 -266 -117 20 -1057 -453 893 -173 -1029 -133 35 -976 274 -497 -222
911 -222 849 252 -1001 809 -139 -872 986 79 24 49 905 43 -945 -193 117 -886 281 -734 -379
930 -379 234 -472 -625 -348 1145 -783 -38 -303 829 220 -318 472 -812 157 -16 3 74 -499 -389 664
950 664 -89 -1545 517 416 -790 73 -243 -170 -122 589 -721 -1652 342 308 -525 403 -1072 -1029 494
969 494 31 -1117 109 90 -474 53 -112 138 125 636 -1489 -173 645 -693 599 236 -33 -395 10
988 10 895 -1331 -707 -244 -931 -464 -281 -761 878 -57 -78 155 402 523 -468 -61 -521 -427 -457 1077 -566
1009 -566 413 526 -420 248 773 438 265 263 -732 -191 -17 -133 -345 1275 436 54 -337 -421 -521 261 -13
1030 -13 -921 191 582 -122 -488 -199 -563 -470 39 -929 -999 871 1294 10 579 -40 -1039 1003 -100
1049 -100 -1322 913 89 299 124 -483 -206 -498 514 -586 30 261 21 -818 -382 116 -704 556
1067 556 108 -653 832 385 -275 -244 258 177 -74 844 -752 489 375 1088 49 275 244 126 1052 -842
1087 -842 -764 561 914 -1355 -455 381 -331 675 395 -475 -294 797 312 -979 -149 711 -224 711 -188
1106 -188 -97 727 574 -740 -320 -47 -201 591 382 -305 -83 418 -245 -417 -9 -254 306 785 -281 -482
1126 -482 202 879 -104 24 -248 -293 201 584 -915 537 194 427 -298 -549 845 -74 -94 -194 168 -605
1146 -605 412 303 -441 -509 -1129 767 137 -746 468 -673 -339 -385 -12 -295 -245 660 -726 -382 530
1165 530 -7 47 -64 482 -1052 253 -210 -1087 440 -979 243 -305 -270 -469 -1009 -162 19 -286 -585
1184 -585 406 -184 307 -104 -993 68 1514 -786 -383 240 51 -264 315 -504 -622 284 376 -493 -100
1203 -100 553 -194 -241 -644 435 158 319 -394 -98 1101 201 -812 1523 99 438 575 -644 -896
1221 -896 449 283 -97 63 -26 -379 373 688 -206 -192 400 -358 25 237 357 25 345 -640 135 729
1241 729 -287 -715 -287 -546 -333 153 857 336 -306 -309 715 -226 -216 -455 -995 908 -569 -423 -196 -320
1261 -320 419 -357 411 -573 -303 -306 -120 572 99 -250 518 100 -815 -187 487 940 -744 -782 1065 -608
1281 -608 974 907 -497 -533 -17 -964 -760 -368 730 -325 604 -46 243 -232 -1163 609 -410 -1 194
1300 194 904 721 -508 -1051 -209 535 -152 -122 709 362 161 -275 -576 219 138 -557 272 -84 1109 449
1320 449 -409 -372 -536 56 -273 -135 -425 -479 -242 -96 -385 -1012 -302 662 232 -206 -962 121 113 -104 -278
1341 -278 -800 -383 13 -272 307 -809 -78 644 -306 -606 -363 -150 440 -378 91 -619 -18 393 232 34
1361 34 -792 -595 737 85 -706 -200 226 -400 -764 -572 72 -348 253 425 -958 126 558 352 -846
1380 -846 202 -373 740 -159 265 -307 1 -333 -790 -521 -216 -229 -132 -618 -555 34 -274 -149 417 417 57
1401 57 591 632 89 490 -77 862 -65 -349 -31 790 913 -4 253 -4 -416 423 200 -448 -502 693 646
1422 646 -285 657 -283 -23 -572 -236 -254 53 658 -430 -900 -438 494 -29 -580 -832 -602 -74 -1052 877
1442 877 328 325 -136 518 -1302 297 -343 -339 -445 -478 -591 -967 84 -1418 578 -485 -268 123 -838 -548
1462 -548 -273 -40 -352 -719 175 518 514 182 -522 -340 184 -725 -134 -515 -1163 382 107 447 -784 -1200
1482 -1200 -551 1088 -701 -936 183 50 397 1188 -433 -364 -187 374 -541 -263 -112 233 -79 483 -121
1501 -121 -511 5 629 -506 -736 -692 -308 -659 -1165 -145 1094 821 13 124 -282 300 164 -510 -171
1520 -171 25 339 -236 -499 13 -255 -927 -9 -797 -874 -305 -8 261 -320 339 700 0 134 -137 -442
1540 -442 -263 309 835 -898 602 -235 542 102 -60 71 198 -158 254 -67 -227 -688 395 186 -327
1559 -327 -426 464 -803 770 799 311 -318 608 -202 -336 442 965 117 -470 -101 -623 354 97 135 -746
1579 -746 136 -265 -1628 32 -384 150 -1037 -651 1105 38 -193 -79 -859 635 -220 328 278 -438
1597 -438 -41 -304 -6 -52 -111 -732 -484 -12 287 786 -412 -167 67 -559 -245 -597 -311 -72 414 -412
1617 -412 371 839 248 637 -247 252 302 467 -1 294 373 -815 -92 -519 -598 -64 319 1055 81 13 -462
1638 -462 -337 207 -544 -980 846 -112 47 -144 -260 -42 -323 45 -174 587 115 665 -226 159 122 307
1658 307 -135 679 -334 513 339 -81 -402 -103 957 -913 258 -53 321 -73 -344 141 102 -233 -462
1677 -462 -839 764 -767 162 594 -408 235 -331 401 324 -789 113 -162 94 14 -10 200 13 753 -350
1697 -350 103 597 82 -569 479 320 -290 644 170 -673 880 1045 121 -192 -344 -266 -549 -591 -422 197
1717 197 421 436 -3 -759 -41 -65 -765 -220 -150 -1051 528 503 471 -154 -398 -177 -509 -212 -92 -461 -559 -167
1739 -167 -1229 -102 114 887 882 -179 -433 694 261 -176 -49 -15 -15 675 324 562 -339 1230 -166 269
1759 269 -186 -678 -550 143 -976 320 794 -1015 -234 -405 -336 135 264 -515 -1050 -368 -639 1511 270
1778 270 -495 -923 -846 619 224 301 -998 467 -127 54 196 -362 327 233 -377 -301 -31 625 479 -5
1798 -5 -1377 -282 596 262 367 726 -333 449 66 264 277 -64 221 -432 -58 -1277 -470 390 -510 -897
1818 -897 -1154 366 -112 -580 385 -429 -460 -627 -674 -337 -481 -132 -151 -311 -32 -705 286 -1134 1 28
1838 28 -272 394 120 -859 764 -190 855 -25 -621 659 -924 245 -789 -118 -1409 949 30 153
1856 153 585 438 200 385 303 368 250 228 -628 -13 -331 -828 1122 -800 -138 -1380 -32 -918 348
1875 348 -113 385 282 871 -244 -221 37 396 -760 -748 881 581 -12 -253 -255 193 502 -153 -1392 -47
1895 -47 -280 891 -104 71 -849 -1311 23 -650 -411 -559 201 113 308 -182 520 387 394 320 310 -432 171
1916 171 -126 -427 -663 -702 -566 1083 1101 275 -243 805 206 69 -1205 573 -83 -140 -9 -1224 555
1935 555 793 -199 -497 90 -158 -63 -196 -557 -909 158 -767 393 250 90 343 290 912 -100 -366 250
1955 250 8 -395 -91 -13 258 319 -48 -91 807 106 -348 -242 -293 -426 -230 1268 394 133 -305 294 -1090
1976 -1090 -137 839 60 -213 -426 806 -1124 984 567 34 -52 374 -765 -612 -741 137 155 -338 -508
1995 -508 -481 269 693 -239 250 373 75 233 -95 9 141 218 94 811 -933 166 -170 12 38 235
2015 235 563 -75 -173 207 -1207 -388 73 -254 864 760 147 882 738 -348 469 -1077 4 167 -301
2034 -301 268 185 -592 -399 -754 -414 49 -90 943 338 102 262 -424 -1018 -55 -102 59 471 511 226 1237
2055 1237 368 -436 -1269 -18 -468 369 -303 177 304 -1143 -203 -93 -1045 -130 -357 -59 -780 -43 -237
2074 -237 231 -438 -1197 164 1103 -112 -321 116 -264 -441 166 -22 401 -171 306 395 -551 -17 455 593
2094 593 88 -373 1091 698 20 1031 58 95 -558 -510 -584 266 -482 73 235 -470 -452 -20 -50 -497 123
2115 123 638 268 177 78 606 -53 -228 -192 -596 -494 768 49 600 714 -525 -232 159 109 -156 -828 814
2136 814 126 381 875 -195 596 -295 91 406 -462 -217 767 107 -400 134 167 530 353 476 477 170 621
2157 621 -237 -447 27 592 -193 242 355 525 -369 -79 411 -452 -737 928 5 726 -802 -99 488
2176 488 197 -283 161 166 -17 -131 33 360 252 970 -1161 104 -376 841 -236 -128 -19 10 664 -555
2196 -555 -58 153 -100 154 664 -335 -845 400 -503 -597 18 -313 -1034 -99 195 156 -264 -308 -156 -253 -555
2217 -555 267 -65 862 465 -160 -89 -223 1028 -1428 -431 850 255 885 -608 183 -1063 1409 121
2235 121 -884 48 184 80 -334 -679 123 140 -211 -259 841 -134 413 35 -176 -852 -81 60 484 -88
2255 -88 304 154 346 1026 -229 417 -796 195 522 -242 294 459 24 -652 -526 -97 -686 796 436
2274 436 839 473 -799 202 -442 -920 -279 275 -783 -188 -55 21 -51 464 -276 316 -380 744 -567
2293 -567 20 -316 1405 798 124 -19 -496 389 -700 148 -60 92 590 137 -567 -695 118 147 -160 -240
2313 -240 -642 4 114 -567 -445 318 374 -432 -92 75 -320 -101 -1229 -142 146 -660 1184 1059 -128
2332 -128 -1173 -679 -173 -27 -224 -216 -340 57 404 90 -266 -223 230 500 -838 -439 326 -50 -454 -283
2352 -283 743 266 120 -852 -440 515 647 -364 708 -247 84 620 -308 599 -548 -368 495 805 -139
2371 -139 -458 563 -102 55 -489 -351 47 -191 -242 -516 -788 1 -327 -429 -590 111 594 -203 -494 -174
2391 -174 708 477 -12 139 173 152 -233 -288 78 -150 -284 -262 29 477 150 -138 629 -589 -1201 -545 645
2412 645 857 802 -455 475 174 482 -616 -648 284 70 209 -152 -381 729 497 -118 -571 1262 312
2431 312 255 -700 429 487 644 186 -90 17 338 -635 -84 -71 -168 -439 -844 -327 -857 479 -250 405 357
2452 357 -999 -705 23 -230 -521 -1064 273 741 -320 -121 -598 -193 236 -425 -649 -549 -1259 -186 -230
2471 -230 -665 -16 154 340 -699 323 240 1199 -10 -699 -194 952 -666 -255 -500 -382 -7 -66 1491
2490 1491 99 -1174 -1138 -11 -580 123 -312 281 -26 -513 -823 -310 -478 123 -47 31 65 -212 440 -252
2510 -252 -178 -969 838 -171 -317 421 132 309 375 669 -399 -299 -80 -557 -569 -179 530 184 -330 -1010
2530 -1010 121 579 84 1083 458 376 -994 376 -527 -322 -74 -300 -856 -350 -420 185 40 -74 561
2549 561 -612 350 -571 -754 277 412 706 -365 -585 748 -813 -1174 1078 767 461 491 -45 -273
2567 -273 -360 166 527 -40 336 -270 -367 781 617 -235 -469 419 388 658 -82 -1026 -295 83 -1094 -228
2587 -228 -170 116 -17 601 -778 269 158 -525 734 -164 -749 294 757 -294 92 103 -22 43 -631
2606 -631 -856 130 440 359 -143 -389 831 444 -432 -106 53 441 328 91 -483 -320 550 877 -1208 -547
2626 -547 -30 -189 -264 -252 -864 -535 864 298 -418 -92 1195 -701 274 18 -355 -425 207 -221 369 267
2646 267 691 470 -69 -601 -4 -529 191 226 -187 309 -469 130 -315 308 620 -252 -432 -20 -260 -250 549
2667 549 -67 -432 -273 -353 317 437 -96 115 -728 -120 -786 -298 -800 -437 348 -369 668 454 -566 524
2687 524 -427 -776 253 164 -273 -12 667 -75 -978 109 89 -67 194 594 -38 -506 -177 226 -618 -524
2707 -524 -328 1126 -256 -152 -1588 378 271 313 -491 -468 -77 21 617 91 344 -395 -59 -138 -140 -968 686
2728 686 -206 90 -383 45 -499 -424 -188 -171 -440 1209 -669 -390 114 325 -322 248 -271 -296 -34 444
2748 444 704 -425 414 290 -18 153 365 324 -43 404 28 630 -8 202 -696 -531 -390 -448 810 484
2768 484 -89 -805 -471 469 -337 47 -414 94 378 -54 364 -569 -507 156 -292 -204 271 -428 -107 398 402
2789 402 -234 820 1164 -191 427 410 52 -370 368 583 -688 -584 986 246 -290 237 375 89 -140
2808 -140 -11 -158 273 23 269 -789 -237 -330 765 587 -544 -6 564 -124 182 682 1339 -591 -752
2827 -752 -605 840 -26 288 101 328 244 -67 687 -466 -809 -10 11 -177 539 115 -31 -564 -287 -356
2847 -356 -180 2 838 -111 708 942 -398 -555 -870 -1423 -569 -241 -431 -303 149 582 766 -105 -316 67
2867 67 -352 871 -189 603 477 -43 288 -542 682 -336 747 -284 -294 -5 727 813 -553 166 118
2886 118 29 1240 316 412 -395 6 -209 -172 -517 -23 188 -1016 -148 -479 -2 443 155 80 -104 426 842
2907 842 537 -78 -118 -724 474 263 -111 -70 729 654 -360 -261 96 -12 204 708 423 375 317 156 -645
2928 -645 -306 -53 19 328 -504 -558 673 -181 -1100 -174 95 -140 -406 -375 280 311 -227 1032 -749 -1234
2948 -1234 -580 -586 59 378 317 392 -498 -406 -103 -406 -1007 649 -64 266 507 -564 425 -757 33 -599
2968 -599 387 720 -241 -1664 -509 -209 393 155 -742 -272 217 -913 -670 83 183 25 106 -719 92
2987 92 -556 487 591 804 1027 39 92 -412 315 40 -1100 244 -205 -270 218 -51 -299 -618 -966 501
3007 501 453 -110 267 127 120 222 56 -600 -659 302 42 484 907 224 -245 230 -1177 10 -356 -226 -60
3028 -60 -169 -70 635 -113 -612 -360 -425 648 -434 -547 -1025 -43 -350 114 -229 -34 1231 693 33 290
3048 290 -731 -504 43 -790 -82 327 -350 253 -332 -550 -527 -41 347 -15 -428 139 -87 -104 778 9
3068 9 645 463 269 -151 443 567 66 105 -373 541 341 26 -799 -10 334 -58 126 -1035 175 179 -324
3089 -324 192 555 -294 554 224 389 -317 -937 -66 -305 126 -144 -596 -87 -131 -46 125 -250 102 -350 73
3110 73 285 141 465 -8 -286 -677 -160 59 10 115 584 160 -354 -346 -582 199 58 -1059 433 -764
3130 -764 26 470 509 779 521 -179 115 -55 210 1007 -432 -709 -735 -769 -424 233 118 -654 692 -315
3150 -315 358 623 -475 -388 -375 -141 607 981 -22 -776 642 -61 636 -169 544 927 486 -541 -617 378
3170 378 -327 -33 456 -237 146 532 -629 50 -586 -37 444 745 346 458 381 214 -482 66 -216 -1109
3190 -1109 23 93 -669 -70 -294 195 81 -387 -120 477 53 209 -28 -290 1132 819 243 358 -606
3209 -606 -327 -163 -581 300 -365 -267 -364 295 4 -203 -954 -596 504 571 512 -408 -438 -156 -520 264 253 179
3231 179 225 80 -224 -394 -470 -980 -379 623 212 -413 -427 681 -377 75 -1069 82 -122 -965 -337
3250 -337 540 34 -222 -905 -812 219 414 567 1080 -10 -349 838 -325 -473 44 -639 103 217 919
3269 919 529 205 1075 479 94 -327 -244 154 -31 45 -181 -90 261 517 -797 788 53 -18 570 -78 -602
3290 -602 101 111 -198 -413 167 226 -186 520 117 65 -576 10 -820 254 572 67 485 25 -442 -283 88
3311 88 357 1016 -640 -494 1222 -438 -641 -500 -276 1267 411 40 -401 1052 -434 288 -857 62
3329 62 -88 653 -6 -88 1238 1018 -384 -68 250 -181 -281 5 -606 348 -194 -24 556 -510 -178 -596
3349 -596 -246 535 622 497 434 1259 -730 -577 178 -53 7 480 82 -866 -241 -299 -257 643 -379 -102 -111 -153
3371 -153 -326 567 502 -291 -405 -249 756 201 298 -757 886 -352 -150 -292 -1183 279 632 -855 -447
3390 -447 -298 130 117 -167 -425 -248 279 436 -711 -366 -186 -59 419 -1147 239 334 -704 274 484
3409 484 217 -407 277 -922 120 24 661 147 14 83 -630 -196 -195 115 -60 285 -161 174 -8 243 -463
3430 -463 421 -438 484 -616 454 394 64 121 62 125 975 -995 113 -162 319 695 546 -257 -642 -846
3450 -846 -446 280 -9 -132 2 -37 57 324 199 315 507 99 -292 323 85 597 -216 -709 -283 185 -837
3471 -837 41 -639 -242 397 -1021 -279 48 -232 -238 500 -39 1101 617 -15 -729 -105 -227 -72 -488 -26
3491 -26 88 -233 584 -85 -939 131 -545 -138 882 316 -67 -458 -614 -241 -596 -918 -532 284 -606 -122
3511 -122 506 970 -573 59 -681 -245 -508 -25 -426 -209 677 -651 -711 -400 623 -978 -83 -26 315
3530 315 -411 262 97 -21 -482 8 338 147 974 -161 -148 -241 -460 250 15 40 674 312 -338 278 407
3551 407 -322 162 -1306 -430 619 -236 -921 295 -36 -23 307 -652 -65 -799 733 -614 842 227
3569 227 -484 599 -105 -170 -357 210 55 172 -676 107 397 488 216 275 -353 699 -155 197 -184 -329
3589 -329 -357 244 306 -307 14 -144 -476 -831 337 393 268 -758 270 176 477 74 81 -361 156 -148 -606
3610 -606 -223 396 713 350 -882 20 -800 299 83 629 -300 246 411 57 -164 216 -462 -239 -432
3629 -432 261 237 1270 1051 453 122 -327 508 -3 435 -135 424 17 794 -390 -161 -762 755 -151
3648 -151 -539 323 475 213 -716 -567 416 -270 618 263 -64 -14 791 -174 -295 -540 -53 -459 80 4 134
3669 134 -43 -175 -182 26 -296 -165 -382 429 626 412 243 -246 253 -484 586 -72 821 -242 -981 -444
3689 -444 -278 -466 -898 303 159 -44 -62 -142 -137 35 -338 821 44 -446 406 559 50 -658 313 -627 -825
3710 -825 70 519 456 163 22 -377 24 278 -449 -224 523 -486 580 1046 -621 -280 -635 -233 -235 -1271
3730 -1271 -178 -112 -193 431 -326 -879 686 -326 394 366 -610 -520 -571 3 -566 389 -776 -319 624 -362
3750 -362 -442 115 637 -96 -131 -775 -21 -9 546 40 -292 -775 1265 333 -1069 -403 -122 -287 -129 -288
3770 -288 -136 333 -610 215 -875 259 -468 901 153 -1181 53 -55 366 -451 52 -255 19 636
3788 636 62 138 531 -91 144 -585 -528 196 187 -443 236 -333 425 424 -112 4 -310 317 -384 -373 1 288
3810 288 -924 -241 122 -894 -747 713 -334 274 521 -723 -911 -843 506 488 228 787 557 25 -59
3829 -59 242 -255 171 -306 -98 175 -644 179 14 -107 -243 -180 -457 -851 -62 24 253 -251 25 63 273
3850 273 -920 1111 -292 -345 27 -661 -307 287 -291 -240 284 -22 92 -12 81 793 337 430 259 29
3870 29 -868 -141 527 -465 271 684 45 184 -525 -103 1129 376 -465 -140 -380 382 -79 -166 29 519
3890 519 -935 -70 234 -384 217 -374 359 -912 509 -16 695 97 517 -232 129 396 -122 -253 -1057
3909 -1057 480 -160 -503 232 -357 -204 -239 -465 -628 -196 -303 290 -194 486 22 328 -721 75 -411
3928 -411 -619 289 258 -892 -766 -277 31 105 -666 95 -364 493 -345 -98 -17 -502 369 -59 -242 -864 -202
3949 -202 33 -381 -199 398 -333 -1404 174 -209 -226 84 314 -512 -326 -201 596 -293 1051 -376 -332
3968 -332 678 419 -1060 165 150 72 249 -321 -252 -414 -361 -199 -682 -344 -7 210 965 -816 322 -660
3988 -660 676 -296 -512 -44 450 1028 52 -411 157 371 -698 -433 -152 -445 214 489 -384 241 -377
4007 -377 540 -277 507 -667 60 675 58 -107 148 59 -205 267 3 359 211 -129 -241 11 -383 -209
4027 -209 -80 -986 375 1097 28 84 551 -593 -69 520 103 -352 -11 955 27 402 -1133 -524 -405
4046 -405 -160 419 49 609 139 610 266 -1517 -349 -253 -440 178 1211 452 102 -40 -575 1197 27
4065 27 384 142 -458 -142 447 1329 -119 -1 -390 190 795 -71 -767 -14 72 311 -367 -883 -244 72
4085 72 1225 365 605 559 -409 -114 -499 517 -620 -205 -289 525 -100 1091 622 -427 -774 424 -311
4104 -311 120 -532 297 642 -363 -118 140 -241 -203 -287 -791 -206 616 -197 547 193 -24 -458 -178 742
4124 742 507 -472 -144 214 1263 -393 -1151 223 527 326 -592 125 646 303 581 1027 100 -275 448
4143 448 125 489 861 380 -191 -117 -27 215 -685 -287 -438 -417 -350 3 397 -120 90 415 63 888 -747
4164 -747 -84 262 -276 588 -250 -450 -257 401 -675 393 -668 280 293 -889 -268 -216 -430 469 -149
4183 -149 -995 624 189 429 -299 539 -139 27 1361 53 -63 555 1080 -602 -344 463 238 100 422
4202 422 376 -406 93 -133 381 275 341 145 -63 -541 181 381 -75 366 64 543 606 -112 -451 516 -455
4223 -455 -419 359 -688 -587 153 558 -25 -744 981 308 -420 107 -381 -603 415 -350 32 -506 -128
4242 -128 590 104 207 725 -601 -562 524 -6 -541 -1297 147 407 -362 -617 -1 771 130 -324 104
4261 104 361 139 -169 -571 92 1016 -73 -190 42 1275 472 306 -252 -303 -443 374 -93 -59 291 167
4281 167 715 -392 -1132 -1122 -580 -1670 -1005 -1094 238 474 470 -208 -520 -261 -18 235 -218 -269 70 1093
4301 1093 -105 109 -27 -40 301 -151 -396 891 370 83 112 23 -1174 -77 186 -584 -453 -12 75 104
4321 104 -330 13 404 402 445 -280 719 538 637 185 -229 -516 -636 554 -392 306 -616 -118 277 -417 -989
4342 -989 -1011 44 -396 258 -703 242 942 -44 -460 -423 330 -538 -319 -113 -426 -188 -61 17 442 -235 -254
4363 -254 43 114 464 -466 476 340 31 3 -106 146 1303 556 -337 -169 227 -1012 -937 599 -48 751
4383 751 126 -231 -100 -801 84 -68 170 386 618 898 -307 -19 194 182 145 -1263 336 323 -407 548
4403 548 450 -987 212 273 -346 -332 87 904 -86 182 -266 -440 1531 -770 -387 81 -381 -475 -743 -574
4423 -574 -525 66 740 301 226 -882 491 786 -698 593 -295 183 491 -127 -91 -58 233 -567 -345 -260
4443 -260 106 -350 114 207 -206 663 734 259 -230 -142 -505 -578 613 453 -427 -293 387 202 -195 429 93
4464 93 -221 593 -939 -312 194 325 -539 232 -27 -708 -80 178 -219 -672 464 -259 -370 134 -592 -376
4484 -376 397 -1161 -300 259 -547 -90 -983 -1056 -1074 1673 490 -244 -29 1150 615 -72 -449 -196 215
4503 215 655 -216 -339 -815 -440 -58 -173 666 275 246 -92 -652 -1065 -109 380 -296 539 -199 -17 -433
4523 -433 -447 -2 -414 -584 -287 547 648 -95 -798 -344 -1350 -546 214 -373 -231 -1063 -8 218 -345 -681
4543 -681 -197 -118 473 -92 516 -1210 21 779 345 -460 132 -834 -436 383 -259 -583 83 341 198 -249
4563 -249 -356 -127 -168 -557 270 1187 866 -827 -325 87 -113 -191 211 276 192 -291 662 109 -558 -1015 -441
4584 -441 -293 -292 -187 119 -427 339 447 -27 -514 -258 -335 -731 499 -85 1014 -505 -456 -661 -191 -313
4604 -313 328 -107 170 -572 -295 -728 -882 118 428 777 1039 -215 291 141 130 -757 -501 -272 -183 387
4624 387 318 -172 568 196 -206 -1070 -149 -598 -268 318 -316 -381 -237 -773 -184 -914 487 439 595 -796
4644 -796 -189 708 69 -456 -173 243 54 829 -355 -163 493 -50 -73 81 80 -455 -445 1094 960 474 -194
4665 -194 406 -966 -238 -549 -278 473 422 376 -544 -592 -388 -449 24 -331 -219 23 149 -6 -250 347 211
4686 211 -19 -676 -545 -28 296 625 -728 -144 684 559 -246 439 -865 -198 258 -1008 444 -538 -526
4705 -526 -50 -160 -81 -423 602 63 -318 839 -267 -724 316 -235 -242 -213 3 -331 -255 -22 -63 -448 -38
4726 -38 -149 -233 413 -344 -404 -302 344 -267 -71 233 -121 545 271 81 165 619 119 797 -721 -410 285
4747 285 463 521 -344 -382 212 -52 150 -184 -265 -336 -11 -19 -783 713 427 496 55 -550 -364 -62 -47 -707
4769 -707 -98 579 1627 -342 122 -556 -336 103 -633 -375 340 -463 616 -618 -215 1165 -778 1275
4787 1275 -210 -164 -81 20 -653 880 -131 -874 194 -715 -599 -216 -449 -306 271 -204 -503 -122 97
4806 97 -525 -773 -700 -74 274 627 -705 -761 -95 -790 81 -233 514 715 414 571 -684 13 -140 -422
4826 -422 -448 62 267 529 -200 -751 -859 47 454 506 -1106 -203 566 -508 651 746 -121 -212 -441 -80
4846 -80 -217 255 -79 139 247 -232 280 900 -754 141 -533 -118 -226 -393 183 -455 -187 217 386 627
4866 627 -118 310 358 847 446 -837 -228 654 30 -501 481 82 -119 -427 -502 376 441 209 -47 -345 -792
4887 -792 192 -985 -260 -946 61 268 52 -1161 323 -422 545 -78 132 -113 376 -533 593 468
4905 468 -540 63 -110 -1010 -800 35 684 1359 -688 403 -313 -761 -755 248 41 -104 346 -747 -104
4924 -104 -99 278 -870 -391 480 -391 330 560 -1179 -228 -612 20 383 -601 -418 845 185 -257 -868 719
4944 719 -133 363 -128 -27 439 -63 982 45 -25 175 125 359 -213 -176 819 -396 -226 72 506 -711
4964 -711 -282 251 -165 -118 -293 -223 162 348 -496 -14 -139 -369 -759 221 1121 887 271 -624 576 -110
4984 -110 -31 220 1192 768 267 -375 541 -308 55 -655 -396 -470 -513 -539 -191 111 -182 765 105 -102 -49 143
5006 143 430 73 523 764 -278 898 -23 66 -915 -150 -1439 -229 -792 6 -52 -255 331 -720 122
5025 122 -497 -122 -377 -376 165 173 237 41 -179 -158 -335 -1470 -355 -672 -87 -1215 71 -97 -81 1 953
5046 953 53 -973 44 -500 975 437 -375 -622 443 241 260 -389 -145 0 -227 -186 -220 -481 -123 -282
5066 -282 -802 189 -17 607 413 463 55 435 284 152 478 -247 -152 -21 -342 38 -458 33 134 -1189
5086 -1189 -584 264 -633 868 -721 -42 430 -208 142 -124 203 -172 365 568 440 -436 -121 812 -217
5105 -217 892 -211 311 -422 280 -24 547 -221 344 230 76 -27 869 -540 -248 -493 -926 1511 533
5124 533 601 -203 1293 92 -697 -785 -375 453 229 -464 702 -126 -330 4 -1660 648 625 -147 1216
5143 1216 -222 6 130 149 -144 -519 -686 -31 172 -241 -82 222 -172 -25 -562 -90 -31 542 75 294
5163 294 489 221 -372 -668 46 -805 -718 -365 -365 -163 -1175 -636 -343 -877 -454 -197 -294 500 -297 -63 -153
5184 -153 -188 79 -1040 -99 -12 137 19 16 432 73 440 160 562 852 -343 -335 -32 330 575 -356 219
5205 219 10 -664 -109 -333 406 -141 53 725 35 -671 -546 -173 663 270 685 213 59 273 70 -577
5225 -577 -79 -688 229 246 -623 -365 -679 740 294 -295 225 262 55 386 469 -980 711 282 435 -103
5245 -103 13 -570 517 -646 -215 -361 371 -231 -616 -358 585 -768 -511 115 149 -1292 351 -738
5263 -738 706 669 468 -3 -369 -89 -482 548 -105 395 42 -422 701 166 -134 270 -776 -293 500
5282 500 -932 131 503 520 -316 -756 -260 24 428 -528 41 -90 -1293 70 750 -145 -1088 753 132
5301 132 181 410 -839 364 -682 -561 191 -8 -372 1465 1265 -84 870 -929 -446 -518 -356 -154 99
5320 99 665 311 344 504 409 -531 191 -372 -269 732 601 -934 -220 -214 -474 236 -350 501 687 -407 100
5341 100 -233 -830 -47 374 -347 -15 -12 -322 -277 -1024 -594 251 252 661 -562 605 -32 402 383 -276 -433
5362 -433 23 207 -27 -554 -250 351 757 -446 -557 263 313 343 -543 -108 405 313 434 -956 455 -255
5382 -255 689 -35 139 -869 -291 541 -636 152 -1009 289 45 -133 -408 -870 790 -530 210 -763
5400 -763 79 339 117 17 233 206 949 -290 -656 60 -380 208 132 305 764 -135 276 -920 -320 -243
5420 -243 -730 494 509 -333 -396 -37 -653 570 509 -623 373 920 -122 -199 34 13 -114 -909 -277 -321 -258
5441 -258 124 684 -409 198 -870 -50 -600 -130 131 592 -45 -671 -417 -1289 612 388 -744 543
5459 543 399 280 -336 -149 18 -280 -272 -311 -347 71 322 559 76 -270 686 -275 -998 -544 -935 7 241
5480 241 57 -334 472 244 436 -63 280 470 263 29 -50 208 185 -125 -77 -456 -699 -684 -283 -282 355 -91
5502 -91 246 39 -193 191 -411 -45 -847 -295 475 -197 925 -429 -299 -48 249 -178 -665 -204 430 -804
5522 -804 290 -35 153 -195 496 -624 -570 751 -403 -688 -625 -419 148 -873 336 -48 107 -504 65
5541 65 72 211 -869 -12 200 286 574 -442 -12 1119 770 23 88 399 -85 481 -215 -513 343 247 -56
5562 -56 36 162 -262 -338 -598 -201 435 488 599 135 -374 -165 18 791 -812 531 262 -182 -201 -396 207
5583 207 1043 -421 306 473 178 729 -202 415 -952 -1286 -31 98 258 -95 -710 -171 -432 -269 168
5602 168 39 -95 -191 -195 -407 -6 265 601 201 604 -188 -872 -595 411 75 235 375 -498 -698 533
5622 533 441 197 -213 -269 184 -196 773 167 -302 187 -749 -279 -36 -44 257 460 1166 -71 -781 317 213
5643 213 80 -592 -566 -450 87 -748 238 -657 292 598 267 135 710 -848 -144 -368 -271 222 324 200
5663 200 669 -1232 434 317 131 -934 161 530 -426 680 -1020 142 672 -967 125 2 -93
5680 -93 184 -504 -490 -290 -247 -938 -610 -112 -391 -205 360 376 67 15 297 498 185 -127 154 569 -233 414
5702 414 1335 364 150 -590 2 -433 585 501 -51 -479 -438 -781 949 690 -626 -34 385 394 -282 -250 -21
5723 -21 408 -730 243 614 26 410 262 510 -251 94 460 -163 474 -383 -507 1949 -456 -745 -174
5742 -174 -245 395 782 445 -278 528 -324 -248 -404 -906 276 -163 -386 262 358 -62 333 -506 -314 1181
5762 1181 -356 165 -176 -945 -348 705 186 -162 -512 -419 493 -275 -555 685 164 488 138 108 -995
5781 -995 43 -69 -578 629 632 -241 -95 -308 291 -185 225 -844 -486 445 84 -564 -34 -953 141
5800 141 120 -575 -65 -42 -274 530 161 -412 -29 -1101 987 -565 616 149 -912 630 -53 -598 209
5819 209 166 121 -722 -99 168 242 -640 -1124 538 125 267 16 -490 -173 568 -535 -763 686 213 -45
5839 -45 177 -1026 -370 -76 172 259 -467 1036 501 -73 368 159 -262 373 174 72 -438 -829 -50 437
5859 437 260 -126 -178 123 78 254 -360 -487 152 120 -494 600 -398 -1058 -547 195 -306 -553 -823 820
5879 820 472 -496 15 -800 -436 -190 387 -910 589 -776 242 -449 494 -131 497 801 -142 986
5897 986 73 -356 -565 245 909 -232 -56 449 -533 685 -431 -565 2 -84 -56 -677 -155 -762 230 644
5917 644 700 -596 572 48 253 -128 -111 159 419 513 -409 -176 241 951 -86 133 -505 154 282 -695
5937 -695 -750 222 -143 391 -477 -410 508 1090 -376 353 -253 563 -37 374 -279 390 -381 715 20 -239
5957 -239 -406 365 -380 317 -219 -638 -158 27 498 -968 -508 761 479 -576 -267 -509 592 -215 -328
5976 -328 323 873 -675 34 -397 -202 482 -438 115 -652 -32 -199 -6 -423 221 -49 -738 -15 252 59
5996 59 -886 -42 -323 -604 -789 238 -350 -383 -610 -122 135 925 841 149 -441 -263 -167 -566 -849 -916 1192
6017 1192 148 -258 490 -384 -298 -241 134 302 224 -210 833 -1318 -465 -1233 -242 457 -334 -210 -255 -845
6037 -845 -934 227 -355 -98 4 488 -601 -520 738 128 -570 -338 -265 897 -665 451 385 -298 815
6056 815 -222 244 401 436 -304 92 -438 -1006 117 201 183 -584 409 190 589 588 786 251 -112 252 -233
6077 -233 -152 -339 -50 31 -649 1040 -320 137 417 -270 107 48 -411 -347 441 90 -891 151 436 -1119
6097 -1119 994 729 389 -611 738 1040 -26 561 -180 -493 382 253 49 -446 286 177 350 215
6115 215 -39 808 -202 -288 815 -889 -206 350 -95 -770 -627 416 328 178 508 -126 -173 190 498 -62
6135 -62 124 -172 1406 625 -805 19 605 -898 194 99 -697 -28 609 72 -555 164 236 -863 602
6154 602 185 808 635 316 391 673 -180 -367 120 -857 -1018 230 1047 -37 -1284 -146 -350 225 24
6173 24 401 356 -269 599 -567 -426 -564 312 -200 83 -648 -281 131 -448 261 -357 219 -284 -245 -191 -77
6194 -77 -543 563 456 -716 -98 -625 286 -279 561 82 197 200 361 -217 -830 738 -404 -1474 -46
6213 -46 278 73 300 99 388 -523 -383 267 -23 312 367 -83 -596 -168 -697 326 -264 86 152 -194 104
6234 104 -504 202 -288 683 479 54 938 574 -159 332 320 -187 77 416 512 164 -52 460 208 105 -357
6255 -357 -248 293 -110 -263 -866 300 186 945 -880 -617 -71 -192 -132 -175 660 362 -283 636 -342 248
6275 248 408 -799 -198 532 -819 -548 -542 -264 165 575 -190 412 -35 -1048 -451 -288 341 -679 28
6294 28 166 -19 418 126 -785 -592 610 -740 468 -516 218 -445 -29 -792 194 309 -1155 583 -299
6313 -299 -263 781 -139 -744 -117 -774 -592 -610 -12 244 -294 -210 -813 24 359 168 -453 55 -663 86 535
6334 535 259 289 -623 -760 515 128 105 418 -344 151 196 -383 -681 582 974 299 -505 -185 919 107
6354 107 428 -762 677 -826 38 152 -358 -304 -164 492 -603 215 -945 -776 458 148 -695 298
6372 298 190 -276 23 -394 -748 855 1104 -897 228 -381 348 411 -506 365 307 -593 -254 -865 -557 189
6392 189 -733 -93 -506 94 -542 -535 -99 -315 357 -166 -323 -828 665 -626 -624 353 907 -730 -1381 587
6412 587 -11 380 -185 -125 446 -182 -1151 240 147 560 -246 -193 275 117 631 260 -636 13 74 -173 -279
6433 -279 -324 614 616 196 -594 -451 -325 61 19 -518 -120 216 -326 -256 -215 -137 -164 -493 87 -745 4 -550 -715
6456 -715 97 -233 142 501 87 -76 -277 129 730 -553 513 -878 -1116 402 618 473 -72 504 -253
6475 -253 -648 -497 -306 -122 -264 -245 -546 177 18 -150 -852 298 242 -437 -145 927 -586 -298 -796 -359
6495 -359 -527 -634 529 397 -77 115 216 100 -401 -808 -403 -45 -430 -182 121 -380 370 259 -114 134
6515 134 -457 3 -91 549 -379 -196 -418 -833 214 -267 -605 -59 1208 -148 -110 346 364 115 -1046 443
6535 443 679 -253 361 -975 -602 -627 505 709 127 44 610 -17 -739 -34 67 -40 -909 -887 592 -22
6555 -22 -88 -345 -1144 -188 -456 161 -678 -1296 -92 -364 616 -441 -673 -233 -422 326 -725 294 321 233
6575 233 753 -139 -829 -505 36 76 4 106 168 598 -16 68 -41 -79 -439 -1088 -181 853 281 -364 339
6596 339 -412 -111 589 -134 -511 -157 571 591 -715 -195 -899 -989 -538 -1355 571 69 831 -598 292 12
6616 12 -465 -258 -12 -566 -84 308 -576 373 -349 -1275 725 -385 -201 271 168 1223 407 -459 541
6635 541 816 -602 255 382 -358 10 256 67 875 -756 303 65 -121 175 -277 1147 45 189
6653 189 -481 -615 -148 617 188 -716 167 18 123 -324 -67 674 274 600 -332 207 -873 -590 92 -815
6673 -815 -227 247 572 514 -225 255 53 210 329 387 -337 -329 335 103 -190 -189 -10 478 -463 272 895 -267
6695 -267 303 -922 -675 -684 -138 574 471 -26 -57 296 -720 -395 203 -331 -718 557 138 489 -412 -245
6715 -245 1313 -773 372 119 -273 -281 -88 -465 379 556 399 -345 15 -69 32 -20 -296 159 -106 198
6735 198 -315 -299 -294 418 -173 123 226 -87 512 -141 -163 271 211 355 -348 -674 -380 390 -1151 -28 -384
6756 -384 -626 1318 357 -773 -661 982 -593 63 -467 -203 467 11 622 -683 18 534 740 -501
6774 -501 -750 -1272 797 1313 -50 -538 72 79 -201 -192 -948 973 944 260 160 -117 -231 -118 61 -394 -180
6795 -180 742 -482 -253 -272 244 362 14 -146 -516 -291 547 428 -816 71 0 50 -221 763 263 510
6815 510 186 -250 -521 -73 34 91 -512 -279 493 -248 -105 -154 18 138 29 -266 -569 377 -207 -618 -217
6836 -217 -485 -737 222 -495 -808 391 -59 728 -533 -308 520 -1142 157 -644 -279 224 -545 827
6854 827 -190 -363 -442 254 327 33 -194 -643 -247 -246 505 -262 -28 600 -386 -56 -281 522 -3 216 -790
6875 -790 19 -804 -414 649 -419 227 369 360 274 -1010 -271 326 -72 170 -862 -107 -534 -257 247 -71
6895 -71 -971 283 578 -180 196 1086 -200 -256 472 -629 553 -535 227 -204 1008 294 -518 -438 158
6914 158 -33 875 169 407 -357 118 -91 667 793 -789 -607 -510 -115 -236 150 -776 66 -635 201 -282
6934 -282 -442 707 442 -265 144 -812 875 -24 -513 -443 549 488 -316 53 -422 252 -594 -405 -130 -241
6954 -241 -5 543 478 592 -337 -193 349 202 200 872 -433 -1 -110 20 76 -490 -58 -664 462 -514 -106
6975 -106 -168 48 -467 547 680 -223 705 429 1195 -771 -764 -164 37 -181 544 753 -1452 -280 -344 849
6995 849 -624 -1016 846 -704 -52 113 -325 -531 226 -465 -181 -543 161 282 -570 -8 253 -41 -633
7014 -633 -726 -420 -181 100 376 117 -248 100 -891 -589 -258 795 597 403 263 191 -288 -252 -446 131 -790
7035 -790 -465 64 29 239 181 510 -1000 483 -365 364 283 353 -262 -865 -327 720 37 108 -406 -847 789
7056 789 208 -39 -614 -468 -341 -8 -86 -201 50 -465 491 -227 -109 -639 -458 172 -481 -206 -377 -31
7076 -31 -854 317 407 476 -471 -66 219 144 199 77 170 267 -335 218 -472 6 475 478 1148 484 -1087 -109
7098 -109 257 79 -765 -474 -241 1044 780 -111 -792 -643 107 -337 59 -21 627 308 -198 -758 252 -306
7118 -306 -297 167 1116 -165 -231 323 -580 196 -489 561 352 166 673 469 -244 286 21 71 586 632 26
7139 26 -189 433 -108 -152 -93 -761 -421 -537 -653 186 33 -1094 126 -276 -586 -608 -256 -75 -966 -890 216
7160 216 -341 -485 1 355 307 92 632 -484 791 -126 -1169 625 -819 -844 -305 244 956 87 -484
7179 -484 242 28 -684 -1403 -415 27 833 486 299 -437 -225 -383 -510 41 241 330 -380 598 386 -114
7199 -114 -56 152 247 -336 -217 -13 -55 -653 628 -479 -510 212 776 -120 445 -398 -116 149 43 -771 -474
7220 -474 -828 -1 -337 351 438 153 -92 12 159 -180 107 256 223 -462 -777 -867 213 545 981 114 -1656
7241 -1656 -1778 -307 -823 185 -487 -601 -427 52 -351 -274 1259 380 510 -236 -182 -409 -719 127 -622
7260 -622 486 -12 -41 15 -1012 -941 -65 -724 319 -109 -248 -59 -305 -1011 -443 256 158 267 -187 423
7280 423 359 -470 287 -641 -295 -273 -34 233 -157 -189 70 56 663 -444 -586 419 693 383 957 478 -528
7301 -528 22 -405 -265 679 304 779 398 753 -852 220 -440 -615 284 -25 -704 114 78 734 27 172
7321 172 -174 -506 -1123 -515 648 132 -471 811 89 -398 209 195 474 -327 -123 -197 -68 331 -196 -293
7341 -293 679 149 436 218 -494 -694 -598 156 290 -290 19 236 -419 225 -280 -552 -523 313 -471 -475 -549 655
7363 655 169 1157 -1228 -524 -69 114 579 -404 -156 428 579 368 463 61 134 -305 40 -679 -33 112
7383 112 -112 -557 32 498 -182 -351 56 -181 106 -172 415 656 -794 214 -321 386 -136 10 339
7402 339 -402 -344 217 732 698 548 -259 401 101 -150 -1124 104 19 -236 136 219 -755 378 -303 -287 413
7423 413 702 -703 579 420 -579 545 114 667 -1354 464 758 -361 -363 -13 -291 -914 -601 243 -363
7442 -363 -288 137 -644 701 1055 -384 -386 626 74 -92 -407 -257 370 -160 933 51 -585 -359 329 -315
7462 -315 -121 462 492 -121 -893 -829 -637 327 -1055 -581 678 831 266 -864 -728 -1064 75 94 368 -29
7482 -29 1015 -184 -196 -93 126 848 -74 501 426 441 431 94 125 -546 423 -296 625 -1007 -67 -255 148
7503 148 -66 77 135 498 -521 491 54 -139 115 980 -189 -229 361 460 -599 -245 642 -571 -496 -41
7523 -41 315 -1228 806 333 82 563 -173 -454 129 -24 185 -1455 -1220 -140 198 -431 351 40 128
7542 128 249 -721 -158 166 593 0 -125 722 368 10 -438 593 -8 -457 -27 74 131 1050 -383 -1122
7562 -1122 131 -12 -123 168 129 -180 221 600 -518 302 40 178 -870 144 -529 -679 -803 792
7580 792 391 317 -420 -29 845 -827 565 -275 -124 -987 255 516 0 741 -115 -353 -484 969 473
7599 473 207 -1080 -114 485 177 630 102 -656 -149 405 156 -369 -623 50 853 147 -458 263 -704 190
7619 190 111 -775 690 609 640 -304 442 -329 -124 -208 268 126 -302 289 313 -878 -59 192 -1020 147
7639 147 -470 46 423 -365 183 429 -102 302 134 -209 -706 -447 -125 1204 -568 401 208 927 -115
7658 -115 -500 527 -297 200 427 -666 417 732 -111 200 143 310 -491 973 -277 -430 87 439 213
7677 213 574 898 239 241 -27 240 -1514 148 -564 -1071 243 -202 381 -82 463 -624 288 -120 -17
7696 -17 -131 398 -838 -298 -149 -679 -511 225 137 352 73 -632 225 105 -651 -766 -66 434 -21 610
7716 610 -25 493 55 445 -655 -219 126 13 1278 98 -269 808 362 282 133 -1021 -103 -292 4
7735 4 246 459 -709 -264 -277 -496 122 206 -133 -390 -250 -55 202 156 1107 142 891 -334 -234 -1007 -453
7756 -453 -469 504 -459 662 181 -443 155 -348 409 -430 848 -446 76 420 121 515 3 199 -906
7775 -906 -540 263 800 9 -126 66 404 504 -260 -310 32 111 180 -564 -75 623 297 816 -598 -25 -311
7796 -311 716 904 -702 -461 -147 7 -247 100 220 -178 432 -109 733 -316 211 -430 -731 -452 -329
7815 -329 194 122 -328 -99 327 -154 -16 591 164 346 -311 111 897 448 1368 -12 -95 213 -533 261
7835 261 -264 -640 100 -490 320 43 -253 -203 -31 249 -190 -310 -116 -396 -1080 -311 -948 396 -506 732
7855 732 489 -375 -41 -358 -795 758 -395 422 338 329 -187 130 863 -195 -449 -213 -310 984 -303 -570
7875 -570 -725 -232 -278 142 -130 784 1049 102 23 653 -611 -634 111 105 -947 3 759 449 427 799 543
7896 543 -15 -1 -209 533 -1048 -301 395 -510 -156 -533 364 424 117 320 484 -60 -344 -1302 -133 35
7916 35 499 -1 436 -441 694 1410 -839 -198 -208 428 -150 -411 271 887 230 -1262 -309 -713 402
7935 402 883 619 -125 -274 937 -486 -519 -1103 -183 246 -81 77 155 -40 -647 -152 -376 -556 -248 -276
7955 -276 184 -1133 563 -202 -352 -593 -566 -472 80 -770 330 -91 271 221 -215 485 -767 396 -140
7974 -140 -185 -829 -467 -158 24 -205 -201 -380 -809 1141 570 -759 -501 -896 -517 351 -903 -534 -495 135
7994 135 -30 298 30 104 -896 123 -340 -493 1050 784 672 252 -630 -154 -255 961 -91 167 1055
8013 1055 660 -216 -213 -582 -906 456 -776 183 355 740 68 606 -621 540 -360 -401 -345 297 649 -136
8033 -136 166 -484 -336 259 -769 -855 17 508 345 190 -525 132 264 -148 -607 6 -871 198 -827
8052 -827 -329 -346 -208 -39 -119 1165 -142 1441 -353 717 676 -1025 194 324 -15 -708 -270 -118 -111
8071 -111 -73 -699 -883 213 -184 -239 227 82 -435 35 50 -343 -1165 -878 146 870 -542 -12 -837 -472
8091 -472 -608 346 -423 -112 676 -67 475 175 -104 -1040 -74 561 147 310 592 -216 -122 -309 245 -805
8111 -805 -807 -124 443 212 210 -44 -820 -57 20 -438 -538 -15 -84 -582 124 -42 402 885 -550 -470 -784 -239
8133 -239 64 -12 -956 373 -1384 -14 699 643 -574 161 73 -184 579 458 -385 -540 -19 819 273 -34
8153 -34 202 -185 -721 53 538 -252 636 -149 664 -1 -340 -667 263 -39 1074 -204 598 996 42 -1337
8173 -1337 769 -345 -772 738 -697 510 492 574 -316 -51 -801 121 505 -684 -321 457 671 -412
8191d12
##END NTUPLES=NMR FID
##END=
