##TITLE=1H_SAM_10.107
 CDCl3, 108 sc, 
 6.3.2019
##JCAMPDX= 6.0         $$ Bruker NMR JCAMP-DX V2.0
##DATA TYPE= NMR FID
##DATA CLASS= NTUPLES
##ORIGIN= UXNMR, Bruker Analytische Messtechnik GmbH
##OWNER= root
$$ XWIN-NMR		Version 3.5
$$ Wed Mar  6 15:56:26 2019 Russian Standard Time (UT+4h)  she@DPX200
##.OBSERVE FREQUENCY= 200.115
##.OBSERVE NUCLEUS= ^1H
##.DELAY= (6, 6)
##.ACQUISITION MODE= SIMULTANEOUS
##.ACQUISITION SCHEME= undefined
##.AVERAGES= 108
##.DIGITISER RES= 16
##SPECTROMETER/DATA SYSTEM= spect
##.PULSE SEQUENCE= zg30
##.SOLVENT NAME= CDCl3
##.SHIFT REFERENCE= (INTERNAL, CDCl3, 0, 15.7039)
##AUDIT TRAIL= $$ (NUMBER, WHEN, WHO, WHERE, WHAT)
$$ ##TITLE= Audit trail, XWIN-NMR		Version 3.5
$$ ##JCAMPDX= 5.01
$$ ##ORIGIN= Bruker BioSpin GmbH
$$ ##OWNER= she
$$ F:/spectra/data/she/nmr/H-F/1/audita.txt
$$ ##AUDIT TRAIL=  $$ (NUMBER, WHEN, WHO, WHERE, WHAT)
(   1,<2019-03-06 15:53:01.73 +0400>,<she>,<DPX200>,
      <continue with go, POWCHK disabled, PULCHK disabled
       configuration hash MD5:
       00 E9 B6 7A A2 85 ED C7 34 08 36 98 17 FE 4E 26
       data hash MD5: 16K
       7B 88 39 7F 4A 57 04 A7 5F D2 52 DE F4 45 FD 02>)
$$ ##END=
$$ 
$$ hash MD5
$$ D0 05 D2 1B 3A C7 57 9C E1 E7 25 87 99 9D D8 AD
##$RELAX= 
##$RELAX= 
##$RELAX= 
##$RELAX= 
##$RELAX= 
##$RELAX= 
$$ Bruker specific parameters
$$ --------------------------
##$DU= <F:/spectra>
##$EXPNO= 1
##$NAME= <H-F>
##$PROCNO= 1
##$TYPE= <nmr>
##$USER= <she>
##$AMP= (0..31)
100 100 100 100 100 100 100 100 100 100 100 100 100 100 100 100 100 100 
100 100 100 100 100 100 100 100 100 100 100 100 100 100 
##$AQSEQ= 0
##$AQ_mod= 1
##$AUNM= <au_zg>
##$AUTOPOS= <>
##$BF1= 200.13
##$BF2= 200.13
##$BF3= 200.13
##$BF4= 200.13
##$BF5= 200.13
##$BF6= 200.13
##$BF7= 200.13
##$BF8= 200.13
##$BYTORDA= 1
##$CFDGTYP= 0
##$CFRGTYP= 5
##$CHEMSTR= <none>
##$CNST= (0..31)
1 1 145 1 1 1 1 1 1 1 1 1 1 1 1 1 1 1 1 1 1 1 1 1 1 1 1 1 1 1 1 1 
##$CPDPRG= <>
##$CPDPRG1= <>
##$CPDPRG2= <>
##$CPDPRG3= <>
##$CPDPRG4= <mlev>
##$CPDPRG5= <mlev>
##$CPDPRG6= <mlev>
##$CPDPRG7= <mlev>
##$CPDPRG8= <mlev>
##$CPDPRGB= <>
##$CPDPRGT= <>
##$D= (0..31)
0 1.2 0 0 0 0 0 0 0 0 0 0.03 0 0 0 0 0 0 0 0 0 0 0 0 0 0 0 0 0 0 0 0 
##$DATE= 1551872976
##$DBL= (0..7)
120 120 120 120 120 120 120 120 
##$DBP= (0..7)
150 150 150 150 150 150 150 150 
##$DBP07= 0
##$DBPNAM0= <>
##$DBPNAM1= <>
##$DBPNAM2= <>
##$DBPNAM3= <>
##$DBPNAM4= <>
##$DBPNAM5= <>
##$DBPNAM6= <>
##$DBPNAM7= <>
##$DBPOAL= (0..7)
0.5 0.5 0.5 0.5 0.5 0.5 0.5 0.5 
##$DBPOFFS= (0..7)
0 0 0 0 0 0 0 0 
##$DE= 6
##$DECBNUC= <off>
##$DECIM= 2
##$DECNUC= <off>
##$DECSTAT= 4
##$DIGMOD= 1
##$DIGTYP= 9
##$DL= (0..7)
0 120 120 120 120 120 120 120 
##$DP= (0..7)
150 150 150 150 150 150 150 150 
##$DP07= 0
##$DPNAME0= <>
##$DPNAME1= <>
##$DPNAME2= <>
##$DPNAME3= <>
##$DPNAME4= <>
##$DPNAME5= <>
##$DPNAME6= <>
##$DPNAME7= <>
##$DPOAL= (0..7)
0.5 0.5 0.5 0.5 0.5 0.5 0.5 0.5 
##$DPOFFS= (0..7)
0 0 0 0 0 0 0 0 
##$DQDMODE= 0
##$DR= 16
##$DS= 0
##$DSLIST= <SSSSSSSSSSSSSSS>
$$ [...]
##$SUBNAM2= <"">
##$SUBNAM3= <"">
##$SUBNAM4= <"">
##$SUBNAM5= <"">
##$SUBNAM6= <"">
##$SUBNAM7= <"">
##$SUBNAM8= <"">
##$SUBNAM9= <"">
##$SW= 260.267013134115
##$SWIBOX= (0..15)
0 0 2 0 0 0 0 0 0 0 0 0 0 0 0 0 
##$SW_h= 52083.3333333333
##$TD= 16384
##$TD0= 1
##$TE= 0
##$TE2= 300
##$TE3= 300
##$TEG= 300
##$TL= (0..7)
0 120 120 120 120 120 120 120 
##$TP= (0..7)
150 150 150 150 150 150 150 150 
##$TP07= 0
##$TPNAME0= <>
##$TPNAME1= <>
##$TPNAME2= <>
##$TPNAME3= <>
##$TPNAME4= <>
##$TPNAME5= <>
##$TPNAME6= <>
##$TPNAME7= <>
##$TPOAL= (0..7)
0.5 0.5 0.5 0.5 0.5 0.5 0.5 0.5 
##$TPOFFS= (0..7)
0 0 0 0 0 0 0 0 
##$TUNHIN= 0
##$TUNHOUT= 0
##$TUNXOUT= 0
##$USERA1= <user>
##$USERA2= <user>
##$USERA3= <user>
##$USERA4= <user>
##$USERA5= <user>
##$V9= 5
##$VALIST= <valist>
##$VCLIST= <CCCCCCCCCCCCCCC>
##$VD= 0
##$VDLIST= <DDDDDDDDDDDDDDD>
##$VPLIST= <PPPPPPPPPPPPPPP>
##$VTLIST= <TTTTTTTTTTTTTTT>
##$WBST= 1024
##$WBSW= 4
##$XGAIN= (0..3)
0 0 0 0 
##$XL= 0
##$YL= 0
##$YMAX_a= 650074
##$YMIN_a= -676363
##$ZGOPTNS= <>
##$ZL1= 120
##$ZL2= 120
##$ZL3= 120
##$ZL4= 120
##$ABSF1= 10
##$ABSF2= 0
##$ABSG= 5
##$ABSL= 3
##$ALPHA= 0
##$AQORDER= 0
##$ASSFAC= 0
##$ASSFACI= 0
##$ASSFACX= 0
##$ASSWID= 0
##$AUNMP= <proc_1d>
##$AZFE= 0.1
##$AZFW= 0.1
##$BCFW= 1
##$BC_mod= 2
##$BYTORDP= 1
##$COROFFS= 0
##$CY= 11.3945322036743
##$DATMOD= 1
##$DC= 2
##$DFILT= <>
##$DTYPP= 0
##$F1P= 18.9103706918063
##$F2P= -1.10871071338519
##$FCOR= 0.5
##$FTSIZE= 0
##$FT_mod= 4
##$GAMMA= 1
##$GB= 0.15
##$INTBC= 1
##$INTSCL= 1
##$ISEN= 128
##$LB= 0.24
##$LEV0= 0
##$LPBIN= 0
##$MAXI= 10000
##$MC2= 0
##$MEAN= 0
##$ME_mod= 0
##$MI= 1.114404
##$NCOEF= 0
##$NC_proc= 0
##$NLEV= 6
##$NOISF1= 3.799351
##$NOISF2= 2.8
##$NSP= 1
##$NTH_PI= 0
##$NZP= 0
##$OFFSET= 15.70392
##$PC= 1
##$PHC0= -8858.351
##$PHC1= 82.00015
##$PH_mod= 1
##$PKNL= yes
##$PPARMOD= 0
##$PSCAL= 0
##$PSIGN= 0
##$REVERSE= no
##$SF= 200.130013532006
##$SI= 16384
##$SIGF1= 3
##$SIGF2= 2
##$SINO= 400
##$SIOLD= 16384
##$SREGLST= <1H.CDCl3>
##$SSB= 0
##$STSI= 0
##$STSR= 0
##$SW_p= 3612.71676300578
##$SYMM= 0
##$S_DEV= 0
##$TDeff= 0
##$TDoff= 0
##$TI= <>
##$TILT= no
##$TM1= 0
##$TM2= 0
##$TOPLEV= 0
##$USERP1= <user>
##$USERP2= <user>
##$USERP3= <user>
##$USERP4= <user>
##$USERP5= <user>
##$WDW= 1
##$XDIM= 8192
##$YMAX_p= 0
##$YMIN_p= 0
$$ End of Bruker specific parameters
$$ ---------------------------------
##NTUPLES= NMR FID
##VAR_NAME=  TIME,          FID/REAL,        FID/IMAG
##SYMBOL=    X,             R,               I
##VAR_TYPE=  INDEPENDENT,   DEPENDENT,       DEPENDENT
##VAR_FORM=  AFFN,          ASDF,            ASDF
##VAR_DIM=   8192,          8192,            8192
##UNITS=     SECONDS,       ARBITRARY UNITS, ARBITRARY UNITS
##FACTOR=    1.92e-05,      1,               1
##FIRST=     0,             0,               0
##LAST=      0.1572672,     0,               0
##MIN=       0,             -676363,         0
##MAX=       0.1572672,     650074,          0
$$ Real data points
##PAGE= N=1
##DATA TABLE= (X++(R..R)), XYDATA
0f8J64j27M9j10K16l01L50l53M19n58P00p91Q81j035J247j465J652j855K120k450
20a315K804l148L513l957M490n055N633o275P031p911Q874r926J1143j2590J4302
35G613j6308J8718k1730K5642l0912L8358m9784O9735j13531K98867J53510j056541
47f76363Q31762L13202q88169K11356P59008p00325k84828Q22680j87839o96207
57d95723O00768K98265p29605J28645O28324m93926l05906O34187o2778n71456
67c69205L86611L19234n42131m681N24413k86725l40070M56182P3566m76642J97128
78f2320L46285l80764j22625M34920j24646l48850L12689J59887l87676O4802
88a08298L32487k47759j75332L32973k2017k98961J89301J71815k72605r175K54385
$$ plain form
0 -68 96 -31 18 -92 124 -177 173 -180 239 -319 381 -410 471 -564 683 -782 870 -985 1135 -1315
20 -1315 1489 -1659 1854 -2103 2387 -2668 2965 -3310 3721 -4190 4684 -5242 5901 -6689 7613
35 7613 -8695 10023 -11707 13935 -16977 21381 -28403 41332 -72199 226668 380178 -676363
47 -676363 155399 468601 -419568 -208212 550796 -149529 -434357 388323 200484 -495723
57 -495723 105045 403310 -326295 -197650 430674 -63252 -369158 265029 202251 -369205
67 -369205 17406 336640 -205491 -210172 314241 27516 -312554 143628 217194 -259448 -62320
78 -62320 283965 -96799 -219424 215496 90850 -258000 54689 214576 -173100 -108298
88 -108298 224189 -23570 -198902 134071 112054 -186907 2394 174209 -98396 -107571 146814
99A46814j27485j60285J97966L8475j94302O3226J38120j17727o5672J28817L687
110E1634j14728L7295R5515o9219p4214J01632M1141j31780J6972J39675r4040
121a17j02642J62901J7191j90885R6923J48697j93728m0025K27234r8488j76339
132a49278K13825M8291k47156J03279J86241k19393n1366K51136j04785j84173
142a53379K17063M8522k41463R7508J74696j98549m9609K21255q5095j62715J78784
153D7018N2163k02075O7499J55335j55283n9934J84568m8486j50808J34153P0358
164I4508j73560L2479J53731j23290q2136J72190k1360j59745J19972Q6144j73713
175g4780K1604J61127j23877q3288J78939l0059j62728J36049P5190j84792M3723
$$ plain form
99 146814 19329 -140956 57010 95485 -98817 -35591 102529 -15198 -80870 47947 51634
110 51634 -63094 -25799 69716 497 -73717 27915 69056 -62724 -45752 93923 -117
121 -117 -102759 60142 77333 -113552 -16629 132068 -61660 -101685 125549 27061 -149278
132 -149278 64547 112838 -134318 -31039 155202 -64191 -115557 135579 30794 -153379
142 -153379 63684 112206 -129257 -31749 142947 -55602 -105211 116044 30949 -131766 47018
153 47018 99181 -102894 -35395 119940 -35343 -95277 89291 40805 -110003 24150 94508
164 94508 -79052 -46573 107158 -16132 -98268 73922 52562 -107183 12789 98933 -74780
175 -74780 -53176 107951 -15926 -99214 79725 49666 -113062 22987 98177 -86615 -42892
186d2892J55831j44953n9745J83559o0369j43886J55266M1838j80349P4106J28464
197A06870j55318k4664J67318q4461j08163J50383J0406j52225Q6627R1478j39134
208e0883k068J34496q0817p9772J26368j237j17554P1479O6981j08774J535J03382
220F3136o0927o2320R0994P555q8849M3727N7588p2808j3593P7585l0474n8033
232d6419O0815K1114o7813J5378N7415m6725l0363O2723m985n7854L7334L3391
244C4011n6187O73N5503l3660l4114N2464K381n0307K6921L0938m3333k123M1449
257B4616k3468k4395L6683o78l1472J6555J8581k4641n63J9478j0272r926J4804
270E302p82j1090O129O370o248k424L439J737l178k194O429j501o436N538N217
$$ plain form
186 -42892 112939 -32014 -91759 91800 31431 -112455 42811 84649 -95700 -21594 106870
197 106870 -48448 -73112 94206 9745 -98418 51965 62371 -89854 -3227 88251 -50883
208 -50883 -52951 81545 728 -79044 47324 46087 -71467 12 66993 -41781 -40246 63136
220 63136 2209 -60111 30883 38438 -50411 -6684 50904 -21904 -35497 42088 11614 -46419
232 -46419 14396 35510 -32303 -16925 40490 -6235 -36598 26125 21140 -36714 620 34011
244 34011 -22176 -21503 34000 340 -33774 18690 21071 -29236 -2315 28623 -14710 -16833 24616
257 24616 1148 -23247 13436 12758 -18714 -2159 16422 -8219 -8782 10696 424 -9502 5302
270 5302 4520 -6570 -441 5929 -319 -2743 696 2433 -745 -2939 3490 1989 -4447 1091 6308
285F308j2611M576J1489j5744k135K0227j2399j4942K6458m030k6646K7122Q936
298A6609l9730J9091L3911m6485n183N5469l4597l6769O6025n429p0688N6267
310H491L7794q7652J7409Q4890p6952l8677J06931k9557r3310R3138L6131j21255
322f2619M1862R9856j08032l4382J33911m9089j05311J15263L4443j38104N1312
333b0890J05416j15746l4544J37102m8706j07612J12566M0088j34758L9514J08661
344H1091j01819m7659J28188k7329j09284Q8017N9414j22027R930J15375p5382
355a485p1999J15975N905j18555O3480Q0221j08886j6928J18200n3283q5491J03273
367C0427K2442j13420M4586Q2046r0619k3168R9082l7416o9115P4566J9942p8789
$$ plain form
285 6308 -6303 -1727 9762 -5982 -8117 12110 -289 -15231 11227 7197 -19449 7673 16609
298 16609 -23121 -4030 29881 -16604 -21787 33682 -915 -37684 28341 22912 -47776 8491
310 8491 46285 -41367 -23958 60932 -16020 -54697 52234 22677 -70633 22505 58636 -62619
322 -62619 -20757 79099 -28933 -63315 70596 21507 -83804 31459 65902 -72202 -20890
333 -20890 84526 -31220 -65764 71338 22632 -84980 27586 67674 -67084 -27570 81091
344 81091 -20728 -68387 59801 32472 -76812 11205 70619 -51408 -41478 73897 -1485
355 -1485 -73484 42491 48396 -70159 -6679 73542 -35344 -52272 65928 12645 -72846 30427
367 30427 52869 -60551 -15965 66081 -24538 -47706 51376 13960 -55155 19411 39353 -39436
379c9436K5774N3334m8663j9860N0334q765l3614J8860J8319j6845j2386J4557
391A609J4305k0617j4738L5167K971m9969K6688M6987o2932j6318Q3803l6335
403A0621p0380Q6419K1955j10535M8421Q9455j08543k7145J33948n9159j01982
414h6925J25989K6133j46617O7687J06135j35695k2524J51128p3550j04990J38761
425D5532K0343j51117P2071J05523j36565j8470J44102o9457r9682J30047J9879
436F2206j41561O5772R9774j24056k2762J35643o0916r6152J19219K2012j33336
447g4157O0549R5963j19243k2201J33371o1393r5424J22626J6039j32228O8612
458g486Q8506j26663o718J31603p8162q1088J30828l823j28580Q8503P0280j34796
$$ plain form
379 -39436 -13662 39672 -8991 -28851 21483 12718 -20896 -2036 16283 -562 -12948 1609
391 1609 15914 -4703 -19441 15726 18697 -31272 -4584 42403 -20529 -36847 46956 10621
403 10621 -59759 26660 48615 -61920 -13499 75956 -32587 -59732 74216 15057 -86925
414 -86925 39064 65197 -81420 -13733 92402 -43293 -65817 85311 11761 -93229 45532
425 45532 65875 -85242 -13171 92352 -44213 -62683 81419 11962 -87720 42327 62206
436 62206 -79355 -13583 86191 -37865 -60627 75016 14100 -82052 37167 59179 -74157
447 -74157 -13608 82355 -36888 -59089 74282 12889 -82535 40091 56130 -76098 -7486
458 -7486 81020 -45643 -52361 79242 1080 -80008 50820 46997 -81583 6920 77200 -57596
470e7596K1186J18444r9843n2553J34638l6294j09023J05414L8502j28773M8072
481a7826R3810j07691k0992J16648n4773p8632J04505R970j05356N5596O3355
492E8614r0780l070Q6320n0055m7869P4992k335o6616L9951L8481n6533k669M8466
505B6897k3049k9592L5115O911l2081R168K2170j4520j4102J6270Q846j7464o439
518a1870K0964Q04k3817Q053K6858k4533j7550L7305n25m3923K6021L4497m9513
531a7229r376O1051k4119n3609N8346K3743p5976J8531O9171n9940l9452Q8647
543C9788j1050q8824O3351N8117j00427l953J09376o0007p9159J09771J8488j27282
555g1811N5249J02089j20072l4256J45469n0678j22500J27667N0239j62114M4668
$$ plain form
470 -57596 -36410 82034 -17809 -70362 64276 27982 -81041 24373 62875 -65898 -17826
481 -17826 75984 -31707 -52699 63949 9176 -69456 35049 45019 -60337 -4741 58614
492 58614 -32166 -35236 51084 1029 -46840 28152 25817 -40799 -848 37633 -18900 -21569 26897
505 26897 3848 -25744 9371 16282 -15799 -6631 15539 1019 -13083 3187 12033 -5431 -11870
518 -11870 9094 9898 -13919 -5866 20992 -3541 -21091 16214 15689 -28234 -2213 32284 -17229
531 -17229 -26605 34446 10327 -43282 15064 38807 -37169 -18638 50533 -9407 -48859 39788
543 39788 28738 -60086 3265 61382 -39045 -42998 66378 6371 -72788 36983 55471 -71811
555 -71811 -16562 85527 -34545 -68801 76668 25990 -96510 31157 81396 -80718 -36050
566c6050J41281j32389o3929J74978m1269j54613J35990P4668j83159L5363J62563
577A13434j32979q2073J82793k8654j64893J27744Q6198j76746K0285J60933j14801
588h759q8987J64197j0040j51876R7771Q7700j45617L45J37916p6421q7982J22281
600D0528J4742j23374N3301Q7288r6258l0875J07956l0204q6105P3635M2663r1459
612c8162R033Q2961n3581n1675P8675Q134p9385L4283N7780o3652k0113P1695
624C5993k2389n5553N2183K3375o0578J0361M8494l3859k4545M1522O58l5161
636a9499J5445K0760j9279j0786J8155O202j7012o654K4711J91l2651J5786L2458
649B7827l8782j6371N7462j7679n6030N6714K6068p9815K4414P1857p4980k9135
$$ plain form
566 -36050 105231 -27158 -91087 83891 42622 -111991 23999 98667 -84492 -49129 113434
577 113434 -19545 -101618 81175 52521 -112372 15372 101570 -75176 -54891 106042 -8759
588 -8759 -97746 66451 56411 -95465 2306 90006 -55611 -55266 82650 6229 -81753 40528
600 40528 55270 -68104 -14803 72485 -23773 -54648 53308 23104 -63001 10634 53297 -38162
612 -38162 -29129 53832 251 -51424 27251 35385 -44000 -9717 48063 -15589 -35702 35993
624 35993 13604 -41949 10234 33609 -26969 -16608 31886 -1973 -26518 15004 15662 -19499
636 -19499 -4054 16706 -2573 -13359 4796 10998 -6014 -12668 12043 12234 -20417 -4631 27827
649 27827 -10955 -27326 30136 12457 -43573 13141 39209 -40606 -16192 55665 -19315 -48450
661d8450R9632l4249q0505Q7660K5471j06814M4078P9615r6677j5783J05828n3120
673F686o9214R6556O392r7543N4922N6496q6996L063P9217n2978l9756P3700q618
686B1927o2532M4857K9524n5632O611M3658l1159k1214L9006l128l1885J9436
698e31J8428k6600l298K5708r700j8587J8231Q401k4498O991K1190k0778p808
711a2851K5958q403k1234K2826N789k8214J5534J7574l0278M974K7688k7682p206
724a5525L5066j8742k2783L6190l092l5125L1379J0464m0284K0455K7777m2947
736a7167L288M1704l5400j3978M5599k1713k9838M6204o477m2049L9745J3064
748B2982n0424K5278L1283n1064R930M5767m6947j0515N6556l2403l5296O0974
$$ plain form
661 -48450 51182 16933 -63572 24088 49559 -57255 -13177 66438 -30239 -46022 59806 6686
673 6686 -62528 34028 40420 -57123 -2201 54295 -32701 -29638 49579 -3399 -43155 30545 21927
686 21927 -40605 4252 33776 -21856 -15245 28413 -2746 -23960 15046 11918 -19967 -531
698 -531 17897 -8703 -12001 13707 4007 -14580 3651 12052 -12446 -5455 15735 -5043 -12851
711 -12851 13107 4704 -16530 6296 12085 -16129 -595 16979 -13299 -8325 19363 -8319 -15525
724 -15525 19541 799 -21984 14206 11114 -24011 7368 17832 -22452 -1997 25780 -17167
736 -17167 -13879 27825 -7575 -21553 24046 2333 -27505 18699 12222 -29827 9918 22982
748 22982 -27442 -2164 29119 -21945 -12015 33752 -13195 -23710 32846 443 -34853 26121
760B6121r193n6833N3730J7063o8946L3197M8102o8718q55P1028m8948l7809P5805
773C3744j5056o4843N7841K6321p5232K4950N6839o0466j6612O8252k5793m9086
785c9141N3511J4029n9084K1876M2325m2802j7713M9876r002m3853L0901K7982
797B8905m5310m672M8706k2027l7187M2705J4546n3463J6509M6666m5531k0435
809c0588N9240j3485n1027M5102K2011n8812J4827M7188m3878j7121N3111j8008
821H560l7574L9183R575l8666J5176K0502k3913O43J5626j0469j385O240q655
834e157R381J325j9859J9649J1364l6979J4143L6768m5748j0947O2025l0458n0174
847d4667O9486P863q3479M9917N6792r2880R02R8990o4925o1149J06003n301j06184
$$ plain form
760 26121 16928 -39905 13825 30888 -38058 -4861 43241 -25477 -26332 44696 -4252 -42061 33744
773 33744 18688 -46155 11686 38007 -37225 -12275 44564 -15902 -32514 35738 9945 -39141
785 -39141 14370 28399 -30685 -8809 33516 -9286 -26999 22877 13875 -29978 923 28905
797 28905 -16405 -21077 27629 5602 -31585 11120 25666 -27797 -11288 35378 -10153 -30588
809 -30588 28652 15167 -35860 9242 31253 -27559 -12732 34456 -9422 -26543 26568 8560
821 8560 -29014 10169 19744 -18922 -3746 16756 -7157 -6514 9112 -1357 -2742 3498 -5157
834 -5157 4224 5549 -14310 5339 16703 -20276 -6133 30635 -15113 -26060 35965 5507 -44667
847 -44667 24819 32682 -50797 -880 55912 -36968 -36066 62924 -2001 -63150 42853 37552 -68632
860f8632P5454N9226j14140J0639J08751q0017n7302J15540j4167j04824P6431
871F959N5580j07288R215R9116o7020n6204R7517k030r3379N4267O0706q6844
883b9405j0059R0259m0540o5537P5868K2212q7948K8067P1815o8858l2999Q8317
895D1192j7696p8273O3241M0893q7762J3048P9425o1688m0222Q5222j2416p6527
907e1563N9776L7092q0434J5197O6832n6115k9038P0866j7209n5701N2196J6949
919B8848n8145K1783L7878m3224o682M2927k2782j9615L2012m808k3548J9516
931D160N905k1052J2135N474j3976Q992M589j4363R148P557j9616R896J2873k1132
945i410K871K2501k1444p264K6765j1356k0825K8334K307l1700K0812J6681l1819
$$ plain form
860 -68632 6822 66048 -48092 -37453 71298 -8719 -66021 49519 35352 -69472 6959
871 6959 62539 -44749 -35534 63582 -3438 -59642 37875 35845 -57534 -3267 57439 -29405
883 -29405 -39464 50795 10255 -55282 20586 42798 -45150 -17083 54732 -14126 -47125 41192
895 41192 23496 -54777 8464 49357 -38405 -25357 54068 -7620 -47842 37380 24964 -51563
907 -51563 8213 45305 -35129 -19932 46900 -9215 -38253 32613 15404 -40297 11899 28848
919 28848 -29297 -7514 30364 -12860 -19542 23385 603 -19012 13000 8192 -15356 4160
931 4160 10065 -10987 1148 6622 -7354 1638 6227 -8136 1012 8569 -11047 -1151 11722 -9410
945 -9410 -6539 15962 -5482 -12746 14019 2663 -18162 10172 12479 -19221 1591 18272 -13547
958a3547N322K7520k5897q632L1888j2970k2156K7321K879k8682J7723J5310k7428
971a1349L578K3353j8931j0819K6014p214j9927J8035Q705k0790K961K0393j5006
984i97j0798J9536R62k3837J2925J9862k5833o803L3037j2868k8817L3192J2037
997B1598m6215J7471M0386m7297j3055O2071k7379n0409O4231J1807p7410L9133
1009e068N6356q1460l667Q8726n6610n5695R7317p363r5469P0422N1063j04612
1021d6060J7421R4026p9952m1938J07846k8373q9160Q6809L1013j03626L5362
1032a6632P8704q5503k0589R4750l9842o5543P9183J3091q2481L6797N4633o7267
1044b0699r822O8052l0426m6854N6197J0007n6009K1657M0447m4025j3612M9809
$$ plain form
958 -13547 -8225 19295 -6602 -15234 16654 3684 -18472 8849 11728 -16954 769 16079 -11349
971 -11349 -7771 15582 -3349 -14168 11846 4632 -15295 2740 11445 -9345 -6384 14009 -997
984 -997 -11795 7741 8703 -15134 -2209 17653 -8180 -14983 18054 5186 -23631 9561 21598
997 21598 -24617 -7146 33240 -14057 -27112 34959 7580 -42829 21402 33209 -44201 -5068
1009 -5068 51288 -30172 -33839 54887 -1723 -57418 39899 32536 -62933 7489 58552 -46060
1021 -46060 -28639 65387 -14565 -56503 51343 22970 -66190 20619 51632 -51994 -16632
1032 -16632 62072 -23431 -44020 50730 10888 -54655 24528 37619 -44862 -8065 46568 -20699
1044 -20699 -30521 37531 7105 -39749 16448 26455 -29554 -7897 32550 -11475 -25087 24722
1056B4722j4981l8140L5495J6297m4618J0670L6890l2312j6813M3461j0669l6084
1068b6082L5862J2621m5428J7248L2998m0138m152M3329k7550k2678M3779r350
1080A0459l9301L9930J0708m8860K5445L1995n1567P005M7174m3125j7442N8647
1092C1068k4021m2237N5533J440n8938M2162K9000o3981J7031N2437n4845j2839
1104b8190O3322l2448l8424N8512m458n3866M2846K2304n7579J9605L9111m6571
1116a5836j987M6607l2186k0275M4876j4211l2754L9336J651l9935K9137J8056
1128B2479m3149J4794L2348l8382m862M3136k7990k5333M7628o377m5193L6581
1140E680K3075n3786J1332M9121m3444k3636O0630j3682n5390M8131L0111p0235
$$ plain form
1056 24722 9741 -28399 7096 23393 -21225 -10555 26335 -5977 -22790 20671 10002 -26082
1068 -26082 9780 22401 -23027 -5779 27219 -12919 -17071 26258 -1292 -23970 19809 10459
1080 10459 -28842 11088 21796 -27064 -1619 30376 -21191 -14186 32988 -10137 -27579 31068
1092 31068 7047 -35190 20343 21783 -37155 5007 34007 -29974 -12943 39494 -15351 -28190
1104 -28190 35132 2684 -35740 22772 18314 -35552 7294 29598 -27981 -8376 30735 -15836
1116 -15836 -17823 28784 -3402 -23677 21199 6988 -25766 13570 15221 -24714 4423 22479
1128 22479 -20670 -5876 26472 -11910 -16772 26364 -1626 -26959 20669 14292 -30901 5680
1140 5680 28755 -25031 -13699 35422 -8022 -31658 28972 15290 -40100 8031 38142 -32093
1152c2093J0678O8708n3835l9088Q0755q370q1717N9905N0579r6240O246R9559
1164F5087o8261o3650J12933n376j15596P9559P1540j29187P032J29344q9142
1175e717p6803J40771j0895j36107R6514P7749j46619J4113J38285j01156p4764
1186h4629J47172j7204j34994J00714O9907j40819J8143J24821r3231o3944J27220
1197E3156j4504j12268P9833N9083j10287P414R9151o1896n7785Q9792M740q4662
1209d8233M0792N7304o8788j6935P2596k0256n9326M8276L3205o4083P80O1607
1221C6939l1750m4744N4431J6493o3500J7431N4682m6459k9888O2956n836n9609
1233c8854L8456L8030n8953m468O1233k9806m4021N2633J4766n9085J8521M7371
$$ plain form
1152 -32093 -21415 47293 -6542 -45630 35125 26755 -54962 4943 55522 -40718 -34472 65087
1164 65087 -3174 -66824 46109 40733 -74863 4696 76236 -52951 -45919 83425 -5717
1175 -5717 -82520 58251 47356 -88751 7763 85512 -61107 -46994 91291 -9865 -84629
1186 -84629 62543 45339 -89655 11059 80966 -59853 -41710 83111 -10120 -74064 53156
1197 53156 38652 -73616 6217 65300 -44987 -37573 61578 -318 -58103 31689 36429 -48233
1209 -48233 -7441 49863 -18925 -35860 36736 16480 -42846 5430 38635 -25448 -24668 36939
1221 36939 5189 -39555 14876 31369 -32131 -14700 39982 -6477 -36365 26591 20755 -38854
1233 -38854 -398 37632 -21321 -25789 35444 5638 -38383 14250 29016 -30069 -11548 35823
1245C5823m4276k3406N5836n724n1618L2217L4641m9935p985N4673k1972m4655
1257c6381M6022K2016n9685J0910N5279m2756l2284O2845k077o3852L9479M2746
1269D2262o7041m319P3046m0155n0984P1328R323p8760M0228N4088p4572p951
1281c3507Q0516m3783n3184P7875N201q1672M6183N1711p8777p61P7534m7892
1293e56m5786P5560k577p2679M9698L9098p2143P905O4132m7169l2782O4878r589
1306A7990n5806M2938K6856n6069P888M9227l6649k5798N0586n812m4183L0626
1318A794K5607m5126P50M3471k5264k9110M2341N393m5075J9829L4413l9929j1710
1331b2616M7652j7376l8301M2151J3951n0983J5931M2563m4451j4827N4575j9001
$$ plain form
1245 35823 -8453 -31859 23977 18253 -33365 -1148 33493 -16442 -24427 30246 8274 -36381
1257 -36381 9641 31657 -28028 -17118 38161 -4595 -36879 25966 23889 -39963 -484 42262
1269 42262 -24779 -29098 43948 3793 -47191 24137 33460 -45300 -5072 49016 -25556 -33507
1281 -33507 47009 3226 -49958 27917 33118 -48554 -2371 49340 -29437 -30198 47336 -556
1293 -556 -46342 29218 26641 -46038 3660 42758 -29385 -21480 42652 -4517 -37299 27579 17990
1306 17990 -37816 5122 31978 -24091 -16203 33024 -3625 -29423 21163 15351 -28832 1794
1318 1794 27401 -17725 -16975 26496 1232 -27878 14463 19856 -25219 -5390 29023 -10906 -22616
1331 -22616 25036 7660 -30641 11510 25461 -25522 -9591 32972 -11479 -26306 28269 9268
1343I268m3332M5816J4228n4247K0165M1310m5769j1687N1355k0896l6476M1712
1355A1447J0275m5811J9499K8530l4074o350L3794j2692k2430K1438R395k1197
1367h176J129J6921o686j2065P875J2147j3092j0608K1470J329k6449J2370K7190
1380B3355l3021j2518M7360j6876m1898M6196J5603o0111K2264N0994n7072j7899
1392c3623P2002k8447n7050O6548J6466p9588L5374N7516p2413j2437Q0428l8274
1404F502n5124P1813J0605p6870L6002N3426o6704j2200P2133l0215n2167N8757
1416A5958J6862o7210K1928N3868n2177k4121O4742j2007n9084M6653L3397o7563
1428b8754O712O4998m5072l9989P0953k574p2759M8616M2817p5890M324P5426
$$ plain form
1343 9268 -34064 11752 25980 -28267 -8102 33208 -12561 -24248 27107 6211 -30265 11447
1355 11447 21722 -24089 -4590 23940 -10134 -16484 17310 4618 -17812 3626 13021 -8176
1367 -8176 -7047 9874 3188 -8877 -1002 11145 -1947 -12555 8915 10244 -16205 -3835 23355
1380 23355 -9666 -22184 25176 8300 -33598 12598 28201 -31910 -9646 41348 -15724 -33623
1392 -33623 38379 9932 -47118 19430 35896 -43692 -8318 49198 -23215 -35652 44776 6502
1404 6502 -48622 23191 33796 -43074 -7072 46354 -20350 -32550 39583 9368 -42799 15958
1416 15958 32820 -34390 -12462 41406 -10771 -34892 29850 17843 -41241 5412 38809 -28754
1428 -28754 -22042 42956 -2116 -42105 28848 26274 -46485 2131 44948 -30942 -26618 48808
1440D8808n3180m1572Q0919j1698p4230O0220L5254q4355K2502O7965o6542k3482
1452c9391Q1086l1417n7857O9647Q060p2211M0965M2220o8204N764O0405m5604
1464f537k6654O1648j7889m3059M5373R622m9340K4144K8981m0912J386L5322
1476B2085k5084j4500L2263j0391k0717K3162K630k0958J2122Q519j5979M067
1488b781R594j0657J549O985p230J469N107o257N54N378o421K2Q271o967l528
1503d912J0105k770j0349J0723K705j1463L101R414q336m472J1383j228j0496
1516f595N000J0029j1101o174J8042k282k0482J3923J5630k8218Q48L3972k4454
1529a862k2593M1251j416m5880L4405K9102n8636R137N6225m8738k8423P2859
$$ plain form
1440 48808 -4372 -45944 34975 23277 -50953 9267 44521 -39834 -17332 50633 -15909 -39391
1452 -39391 41695 10278 -47579 22068 30128 -42083 -1118 41102 -27102 -21338 39067 -6537
1464 -6537 -33191 28457 10568 -32491 12882 22504 -26836 -2692 26289 -14623 -13237 22085
1476 22085 -2999 -17499 14764 4373 -16344 6818 9448 -11510 612 9131 -6848 -2781
1488 -2781 6813 -3844 -2295 4690 -2540 -1071 4036 -2221 -1667 3711 -2710 -2688 5583 -1384 -4912
1503 -4912 5193 2423 -7926 2797 5502 -5961 -2860 6554 -1782 -6254 5129 3901 -6595
1516 -6595 -1595 8434 -2667 -8841 9201 6919 -13563 360 15990 -12228 -11380 22592 -1862
1529 -1862 -24455 16796 15380 -30500 3905 33007 -25629 -16492 39733 -9005 -37428 35431
1541C5431k0194o3831O5014K4118q4468L1510O6481p6785j7093Q9804m2649o3016
1553e5678Q6370O094r1621N4348N5740q9761K300Q7547o0497m6114Q8426j1485
1565B5669p7659O0062L6914q0880J6134O7887n7833k9111P2483j7542n6501M9748
1577I371K3089o0569J5213M7458m2177j9770N0052j0581l9869L2153J8934l9705
1589a6401L055L6820k5070k0454L5668M56l5044J9858K3124l4221j761L4862j9770
1602A122k1859L3833j35l3794K2283J8395l4895M303L2136k5225j3983L6241j2314
1615F108k5856K9219M730l3038J7939J8841l1257N911K6139k4317q485L0399j5263
1628A070j7597K8274l985k5491K3567O988k8498J4843J6685k6944L965K3301k3477
$$ plain form
1541 35431 15237 -48594 16420 40538 -43930 -12420 54061 -22724 -39817 49987 7338 -55678
1553 -55678 30692 36786 -54835 -487 55253 -34508 -32208 55339 -5158 -51272 37154 25669
1565 25669 -51990 8072 44986 -35894 -19760 48127 -9706 -38817 33666 16124 -40377 9371
1577 9371 32460 -28109 -12896 34562 -7615 -27385 22667 12086 -27783 4370 23304 -16401
1589 -16401 -13346 23474 -1596 -22050 13618 14074 -20970 -1112 22012 -12209 -13970 20892 1122
1602 1122 -20737 13096 12961 -20833 1450 19845 -15050 -10747 21389 -3836 -17819 18422 6108
1615 6108 -19748 9471 14201 -18837 -898 17943 -13314 -7403 18736 -5581 -14066 16333 1070
1628 1070 -16527 11747 7762 -17729 5838 12826 -15672 -829 15856 -11088 -7123 16178 -7299
1641g299l109K5799j5241j4503K6760o563k1566K3848K304k6261J8596J0702k7217
1654a3750J0812K0375k6746j154K9266k1458j3825L1046q800k6006K8576O726
1666A5062l3966J7646K1538l1852k81L1785k0997j8572L3354l421k9937K0836
1678A195J6369k8702L56K8687j7889j7600K7558K175k8176J1591K3277k3564j2828
1691a7551L3017m708l3686K4446K2993m0130q02M3607k6776l1370M9308L661n6367
1704c4358L2976L8269o0319j953O7214m1500m2157O9810j058p3002M9516M1262
1716D4700p7212P602P3144n5674l6704P9451j4641o7165N6528K8638p3581K0521
1728a4393N7430n4929k0909O4625k0675m7248M6964J4591n0615J7078L5605l5522
$$ plain form
1641 -7299 -10408 15391 150 -14353 12407 5844 -15722 8126 10430 -15831 2765 13467 -13750
1654 -13750 -2938 17437 -9309 -10463 18803 -2655 -16480 14566 5766 -20240 8336 15062
1666 15062 -18904 -1258 20280 -11572 -11853 19932 -1065 -19637 13717 10296 -19641 1195
1678 1195 17564 -11138 -10782 17905 16 -17584 9974 12149 -16027 -4436 18841 -4723 -17551
1691 -17551 15466 10758 -22928 1518 24511 -15619 -16421 27186 410 -30960 18348 22009 -34358
1704 -34358 -1382 36887 -23432 -25385 41829 329 -41828 27982 26924 -46078 3438 44700
1716 44700 -32512 -24910 48234 -7440 -44144 35307 20666 -46499 10029 38667 -34914 -14393
1728 -14393 43037 -11892 -32801 31824 11149 -36099 10865 25456 -25159 -8081 27524 -7998
1740g998j1850L7558r542k7154K1084J3335k4050q18K1497q077j6869J4521J1270
1753A2907k0018k549K2158r647j8736K0371Q616k5460O534K4551k3972r574K9147
1766A4328q900k2633K2430P932k6330R082J7954j8487l830J8711q344j0864J2832
1779C881l44p456M041K351l424J384l161L270M656j0188K003J3458j3119p831
1793a0479K3279r030k1324K6592M599l2954J7969K4227l6478N22L8736k9048k0682
1806b4071M5667j1169l9873M0494J1844n0311K3483L5096m8594r53M8392l2989
1818b984k6234N2255j0930m2326M0791J2271m8584K1122L3264m4879n01M2963
1830B6228k8127k2074M1568o764l4806L0438J1943l7320J5051K4541k9157n989
$$ plain form
1740 -7998 -19848 17710 8168 -18986 2098 15433 -8617 -9435 12062 3985 -12884 1637 12907
1753 12907 -7111 -9660 12498 2851 -15885 4486 13102 -12358 -5824 18727 -5245 -14819 14328
1766 14328 5428 -17205 5225 13157 -13173 -4091 13863 -4624 -8454 10257 1913 -8951 3881
1779 3881 3537 -3919 122 2473 -951 433 -2728 542 5198 -4990 -2987 10471 -2648 -10479
1793 -10479 12800 3770 -17554 9038 13637 -19317 -1348 22879 -13599 -13077 25659 -3389 -24071
1806 -24071 21596 10427 -29446 11048 22892 -27419 -3936 31160 -17434 -18387 30005 -2984
1818 -2984 -29218 23037 12107 -30219 10572 22843 -25741 -4619 28645 -16234 -16735 26228
1830 26228 -1899 -23973 17595 10831 -23975 6463 18406 -18914 -3863 20678 -8479 -14468
1842a4468L1659j4776j9349K3719L569k3820J1105J6535j9309n225K0321m941
1854E020j8267J5716R373k0117O30K0352j2576j4445K3269J455k6183J4155J8844
1867A7226k6655l330L2006j8926j9154L1603j962l1800K2730J7343l4557O984
1879h492K9606k6728j1078L4299j3136k3639K9134J177k8740J8808J4928k9055
1891a2916P317K1363k2108k212K1175j4711p481K0787j1561j0518K1186o405j6556
1904a2640K0993m25k3496K1113P635k9051J3965K1238l1949J821L2491k5259j6384
1917a9948L8413j1157l1394L3453R283m1711J8969K9543l8606k825L9683k3643
1929F0k3054L8347j681l7177K5603J8919l5567L419L1609k2406j6727L1457k611
$$ plain form
1842 -14468 17191 2415 -16934 6785 10354 -13466 -2361 14174 -5135 -10360 9961 5020
1854 5020 -13247 2469 11842 -8275 -7645 12707 131 -14314 8955 10410 -15773 -1618 17226
1867 17226 -9429 -12759 19247 321 -18833 12770 10808 -20992 1738 19081 -15476 -8492
1879 -8492 21114 -5614 -16692 17607 4471 -19168 9966 11143 -17597 1211 16139 -12916
1891 -12916 -5599 15764 -6344 -8556 12619 -2092 -9573 11214 -347 -10865 10321 3916 -12640
1904 -12640 8353 7928 -15568 5545 13180 -15871 -1906 19332 -12617 -10796 21695 -3564 -19948
1917 -19948 18465 7308 -24086 9367 18650 -23061 -4092 25451 -13155 -15980 23703 60
1929 60 -22994 15353 13672 -23505 2098 21017 -14550 -11131 20478 -1928 -18655 12802 10191
1942A0191k7598J8747J3903k4679n98K4295j2535j6634K2347L785k4806R579J9285
1955A5282k0771p234K5223q095k1262K2215Q072k7142Q513K3217k5669o514L0664
1968A6499j3503k3239K9844K518l1411K0165J8452l4027N296L0808k8244j1075
1980a7917L7274j6530k4673L4510J214l7073K5650J9409m0053R785L3681l3263
1992g986j0924M0948j8745k7887L8590J885m1754K7160K2096m1018N190L7631
2004B5186l0440j6077M1222j1584l2560L3248Q023l6773J5118K5921l0570m805
2016a4091L1884j5089k1198K6000L368k5692J3426J5467k0275l919K0313o859
2028C335j4318J3955O494j6665K312J4466r785r825J4560K957j5866O461J2793
$$ plain form
1942 10191 -17407 1340 15243 -9436 -10034 14261 1726 -14908 7439 11224 -13582 -4003 15282
1955 15282 -5489 -12723 12500 4405 -16857 5358 13430 -13712 -5199 18018 -7651 -14165 16499
1968 16499 2996 -20243 9601 12119 -19292 873 19325 -14702 -9406 21402 -6842 -17917
1980 -17917 19357 2827 -21846 12664 13878 -23195 2455 21864 -18189 -8404 25277 -7986
1992 -7986 -18910 22038 3293 -24594 13996 15881 -25873 1287 23383 -17635 -12445 25186
2004 25186 -5254 -21331 19891 8307 -24253 8995 17018 -19755 -4637 21284 -9286 -14091
2016 -14091 17793 2704 -18494 7506 10874 -14818 -1392 14075 -6200 -10119 10194 3335
2028 3335 -10983 2972 9466 -7199 -4887 9579 -206 -10031 4529 7486 -8380 -1919 10874
2041A0874j4125n763J8968n208j6771J5384N008j8144P063J5184j8002l434J8757
2054I791r449j0825J6590j447j5066J3769M198j5564Q060P588j5037M909J1148
2067H665j3861P73J4949j4271m513J9709j1996j1752K1551l701k0832K2378M839
2080A1938k8265J5252J9890l0722K173K9878k5182j3645L5504r680l0005L1439
2092H575Q208l6327J6178K5644l3855k722L6199k2166j9966L3396j873l1614K3025
2105B702J5362l1299M684K6173k0329j1454K4180l026k1509J6023J0935j9947
2117g505R48J7249r800j1731J6486K806j7946O007J4615j4572o382K0156m319
2130F012j9277J6081R286k2846N425K1990k1354r825K9275j0103k4947K9425N782
$$ plain form
2041 10874 -3251 -9014 9954 4746 -12025 3359 8367 -9777 -2714 12470 -5532 -8966 9791
2054 9791 342 -10483 6107 4660 -10406 3363 7561 -8003 57 7645 -7392 -2483 8665
2067 8665 -5196 -4423 10526 -3745 -8258 11451 -545 -12297 9254 5553 -15279 7099 11938
2080 11938 -16327 -1075 18815 -11907 -9734 20144 -5038 -18683 16821 7141 -22864 8575
2092 8575 16783 -19544 -3366 22278 -11577 -14299 21900 -266 -20232 13164 11291 -20323 2702
2105 2702 18064 -13235 -8551 17622 -2707 -14161 10019 6993 -14516 1507 12442 -7505
2117 -7505 -6557 10692 892 -10839 5647 8453 -9493 -3486 11129 -3443 -9825 10331 6012
2130 6012 -13265 2816 12102 -10744 -5319 16671 -4683 -14508 14767 4664 -20283 9142 14924
2143A4924l4115J8523K0198l3618K459L3812k6208j5390L7186j0801l1524L4579
2155A0025P793m0083K1298K4188l9122L688L5868k9019j5919M1222j3843l0763
2167b4667L5349N119l6547J9636K2137l4771K966L0609k4150j2078L1778j0209
2179E172k1649K3260M010k4340J2488J3462k0331K060J6062j1925n219J3279n767
2192E62n876P756K38o022L507J304k431J910j466j301M203k980k042N883k877
2207C68l420N231K62o120M712K890p011K687L600n634O87L870l148N79J530l569
2223b486L500M80m758M346L843j0119M951P852j2410K08J5380j3010r116K2094
2237A0755m540k2433K1701Q108l0071J4448K2300l1677k070L4850k3063j9518
$$ plain form
2143 14924 -19191 -668 19530 -14088 -11629 22183 -4025 -19415 17771 6970 -24554 10025
2155 10025 17818 -22265 -967 23221 -15901 -12213 23655 -5364 -21283 19939 6096 -24667
2167 -24667 10682 15801 -20746 -1110 21027 -13744 -10778 19831 -4319 -16397 15381 5172
2179 5172 -16477 6783 10793 -13547 -1059 12403 -7928 -5868 10194 -1731 -6950 6329 562
2192 562 -5314 2442 2680 -3342 165 1469 -962 948 -518 -1819 2384 -596 -2638 3245 368
2207 368 -3052 2179 2441 -3679 1033 3923 -3088 -401 3199 -2435 -1748 2122 -1026 -447 1083 -2486
2223 -2486 1014 1494 -3264 1082 4925 -5194 -243 7609 -4801 -4593 10787 -2223 -11339 10755
2237 10755 6215 -16218 5483 13591 -16480 -2032 20268 -11409 -13479 21371 -1692 -21210
2249b1210L9004p181l5339L1097J4018m1011J4689L1039l5834o110M0188k2000
2261A350k4434L7653k531l4032K5333J5462l4419R509K5826k7402n294K8181j3366
2274A836j6487K3295n64k1310J5000O675j6436N747R990j1295p13J0119o467m208
2288d818P270k003k391M467k334p40K094k075j3J572j725n46L622m204k69M619
2304B526m035J8M163k221m533P723j573o170O635q04p020O993K590j0389O676
2319E79O164j2134L421J0300j2462j382J3754p801r816J6683k564j5121J3764
2332C385M316j8295J0459J1053j8385K557J7219j6328n819K0954r942j2721J9922
2345H375k907j8295J6929O202k1765J1436J1515k0519M217J7739j6934o597K3886
$$ plain form
2249 -21210 17794 10613 -24726 6371 20389 -20622 -5933 25106 -10728 -16838 23350 1350
2261 1350 -23084 14569 12038 -21994 3339 18801 -15618 -6109 19717 -7685 -12979 15202 1836
2274 1836 -14651 8644 8080 -13230 1770 8445 -7991 -2244 7746 -3549 -4262 5857 -610 -4818
2288 -4818 2452 449 -1942 2525 191 -549 1545 -530 -543 1029 -696 -1242 2380 -1824 -2093 2526
2304 2526 -1509 -1491 2672 451 -4082 3641 2068 -4102 2533 1729 -5291 1702 4292 -6097 579
2319 579 6743 -5391 -1970 8330 -4132 -5514 8240 439 -9377 7306 4742 -10379 3385
2332 3385 7701 -10594 -135 10918 -7467 -4910 12309 -4019 -9838 11116 1174 -11547 8375
2345 8375 5468 -12827 4102 10304 -11461 -25 11490 -9029 -4812 12927 -4007 -10604 13282
2358A3282j2836j2593K0509l180j8309J8041N320k2500J1471J3407k1726K126
2370f988J9856j5824q294K1482p075j5746J9110J573j9749J1796J0397j7617K071
2383e008J4800j2326m962J3493l899r195R708K352q516K802L603l371k165K918
2397B34J868l725j337O026j00q003M338P248r845k490J4434q772r637J6556k31
2412F564j8394J3110J1030k2383N481J9264j9645o499K5616j2249j7795K4431
2424H531J180k5360J6690J3546k7166P429K1108k1698o199K6362j2727j6441K4106
2437I361j898k1224J7371O973k1679Q389J5371j9343L03J7480j3610n097J5661
2450H058o707j0356J5392j908j2857J1305K618j2672P505N428j1121L593P603
$$ plain form
2358 13282 446 -12147 8362 5182 -13127 4914 10234 -12266 -795 12612 -9114 -6988
2370 -6988 12868 -2956 -11250 10232 3157 -12589 6521 8094 -11655 141 10538 -7079 -5008
2383 -5008 9792 -2534 -7496 5997 2098 -7097 2611 4963 -3553 -751 2852 -519 -2684 234
2397 234 2102 -1623 -2960 3066 2966 -5037 -699 6549 -3296 -5786 8648 -124 -9761 6795 6564
2412 6564 -11830 1280 12310 -10073 -4592 14672 -4973 -11472 14144 1895 -15900 8531
2424 8531 9711 -15649 1041 14587 -12579 -5150 15958 -5740 -11939 14423 1696 -14745 9361
2437 9361 7463 -13761 3610 10583 -11096 -2707 12664 -6679 -6376 11104 -2506 -7603 8058
2450 8058 1351 -9005 6387 4479 -8378 2927 5545 -7127 378 5806 -5315 -1722 5881
2463E881r361O66Q283o847k398P867m429m642R830m800l716P673l095m680O263
2478B495j205n659O452n99o683O644Q76o919O148K382r197N126N055r527L938
2493f73Q202j1655M32J2854j1271m829J6509r023j1011J7550k210j8044J8057
2506D888N153k1598J1059J3705k3830M349K2912k2624o078K6913j4267j7780K9319
2519A2121k226k8296K2995J1622l2071J0567K5825k9955l951L2153j9138j7559
2531a7913L1508m136k8424K4438R943l1149J1744K0524k4910k561K6480j5388
2543A56j4685K3155j650j8771J3673Q822j7377L564J1626r942n382J1265m53q521
2557d520L477N722m550m141O377K255p809P24Q757p430o260J3450j361j4735J2382
$$ plain form
2463 5881 -3480 -2814 5469 -1378 -3776 4091 -338 -4980 4850 50 -3666 4007 912 -3768 2495
2478 2495 1290 -4369 2083 1484 -5199 1445 2321 -4598 1550 3932 -5265 -139 4916 -4611 -673
2493 -673 7529 -4126 -3694 9160 -2111 -6940 9569 546 -10465 7085 4875 -13169 4888
2506 4888 10041 -11557 -498 13207 -10623 -6274 16638 -5986 -12064 14849 582 -17198 12121
2519 12121 9895 -18401 4594 16216 -15855 -5288 20537 -9418 -13369 18784 -354 -17913
2531 -17913 13595 9459 -18965 5473 15416 -15733 -3989 16535 -8375 -10936 15544 156
2543 156 -14529 8626 6976 -11795 1878 10700 -6677 -3113 8513 -1429 -6811 4454 4001 -4520
2557 -4520 -1043 4679 129 -4012 2365 4620 -3189 -2465 6292 -1138 -7398 6052 4691 -10044 2338
2572B338Q082j9752N442J5979j7371m787K2789j1147j5712K2900j720k1442J7233
2585B832R200k4544Q644K0201k3703k807K4712j5785j1775K3549p086j7952K0927
2598F413K007k2381J5623J0223k2857P924J5877j9831j83K0312j5156q984K2599
2611A1586q905j5269K1099j631j9771J5903P106k1251R389J4135k0448J973J8030
2624A1946j5466o215J9502p911j3476J8100o71j5533J2384N691j6032N695J0903
2637H917j3382l55J2512q717l951R418k538p524P056J183o340L441K503l720J517
2652B0J46O03R1k524N05L640l992j101P353m958m203P757n33r423Q088L873j2978
2669g636O802J0483j5735Q38J5941j2221q121J8973n818j5785J7538L638k1802
$$ plain form
2572 2338 10420 -9332 -3890 12089 -5282 -10069 12720 1573 -14139 8761 7041 -14401 2832
2585 2832 12032 -12512 -3868 16333 -7370 -10177 14535 -1250 -13025 10524 3438 -14514 6413
2598 6413 8420 -13961 1662 11885 -10972 -3048 12829 -7002 -7185 13127 -2029 -11013 11586
2611 11586 2681 -12588 8511 6880 -12891 3012 10118 -11133 -1744 12391 -8057 -6084 11946
2624 11946 -3520 -9735 9767 1856 -11620 6480 5809 -9724 2660 8351 -7681 -1986 8917
2637 8917 -4465 -4820 7692 -1025 -4976 4442 1904 -5620 1436 2619 -3721 -280 2223 -1497 20
2652 20 166 769 860 -1664 -1159 2481 -1511 -2612 4741 -217 -4420 3337 2804 -6619 1469 5342 -7636
2669 -7636 -834 9649 -6086 -5248 10693 -1528 -9649 9324 3506 -12279 5259 8897 -12905
2682a2905J2584J3677k2002J612K1194j7177q653K3939j0056j5105J8835K633
2694H576k0975J3841J0001k0573L055J7480j4644m702J6650o634j0845J3963k176
2707C017j0838R355L683j0680N299N271q930L440M263o287M79N705o404K772L787
2722C932o640R1P769p753j645R655n241n595J0738k160j0276R490L889j3394O219
2737i21Q532j2449J502J1048r376n177J2985m461q873J1143p45q488N722L012
2751C454o980L150L489n634J497M228m431J75M237m819Q15L905n278J268N211
2766D287o264j222Q260m700o076J1485l065r048Q675L759j3264O971Q550j5062
2780f714K279J3250j0752n600J4560n139j1461J4498J203j5439J0858N925j4226
$$ plain form
2682 -12905 -321 13356 -8646 -7034 14160 -3017 -11670 12269 2213 -12892 5943 8576
2694 8576 -12399 1442 11443 -9130 -6075 11405 -3239 -7941 8709 2075 -8770 5193 3017
2707 3017 -7821 1534 5217 -5463 -164 5107 -3823 -383 3880 -2407 -1928 3777 -2627 145 3932
2722 3932 -2708 -2617 5152 -2601 -4246 5409 168 -5427 5311 3151 -7125 2365 6254 -7140 -921
2737 -921 7611 -4838 -3336 7712 -1664 -6841 6144 1683 -7190 3953 3208 -5280 442 3454
2751 3454 -3526 -376 3113 -2521 -1024 3204 -1227 -1052 3185 -1634 -819 3086 -2192 -924 4287
2766 4287 -1977 -3199 5061 361 -5715 5770 2705 -6343 2332 6091 -7173 -202 8348 -6714
2780 -6714 -4435 8815 -1937 -7537 7023 1884 -9577 4921 6124 -9315 1543 7468 -6758
2793f758M924J0800j2638q74J2175q091n842J1847m620q203J1621j307r941Q428
2807A521L444j0882O153N559j0170J888Q073q147j258R560o534l082R806n895
2821C6n501R999k472p481P870J49p759O288K362p808M141M813q455J873P246q194
2837b893J5Q318p554j705R946p456m644J1756m374q328J0400L55j2671J0598N349
2852G112j5373P288R725j4961J610J5454j3037o098J6492p096j1614J5795Q56
2865F153j6495J2893O004j6684N706J1707j4485J91J4620j2500m257J4466o381
2878I38q561J3507l229j0754J1950J130j2430Q401N886j4143O972P317j2744L198
2892b562J0441j2044k417J4871q792q634J5370k861j2188J2680K366j5491R626
$$ plain form
2793 -6758 -1834 8966 -3672 -4546 7629 -462 -6304 5543 923 -7280 4341 3034 -6907 1521
2807 1521 4965 -5917 236 5795 -4375 -2487 5586 -2561 -3819 5741 -793 -3875 5931 36
2821 36 -5465 4534 2062 -5419 2451 2600 -5159 1129 3491 -4317 -176 4637 -3818 -1945 5301 -2893
2837 -2893 -2878 5440 -2114 -3819 6127 -1329 -5973 5783 1409 -6919 3481 3836 -8835 1763 7112
2852 7112 -8261 -973 8752 -6209 -4599 10855 -2182 -8280 8212 1116 -10498 5297 6153
2865 6153 -10342 2551 8555 -8129 -2423 9284 -5201 -5010 9610 -2890 -7147 7319 938
2878 938 -7623 5884 2655 -8099 3851 4981 -7449 952 6838 -7305 -333 6984 -5760 -2562
2892 -2562 7879 -4165 -6582 8289 -503 -9137 6233 3372 -8816 3864 6230 -9261 365
2905C65P878j4083J821J2712j1020l011J2138n626o799R893j399q227O746R60
2919B348n262L815O22k405J225M2j382L385k504l064P572k872p077Q067J560j1814
2935g744Q792P310j5430L488J4123j4858m166J9070r309j3720K1077j864k0717
2948a3948J6930Q888k3110P941J7330k1004j183K1212j4248j1001K1924m620j7484
2961a2373J6143M911j9901J0728J1430j9346M870J4437j5759j045J5561r925p686
2974g955J4884m242j0597J2574o09j2666J0415M817j3339O651O833j3352L846
2987b740R476j0151m01J1269q906m833J2532n560p384J0743k88j0923Q555L266
3001D655j0963O769M078q855K480O472o246o61O192o004q39P756n306k984P331
$$ plain form
2905 365 8243 -5840 -4019 8693 -2327 -5338 6800 1174 -5625 4268 2869 -5358 1388 2348
2919 2348 -2914 901 1523 -882 343 385 -997 2388 -116 -3180 4392 1520 -5557 2510 4070 -7744
2935 -7744 1048 8358 -7072 -3584 10539 -4319 -8485 10585 1276 -12444 8633 6769 -13948
2948 -13948 2982 11870 -11240 -3299 14031 -6973 -8156 13056 -1192 -12193 9731 5111 -12373
2961 -12373 3770 8681 -11220 -492 10938 -8408 -3538 10899 -4860 -5905 9656 -269 -7955
2974 -7955 6929 2687 -7910 4664 4055 -8611 1804 6621 -6718 -67 6766 -6586 -2740
2987 -2740 6736 -3415 -3816 7453 -1453 -6286 6246 686 -6698 4045 3757 -7166 1389 4655
3001 4655 -6308 461 4539 -4316 -1836 4636 -1610 -2271 3921 -2083 -2922 4834 -472 -3456 3875
3016C875m162l831Q214k853o012Q249k036p213Q844M58r690P871L713j0561L417
3031a717Q764j1385N39J2372j1832l606J3837p293p363J3828k476j3130J3691
3044D229K569j4787P263R647j5053K775J3829j5200k262J6749r575r538J7083
3057G729m544j4137J4811K773j5886Q997J0141j6498J743J4646j2581m682J6052
3070H564p692j0258J4651o73j2408J0327K756j0947N442O653j1036J433Q066o421
3084a543j428P025m556k151O387m149j086M298m139j763O982l880l429Q049l364
3099A253o123Q007Q03j0103P921M855j3343M324J1230j2117k280J3978r113p180
3113g888J4881m811j1830J2802L831j4498O627R078j3549K535J0170j0123k044
$$ plain form
3016 3875 -287 -4118 4096 1243 -4769 3480 1444 -5769 3075 3533 -6157 1714 5427 -5134 -1717
3031 -1717 7047 -4338 -3799 8573 -3259 -6865 6972 -321 -7684 6144 3668 -9462 4229
3044 4229 6798 -7989 -726 8921 -6132 -3357 10472 -4728 -6990 9759 184 -9354 7729
3057 7729 3185 -10952 3859 6632 -9254 -257 9884 -6614 -4871 9775 -2806 -7488 8564
3070 8564 872 -9386 5265 4592 -7816 2511 5267 -5680 -238 6415 -4621 -3188 4878 -1543
3084 -1543 -2971 4054 -502 -2653 3734 -415 -1501 2797 -1342 -3105 3877 -3 -3432 4617 1253
3099 1253 -4870 3137 3940 -6163 1758 6613 -6730 -2406 8824 -3293 -5573 8405 -708 -7888
3113 -7888 6993 2182 -9648 3154 6985 -7513 -886 8192 -5357 -2822 7348 -2775 -4819
3126d819J1044o262o074J0793k630p218Q347q85p355O599K109q256N374L416q136
3141c953M341N500r968K649Q464j0476j205J1700q488l855J1844o175q226J3363
3155E515p43j3924J1304M542j3644N072J0578j3567L27J2295r119n829J3841n622
3169A026q561J2153j85j1305Q385L226j1061N416O539r132K778N585q326M37Q205
3184E180o843j809R808p660l172J0522n621p301J1957k544r498J0075K087j2164
3198f983P763O068j3934M555J1529j2983j329J4109j0874n513J5981o499j1562
3211i672J4395N85j4174J0559O174j5367O473J0518j5497J256J4391j3020l255
3224f634J4916p777q255J3695k708j1479J1789J797j3210Q376O455j2421L713
$$ plain form
3126 -4819 6225 -37 -6111 4682 2052 -5166 3181 2296 -5059 1540 3649 -4607 767 4183 -3953
3141 -3953 388 5888 -4080 -1431 7033 -3443 -4648 7052 -1436 -5291 6553 378 -7848 5515
3155 5515 4772 -9152 2152 6694 -6950 -1878 8700 -4867 -4540 7755 -1364 -7193 6648 1026
3169 1026 -7535 4618 4433 -6872 1513 4739 -6322 -906 5633 -3499 -721 4864 -3462 -3025 5180
3184 5180 -1663 -3472 6336 -1324 -4496 6026 405 -6896 5061 2517 -6981 3094 5181 -6983
3198 -6983 780 6848 -7086 -2531 8998 -3985 -5314 8795 -2079 -7592 8389 1890 -9672
3211 -9672 4723 5308 -8866 1693 7867 -7500 -1027 9491 -6006 -4750 9641 -3379 -6634
3224 -6634 8282 505 -7750 5945 3237 -8242 3547 5344 -7866 510 6965 -5456 -1743
3237a743R320j1845L62J0933q365l734J1614o014p003J1205k849p832Q473J025
3251C547r900P986K158r966O373M158q424K801P013r420J449Q944j0105j461J1976
3266G129r199m302J2584m497r300J2615q49j3164J2587L500j4908O785R316j4318
3280f021K285J3376j4168k623J5903q870q472J5692m202j1002J1979J641j2576
3293g058Q109O009j2909N844P513j2174K475R518j1362n69J1938r396m564J3912
3307G286o761q229J4136l751j2245J4138J664j5456J0367Q341j7294N033J4261
3320A1490j7562p21J7234j1862q369J7775m657j4222J6435R74j6692J0644R008
3333I475j6287L834J2578j2843l405J3925o682p495J2059l360o929O980R77p693
$$ plain form
3237 -1743 7577 -4268 -3906 7027 -1338 -5072 6542 528 -6475 4730 1881 -5951 2522 3547
3251 3547 -6353 1633 3791 -6175 198 4356 -4068 -1267 5746 -3674 -2225 6719 -3386 -4847 7129
3266 7129 -2070 -6372 6212 1715 -7585 5030 4181 -8983 3604 7104 -7804 -1019 8297 -6021
3280 -6021 -3736 9640 -4528 -7151 8752 -118 -8590 7102 2900 -8102 3877 5518 -7058
3293 -7058 1051 7060 -5849 -5 7508 -4666 -2191 7327 -4035 -4604 7334 -2062 -6626 7286
3307 7286 525 -7704 6432 2681 -9564 4574 6238 -9218 1149 9490 -7804 -2771 11490
3320 11490 -6072 -6793 10441 -1421 -9790 7985 3328 -10894 5541 6515 -10177 467 9475
3333 9475 -6812 -2978 9600 -3243 -6648 7277 595 -6900 5159 1799 -5130 1850 2827 -4866
3347d866M945L229o605K823K159m594L341K963o976M722K194p817M609L856p726
3362c743J735Q468r246k474J2600p775o891J2959k243j1242J1366K877j3947P298
3376b58Q483j3198P71J2176r498m413J2706n562q193J1953k142r587Q954K602
3390D794r971N715M442r490L641O771r705J681P567q093j301J0481p986l580J0841
3405E807m891p814J1612j529j0307J0201K407j3258Q621O423j2961K584J1603
3418H498j1769k574J4021q415p581J3480k409j1705J1761J924j2798O353P816
3431F602j1407K078Q967q369l342J1368n863m836Q334k306o194O574J195o609
3445c808M495K293o882M241L265o787K819M308o544J669N394o563n16P086o005
$$ plain form
3347 -4866 79 3308 -3297 -474 1685 -2909 432 3395 -3581 1141 3335 -4482 127 3983 -3743
3362 -3743 -2008 6460 -2786 -5260 7340 -435 -7326 5633 3390 -7852 3514 6391 -7556 -258
3376 -258 8225 -4973 -4202 7974 -1524 -5937 6769 1207 -6986 4967 2825 -6762 2192 4794
3390 4794 -5177 538 4980 -4510 -869 5902 -3803 -2122 5445 -2648 -3949 6532 -1454 -5034 5807
3405 5807 916 -6898 4714 3185 -7122 3079 5486 -7772 849 7272 -5689 -3105 8498
3418 8498 -3271 -5845 8176 -239 -7820 5660 3251 -8454 3307 5231 -7567 -1214 6602
3431 6602 -4805 -2727 6240 -2129 -5471 5897 34 -4802 3532 1226 -4968 1606 2801 -3808
3445 -3808 687 2980 -3902 339 3604 -3183 -364 3944 -2600 -931 4463 -2100 -2616 4470 -1535
3460a535k064P793m075n213Q182p90p168O743K820r768M004P210j0903K471Q790
3475F497q763j802J0167n274o100J0278k866q651Q537K430j0322N590N634r662
3489d307K893O931p796j200R089o583l435R216l662o763Q296p3p965O728K154
3504C523o720L379L097o773J793N618o257P72N777n056j780O718n229k529P319
3519C652k275o239Q298j668p258P714K719r957M956O286r896J031R872j0106j585
3534d456J0746o651n770J1278k947r347J0762N23j1080Q684M862j1816L164Q561
3548F513j0686o36J0938p686l692J0914l623p977J0673j297r727Q263K008r013
3562e028M736O279j0327K588P683j0110J105R461p876k814J0373o461n105J0713
$$ plain form
3460 -1535 -3599 4194 119 -5094 3088 2298 -4870 1873 4693 -5075 -1071 6139 -4764 -2293 6497
3475 6497 -2266 -4068 6099 825 -5275 5003 2137 -6514 2023 4453 -5869 -279 5355 -4307
3489 -4307 -1414 5517 -2279 -3479 5610 -973 -4408 4808 1146 -5617 2679 2606 -5359 1369 3523
3504 3523 -3197 182 3279 -3494 -1701 3917 -2340 -1568 4209 -847 -2627 4091 -1138 -3667 3652
3519 3652 1377 -4862 3436 1768 -5490 2224 4943 -5014 -58 6228 -3668 -2637 7235 -2871 -4456
3534 -4456 6290 -361 -6131 5147 2200 -7147 3615 4138 -6942 1742 6604 -5212 -2048 6513
3548 6513 -4173 -4809 6129 -1557 -5249 5665 2042 -5935 4738 3441 -6286 1977 3985 -5028
3562 -5028 -292 5987 -4340 -1752 5931 -4179 -3074 6387 -1489 -4303 6070 -391 -5496 5217
3576E217m218p752R707J667j1438Q382M527j2327M396R099j1658J94J1136p806
3590h74m042J0441m892o958J0215r93q826Q261K229j0395N868N581r874L241N469
3605D451p279J090O975p220j277P609o214j638Q690n028n754R805l107o353Q479
3620C229K59r353Q099L110j1777O068P506j1372J482J0212j0770k833J2924p246
3634d62p202J3902l137j0453J1109K433j3923P959P541j3931K895J1369j1325
3647c225k008J2815q358o421J3654l770j0210J2169k56j1416R737K934j2802N937
3661a220Q021j2236L572Q864j0108j127J0462p147m457J0320l915o605R551j83
3675C792q998P147J823r137N782L769q559L556O067r397J139R267q554k116J0488
$$ plain form
3576 5217 999 -6753 2954 4621 -6817 1565 6092 -6235 -1839 7260 -4398 -4204 6932 -874
3590 -874 -4916 5525 633 -6325 3890 2897 -5929 2332 4561 -5834 34 5615 -4259 -1018 4451
3605 4451 -2828 -1738 5237 -1983 -3260 4349 -1865 -3503 5187 159 -5595 4210 1103 -5250 3229
3620 3229 3488 -5865 2234 5344 -6433 -365 7141 -4231 -2749 7463 -3307 -6140 6784 -462
3634 -462 -7664 6238 3101 -7352 3757 6190 -7733 226 7767 -6164 -3269 8100 -3225
3647 -3225 -5233 7582 -776 -7197 6457 2687 -7523 4646 4390 -7026 2711 5645 -7157 -1220
3661 -1220 6801 -5435 -1863 7001 -3107 -4234 6228 -919 -5376 4944 1029 -5576 3975 3792
3675 3792 -5206 1941 3764 -5373 409 4178 -4381 -825 5242 -4155 -3016 6251 -2303 -4419 6069
3690F069o922m459J0277l939p015R490N03j1212Q532M736j1677L732Q952j1366
3704d299N1J1721r495l309J0671m535o584J0193j864q545Q390J208p210L183N497
3719E073r457J855O756p167J162O001o587R3O548n910k092R215n925l898R819
3734E486n348o385J0810j923j0287J0114L071j2654O665Q461j3113J235J2301
3747H433j1080m859J5795o837j1083J4277L12j2987Q563O899j2527K548J0057
3760G511j0654j264J1225o984n365R304j903o752P505o79n025M064J853o732M974
3775A078J899n939M489J066o459L710L869q131K880P185q664n05J1167q404n400
3790f159J2948n248r194J1007J741j2490P816P635j4158L332J0125j0753l013
$$ plain form
3690 6069 -853 -5312 4965 1026 -5989 3501 4004 -7208 1324 6060 -5617 -1885 7067 -4299
3704 -4299 -4248 7473 -2022 -5331 5340 805 -5779 4414 2550 -5995 2395 3603 -3607 -424 5073
3719 5073 -4384 -2529 4227 -2940 -1778 4223 -2364 -2271 4277 -1633 -3725 5490 -435 -4333 5486
3734 5486 138 -6247 4563 2640 -7647 2467 5538 -7116 -451 8010 -5103 -3868 8433
3747 8433 -2647 -7506 8289 1452 -9631 4646 4958 -8029 534 7433 -5094 -2546 7511
3760 7511 -3143 -4407 6818 -166 -5531 3773 1870 -4882 2623 1944 -3081 983 2836 -3896 1078
3775 1078 2977 -2962 1527 2593 -3866 -156 3713 -4418 -1538 5647 -3017 -3522 7645 -759 -6159
3790 -6159 6789 1541 -7653 3354 5095 -7395 421 8056 -6102 -2770 7355 -3398 -6411
3803f411J3499o303q350J2010k29j1092Q629K894j0005M121O903q066n43P025
3817D082m610l182P155m216j675M890l141j492M773k763l473P152l046m437P464
3832C481r87q162Q300J187r531N541O488j1283J990J0307r594l647J2676o581
3846A85q018J2565j029j1435R419N257j2922M276R787j1830n2J0764q397m305
3860e735J0721l585p190R299l34q751P529J445p569O103R21o778L252M052p495
3875d115L079O497r208O07Q697q816r16J0274p421m619J0774k984q665J1012l9
3890D157j1656R053N311j3413M310J0685j3258l23J3445r703m586J2981o088j0120
3904i205J3920j67j2987R940N179j3714N945Q927j3320J985J0180r502k106J2424
$$ plain form
3803 -6411 7088 785 -7565 4445 4216 -6876 1753 4647 -5358 -1237 5666 -2400 -2943 4082
3817 4082 -528 -3710 3445 -771 -2446 2444 -697 -2189 2584 -179 -3652 3500 454 -3983 3481
3832 3481 2494 -5668 2632 3819 -5712 -171 6317 -4966 -2976 7331 -2263 -5910 6766 185
3846 185 -7833 4732 3703 -7732 1687 6944 -5978 -1702 8085 -3745 -3797 6967 -1430 -5735
3860 -5735 4986 1401 -5789 3510 3176 -5575 1954 3399 -4170 1933 2854 -3924 -672 3380 -4115
3875 -4115 -1036 5461 -3747 -3140 5557 -3259 -4175 6099 -1322 -5941 4833 1849 -6816 4196 4157
3890 4157 -7499 1554 6865 -6548 -2238 8447 -4811 -5134 8311 -1392 -5978 7003 915 -9205
3904 -9205 4715 4548 -8439 1501 6680 -7034 -1089 7838 -5482 -3497 6683 -2819 -4925 7499
3918G499p565n853J1470k356j0903J1640l71q982P764K236r768M635N914r259
3932c899K440O701q015l2Q635p158k897J0687o167m939J0214m807o884R466q89
3947B456r052R161K286j1872P185P063j2890L291R560j1870m00J3645r610o876
3961g923J4833m010j0389J2084N24j3292J0629N056j4250N432R011j3726K628
3974c393J0141q882k855J1470o990n060J0948m842p436J1039j886q703R529Q50
3988C930r894Q158K530j0704O128O496j1624J854J1648j1566l263J4657r266o449
4002g365J4537m392j2380J4155J393j5404J0146P635j6243M586J2697j3010k564
4015f209J5029r769p628J5838m099j1637J2725P03j2478Q657M658j1610M598P475
$$ plain form
3918 7499 -66 -5919 5551 3195 -7708 3932 3561 -5421 2343 4579 -5189 -554 5360 -3899
3932 -3899 -1459 5242 -2773 -2805 5830 -1328 -4225 6462 295 -4644 5570 763 -6121 3345 2456
3947 2456 -6596 2565 4851 -7021 164 7227 -5663 -2372 7188 -4682 -5082 8563 -1047 -7923
3961 -7923 6910 2900 -7489 4595 5119 -8173 2456 7512 -6738 -1306 7705 -6021 -3393
3974 -3393 6748 -2134 -4989 6481 -509 -5569 5379 537 -6899 4140 2254 -6449 3080 3930
3988 3930 -5964 2194 4724 -5980 148 6644 -4980 -3126 8522 -3044 -6307 8350 -916 -7365
4002 -7365 7172 2780 -9600 4555 5948 -9456 690 8325 -7918 -3332 9365 -3645 -6209
4015 -6209 8820 -949 -8577 7261 3162 -8475 4250 4953 -7525 1132 5790 -5820 -1222 6253
4029F253r899J806P253p949k030R893o773k128P944m804l686Q752m239m919P739
4044C213j305p740Q352N34r267P848L520j1105M444Q855j2431R77J1939r533m291
4059e990J3157o274p496J1552p47j2132R557M537j3698O534Q315j2143K580R068
4073F820r909o59Q897n526n903J1117l681o728Q712P50q875O284K397q718N625
4088F03M446q871L205O283q724K80Q400p440k339R579o527m083J0178l316q543
4103f869R412J142j0457P965N162j2301M974P500j0804L64J2264j0427l828J3354
4117G451n559r833J1766O1j1130Q567N648j2765L914Q872j0491j58R340o724l687
4132d728J0121l192p633Q698Q4p703O229J574o032K497L194n096J770L612n805
$$ plain form
4029 6253 -3646 -1840 5413 -2536 -4566 5327 -1446 -3574 4370 -434 -4120 4632 393 -4526 3213
4044 3213 1908 -5832 2520 3054 -6213 1635 5155 -5950 -1506 7349 -5082 -4105 7834 -1699 -5990
4059 -5990 7167 893 -6603 4949 4202 -7930 1627 6164 -7534 -1000 7315 -4828 -2248 6820
4073 6820 -3089 -3748 5149 -377 -6280 4837 1156 -5572 3140 3890 -4985 1299 3696 -5022 603
4088 603 5049 -3822 -617 5666 -3058 -2778 5622 -1818 -4157 5422 -1105 -5188 4990 1674 -6869
4103 -6869 2543 3685 -6772 1193 6355 -5946 -972 6528 -4276 -3912 8352 -2075 -5903 7451
4117 7451 1892 -7941 3825 3886 -7244 1323 6971 -5794 -1880 6992 -3499 -3657 5683 -1041 -4728
4132 -4728 5393 2201 -5432 3266 3350 -4353 1876 3450 -2582 -85 3109 -1987 -217 3395 -2410
4147b410J468L878m964J835L605m954K97N911o130j917P954n186l834Q543j855
4162B241q097R279L65q941N526N453j1540L766R781j0913l296J2504m956r010
4176g838J2264n3j1607Q896M499j1119L456Q108r319p97Q579m823m909P552j787
4191A102n421N995N17n159M288L26l856K381J587m614K951K350n455M013K595
4206C600p486L782M422q186J639Q640q681k337J1063o001p640J2404j301j3281
4220i363J0634N099j3156M557J0488j2508j721J3460p114q728J3944k652j0735
4233g795J0587L021j1347L895P534j0252J639Q364p149k787P645k890l191N228
4247B502j228k980L459j200k025K784q75l547O451k583m966O585J566q914P839
$$ plain form
4147 -2410 -942 2936 -2028 -193 3412 -1542 -1245 4666 -1464 -3381 4573 -613 -4447 4096 2241
4162 2241 -5856 3423 3788 -5153 373 5826 -5714 -1948 7833 -3080 -6376 6128 1172 -7838
4176 -7838 4426 4373 -7234 1662 6161 -4958 -1502 6606 -2713 -3510 5069 246 -4663 2889 1102
4191 1102 -4319 1676 2193 -2966 1322 1648 -2208 173 1760 -2854 97 2447 -3008 1005 3600
4206 3600 -3886 -104 4318 -3868 -2229 6411 -2270 -4607 6456 455 -7185 5219 3918 -9363
4220 -9363 1271 6370 -6786 -2229 8259 -4249 -5970 7490 376 -8352 5592 2940 -7795
4233 -7795 2792 5813 -5534 -1639 5895 -4357 -2718 5646 -1503 -4290 3355 465 -2726 2502
4247 2502 1274 -1706 1753 553 -1472 1312 437 -3110 3341 758 -4208 2377 3943 -4971 2868
4262B868J946j0867N895O823j0814J066R311q318m969J4968o138j0256J3520N81
4276E616j5402R327Q650j4633L642J0858j1156k939J3100o963p373J2609j490
4289C846j0545Q698L584j0930M370O541p858m69O491m693j450O051m160k360N416
4304B532l673q97M958m459r31N790m539l050Q282l916n839R134j032q771Q440
4319B029K791j1573O311Q269j2440m69J3729j1047n066J5383o230j0236J3005
4332D456R8j3307J0108O398j4764N228R723j2330O7J0933p339n291J1459m138
4346A301p412R122J062r996O250M310p460K235M170q080L882L832n145J158L348
4361B577m480R10M924o229r27Q295o786k963J0190n555o139J1254k340j0773J1135
$$ plain form
4262 2868 4814 -6053 -158 6665 -4149 -3083 6228 -2090 -7059 7909 1771 -8485 5035 5616
4276 5616 -9786 -459 8191 -6442 -2800 8058 -3098 -6037 7063 100 -7273 5336 3846
4289 3846 -6699 1999 5583 -5347 -977 5564 -2294 -2763 3728 -965 -2415 3636 -524 -2884 2532
4304 2532 -1141 -2038 2920 -1539 -2470 3320 -1219 -4269 4013 97 -5742 3392 2360 -6411 2029
4319 2029 4820 -6753 -442 7827 -4613 -5082 8647 -2400 -7466 7917 1687 -8549 4456
4332 4456 4554 -8753 1355 7753 -7011 -1783 7940 -4390 -4323 6610 -729 -6020 5439 1301
4346 1301 -6111 3011 4073 -5923 327 4637 -2823 -588 3582 -4498 -616 3216 -1929 -771 2577
4361 2577 -1903 -993 3931 -2298 -3225 5070 -1716 -4679 5511 -44 -6183 5071 2731 -8042 3093
4376C093K646j3730O688J0373j4096N67J3089j0394o683J6970o159j1264J2640
4389C740J234j2690Q676O823j4153L943J0148j0155k574J1379o172o509J0163
4402C853k225o728O489J898o030K514L236n730K257J916k458J494P59k916K993
4417A322L52m776M157J441p265M842N265r883K078R048q549l442J2028m454j0238
4432h074J2328Q12j3246Q179P976j4812L697J2391j2599l801J5181q305o989J2785
4446E523j624j1261R823L629j2484N312P078r019q82R942p210l028Q033l122m952
4461d242O737o77m898N238j620l554M354K9m645M599R41o547O147O69o897L936
4477d30O123r522R79R053q959k989J3099n705q374J1640q18j1865J0044M809j2957
$$ plain form
4376 3093 5739 -7991 -1303 9070 -5026 -4459 8630 -1764 -8447 8523 2364 -8900 3740
4389 3740 4974 -7716 960 7783 -6370 -2427 7721 -2434 -5008 6371 199 -6310 3853
4402 3853 1628 -5100 1389 3287 -2743 -229 3007 -2723 -466 1450 -1008 486 1245 -1671 1322
4417 1322 1674 -3102 1055 2496 -4769 73 5338 -4545 -2467 6581 -1968 -5410 6618 2164 -8074
4432 -8074 4254 5066 -8180 -1 7975 -6837 -3140 9251 -3348 -7149 8032 -273 -7262 5523
4446 5523 3899 -7362 2461 6090 -6394 -1082 5996 -3023 -3905 6037 -1173 -4201 3832 710 -4242
4461 -4242 2495 1818 -3080 2158 538 -3016 1338 1367 -3278 1321 2262 -4285 1862 2531 -4366 -430
4477 -430 5693 -3829 -2850 6203 -2756 -5745 7354 1649 -6725 4915 4097 -7768 2276 7085 -5872
4492e872M242R410j1294k867J4273p112p657J1574o30j1100Q371M604j0713K271
4506b500Q429q356j478P012k393l466M696j63m736L138J398j441o66J76R51j52
4522D49j626J051K401m585K18O617n743m390R822k678q282Q892M297j2340N234
4537f63Q016j2249n88J4713j0280p541J5097k649j4906J5240L184j6168P928J1298
4551A0432j4924j582J5245j0219p050J4561l226j2540J2533M269j5828P881Q112
4564G664j1685J31R958p969k936R090l792n206P290o13m206L299m6j830J548M37
4580A134k801L470j575l592N750p14n515O197Q83q183N286L945j0094M290Q514
4595F995q938l449J2381o369q740J4213k064j3620J2185M221j4530M904J1688
$$ plain form
4492 -5872 -1630 7780 -3514 -6381 7892 780 -6877 4697 4067 -7033 1338 5942 -4771 -2500
4506 -2500 5929 -2427 -3905 3107 714 -2752 1944 1781 -2955 183 1581 140 -526 -350 601 449
4522 449 -1177 -126 2275 -2310 -2092 4525 -1218 -5608 4214 1536 -6746 2146 6443 -5897 -663
4537 -663 7353 -4896 -5484 9229 -1051 -8592 6505 3856 -11050 4190 7374 -8794 -866 10432
4551 10432 -4492 -6074 9171 -1048 -8098 6463 3237 -9303 3230 7499 -8329 -448 7664
4564 7664 -4021 -3890 6068 -1901 -4837 4253 461 -4745 2545 1932 -2274 1025 979 -851 697 1134
4580 1134 -1667 1803 228 -3364 2386 1672 -3843 2354 3237 -4946 340 4285 -5809 -1519 6995
4595 6995 -1943 -5392 6989 620 -8120 6093 4029 -9591 2594 6815 -7715 -2811 8877
4608H877j2104k788J4438q522p898J3428k622r480Q704L475j0035L648N738p303
4622b444l19O562m051j507L131o20j147J809k776J930J714o079L890M019q385
4637d273K183Q292q743k617J2323n724j0824J4965O26j6584J1564R003j9090M675
4651d224J6848j7367n673K1968r395j4908J9473P08k0557J3759J1631k0914L528
4664e123J6261j4105n022J5640m916j1206J2646J470j2459O904N143q755J669
4677a853N683l802j907K826m58n42q38m0L555k724l849P875j496q194P180M644
4693F060j2150K013J3048j3095l368J5710o942j2045J6736R39j8281J3038R165
4706A0828j9294M322J5807j5055n033J8217q307j1850J5741K51j5173J0609P384
$$ plain form
4608 8877 -3227 -6015 8423 -99 -7997 5431 2809 -6671 2033 5508 -4527 -879 4859 -2444
4622 -2444 -2763 3799 -252 -1759 1372 752 -395 1414 -1362 568 2282 -3797 93 4112 -4273
4637 -4273 -2090 6202 -2541 -5158 7165 1441 -9383 5582 6208 -10376 1188 10191 -8899 -4224
4651 -4224 12624 -4743 -10416 11552 2157 -12751 6722 7430 -13127 632 12263 -8651 -5123
4664 -5123 11138 -2967 -7989 7651 2735 -8471 4175 5645 -6814 90 5233 -3522 -1853
4677 -1853 3830 28 -1879 947 489 -53 -891 -931 2624 -100 -3949 3926 2430 -5764 1416 6060
4693 6060 -6090 -4077 8971 -4124 -7492 8218 1276 -10769 5967 6906 -11375 1663 10828
4706 10828 -8466 -4144 11663 -3392 -8425 9792 1485 -10365 5376 5627 -9546 1063 8447
4719H447j5784M384J0289j0306j391R969o099m062R458m134n173P283k249k596
4733a964M469k624k834N149j549m086O625k804n537R352j208r754R050L850j2768
4748f633N166J0093j3526j021J5785j0894q639J7360m385j3565J4193L449j6551
4761i168Q996R466j5663J765J4357j1565n833J4997m265j2034J2593K016j2973
4774g311O761P133r654m46Q070m374m447N936m65l034O60L000j579o54o86K634
4790A544j700l124M631J196q197N292P701j2157J56J3237r398q582J6889l411
4804D077j5892J4191Q569k0618O581J5821j8364m578K2789j1958j5124K2908j29
4817H273k3111J6009J1920k3967M367J9800j7013p315K2545p760j5487J6295M005
$$ plain form
4719 8447 -7337 -2953 7336 -2970 -4361 5608 -491 -4553 4905 771 -4402 2881 632 -1964
4733 -1964 2505 -119 -2953 2196 647 -3439 3186 382 -5155 4197 2989 -6765 2285 6135 -6633
4748 -6633 -1467 8626 -4900 -5921 9864 -1030 -9669 7691 3306 -10259 3934 7383 -9168
4761 -9168 -172 9294 -6369 -4604 9753 -1812 -7645 7352 3087 -8947 3646 5662 -7311
4774 -7311 -550 6583 -3071 -3517 4553 179 -4268 1668 1203 -1831 -1171 1829 250 -404 -1090 1544
4790 1544 -156 -3280 1351 2547 -5650 -358 7343 -4814 -4658 8579 -819 -9401 7488 4077
4804 4077 -11815 2376 10945 -9673 -3092 12729 -5635 -10213 12576 618 -14506 8402 8273
4817 8273 -14838 1171 13091 -10876 -6509 13291 -3722 -11037 11508 3748 -11739 4556 8561
4830H561j9383R152J1409j3644k461J3891p288o897J0644o88p732L788M065m411
4844i94q89K252K503l384j083L259N38o074M415L969p634o69R911n612p645J1760
4860D623j6j3066Q958P321j4478J801J4458j1694n593J5699m910j2412J2975L601
4874G267j4478O000R242j2077m95J1147o356o142R034q62n852L216M092n075N13
4889h26J286k13m69j302K210J255l783j5O070n106l256R489k219j1629J1229L865
4905F586j4581O365J1989j6637j119J8401j0150j3228K0860j379k1241J6034J0982
4918A2882k3366N870J8971j9927n077K3630r724j6865K0352J818k0732J1825J3156
4931A2813k1239K047J8450j2324r610J6733k446j5363J3915M318j4619L333J1527
$$ plain form
4830 8561 -10822 -1670 9739 -3905 -6366 7525 237 -6660 3984 3296 -4436 -648 3417 -994
4844 -994 -1883 369 2872 -512 -1595 1664 2202 -3872 543 4512 -3122 -3791 6120 508 -7137 4623
4860 4623 4607 -8459 499 7820 -6658 -4857 9601 -2093 -7686 8013 3103 -9309 3666 7267
4874 7267 -7211 -1211 8031 -4046 -4541 6606 250 -5892 3142 2280 -3572 -356 3736 -1339 -826
4889 -826 460 247 -222 -1524 686 1941 -1842 -1857 4213 -893 -4149 5340 3121 -8508 2721 6586
4905 6586 -7995 -1630 10359 -6278 -7397 11004 854 -12374 8486 7107 -14134 1900 12882
4918 12882 -10484 -4614 14357 -5570 -10647 12983 3259 -13606 6746 8564 -12168 -343 12813
4931 12813 -8426 -6379 12071 -253 -9863 6870 4424 -10939 2976 7294 -7325 -3992 7535
4944G535q427m648J0416k557p414O014M474p929j553Q096j984p260N596O075r437
4959c003j152J1160n802r358J1742K933j4826O043J2923j5934k739J8772j0012
4972G47j1911J7801N71j9464J3147J2025k1853L051J8438j5491q600K1449o088
4985C822j6948J8220M917k0670Q664J2371j5887p35J4812q428p951J2168r69q916
4999e530O370K996o857L054K598k790J60l19n51K639l853J46O241m750m973J0633
5015E214j541j1471R298O438j5389M378J4293j5600m903J9905q917j3383J7424
5028E746K226j9361J0655J3063k1383K590J8856j3735r848J8631j898j7398J3137
5041A281P058j4889K226J2806q992n989J1418m38r764M985N796p151l436Q407
$$ plain form
4944 7535 -892 -5540 4876 2319 -5095 919 5393 -2536 -4089 4007 2023 -5237 359 6434 -3003
4959 -3003 -4155 7005 1203 -8155 3587 6520 -8306 -2263 10660 -5274 -8013 10759 747
4972 747 -11164 6637 7208 -12256 891 12916 -8937 -5886 12552 -2939 -11539 9910 3822
4985 3822 -13126 5094 10011 -10659 -1995 10376 -5511 -6246 8566 138 -7813 4355 3386 -5530
4999 -5530 840 3836 -3021 33 2631 -159 1 -318 -869 1770 -2083 -1937 4304 -446 -5419 5214
5015 5214 3673 -7798 1500 7938 -7451 -3073 11220 -4380 -9283 10622 1705 -11678 5746
5028 5746 7972 -11389 -734 12329 -9054 -6464 12392 -1343 -11191 7440 5542 -11856 1281
5041 1281 8339 -6550 -4324 8482 -510 -6499 4919 4481 -5283 -298 5498 -1653 -5089 3318
5055C318K87r630N227P882p924o100J2114o01j3882J0659R007j8276K294J8485
5069A2860j4548j0779K3499m493k1039J7946Q867k5041Q240K0910k2425o595K6444
5082A3846j0416j9897K4390J761k5216J5081J5055k3273J143K1498j5393j1073
5094a2494K2951n429j7165J5492N391j7105M935J1980j0964l580J2916n722o749
5107e543P181K099o157Q27M647l020k959L544J553l393j298N427j287o668O475
5122A428L850r771N62J0605q272m451J2306l134j1479J0807L908j4046N440J1197
5136H950j3144k589J5860r349q825J5273j831j3326J0243O462j3280L444Q621
5149F509q319l186J0428n409n110P380R65o467L023K415k694O68O37j257J678
$$ plain form
5055 3318 3605 -6025 -798 7084 -840 -6940 5174 4573 -9309 1350 10357 -7919 -5625 12860
5069 12860 -1688 -12467 11032 6539 -14500 3446 12313 -12728 -4488 16422 -6003 -12598 13846
5082 13846 3430 -16467 7923 9684 -15532 -451 14604 -8669 -7526 13972 -1421 -12494
5094 -12494 10457 5028 -12137 3355 8746 -8359 -3424 8556 -2408 -5988 6928 1206 -5543
5107 -5543 1638 3737 -2420 -1593 3054 34 -2925 619 2172 -1221 -2519 2908 1621 -5047 1428
5122 1428 5278 -4493 -3931 6674 -1598 -6049 6257 3123 -8356 2451 6359 -7687 -2247 8950
5136 8950 -4194 -6783 9077 -272 -9097 6176 4345 -8981 1262 7724 -5556 -2112 6509
5149 6509 -1810 -4996 5432 23 -5087 2293 3258 -3209 -186 2229 -465 203 840 -417 1261
5164A261k997J434K542k928k901P968k993p529R610J513j2503P037Q709j4325
5178f102J264J5657j2645p809J8367m629j7467J7320O764k3750J1081J6157k0858
5191f650l347K2521j0910j5507K2767j012k1752J5740R795k0549K911J9104j4715
5204a604r824K0648m401j4974J1670O795j5066K209J3172q969p860J2631L43j1086
5218f316N413Q741r666m174J2474l171j1467Q368Q451j3337j14J3671q875r945
5232i947J6666n18j6577J0056J1049j7138O11J7631j2521j0979J9192k221j7781
5245a2477J4820P954j9204N115J6337j7137m134J8461p431j3069J6423P54j5827
5258i415R306Q495j4776L490J1362j0950k810J1208m258p738R892k075o072O102
$$ plain form
5164 1261 -1736 -302 2240 -688 -3589 4379 1386 -6143 3467 4980 -7523 -486 8223 -6102
5178 -6102 -4838 10819 -1826 -9635 8732 4103 -13364 3956 10720 -13030 -1949 14208 -6650
5191 -6650 -9997 12524 1614 -13893 8874 7862 -13890 1850 11645 -8904 -5993 13111 -1604
5204 -1604 -11428 9220 4819 -10155 1515 8310 -6756 -4547 8625 -344 -8204 4427 4770 -6316
5218 -6316 -903 7838 -1828 -6002 6472 3301 -8166 202 8653 -4684 -4798 8873 -2 -9947
5232 -9947 6719 6201 -10376 -320 10729 -6409 -5798 11833 -688 -11667 7525 5304 -12477
5245 -12477 2343 10297 -8907 -3792 12545 -4592 -8726 9735 2304 -10765 5658 6412 -9415
5258 -9415 -109 8386 -6390 -2900 8462 -2488 -5298 5910 1652 -6086 3806 1731 -4341 1761
5272A761J207o707M659J999o341L750K219o158M520J710p232N117M296q256J554
5287a902P928p946k169J0347o327n972J1545k341j0977R118M927j3083L836J0360
5301G344j0701j624J2853p408o903J1623j985r997Q400M585j0996K049R260o943
5315d43l714P268n67o662M890L105n230j668N810n69n841K464M637n950j951R281
5331D860k859r813J0843N030j5700N142J3319j4062n653J9207p838j5317J8884
5344F043L830k3474J2436J6324k4987M23K4922j7765j2276K5979m097k4855K2448
5357D951R280k7456R119K1008k4239l803K6924j3701j7711K5000L57k3965J4617
5370C81J2962k2772M045J8252j5470o733J7160m042j3251J1901L943j2306L033
$$ plain form
5272 1761 2968 -3739 920 2919 -3422 328 2547 -3611 909 2619 -4613 504 4800 -3456 -1902
5287 -1902 6026 -1920 -4089 6258 -69 -6041 5504 3163 -7814 1304 6231 -6852 -3016 7344
5301 7344 -3357 -4981 7872 464 -6439 5184 3199 -6798 1602 6187 -4809 -2760 6500 -443
5315 -443 -4157 3111 2544 -4118 772 3877 -1353 -3021 2789 2220 -3621 -1157 3480 -2470 -4421 4860
5331 4860 2001 -7812 3031 8061 -7639 -2497 10822 -3240 -8893 10314 2476 -12841 6043
5344 6043 9873 -13601 -1165 15159 -9828 -9405 15517 -2248 -14524 11455 7358 -17497 4951
5357 4951 14231 -13225 -4106 16902 -7337 -11140 15784 2083 -15628 9372 9729 -14236 381
5370 381 13343 -9429 -5384 12868 -2602 -9335 7825 3783 -9468 2433 6376 -5930 -2897
5383b897R216p380l712Q326j374o143L177L457l692j317L673J333n720J733O171
5398D851o637k470Q564k158q875Q395M852j2413M280J0048j2471j234J2232p356
5412c92p150J2993j415j1460R595L299j2621N701Q110j0867k1J0810q559l296
5426e273R972m361n524R189k525o870Q313J24q274P328J442r239O463M922j1572
5441e885N596O789j1296J278J1407j0952m388J6011p797r403J4733j60j6862J3105
5455B176O981j7456N784J3388j5595l308J8715j0183j0916J7753k332j4825J2898
5468C080N921j7591O408J2825j5059k732J5868p430r974J3579Q47j2853O460P618
5482F967r447j910R829m483n573O148K202p046J764O051m441o287Q438K450j0594
$$ plain form
5383 -2897 6319 -1061 -4773 3553 2179 -3964 -787 2670 -1022 -2339 1334 2667 -3053 -1320 4851
5398 4851 -1786 -4256 4308 2150 -6725 1670 6522 -5891 -1611 8437 -4034 -5268 6964 -392
5412 -392 -7542 5451 4036 -7424 2171 5470 -7151 -1450 6660 -4207 -4228 6582 -1977 -5273
5426 -5273 4699 338 -5186 4003 1478 -5392 2921 3045 -5229 2099 3541 -5698 765 5687 -5885
5441 -5885 -289 6500 -4796 -3518 7889 -3063 -7451 8560 763 -8640 6093 5933 -10929 2176
5455 2176 9157 -8299 -2515 10873 -4722 -8030 10685 502 -10414 7339 5007 -9818 3080
5468 3080 9001 -8590 -2182 10643 -4416 -7148 8720 1290 -8684 4895 5742 -7111 -651 6967
5482 6967 -2480 -4390 5439 956 -4617 1531 3733 -3313 -1549 4502 61 -6226 2212 4662 -5932
5497e932L234J1468j1359n067J5738n004j4116J4014O199j9509P299J6772j9430
5510e693m629K3771j2318j5694K3947n78k3556J5163J4832k7120N342K3253k1098
5523d378r636K7576q852k1582K3917L771k4863J2965J5731k1962p42K1353j5029
5536a731r320J9716m525j4898J4529M220j5944N908J0540j1316j380J0185o806
5549h22l656P346j246m775N058q93k610J147P29R8m70k62P85k61k140O37K990
5566A655k213p22M520k294m511N938J020o603M076K964o462J239O126o750q46
5581b863N879l267k225M697j447l394M325l96m303M314j11l865L390M49m671M356
5597H68J826o982N069K449p064L300N636r953J748J0962j0491m387J4196o105
$$ plain form
5497 -5932 -2698 8770 -2589 -7656 8082 3078 -11038 2976 9175 -10334 -3035 13737 -5693
5510 -5693 -10322 13449 1131 -14563 9384 8806 -14750 413 15245 -11875 -6533 16720 -4378
5523 -4378 -14014 13562 4710 -16872 7045 10816 -14047 -1082 14649 -7313 -8055 13298 -1731
5536 -1731 -11051 8665 4140 -10758 3771 7991 -7953 -2045 8495 -2821 -4201 5984 -822
5549 -822 -4478 2868 1622 -3153 1905 1012 -1598 -451 278 376 -94 -356 429 168 -1972 -1335 1655
5566 1655 -558 -1280 3240 946 -3565 2373 3393 -3210 866 3830 -2632 -1393 4733 -2017 -2863
5581 -2863 3016 -251 -2476 2221 774 -2620 1705 1309 -2994 1320 1209 -2656 734 1183 -3488 868
5597 868 2694 -4288 781 3230 -3834 -534 5102 -4851 -3103 7859 -2632 -7019 7177 1072
5611A072j0380J5214N41j7951J3170Q765j9992M395J8645j8872n043K2774j0249
5624B089j6796K2936J589k5560J6758J3874k6381M464K3915k0726r974K6976q476
5637D688k0144K1284N775k4741J1347J6891k2407k316K2014j1538j3012J8796
5649F637K290j9981R196J3088j6659k790J7412o180j3854J3171N598j5553K226
5662e399J4704r995q212J4914O17j6495Q629J2957j7057l371K0103r262j5455
5675a3322J9432M756k3448J0955J6564k2224j761K2441j3150j3505K1785j322
5687G201k1676J5689J1164k1817L188J9082j5673p398K0174o659j3356J4208L211
5700G338j4827N985Q655j0593N56Q512o676j998O208k757k031L576l219J040K566
$$ plain form
5611 1072 -9308 5906 6447 -11504 1666 10431 -9561 -5166 13479 -5393 -10436 12338 2089
5624 2089 -14707 8229 9818 -15742 1016 14890 -11491 -7027 16888 -3838 -13812 13164 4688
5637 4688 -15456 5828 11603 -13138 -1791 15100 -7307 -9623 12391 853 -12159 6637
5649 6637 8927 -11054 -1858 11230 -5429 -8219 9193 3013 -10841 2330 7928 -7625 -5399
5662 -5399 9305 -690 -8902 6012 6629 -9866 -1237 11720 -5337 -8708 11395 2133 -13322
5675 -13322 6110 10866 -12582 -1627 14937 -7287 -9048 13393 243 -13262 8523 7201
5687 7201 -14475 1214 12378 -9439 -6251 12831 -2842 -10240 9934 3275 -10081 4127 7338
5700 7338 -7489 -1504 7151 -3442 -2886 5626 -1050 -3048 3160 403 -1628 1948 -1271 -231 2335
5715B335n565K553N251p289q17J0064p179o376J3752l129j3589J3462M925j8357
5729i959Q061J3831j7876k653K0390j1225j2263J9271o8k0114J3057J0746k0187
5742h989M286J7344j5603p213J8175l410j5251J3511O678j7547K764J5173j0580
5755f62q485J5453p17j4397Q210R415j3619j833J4573n310j3430J4346N899j8872
5769i429N243J7570j7647o828K2405n696k1019K0034R785k8141P690K5301k5084
5782e816r159L1386j1802k5238K9574N916l4264J6425K4633l3432j970L5081k1089
5795B45k0308L3573j781l2345K3472J6219l4515O384K9875k4540j3277L1174p732
5808F444k4483K2243R943k7229Q175K0484j8923p991K1428m573j7078J3941P081
$$ plain form
5715 2335 -3230 -677 4574 -2715 -3532 6532 -647 -7023 6729 3600 -9989 3473 8398 -9959
5729 -9959 -1898 11933 -5943 -8596 11794 569 -11694 7577 7509 -12605 452 11198 -8989
5742 -8989 -4703 12641 -2962 -10175 8000 4590 -10661 2850 9528 -8019 -5255 9918 -662
5755 -662 -9147 6306 5589 -8808 -598 8817 -4802 -6635 7938 2628 -10802 3544 9443 -9429
5769 -9429 -4186 13384 -4263 -11091 11314 5618 -15401 4633 14418 -13723 -6033 19268 -5816
5782 -5816 -14975 16411 4609 -20629 8945 14861 -19403 -2978 21655 -11777 -13747 21334 245
5795 245 -20063 13510 11729 -20616 2856 19075 -15440 -9056 20819 -3721 -16998 14176 6444
5808 6444 -18039 4204 14147 -13082 -4907 15577 -3346 -11337 10091 5518 -11560 2381 9462
5821I462j6624K122J3512p841r697J1781M202j3352L182J2113r963p069J3644
5834E472K47j5667P830J2769j4784l736J7926p522j2880J4810M505j9892Q134
5847b788J4101j5708m429J7811p515j1844J4928L349j5565M957J0194q999l688
5860e196R987o61r125L726N762m416n384P672K935r231K50J1754p372j0004J4493
5875E190K777j9807J0036J6598k2317m233K7106j2982k0993K8115L618l2260J7696
5888a456K1595l2689j321L5808k2277k1954L6060p31l6330K5289K0680l8886M133
5901a2079L5354k6594j8874L9115o490l3127K6930J5654l5511O395L1428k5924
5913c723j4984L3939n689k9460K3513J4155l1166M524K7206j9132j6749K8470
$$ plain form
5821 9462 -7162 -5040 8472 631 -9066 2715 6917 -6435 -3253 8860 -1103 -8172 5472
5834 5472 5719 -9948 -2118 10651 -4133 -7869 10057 2535 -10345 4465 8970 -10922 -2788
5847 -2788 11313 -4395 -8824 8987 1472 -10372 4556 7905 -7660 -2703 7491 -1508 -5196
5860 -5196 4791 4130 -4995 -1269 4493 77 -5307 2365 5300 -3931 -3681 8073 701 -9303 5190
5875 5190 7967 -11840 -1804 14794 -7523 -11756 15350 2368 -18625 9490 13108 -19152 -1456
5888 -1456 20139 -12550 -13871 21937 -340 -22294 13766 13035 -23295 1994 22674 -16212 -12079
5901 -12079 23275 -3319 -22193 16922 10432 -22695 4235 19889 -15622 -9227 22201 -3723
5913 -3723 -18707 15232 9543 -19917 3596 17751 -13415 -8891 18315 -817 -17566 10904
5925A0904j581k6697J6958J7439k6249k238K7637j4032k0199K6494M529l1630
5937a8665J5376K2818k8937m979L2387j4989k3162K9918M548l3813J7459K2328
5949B0289l2220q70L3307k1233j8571L2637k005l1484K2721J5619l1495M736K7386
5962A8817k2816j1036K8176p300k2075K1429P442k4563Q103J6802j7847l448J7339
5975I023o877j0963J2290J777j1042L911P270n577l574N813L96l888j071M672
5989B160R23p360L041Q373r383l848J3294l683j3969J3234O821j8817N547J6108
6003A2441j5785p945K1887n547j9716J8619Q456k3608O492J9927j9986q301K5950
6016A2884p187k1360J9926R095k5274N945K1073j7109j2549K5172j913k4072J5324
$$ plain form
5925 10904 9323 -17374 -416 17023 -9226 -11464 16173 2141 -18058 8436 12965 -18665
5937 -18665 -3289 19529 -9408 -14387 18000 3011 -20151 9767 14315 -19498 -2039 20289
5949 20289 -11931 -12801 20506 -727 -19298 13339 11334 -20150 2571 18190 -13305 -8569 18817
5962 18817 -3999 -15035 13141 5841 -16234 5195 12637 -11926 -3823 12979 -4868 -8316 9023
5975 9023 2146 -8817 3473 5250 -5792 -1881 5389 -188 -3762 2051 2447 -1441 -2512 2160
5989 2160 3083 -4277 -1236 7137 -2246 -6094 7200 3517 -10452 2782 9603 -9214 -3667 12441
6003 12441 -3344 -11289 10598 5051 -14665 3954 12410 -11198 -4706 15221 -4765 -13066 12884
6016 12884 5697 -15663 4263 13358 -11916 -5971 15102 -2007 -14556 10616 8703 -15369 -45
6029d5J5217k2765n454K8570j1147k1987K5124P961l1953J0956K7446k8408j2252
6042a8737L7080q928l3781L0759J5661m3081J0869L8520l6096j5922M6341j1903
6054A0782m0993L9139J5831m9927J5720L9818m0628j3877M9829j8102l7372M1773
6066A1993J0127m7260K0084L3849m1088o795M2985j9799k9724L6704N758l7304
6078b0470J7132K4308l0972n089L1902j3245k1524K4335P404k6538Q196J9179
6090A4618j7853r886K2288j789k0894J3530J2545j8419m377K2369r515j6148J8978
6103E447N419k2275P177J8622j8482r121K4335o083j9810J8313Q381k3381N472
6116e986J9611j7611p087K1211n755j6703J5441O492j8173M578J3278j1647n282
$$ plain form
6029 -45 15172 -7593 -13047 15523 4376 -17611 7513 15474 -16479 -5523 21923 -6485 -18737
6042 -18737 18343 9415 -24366 6393 22054 -21027 -10158 28362 -7734 -23656 22685 10782
6054 10782 -30211 8928 24759 -25168 -9448 30370 -10258 -24135 25694 7592 -29780 11993
6066 11993 22120 -25140 -5056 28793 -12295 -19090 23895 4096 -25628 11076 16834 -20470
6078 -20470 -3338 20970 -10002 -15091 16811 3566 -17958 6377 13781 -12757 -4561 14618
6090 14618 -3235 -13121 9167 7378 -13516 14 12559 -5860 -10237 12132 2617 -13531 5447
6103 5447 10866 -11409 -4232 14390 -4092 -13213 11122 5039 -14771 3542 11923 -11458 -5986
6116 -5986 13625 -3986 -11073 10138 4383 -12320 3121 9613 -8560 -3982 9296 -2351 -7633
6129g633J3506j967r994M753Q278q005m123Q559J410j0589K650J1213q169r606
6143i717J5549J473j9488J1836J4006k1987l083K7200j4158j9867K9302J043l2790
6156b0681K0282K1596l4918L69L5837k3151k2224L9914m436l6636K6930K1005
6168B3887m2485O886L8312l1305j8363M2346r408l5014L1468J4796m0112Q813
6180a0179L4599k9249j4860L6783p942l1524K6039J5988l4543M459L1783k2287
6192i33j8633L1859Q27l3044J9449K1267l1167m560L3898j5425k5898L2208O788
6205A6636l6156J4541K8854l2567j0921M0532j5240l1511L5502J0151m1592J5513
6217f258L0998l4174r420L9651j5848k8874L4426O020l7314J7225K5862l2862
$$ plain form
6129 -7633 5873 3906 -6088 -1335 6943 -1062 -5185 3374 4784 -5805 -3155 8058 -111 -9717
6143 -9717 5832 7305 -12183 -347 13659 -8328 -11411 15789 1631 -18236 11066 12109 -20681
6156 -20681 -399 21197 -13721 -13352 22485 -666 -22890 17024 12588 -24048 2882 23887
6168 23887 -18598 -11712 26600 -4705 -23068 19278 9870 -25144 6324 21120 -18992 -10179
6180 -10179 24420 -4829 -19689 17094 9152 -22372 3667 19655 -14888 -10429 21354 -933
6192 -933 -19566 12293 13120 -19924 -475 20792 -10375 -14935 18963 3538 -22360 9848 16636
6205 16636 -19520 -4979 23875 -8692 -19613 20919 5679 -25832 9670 19821 -21771 -6258
6217 -6258 24740 -9434 -18854 20797 4949 -23925 10501 16521 -20793 -3568 22294 -10568
6229a0568l680L2759j7445j7664K6134J031k4866J3407J4008j9463r38J6725q533
6242I07q970J1735P03q977K647N802k467o601N023M027m764m320J0301J30j2087
6257f911O949R647j5133j955J8359j1023j1915J8589K888k2581J2133J5624k2506
6270g835o56K2778j4073j5381K3892J077k4240J3525J5324k2239j611K3888j3796
6283F53j5112K1317M070k3273R866J5602j7992o827K2858o649j8561J7595R559
6296A3106k3088K919K1942j5389j4427K4434L6k7365J8485J7813k9694o20L1319
6309A9471j9263k0676L4193j781l5167K4531K0963l8680L534L9015l0290j9193
6321b3343M2688r727l5896L2711J5837m4008J4267L4357l7011j1700M5645j8077
$$ plain form
6229 -10568 -14248 18511 1066 -16598 9536 10567 -14299 -892 13116 -6347 -7285 9440 907
6242 907 -8063 3672 4375 -4602 -1955 3847 1380 -5221 -198 3829 -935 -5255 5046 5176 -6911
6257 -6911 38 9685 -5448 -7403 10956 -67 -11982 6607 9495 -13086 -953 14671 -7835
6270 -7835 -8491 14287 214 -15167 8725 9802 -14438 -913 14411 -7828 -9439 14449 653
6283 653 -14459 6858 10928 -12345 -2479 13123 -4869 -11696 11162 4513 -14048 3547 13106
6296 13106 -9982 -7063 14879 -510 -14937 9497 9533 -17832 653 18466 -11228 -11848 19471
6309 19471 208 -20468 13725 11944 -23223 1308 22271 -16409 -12875 26140 -4150 -23343
6321 -23343 19345 9618 -26278 6433 22270 -21738 -7471 26886 -10125 -21825 23820 5743
6333E743l1404L6636O675m0008J9229K7595l6294m319L7801k0018k2539L2563
6345A1660J280l1435J8026J8949k8174j124K7588j5284j5938K2498J586k2537
6357a2905R554J7004j7720o180K0129m654j6724J3901P660j7376P02J7274r699
6370I66j2382J7964Q78j8028Q007J4971j7730k605J8381q247j3471J6913K389
6383H006j7786P627J2172j3382l046J4132o409q270R631Q06p371K238N437l883
6397i8k585K542K793j984l581M002L508q630P38J1495r655p637J6179j305j8600
6412a2818J3713J1668k2536K346K4375j9690j4277L1401n779k8594K5816J2162
6424A7787l4989R269K9847k9617j0640L8237j4673k9023L2909Q240l7902J6683
$$ plain form
6333 5743 -25661 10975 17650 -22358 -3129 24466 -11828 -16147 21654 1636 -20903 11660
6345 11660 12940 -18495 -469 18480 -9694 -10818 16770 1486 -14452 8046 9632 -12905
6357 -12905 -3351 13653 -4067 -10247 9882 5228 -11496 2405 10065 -7311 -6609 10665 966
6370 966 -11416 6548 7426 -10602 -2595 12376 -5354 -7959 10422 2175 -11296 5617 8006
6383 8006 -9780 -2153 10019 -3363 -6409 7723 1314 -6956 2675 3481 -3890 -1652 3785 -98
6397 -98 -2683 -141 2652 668 -2913 1089 4597 -4033 -3295 8200 -1455 -9092 7087 5782 -12818
6412 -12818 895 12563 -9973 -7627 16748 -2942 -17219 14182 8403 -20191 5625 17787
6424 17787 -17202 -7933 21914 -7703 -18343 19894 5221 -23802 9107 17347 -20555 -3872
6436c872K7078l5204l829L7068j9217k3506L2735K746l3707J8137K1950l0327
6448i948l204L1079j5166k0165K6235M423k8587J2079J9465k3333n830K6803r713
6461D138k0796K2275P525k5143O147K1701j9850r377K6168n861k4455K1717J1367
6474A5556k9142N515K6592k3336j1319K9841p362k5834K6510Q178l0743J1612
6486c932K2128k6327n155K9618j5124j8486K6298J223k6772J7697J2518k4297
6498a0611M426J9770j7019p848K1823p683j4114J6196J700j5875J0174N528j1761
6511e294L479P479q374q53O202l953q75M358l109l49M180m214j503P792n945k183
6527c162Q530m965o414R873R25j2154P674P088j3617L834J0881j1103m484J4178
$$ plain form
6436 -3872 23206 -11998 -15827 21241 2024 -21482 11253 13999 -19708 -1571 20379 -9948
6448 -9948 -13152 17927 2761 -17404 8831 13254 -15333 -3254 16211 -7122 -12952 13851 4138
6461 4138 -16658 5617 13142 -12001 -5854 15847 -4003 -13380 12788 6927 -17528 4189 15556
6474 15556 -13586 -8071 18521 -4815 -16134 13707 6345 -19489 7021 15199 -15544 -3932
6486 -3932 18196 -8131 -13286 16332 1208 -17278 9020 10243 -16529 1168 13686 -10611
6498 -10611 -6185 13585 -3434 -11282 10541 2858 -11256 4940 6640 -9235 939 6467 -5294
6511 -5294 -1815 5664 -2710 -3563 2639 -1314 -2189 2169 -940 -1289 2891 -1323 -2826 4966 -979 -3162
6527 -3162 5368 403 -6011 3862 4787 -7367 307 7395 -6222 -2388 8493 -2610 -7094 7084
6541G084m891j1313J1962M166j3867L596J1497j0749m092J3579m324j1231J0057
6554A474N140j1585O06J2529p031j0243J3326L383j6244O114J3270j4088p574
6567a0923K1238m693j9814J8148R082k6378Q005K2154k2099q757K9840j1156k4847
6580b0200K7539P242l3046J5674K3161l0561l034L3325j8752k2191L4520q53l3287
6593b0463K1460J7626l3316N903L0012k5508j2830L1438q260k4801K5436O673
6605A3370k8204J1052J8701k1904l246K2839j1380j3131J9305%j7786J0493R242
6618I351j4398J164J2123q034o182J0121j434o950M129M631p364j145P888l756
6632A44m132N541J054n533K033M468n595r49P260m210m288O907M15p757N339L478
$$ plain form
6541 7084 2193 -9120 2842 7008 -6859 -3263 8234 -2515 -6607 6972 2648 -8583 1474
6554 1474 6614 -4971 -4365 8164 1133 -9110 4216 7599 -8645 -2531 10739 -3349 -10923
6567 -10923 10315 5622 -14192 3956 13038 -13340 -5335 16819 -5280 -14037 15803 4647 -20200
6580 -20200 7339 14581 -18465 -2791 20370 -10191 -13225 20100 1348 -20843 13677 12824 -20463
6593 -20463 997 18623 -14693 -8790 21222 -4286 -17116 14322 6062 -18739 6697 13370
6605 13370 -14834 -3782 14919 -6985 -10231 12608 1228 -11903 7402 7402 -10384 109 9351
6618 9351 -5047 -3883 8240 206 -5976 4145 2711 -4239 -110 4521 -2843 -3988 3900 144
6632 144 -3988 1553 2607 -2926 -893 3575 -2020 -2969 4291 81 -4207 2700 3115 -4642 697 4175
6648D175q550K733O575p087r12Q171n338n293J1362l378r815R485K629j1475P026
6663C08O201j1653J896J2391j2418l040J4703q025r800J5855l37j5942J2639O535
6677I313j8678O364J5081j7479l002K0217j1597j1434J9720l375j8297J6447P489
6690A0769k1985Q053J6443j9751k387K2028j3346j2567K2204k718k0195J5868
6702B416P966k0686O087J7754j8285m828K0817j0166j3792J7406L374j8712R153
6715a496J2453j6130k031J6981r731r913J5190J105j5861R540R241j3925k109
6728f686J6011p526j1418J4022L180j6102O585J2188j4886l381J8027q008j3371
6741a1365J7359J211j9258J0996J3361j9096l22J8870j2285j1906K1816l427j8785
$$ plain form
6648 4175 -4375 -1642 4933 -2154 -3066 5105 -233 -5526 5836 2458 -7357 2128 4757 -6718 308
6663 308 6509 -5144 -3248 9143 -3275 -6315 8388 363 -9437 6418 6081 -9861 2778 9313
6677 9313 -9365 -3001 12080 -5399 -8401 11816 219 -11215 8505 5130 -13167 3280 10769
6690 10769 -11216 -3163 13280 -6471 -8858 13170 -176 -12743 9461 6743 -13452 2416
6702 2416 10382 -10304 -4217 13537 -4748 -9576 11241 1075 -12717 4689 8063 -10649 -1496
6715 -1496 10957 -5173 -7204 9777 46 -9867 5323 6428 -9433 107 9348 -4577 -6686
6728 -6686 9325 1799 -9619 4403 7583 -8519 -1934 10254 -4632 -8013 10014 2006 -11365
6741 -11365 5994 7205 -12053 -1057 12304 -6792 -7114 11756 -529 -12435 9381 5954 -12831
6754a2831J4985R722k3209Q400J6482j9163l096K0982j2833j2515K2337l217j9324
6767a3280J5345R100k2346P932J6986k0783k093K2433j3657j2525K1712l670j9161
6780a4007J8295O551k2888Q822J7514k1066j215K0155j3149j0895K0260k153j8800
6793a2576J5280P546j9137N128J5056j5393l562J6755n908j2219J2792K449j4097
6806g886O410R505j1135k423J1527n108n745P237K308q842K411P759o735m617
6820e334Q592l18q640N500O653r700k90Q960n951n442R748p66r572Q608L747j1029
6836e234M469P291r756k90R775q008l192J1786o498o999J2485k506j1368J0619
6850B574M443j6155Q984R325j7394K823J8048j6411m847K0190q899j5880K1884
$$ plain form
6754 -12831 2154 11876 -11333 -2933 13549 -5614 -8710 12272 -561 -13076 9261 6044 -13280
6767 -13280 2065 11165 -11181 -3249 13737 -7046 -9139 13294 -363 -12888 8824 5154 -14007
6780 -14007 4288 10839 -12049 -3227 14287 -6779 -7994 12161 -988 -11883 8377 6224 -12576
6793 -12576 2704 10250 -8887 -3759 11297 -4096 -7658 9097 3189 -9030 3762 6211 -7886
6806 -7886 -1476 8029 -3106 -5529 5998 890 -4855 2382 4690 -4152 -1741 6018 -717 -5334
6820 -5334 3258 2940 -5700 -200 6453 -3247 -3537 5423 -528 -5970 3778 3012 -6560 2048 5795 -5234
6836 -5234 -765 6526 -3230 -3520 6255 -1753 -4945 6841 343 -6656 5829 3323 -8045 2574
6850 2574 7017 -9138 -154 9171 -8223 -5400 12648 -3763 -8610 11580 2681 -13199 8685
6863H685J72k5019J7573J3805k7711N054K5411k2837r358K9625j1045k2926K6573
6876H002M809l0586J4493K1021k8010j803K8734j7569j6211K8525j327k7514J9045
6889A609J3842k6118K874K4118j8293j1424K4071l037k1090J5381J1293k1982
6901h756J944J9939j3629j1160K0338r46k0806J2336J2846j9045r52K0268j2063
6914C14j4517K0998K750k3589J3821J4663k3730j34K5428j7639j2597K6435m927
6927G276k4137K0331J1428k8040Q849K1982k5319m602K7866j4221j7975K6570
6939A0008j222k4697J8155J2164k7151O609K2365k2266n317K4920j1364j7405
6951a5201K3096L79k1753J5181J0526k2326O049J6140j5301n343J8489q363j0544
$$ plain form
6863 8685 8857 -16162 1411 15216 -12495 -7441 17970 -4867 -14225 15400 4355 -18571 8002
6876 8002 12811 -17775 -3282 17739 -10271 -12074 16660 -909 -17120 11405 10078 -17436 1609
6889 1609 15451 -10667 -7793 16325 -1968 -13392 10679 7642 -13448 1933 13226 -8756
6901 -8756 -6812 13127 -502 -11662 8676 7730 -13076 -740 12106 -6939 -7891 12377 314
6914 314 -14203 6795 9545 -14044 -223 14440 -9290 -9424 16004 -1635 -14232 12203 7276
6927 7276 -16861 3470 14898 -13142 -4293 17689 -7630 -12232 15634 1413 -16562 10008
6939 10008 8786 -15911 2244 14408 -12743 -6134 16231 -6035 -11352 13568 2204 -15201
6951 -15201 7895 8274 -13479 1702 12228 -10098 -4049 12091 -3210 -8553 9936 1573 -8971
6964h971J4254j015j1951Q457N793j2980N574P799r271r00Q553o351k314O481
6978C158k234l996N553j300n204N911J24n135L124L664n730j53M924l102k459
6993b855N903j158n898N585K283p758J582P908n666n013Q951P97j1438N891R310
7008H424j3576o28J6045r852j2466J9150K99k0662J3294J5234k5927J737K7248
7021A8320j9672j6253L1467m366l1159K5931J5471l8027R564L3107l1326j3919
7033b0862M1031j2155l4349L5967J0267m2473J7352L1509l7771p935M3886k1698
7045B769k8172L9253K562m0175K2945K3358l6224P45L5422k3481j9811L3814j544
7058A1461l1471K1055J7749l0890J187K8205j7454j5398K3695Q85k3171J3309
$$ plain form
6964 -8971 5283 4268 -7683 774 6567 -6413 -839 6960 -2311 -3211 5342 -1009 -3323 3158
6978 3158 924 -3072 2481 1181 -4023 1888 2012 -3123 1 3665 -2065 -2218 2706 -396 -2855
6993 -2855 3048 1890 -4008 1577 3860 -3898 -2316 5592 -74 -5087 3864 4661 -6777 -886 8424
7008 8424 -5152 -5780 10265 413 -12053 7097 7396 -13266 28 15262 -10665 -8928 18320
7021 18320 -1352 -17605 13862 9496 -21663 4268 19739 -18288 -8724 24383 -6943 -20862
7033 -20862 20169 8014 -26335 9632 19899 -22574 -5222 26287 -11484 -19419 24467 2769
7045 2769 -25403 13850 16412 -23763 -818 22540 -13684 -12939 22483 -998 -20809 13005 11461
7058 11461 -20010 1045 18794 -12096 -10909 17296 -158 -15556 8139 9024 -14147 -838
7070h38J4779k1300r33J9678q902j4749J7014M298j9518O406J5373j4244o033
7083h969J8964o522j4961J5227N509j8093O354J3246j4340m076J6031o607j1639
7096i876J4426Q75j2840O559P952j2324K340Q947q049k598R139m063m841P493
7110C140j736m610O065k036m801O110j059n713Q226M69j1424Q482N494j3310N020
7125a683J1433j4787j184J7890j2750j0022K0216l095k0607J8591Q383k4598Q550
7138c663J9582k3128n721K9159j4540j9730K8663n48k9085K0844J5559k9717L873
7151h452K6771k1435j4402L1648n644k6822K2284J2009l0679Q282K5375k4079
7163e144j1025L1098p574k5882K2162J2029k9133N603K7074k2217j3945K9830
$$ plain form
7070 -838 13941 -7359 -8292 11386 2484 -12265 4749 9047 -10471 -4065 11308 -2936 -8969
7083 -8969 9995 3473 -11488 3739 9248 -8845 -2491 10755 -3585 -7661 8370 1763 -9876
7096 -9876 4550 5425 -7415 -856 7096 -5228 -2888 6059 -1990 -4588 4551 488 -4353 3140
7110 3140 1404 -3206 2859 823 -3978 2132 1073 -4640 3586 4055 -7369 1113 6607 -6703 -1683
7125 -1683 9750 -5037 -6221 11669 -1081 -11103 9113 6018 -14589 4002 12385 -12213 -3663
7138 -3663 15919 -7209 -12930 16229 1689 -18041 10622 10074 -19011 1833 17392 -12325 -8452
7151 -8452 18319 -3116 -17518 14130 8486 -18336 3948 15957 -14722 -6440 18935 -5144
7163 -5144 -16169 14929 7355 -18527 3635 15664 -13469 -7866 19208 -3009 -16954 12876
7175A2876l150k8873K0041J7787l2338J807L1895k0685k1023L5542o37l5408K2080
7188h6K3178l8744K057L7202k4959k2245M0529l204l9647K9809K0541m2449N834
7201a2184L7290k9846j8634M2393r514l4479L1261J3708l8302J1355K7821k8356
7213g487q768L3164j2437k2338K4767N770k6023J0450J7280j9827k991J7666p940
7226A286j0191J2481J066j0111L713O235m027l696K879L468m302l343O773J653
7240C884q936L110Q247p590n589J2035j717j2878J0855P292j5281J637J4679j0879
7254a131p744J5896k822j4403J0289R672j5218j658J6132p530j1372J3966L882
7267G959j7104N887J4535j2511r669J9256j319j9475J2579J3555k2073j735K5633
$$ plain form
7175 12876 9726 -19147 894 18681 -13657 -11850 20045 -640 -21663 13879 13242 -22166 -86
7188 -86 23092 -15652 -13595 23607 -1352 -23597 16932 13728 -25919 3890 24431 -18018 -12184
7201 -12184 25106 -4740 -23374 19019 9505 -24974 6287 19995 -18307 -6952 20869 -7487
7213 -7487 -16255 16909 4472 -17866 6901 12671 -13352 -2902 14378 -5449 -8440 9226 1286
7226 1286 -8905 3576 4642 -5469 -1756 4479 452 -3244 -365 3103 -1199 -4542 2231 3884
7240 3884 -5052 -1942 6305 -1285 -6874 5161 3444 -9434 1421 8713 -6568 -4931 9748 -1131
7254 -1131 -8875 7021 4199 -10204 85 9757 -5461 -7119 9013 1483 -9889 4077 7959
7267 7959 -9145 -3258 11277 -1234 -10903 8353 7034 -12441 138 13693 -8380 -10115 15518
7280A5518j3926k0131K8867J403l1215J7952K2715l4987l58L7177k3212k4018
7292b4215M0094j052m1064K9108K2007m3562M843M2157l3567j9921M6916j0665
7304A1079m0257L8076J4831m7342J5358L6705l7499j2252M5033j8092l1617L7669
7316A1692O605m0585J7452L0035l7037m839L8205j8565k5666L3084M770l4004
7328a8853J6953K1668k7761o104L0173j2330k1380K3838N895k5439Q929K1199
7340A6788k0902q926K5272n944k2576J9653J0733k5808L563K4215j8614j1559
7352a4105K5662m696k2213J8208J0177k3820M875J9560j5562r405K1299o056j5751
7365a1827J3749P546j6539M147J0855j0654l681J0761k980n826N879j11k660R25
$$ plain form
7280 15518 1592 -18539 10328 11731 -19484 -1532 21183 -13804 -14162 23015 -197 -24215
7292 -24215 15879 14827 -26237 2871 24878 -18684 -13841 28316 -5251 -25172 21744 11079
7304 11079 -29178 8898 23729 -23613 -8255 28450 -9049 -21301 23732 5640 -25977 11692
7316 11692 18297 -22288 -4836 25199 -11838 -16677 21528 2963 -22703 10381 15151 -18853
7328 -18853 -1900 19768 -7993 -14097 16076 3746 -17634 6204 12099 -13340 -4411 16788
7340 16788 -4114 -13040 12232 6288 -16288 3365 14098 -11710 -8147 16068 -2546 -14105
7352 -14105 11557 6861 -15352 2856 13033 -10787 -5912 13648 -1914 -11319 9980 3924 -11827
7365 -11827 1922 9468 -7071 -2924 7931 -2723 -6404 4357 1377 -4449 1430 1319 -1341 -416
7379d16J058J59P56l792J599N763q353j784J2924q467q320J6081j042j8813J4151
7394A504J1170k2941L585K2857j9097j1812K8641o592k6955K5412J0598l3364
7406a6994J0441K8306k9782r576L7217j3531k9593L2328R191l7690J4264K8602
7418B3183l2704p935L7471j5518k7300L2275P703l6966J4767K6855l0772p613
7430a6554L4795j2314k7765K9654R591l5403J1243K9037k9256j1307L6263j0273
7442G711l0771K9434J2568l6835Q793L2785l0466j3369L9291j1443l0879K9667
7454F486J3777l9538J1245L2285l2362j1205M0498j5375l0146L4637O784l7994
7466b0908J7838K6872l5641k577L5642k0845k1517L3594j197l0886K1840J5346
$$ plain form
7379 -416 642 801 1557 -2235 -636 5127 -3226 -5010 7914 -553 -8873 7208 6166 -12647 1504
7394 1504 12674 -10267 -6682 16175 -2922 -14734 13907 7315 -19640 5772 16370 -16994
7406 -16994 -6553 21753 -8029 -17605 19612 6081 -23512 8816 18007 -19683 -5419 23183
7418 23183 -9521 -17456 20015 4497 -22803 9472 17175 -19791 -5024 21831 -8941 -16554
7430 -16554 18241 5927 -21838 7816 17407 -17996 -6753 22284 -6972 -18279 17984 7711
7442 7711 -23060 6374 18942 -17893 -9100 23685 -6781 -20150 19141 7698 -23181 6486
7454 6486 20263 -19275 -8030 24255 -8107 -19312 21186 5811 -24335 10302 17086 -20908
7466 -20908 -3070 23802 -11839 -14416 21226 381 -21136 12458 11261 -19625 2215 17561
7478A7561l1074N333K5567k1278j0726K6603p200j9627J9178O706k1718P929J4208
7491A1462j6567j594J4971p823q181J2323q71q582L827M838n343j44L380q42k096
7506a242K063N11m71l265J580M290l840k356M888l30o232M330N813q430p77Q358
7522D890l614o222P294J977r931L765P922p785l241J0582k584j0458Q509O958
7536H062j2774j521J4695p150j1516J4722M556j9903P139J7855j9870n956K5603
7549A3942r036k2451K3128R149l1099J1426K5911k9050q257L6397j5005k9783
7561b4728L5741P107m1118J9129L0259l9556l850M1613k3489k7501M1391J470
7573A6468m2222K6869K5206m3132K333L9221k7447k1282M0528l980l6135K6325
$$ plain form
7478 17561 -13513 -8180 17387 -3891 -14617 11986 4786 -14841 4337 11043 -10675 -2746 11462
7491 11462 -5105 -6699 8272 449 -7732 4591 3720 -4862 -1035 3803 -1540 -1684 1696 854 -1242
7506 -1242 821 1332 861 -2404 -824 3466 -374 -2730 2158 1828 -4404 -74 5739 -2691 -3468 4890
7522 4890 1276 -4946 2348 4325 -5606 -1841 6081 -1704 -4945 5637 3053 -7405 1104 8062
7536 8062 -4712 -6233 8462 1312 -10204 4518 9074 -10829 -3690 14165 -5705 -11661 13942
7549 13942 4906 -17545 5583 14732 -16367 -4941 20970 -8080 -16337 20060 5055 -24728
7561 -24728 11013 18120 -22998 -3869 26390 -13166 -17016 24597 1108 -26393 14998 16468
7573 16468 -25754 1115 26321 -16811 -14478 24743 -2704 -23986 16542 12562 -23573 2752
7585B752J8555l7684M996L3065k4798j5590L2074l484k8165J9692J4698k6373
7597a0262N30K5925j5974j5248K2964J287k2749J2437J5075j8826n223K1651p285
7610D302j7894J8753N288k0261N137J7981j7260n181J8917n732j6738J6522O115
7623I949j9616O590J4731j5759m024J7645p815j0897J3482J649j2945P529N343
7636E862r454J653O060n237j282M789k496o78L070l776Q26L613o271K467O000
7651E146q420p95J1131q234o250J4166k315j4931J3631N926j9842P926J5892j9098
7665f067m352K3928j2177j4937K2119N00k5114J6295J5864k7626L229K5297k1091
7678d132j0645K8315p002k3680K1001J0435k7724P522K2472k2508p223K6887q469
$$ plain form
7585 2752 21307 -16377 -11381 21684 -3114 -18704 13370 9886 -18279 1413 16111 -10262
7597 -10262 -9732 16193 219 -15029 7935 9222 -13527 -1090 13985 -4841 -10064 11587 4302
7610 4302 -13592 5161 10449 -9812 -4675 13306 -3954 -9135 9782 4050 -12688 3834 9949
7623 9949 -9667 -3077 11654 -4105 -8129 9516 1701 -9196 4286 5935 -7010 519 5862
7636 5862 -3592 -1939 4121 -1116 -2398 2391 -105 -783 2287 -1489 -663 2950 -3321 -854 5146
7651 5146 -3274 -4069 7062 -1172 -7422 6744 4429 -10502 3129 9055 -10787 -2861 13031 -6067
7665 -6067 -10419 13509 1332 -13605 8514 9014 -16100 195 16059 -11567 -8338 16959 -4132
7678 -4132 -14777 13538 6536 -17144 3857 14292 -13432 -5910 16562 -5946 -13169 13718 5249
7691E249k1536K1643Q132k6762P732K1089j9718q725K4801o362k1595J9379J1363
7704A4690k6713M857K2667j8017j2456K6634l407k6429K0827J4198k9723L289
7716i583K8214k2400j3485L1087n548k8242K3807J4176l3659Q212K7778k6552
7728f195j1037L3406j0267k5998K7231Q561l2850J3232K2938k7115l667K7381
7740A5620j4096j8238K5117Q9k2632J5614J2360k2526L542J6567j4417o306J6530
7753G224m953j0144J1757N86j0279N550L719p680L746M377n278Q33L094m326J841
7768F7J743l555J720L887n448j058P097m767n338R394j825q902Q130M928j1133
7783e060K416R353r281m052J1870k426r836Q701M592j1435K052J0476p766p568
$$ plain form
7691 5249 -16287 5356 13488 -13274 -5542 15547 -4171 -12896 11905 5543 -16052 3327 14690
7704 14690 -12023 -7166 15501 -2516 -14972 11662 8255 -18174 2653 16851 -12872 -9583
7716 -9583 18631 -3769 -17254 13833 8285 -19957 3850 18026 -15633 -7421 20357 -6195
7728 -6195 -17232 16174 5907 -20091 7140 15701 -17149 -3917 19021 -8094 -11761 15620
7740 15620 1524 -16714 8403 8492 -14140 1474 13834 -8692 -5150 11417 -3000 -9306 7224
7753 7224 2271 -7873 3884 4470 -5809 -259 3460 -4220 -474 3903 -1375 -542 2552 -1774 67
7768 67 1810 -1745 -25 3862 -1586 -2644 4453 -314 -5652 3742 1917 -6985 1145 6073 -5060
7783 -5060 -2644 6709 -2572 -6624 5246 2820 -7016 1685 6277 -5158 -3106 7370 -396 -7964
7797g964J2704mj3097Q480R346j4173k311J6464p589j3899J7279M477k1054R808
7811a533J4146j8916l760K4205j2568j7674K3495L950k7249J4769J8666k8304
7823a0773n24K8988j8852j7790L2124m080k7614K2982J2430l3528R964K7467k7749
7836f955r895L5197j4462k4735L0204M364l2303J7544K0220k9979l44K8715j8365
7849g94j6007K9563m471k4850J8737J3177k7468O515K0957j9468q005K3464n989
7862E361j8022J5967O023j7995M675J4754j3229o895J6921k688j5082J2879N551
7875H220j4557J018J4343j0330p532J5894k241j4348J0272Q235j5079K264J3548
7888I707j1361p014J5571k262j3601R949P816j6989N715J2206j3993k190J4964
$$ plain form
7797 -7964 4740 4736 -8361 119 9465 -4708 -7019 9445 1856 -12043 5236 9713 -11341 -1533
7811 -1533 12613 -6303 -10063 14142 1574 -16100 7395 11345 -15904 -1135 17531 -10773
7823 -10773 -11297 17691 -1161 -18951 13173 9093 -18521 4461 16891 -16637 -6673 20794 -6955
7836 -6955 -16850 18347 3885 -20850 9354 13718 -18585 -1041 19179 -10800 -11144 17571 -794
7849 -794 -16801 12762 8291 -16559 2178 15355 -12113 -5598 15359 -4109 -12114 11350 5361
7862 5361 -12661 3306 9329 -8666 -3991 10763 -2466 -9361 7560 4872 -10210 2669 8220
7875 8220 -6337 -5319 9024 -1306 -8838 7056 4815 -9533 739 8974 -6105 -3841 9707
7888 9707 -1654 -8668 6903 4641 -8960 989 8805 -8184 -2469 9737 -4256 -6446 8518
7901H518q169p788J3205k188j0746R337K802j2213O980P014j1693L032R352j1445
7915d002l30J2244j0829k990J3843q164q615J4735k084j3934J3262N920j9013
7928i957P975J4930j9799j541K1472j4643j1677K2615k716k1761J8020R899k3792
7941a0975N802J9760j9940n193K2477r248j6708K0401L452k1575J0147J4213j8633
$$ plain form
7901 8518 349 -7439 5766 3578 -7168 2169 4971 -7242 -262 6752 -4941 -1909 7443 -4002
7915 -4002 -4332 7912 -2917 -5907 7936 -228 -8843 5892 3808 -10126 3136 9056 -9957
7928 -9957 -1982 12948 -6851 -8392 13080 -1563 -13240 9375 6659 -15102 2918 12817 -10975
7941 -10975 -5173 14587 -5353 -10546 11931 2683 -14025 6376 9828 -11747 -1600 12613 -6020
$$ [...]
8191H48
##END NTUPLES=NMR FID
##END=
