##TITLE=1H_SAM_10.102
 CDCl3, 108 sc, 
 7.2.2019
##JCAMPDX= 6.0         $$ Bruker NMR JCAMP-DX V2.0
##DATA TYPE= NMR FID
##DATA CLASS= NTUPLES
##ORIGIN= UXNMR, Bruker Analytische Messtechnik GmbH
##OWNER= root
$$ XWIN-NMR		Version 3.5
$$ Thu Feb  7 14:33:15 2019 Russian Standard Time (UT+4h)  she@DPX200
##.OBSERVE FREQUENCY= 200.115
##.OBSERVE NUCLEUS= ^1H
##.DELAY= (6, 6)
##.ACQUISITION MODE= SIMULTANEOUS
##.ACQUISITION SCHEME= undefined
##.AVERAGES= 108
##.DIGITISER RES= 16
##SPECTROMETER/DATA SYSTEM= spect
##.PULSE SEQUENCE= zg30
##.SOLVENT NAME= CDCl3
##.SHIFT REFERENCE= (INTERNAL, CDCl3, 0, 15.7039)
##AUDIT TRAIL= $$ (NUMBER, WHEN, WHO, WHERE, WHAT)
$$ ##TITLE= Audit trail, XWIN-NMR		Version 3.5
$$ ##JCAMPDX= 5.01
$$ ##ORIGIN= Bruker BioSpin GmbH
$$ ##OWNER= she
$$ F:/spectra/data/she/nmr/H-F/1/audita.txt
$$ ##AUDIT TRAIL=  $$ (NUMBER, WHEN, WHO, WHERE, WHAT)
(   1,<2019-02-07 14:30:32.60 +0400>,<she>,<DPX200>,
      <continue with go, POWCHK disabled, PULCHK disabled
       configuration hash MD5:
       00 E9 B6 7A A2 85 ED C7 34 08 36 98 17 FE 4E 26
       data hash MD5: 16K
       34 AF 84 C8 9B CC E3 BA 67 5F 7B 80 18 51 6C C4>)
$$ ##END=
$$ 
$$ hash MD5
$$ 88 97 8D 50 A9 E1 BC 46 50 7A 55 47 26 9E BD 86
##$RELAX= 
##$RELAX= 
##$RELAX= 
##$RELAX= 
##$RELAX= 
##$RELAX= 
$$ Bruker specific parameters
$$ --------------------------
##$DU= <F:/spectra>
##$EXPNO= 1
##$NAME= <H-F>
##$PROCNO= 1
##$TYPE= <nmr>
##$USER= <she>
##$AMP= (0..31)
100 100 100 100 100 100 100 100 100 100 100 100 100 100 100 100 100 100 
100 100 100 100 100 100 100 100 100 100 100 100 100 100 
##$AQSEQ= 0
##$AQ_mod= 1
##$AUNM= <au_zg>
##$AUTOPOS= <>
##$BF1= 200.13
##$BF2= 200.13
##$BF3= 200.13
##$BF4= 200.13
##$BF5= 200.13
##$BF6= 200.13
##$BF7= 200.13
##$BF8= 200.13
##$BYTORDA= 1
##$CFDGTYP= 0
##$CFRGTYP= 5
##$CHEMSTR= <none>
##$CNST= (0..31)
1 1 145 1 1 1 1 1 1 1 1 1 1 1 1 1 1 1 1 1 1 1 1 1 1 1 1 1 1 1 1 1 
##$CPDPRG= <>
##$CPDPRG1= <>
##$CPDPRG2= <>
##$CPDPRG3= <>
##$CPDPRG4= <mlev>
##$CPDPRG5= <mlev>
##$CPDPRG6= <mlev>
##$CPDPRG7= <mlev>
##$CPDPRG8= <mlev>
##$CPDPRGB= <>
##$CPDPRGT= <>
##$D= (0..31)
0 1.2 0 0 0 0 0 0 0 0 0 0.03 0 0 0 0 0 0 0 0 0 0 0 0 0 0 0 0 0 0 0 0 
##$DATE= 1549535220
##$DBL= (0..7)
120 120 120 120 120 120 120 120 
##$DBP= (0..7)
150 150 150 150 150 150 150 150 
##$DBP07= 0
##$DBPNAM0= <>
##$DBPNAM1= <>
##$DBPNAM2= <>
##$DBPNAM3= <>
##$DBPNAM4= <>
##$DBPNAM5= <>
##$DBPNAM6= <>
##$DBPNAM7= <>
##$DBPOAL= (0..7)
0.5 0.5 0.5 0.5 0.5 0.5 0.5 0.5 
##$DBPOFFS= (0..7)
0 0 0 0 0 0 0 0 
##$DE= 6
##$DECBNUC= <off>
##$DECIM= 2
##$DECNUC= <off>
##$DECSTAT= 4
##$DIGMOD= 1
##$DIGTYP= 9
##$DL= (0..7)
0 120 120 120 120 120 120 120 
##$DP= (0..7)
150 150 150 150 150 150 150 150 
##$DP07= 0
##$DPNAME0= <>
##$DPNAME1= <>
##$DPNAME2= <>
##$DPNAME3= <>
##$DPNAME4= <>
##$DPNAME5= <>
##$DPNAME6= <>
##$DPNAME7= <>
##$DPOAL= (0..7)
0.5 0.5 0.5 0.5 0.5 0.5 0.5 0.5 
##$DPOFFS= (0..7)
0 0 0 0 0 0 0 0 
##$DQDMODE= 0
##$DR= 16
##$DS= 0
##$DSLIST= <SSSSSSSSSSSSSSS>
$$ [...]
##$SUBNAM2= <"">
##$SUBNAM3= <"">
##$SUBNAM4= <"">
##$SUBNAM5= <"">
##$SUBNAM6= <"">
##$SUBNAM7= <"">
##$SUBNAM8= <"">
##$SUBNAM9= <"">
##$SW= 254.9554414375
##$SWIBOX= (0..15)
0 0 2 0 0 0 0 0 0 0 0 0 0 0 0 0 
##$SW_h= 51020.4081632653
##$TD= 16384
##$TD0= 1
##$TE= 0
##$TE2= 300
##$TE3= 300
##$TEG= 300
##$TL= (0..7)
0 120 120 120 120 120 120 120 
##$TP= (0..7)
150 150 150 150 150 150 150 150 
##$TP07= 0
##$TPNAME0= <>
##$TPNAME1= <>
##$TPNAME2= <>
##$TPNAME3= <>
##$TPNAME4= <>
##$TPNAME5= <>
##$TPNAME6= <>
##$TPNAME7= <>
##$TPOAL= (0..7)
0.5 0.5 0.5 0.5 0.5 0.5 0.5 0.5 
##$TPOFFS= (0..7)
0 0 0 0 0 0 0 0 
##$TUNHIN= 0
##$TUNHOUT= 0
##$TUNXOUT= 0
##$USERA1= <user>
##$USERA2= <user>
##$USERA3= <user>
##$USERA4= <user>
##$USERA5= <user>
##$V9= 5
##$VALIST= <valist>
##$VCLIST= <CCCCCCCCCCCCCCC>
##$VD= 0
##$VDLIST= <DDDDDDDDDDDDDDD>
##$VPLIST= <PPPPPPPPPPPPPPP>
##$VTLIST= <TTTTTTTTTTTTTTT>
##$WBST= 1024
##$WBSW= 4
##$XGAIN= (0..3)
0 0 0 0 
##$XL= 0
##$YL= 0
##$YMAX_a= 639729
##$YMIN_a= -659531
##$ZGOPTNS= <>
##$ZL1= 120
##$ZL2= 120
##$ZL3= 120
##$ZL4= 120
##$ABSF1= 10
##$ABSF2= 0
##$ABSG= 5
##$ABSL= 3
##$ALPHA= 0
##$AQORDER= 0
##$ASSFAC= 0
##$ASSFACI= 0
##$ASSFACX= 0
##$ASSWID= 0
##$AUNMP= <proc_1d>
##$AZFE= 0.1
##$AZFW= 0.1
##$BCFW= 1
##$BC_mod= 2
##$BYTORDP= 1
##$COROFFS= 0
##$CY= 11.3945322036743
##$DATMOD= 1
##$DC= 2
##$DFILT= <>
##$DTYPP= 0
##$F1P= 18.9103706918063
##$F2P= -1.10871071338519
##$FCOR= 0.5
##$FTSIZE= 0
##$FT_mod= 4
##$GAMMA= 1
##$GB= 0.15
##$INTBC= 1
##$INTSCL= 1
##$ISEN= 128
##$LB= 0.24
##$LEV0= 0
##$LPBIN= 0
##$MAXI= 10000
##$MC2= 0
##$MEAN= 0
##$ME_mod= 0
##$MI= 1.114404
##$NCOEF= 0
##$NC_proc= 0
##$NLEV= 6
##$NOISF1= 3.799351
##$NOISF2= 2.8
##$NSP= 1
##$NTH_PI= 0
##$NZP= 0
##$OFFSET= 15.70392
##$PC= 1
##$PHC0= -8867.605
##$PHC1= 129.8001
##$PH_mod= 1
##$PKNL= yes
##$PPARMOD= 0
##$PSCAL= 0
##$PSIGN= 0
##$REVERSE= no
##$SF= 200.130013532006
##$SI= 16384
##$SIGF1= 3
##$SIGF2= 2
##$SINO= 400
##$SIOLD= 16384
##$SREGLST= <1H.CDCl3>
##$SSB= 0
##$STSI= 0
##$STSR= 0
##$SW_p= 3612.71676300578
##$SYMM= 0
##$S_DEV= 0
##$TDeff= 0
##$TDoff= 0
##$TI= <>
##$TILT= no
##$TM1= 0
##$TM2= 0
##$TOPLEV= 0
##$USERP1= <user>
##$USERP2= <user>
##$USERP3= <user>
##$USERP4= <user>
##$USERP5= <user>
##$WDW= 1
##$XDIM= 8192
##$YMAX_p= 0
##$YMIN_p= 0
$$ End of Bruker specific parameters
$$ ---------------------------------
##NTUPLES= NMR FID
##VAR_NAME=  TIME,          FID/REAL,        FID/IMAG
##SYMBOL=    X,             R,               I
##VAR_TYPE=  INDEPENDENT,   DEPENDENT,       DEPENDENT
##VAR_FORM=  AFFN,          ASDF,            ASDF
##VAR_DIM=   8192,          8192,            8192
##UNITS=     SECONDS,       ARBITRARY UNITS, ARBITRARY UNITS
##FACTOR=    1.96e-05,      1,               1
##FIRST=     0,             0,               0
##LAST=      0.1605436,     0,               0
##MIN=       0,             -659531,         0
##MAX=       0.1605436,     639729,          0
$$ Real data points
##PAGE= N=1
##DATA TABLE= (X++(R..R)), XYDATA
0e3J56j47O7r6J98k89L35l55M14n34O85q05Q89j014J216j448J662j861K098k411
20a293K775l145L513l927M427m999N610o259O982p825Q803r885J1090j2488J4155
35G534j6169J8606k1603K5458l0661L8074m9441O9173j12278K92799J09245r90268
47f59531Q88563J72181q78233M06200N92087q24654J7936P58446n05932m05386
57d38323P66303j33648o25099N25079K54994o73500K06459M96559n09895j45816
67b76887N80850k40929l89410M76619O5763m98138K55122L07342m32718j6259
77a68645M22141k54149k37636L90870k3770l55757K49624J78358l49770N3550
87i5184K93502k35564j26493L01163p1751k33502K12399Q2952k48081P7074J79658
$$ y = [-53, 103, -44, 23, -73, 125, -164, 171, -184, 230, -304, 381, -424, 465, -549, 667, -781, 881, -980, 1118, -1293, 1482, -1663, 1850, -2077, 2350, -2649, 2961, -3298, 3684, -4141, 4662, -5223, 5867, -6621, 7534, -8635, 9971, -11632, 13826, -16835, 21239, -28202, 40971, -71307, 221492, 330737, -659531, 229032, 401213, -477020, -70820, 521267, -303387, -285451, 472995, -32937, -438323, 327980, 194332, -430767, 94312, 349306, -324194, -117735, 378824, -131071, -276887, 303963, 63034, -326376, 150243, 216006, -282132, -27010, 280332, -152386, -168645, 253496, -653, -238289, 152581, 128811, -226946, 22678, 201036, -148734, -95184, 198318, -37246, -163739, 137424, 65673, -167829, 44570, 127522, -120559, -43485, 136173]
98A36173j79079n4827J94332o5715j35988J36425M4873j47032L8921J12501r4214
109a3630n4024J14349n340j08743O0880P8888j04689k6281J25698m3669j06247
120h2808J10964M4681j50864M9716J28866j37690m4352J76859p3216j36148J69129
131E5137K4895j92871J07710J23951j95330Q732J92198j42310r5818K10592m9444
142D7442j75853J70258N7008k08674Q7109J46220j85716j7102J93845j14430j12855
153a12748J88718j6035j75383J34222Q2021j86376M4723J53279j46365n2578J79543
164I3021p0633j30767J59141K2454j73866R4305J09774j69117Q090J62534j18676
175a3740p9981J72624m0751j44339J42581M3718j71004P6779J13454j54589m643
$$ y = [136173, -42906, -97733, 96599, 30884, -105104, 31321, 76194, -70838, -31917, 80584, -13630, -67654, 46695, 41355, -67388, -6508, 72380, -32309, -58590, 67108, 23439, -82808, 28156, 72837, -78027, -28311, 100555, -37135, -81487, 95372, 22156, -113992, 55137, 80032, -112839, -5129, 118822, -76508, -67776, 124422, -17888, -113706, 96886, 47442, -128411, 41847, 98855, -109819, -22710, 123510, -62206, -79308, 114537, 107, -112748, 75970, 59935, -115448, 18774, 100795, -85581, -40858, 112421, -33944, -86522, 93021, 22388, -108379, 50762, 73216, -100650, -6345, 103429, -65688, -57598, 104936, -13740, -93721, 78903, 38152, -106187, 36394, 80112, -90892, -14113, 99341, -55248, -59891]
186e9891J56013j04663p9753J57300l1170j32387J21681M3790j48460O2476J00334
197H5270j29577o510J28792q2904o5390J22453k0836j01981Q9221L6206j09427
208e4683M0594P5598q8670j1879R1433n0822n0433Q0049o039o9494M9839L1013
220C6506o5658J4473N0514m5845j6458N1194j6437l4836L5890R256l6079J1987
232e493K4600k4483r066K7408n940k2068J5471J3398k2764j448K4276j2224j7166
245a5499K3049L740k6429J2552J9775k5388m909K9142j4498j9317K7129L190l0401
258a7864J6298K0423k9454j333L0150j7544j9438L0879o94l2056K2542J7643l4621
271a5069N303L2122k7914j2976L7834j2454l1097L4557P464m0772K1242K6239
$$ y = [-59891, 96122, -8541, -88294, 69006, 37836, -94551, 27130, 70920, -77540, -15064, 85270, -44307, -50817, 77975, -4929, -70319, 52134, 31298, -70683, 18538, 54744, -54683, -14089, 61509, -27161, -39040, 52393, 1571, -48862, 31187, 25148, -44346, 5493, 36506, -29152, -14679, 35835, -10010, -26468, 24726, 8289, -26547, 9343, 18599, -17480, -5493, 19107, -5376, -14442, 12966, 7026, -15042, 429, 13827, -8937, -10385, 13891, 1667, -15499, 7550, 11290, -15139, -2587, 17188, -8200, -13109, 16033, 1535, -17782, 9347, 12537, -17864, -1566, 18857, -10597, -11930, 18220, 676, -18762, 12117, 11423, -20633, 1909, 19552, -15069, -9766, 22356, -5558, -18534, 19300, 6846, -24251, 10306, 17770, -23002, -1760, 24479]
283B4479l9749J048M0204l0554j8571M4396j3119l5498L9224O811m4832K5397
295g64K8099m5722M821M2453l7024j4641M7434j9621l4148M4843J783m6970L2879
308C422K2122m8543J3594L8875m1300r697M9409k7096k8853M7526n966m1952L6181
321G722J4891m6909J9515L2101m0728k616M1558k7504k1750M0864p602l3235L0059
334F366J2518l7626J4636K5913l1498n122L2685j5281k1178K8488J010k8317J6753
347f53J7354k8246J921K6204j8559j2996K6988n147k3196K1389P007k4393Q014
360d313J9093k0846l540K2078j2535j1659J9499k471j4820J0698N875j4108M883
373b166Q702q177k377O624r38l189R30J529K21l381J153N683o309l009R634k766
$$ y = [24479, -15270, -14222, 25982, -4572, -23143, 21253, 8134, -27364, 11860, 18671, -26161, -764, 27335, -18387, -13566, 28887, -8137, -22778, 24656, 5035, -29113, 15730, 17513, -29457, 3422, 25544, -22999, -9405, 29470, -11830, -21527, 27882, 786, -28067, 19459, 13493, -28459, 7722, 22613, -24296, -4781, 27320, -13408, -16024, 25534, -1970, -23720, 17144, 9542, -23693, 6366, 18884, -18742, -4106, 21807, -9691, -14813, 17872, 2591, -18587, 9901, 10911, -17406, -653, 16701, -11545, -9624, 16580, -1979, -14975, 12013, 6866, -16330, 5059, 12066, -12327, -4313, 14780, -6066, -9606, 12472, -63, -11722, 7777, 5306, -9514, 1184, 7059, -7049, -2166, 6536, -1641, -4018, 2606, 1668, -1521, -591, 938, 1159, -2222, -1069, 4614, -1695, -4704, 4930, 2164]
389B164j1207J2417L672j7371Q794J3842j9021j771K1272j3745j3601K5904n001
402F348k3011K2643Q611l1175J4080K1249k8280j720L0334k0954j7145L3760p425
415G315k7346K5627J0288l4049J4509K4361l0845j955L0648j9546j7486L1123
427A2644m387k7546K4924R735l0189R967K2221k5351m895K9366j4953j8374K6575
440I737r97k4652J9017J1355k6970O711K3517k3600o698K7480j2320j7863K3660
453H377K24k3482J6720J2499k5452N935K0428k1350l893K2789j2281j3018K0740
466H236k371j9187J6473O711j9868P956J3545j6805j289J6258j1227n844J4003
479F591l882j0035J1305K22j0439O479N321r097J610O833o298j611O638l460l048
$$ y = [2164, -9043, 3374, 7046, -10325, -1531, 12311, -6710, -8481, 12791, -954, -14555, 11349, 6348, -16663, 5980, 14591, -16584, -2504, 18745, -9535, -11255, 19079, -1875, -19020, 14740, 7315, -20031, 5596, 15884, -18165, -3656, 20705, -10140, -12095, 18553, -993, -18479, 12644, 8257, -19289, 5635, 15370, -14819, -4852, 17369, -7982, -12877, 16489, 1536, -16838, 9737, 8740, -15912, 3105, 14460, -12510, -5799, 17718, -5882, -12580, 14900, 2580, -15283, 8377, 8601, -14881, 1839, 14338, -11114, -5179, 15249, -6101, -9994, 12795, 514, -12504, 8236, 5865, -13322, 3151, 9862, -10006, -2050, 11495, -5310, -6599, 9659, -1568, -7412, 6591, 2709, -7326, 3979, 4201, -6238, 241, 5562, -3535, -1925, 4908, -1390, -3001, 3637, 177, -2871]
494b871M496r95k379J926K24j294J142O2m06Q12o70m4J404j260k278K886J28l042
512b159L496O3m243K456L897n732k29O269n442j541O088j658n724O246K019q121
528d315M089M930q164m82R441n323n147P843J49r260O941N496j1191J473J0117
543F597q172m036J1402m519r504J1941J950j4409Q706Q507j4388J002J4517j1361
557a767n733J5084m819j2144J3210K178j4470P599R801j5044K532J2497j0508
570a584n434J3922n650r368J2210J834j2740P009O238j0547O50R620p337l570
584d747J0309l960p103Q121J654q953M130M355o188m95O591m271j868N468k762
599B81k944L756Q50m265J959J982k618J422J542k003n97J688p13j360L148j051
$$ y = [-2871, 1625, 630, -1749, 177, 401, -893, 249, 311, -95, 717, 47, 3, 1407, 147, -2131, 755, 883, -2159, 1337, 1400, -2843, -387, 3510, -2222, -2451, 3818, -1624, -3165, 2923, 1265, -4459, 1787, 3806, -4315, -226, 4704, -3460, -3942, 5499, 176, -4971, 2872, 3021, -6239, 702, 6198, -4993, -3520, 6597, -1575, -5611, 5791, 1272, -8232, 3709, 5659, -8750, -44, 8463, -5925, -4923, 9594, -1767, -7500, 7584, 2765, -9379, 3831, 6009, -8461, -862, 8939, -6105, -3573, 8924, -1584, -7018, 6904, 1254, -8114, 4096, 5930, -6810, 199, 6437, -4110, -3460, 6160, -1177, -4747, 5562, 1602, -5501, 2620, 4274, -4679, -549, 3806, -2382, -2877, 3714, -557, -2425, 3043, 281, -2663, 1093, 1943, -2322, -363, 1619, -999, 423, 1965, -38, -635, 1053, 340, -1020, 2128, 1077]
615A077j498J025j96j845J498l52p36J800M95l759K594J409k149o22L045k313
631e27q47M156k477l253M678o74m288M233R48n271K838M083o494m47P625m387
647a04l206O915k265n067N326Q60o377M667L334o856J911N006n237k107O994m028
663b34l532O189n78n074M776J431n399J875L497m304L93M320l204j676L932r96
679A416l165L059j45k808J285K078k642l75K365j059r66J731j425K10P49M53k125
696a364J735O06k546J337J346k584J427J687k037n20K094o34j292J617K00k249
712a177J757k0j408N39K271k932M17K691j900r09K187k009j349K828o86k410L023
729I13P53k713O59K737m475O13M355l306j665M218k807j111L670j273l109L649
$$ y = [1077, -421, 604, 408, -1437, 61, -291, -1027, 773, 1268, -2491, 103, 1512, -637, -1259, 1786, -527, -1374, 2782, 305, -2948, 1730, 1056, -3232, 1001, 1949, -3322, -484, 3599, -2895, -3342, 4283, -104, -3310, 3605, 1340, -3727, 1599, 2459, -3918, 749, 4083, -2773, -862, 4144, -1093, -3200, 3794, -234, -3766, 2423, 1845, -3229, 1547, 2978, -2421, -546, 2951, -1353, -960, 3360, 156, -1520, 2412, 1416, -1749, 1310, 1165, -1643, -358, 1720, -922, -1297, 1068, 9, -957, 774, -651, -441, 308, 761, -1364, 371, 977, -1569, -232, 1114, -1470, -43, 1644, -393, -913, 1181, 547, -745, 872, 1072, -1177, 580, 560, -848, -309, 1962, -970, -553, 2138, 238, -671, 1516, -493, -1842, 986, 300, -2110, 913, 1666, -1047, -388, 2349, -2126, -1513, 2842, -464, -2129, 2089, -718, -1829, 1841, 568, -2541, 1108]
745A108L89l949L291J775m213L93L979l761j465N304k109l500M507o65k694K007
761C97J367m221J475L042l001o30K660o51j932K113P51k897J823J467l456J451
777b42J623k692l04K652q94k620K806J512l045P5K626k445p49L249j678j679K161
794C56R50k409J831j105l32J050P68j211r59K880j888k47J634M0k296Q77K61j673
812a473J250K7k17k2J924j558P49o58o77N70j69L47M28k14l2m82Q90j040l10K104
832A437k156M36J678j878j318K236r64m93O68O22j507J101J587k726P99K481k116
849a13j597K685n14j668K626r5k603R93J702k140M00K147j782q69J986j113j683
866a638J666P13k088R51J545j184j178K686k480j06K026q6l365L170P03k686P78
$$ y = [1108, 1497, -2452, 839, 2614, -1599, -1206, 2773, -988, -2453, 2851, 742, -2758, 1749, 1084, -1610, 397, 1764, -2457, -982, 2060, -941, -1571, 1089, 438, -1494, 619, 1370, -1527, 296, 1763, -1693, -242, 1381, -1311, -1615, 1037, 143, -2477, 329, 1841, -1204, -1129, 1497, -948, -1697, 1552, -126, -1805, 356, 1306, -1103, 728, -377, -709, 341, 1109, -102, -1061, 1819, -69, -316, 1318, 1358, -938, -61, 200, -1473, -223, -196, -413, -435, 1489, -69, 680, 22, -655, -85, -254, 93, 521, 307, 275, -207, 683, -357, -667, 1437, -719, -283, 1395, -483, -1801, 435, -529, -1022, -354, 268, -1239, -138, 1449, -1277, -478, 2003, -113, -1710, 975, 461, -1207, 1419, 1324, -1279, -286, 1416, -724, -324, 1823, 41, -828, 1158, 45, -1638, 28, 741, -1347, -396, 1149, -35, -1213, 1473, -1007, -1113, 913, 827, -2538, 632, 1335, -1351, -573]
883e73K376k471q01L220j489j996L135q31j920J355Q61n70j651K640r56j43N37
900G23p78j171J683M72k327J724N45j653K62J047l39p24K49N70p80N62J2k23L73
919B27k78j168R55R39j118k50Q78o64M48J12k4K82o26K72Rl13K99N88m56n36P97
940C73j130L65J046m70J99k21P26p03q70M62n14O17J40o3o2L67J2m75l35J027
960D91r11m0R31n35k92M17q3m40j8J055q49N00m2J95j055K39K78l52K08M15L61
981D73k76O89p69k3N61P31j775n12J912j013m77J59r4M90M22r8j834J143M22j26
1001EO98r93p24P79J509j351q4R52j218j74R97n4j143J38J478j176K45J333j324
1020a07l03P60j061O36J6L71j022J942k16k602J841J01K88r82L77k35l51P48K23
$$ y = [-573, 1803, -668, -1469, 1751, 262, -1734, 1401, 570, -1350, 5, 866, 296, -1355, 1285, 329, 186, 723, -55, -1226, 457, 929, -1398, 326, 871, -782, -520, 527, 188, -536, -287, 283, -497, 65, 77, -146, 227, -51, -1219, -264, 675, -443, -693, 185, -479, -31, 81, 57, 339, -287, -15, -6, -319, -20, 568, 112, -424, 373, -757, -392, 654, 184, 383, 162, 888, 185, -685, -223, -737, -120, 20, -43, -105, 262, 274, -201, -536, 491, -420, -460, 471, -64, -356, 61, -22, -462, -480, 575, -274, 226, 184, 379, -676, -437, -159, -511, -303, 112, 473, 197, 886, 117, 94, 655, 1386, -389, -901, 1011, -2, -479, -320, -414, 76, 498, 400, -1434, -291, 131, 5, 703, -290, -1014, -235, 1274, -77, -161, 791, -427, -601, 396, 342, -801, -663, 815, -361, -116, 1217, -107, -410, 350, -711, -75, -59, 312, -710, 1232, 1016, -1586, 255, 356, 644, -338, 39, -196, -547, 201, 424]
1039D24q30j99J125j210J75K38P72o56J281j685K53Q53k07n44n37R05l15O27j46
1058C24n65n62J068K65j088J160j564L99j44P89P01q56K60o51O44J76o18j21O76
1077B93j270J128m00N27J00k86k58nR83k13j026Q90o26P36O96j529m13J201L63
1096H91j475J368Lj006O16o18N2k61K67l93R90m48o51N64N21p7j339J134N95k73
1116D60j190J28P34j17O36j117M41L39Q7q13J72M32q09R38N03j502J6O63J75q18
1136f42J31J000n77j08N00j009K49M13M1j10L37o4l25j22P65r64r52J968r87l31
1156g87N09l22Q18o23L70k44N57k30m99L34N86l18j252J946o49k4m95O46n68P64
1176E19m50n5l43O95o04Q09q20l96o0J555j573L57L31p66L97N32k58L07m45K68
$$ y = [424, -406, -605, 520, -690, -515, -277, 495, -161, 1120, -565, -312, 541, 334, -210, -747, 158, -157, 470, 324, -241, -803, 265, 530, -558, 602, -962, -563, -707, 82, 783, -73, 187, -464, 180, 356, -262, -383, 293, -977, 151, -249, 278, 378, 92, -166, -171, 812, 599, -427, 463, -163, 573, 1269, -260, -673, 528, 891, -584, 784, 787, -219, 397, -221, -169, -430, -163, -556, 434, -14, -665, -101, 420, 343, -996, 138, 733, 460, -730, -602, 132, 15, 651, -466, -25, 314, 401, -412, -240, 192, -617, 321, 824, -678, -662, 1, 176, -642, -511, 489, -88, -196, 304, -705, -456, -43, -2, -112, 225, 161, -164, -286, 479, -485, -1437, 531, -456, -787, -278, -600, 218, -405, -35, -279, 278, 48, -451, -117, 469, 151, -1101, 845, 196, 172, -323, 323, -245, 519, 69, 14, -329, 366, -238, 571, -249, -645, -705, 850, -723, -366, -35, -801, -404, 128, -130, 177, -268, 0]
1196@K72k87J63O11l53l46p22O71j42k17k22M26k7N58j707J107K48j12N7K43k13
1217Hj3MJ72M73q13J043j478j42J148n25m81J34m98N63r9Q76Q5p64m73N77J72
1238c1j075J170O48q80j28M70lJ13m06J95O14j40r16M40L51l23r56P24K16Kj019
1259i34J601n85p35j39J56R56j41l03L70k53J27l22K95M02q01L91j18O26r35L31
1279a1l72k5N13n17M0J63n25M67L77p05M91ql10N31po79N31p0L98K44o23n43Q49
1302B09O50o12O74p08J12J73m06j10R44m65r57Q32n76M0M62o58P69k16o38J210
1322G29o51n76k73N15J12l1n17N34J86N58o16M1l85q95J088K29p0p72J61K80M7
1343c06m24K29L00L20m0l16QO50j001J078m76J26l72n39J340q61K56m31M84L33
$$ y = [0, 272, -15, 148, 759, 406, 60, -662, 9, -133, -350, -572, -146, -173, 385, -1322, -215, 33, -79, -22, 221, 8, -5, -1, 171, 644, -169, 874, -604, -746, 402, -123, -604, -470, -968, -405, -504, 372, 457, -307, -780, -203, -31, -1106, 64, 712, -168, -296, 174, 171, 284, -122, 73, 687, 547, -369, 71, 422, 99, -857, -133, 83, 85, -934, 667, 82, -653, -792, -636, 320, 179, -124, 246, -7, 120, -202, 93, 495, -306, 85, -33, 593, -342, -11, -383, -408, 105, -412, -372, -209, -734, -267, 110, -595, -104, -112, -422, 109, 102, -577, -46, -116, 282, 526, -97, -640, 209, 859, 247, 921, 213, 325, 498, 92, -18, 926, 461, -496, 336, -240, -200, 262, -396, 373, 157, -481, 729, 78, -498, -771, -256, -144, -175, -692, -158, 28, 586, -30, 11, -374, -1269, -181, 48, -22, -794, -633, -353, -306, -730, -501, -201, 119, 79, -237, -229, 421, -580, 498, 22, 148, -224, -763, 577, -284, -28, -459, 25, 358]
1363C58r07r2J252j394J136n72K49Mj70o7k11J87k83K83k20K01J21K40l35k70
1383d90K75k3J329j233l40L57q76L97O42m0L13o6o11k67N61L19J70o52J597j850
1403d88M14N77j223N31M43o74O87j37M94n71o57N0M43m22J052r4n14l49M04m91
1423e25N90J04K72m86O09K17j353K37L58o21P63J36R8m43k89M51q39L21N23q6
1443C7o15o3R13q63l38Q43L17p29Q83k61n19k23N24l20J39P67k32R1l45o05M76
1464a23M96n80O08p42M3P9k6k42O66l35P0l23L42j53K79n06M38l16R95r47L95
1485A18L99r40J457k56J97j799J141j65k10r47p5J231L56n47l92M6O0P52j070
1504f44J732j59n68o95L26K18m79M00l6j048R13P26j57o29n22J057j432J097l79
$$ y = [358, -549, -641, 611, -783, 353, -219, 30, 34, -136, -203, -414, -227, -510, -227, -447, -246, -125, 115, -220, -490, -215, -238, 1091, -142, -482, -125, -1001, -604, 38, -2, 311, 245, -366, -633, -72, 247, 417, -235, 1362, -488, -74, 503, -720, -189, 254, -420, 267, 130, 624, 53, -604, -554, -111, -533, 519, 425, -89, -438, -34, -525, 65, 169, 441, -45, 564, 781, -572, -335, 23, -598, 165, 301, 399, -44, -333, 118, -721, -400, 123, 37, -578, -641, 272, -591, -929, -86, 231, -498, 385, 124, -395, -618, -94, -414, -275, 492, 260, 351, 6, -599, -123, 373, -207, 401, -341, -298, -219, -245, -487, 179, -156, -86, -409, -67, -220, 59, -447, -9, -325, 670, -277, 118, 517, -423, 1034, 778, 975, -824, 317, 152, -58, -1005, -1080, 151, 507, -40, -432, -386, -326, 426, -644, 1088, 929, 361, -334, -8, 210, -269, 131, 95, -953, -40, 686, 529, -100, -622, 435, -997, 100, -279]
1523b79K30k58l4j5Q17j043N42j27P80p31L22j67P9K48r27R62o88J534j526M39
1543A58k43L39k04M7k72N31K59j608N83K48K08p7L59k90n0o72M75R6m93M81K90
1564A65K34o76p04Q74K31m26M08K9o09O61n86l22M44L71P27m82j477J125J67q50
1584f96J582n46o14o6J12k61P51p15m56N86J016j27p64N85j381Q67l22J45J92
1603a12M55o54Q51j059K59K99m64N38O09r70N44j134P72o28M34M97q71M45J063
1622H74r43l20K33M5P42l24l53n01J109l29p6K13m27K08m67M49Q6j55q11j89P90
1643a46Q57n11L74r97O95l32K01j32n82J150m72n03O10L90k08r5p58Q56n61J67
1663Cj70L60M21n64l87J367j539M88M41m22m74O13J0L3n53k99J179l17k1m85N35
$$ y = [-279, -49, -307, -341, -356, 461, -582, -40, -167, 613, -118, 204, 37, 116, 364, -563, 399, -289, 1245, -281, 158, -85, 254, 50, 97, -175, 356, 615, -993, -410, -162, 46, -31, 328, 38, -12, -684, -209, -113, -606, -125, 165, 399, -277, -981, -107, 124, -302, 106, 135, -474, 187, -399, -721, -277, 94, 821, 339, -1138, -13, 154, -696, 886, 340, -274, -340, -228, -489, 262, -453, -909, -323, 693, 566, -198, 387, -994, -127, -449, -304, -112, 343, -311, 540, -519, -260, 39, -425, 113, 722, -248, 296, -838, -66, -694, -260, 237, -634, -189, 874, -69, -389, -156, -111, 631, 307, -46, -547, 562, 233, 157, 370, -57, 151, -316, 133, 219, 64, -747, -936, -146, 711, 200, 574, -423, 272, -60, 141, 9, -573, 577, 105, -398, 212, 602, 394, 299, -459, 397, -164, 3, -167, 193, 614, 50, -337, 1030, -509, -21, 420, -2, -476, 137, 147, 180, -373, -672, 507, 190, 169, -316, 219]
1684B19K90q04J63Q1r0J277j647O06K46p91K77o67P87m52R23m24R56r0j088Q44
1704F16j086n67J169P1N38r08o5o1O8M01j48l77o51k16J098n0M86N89j556R2J062
1725E05j020J392q38K36L35L41k06j763J465q75N5n09J159o16j04P39p09p4J06
1744c81Q20L71r91N44m37k93M50j1P17k047M18J162q16o85O87O94m51M89o35M51
1764E6k31M29q67j83K89l06M79K90N6o22K37n14J801k386J524P43j020N70p67
1783d22L82l85J45N95k29O11q33j00J56o04l93J367j94L89j580M84O16l45L78
1802C8l14K10K19p75Q35o54j13O79M37j098N46O1j6K94j017j24L94p8N03N07r52
1823d18P00o05o48M01J064n99J403r18N49p64l7J23M41q58k50K12Q75o02N22j758
$$ y = [219, 509, -295, -132, -51, -141, 1136, -511, 95, 341, -450, -173, -840, -53, -505, 418, -6, 950, 860, -228, 616, -470, -1037, 132, 203, 741, -167, -232, -293, -225, 176, 28, -349, -1000, -1216, -118, -168, 318, 907, -649, -557, 505, -515, 877, 39, 275, 610, 951, 745, -1018, 447, -428, -373, -882, 277, -339, -443, 296, -413, -487, -381, 439, 810, -181, 363, -74, -367, 83, 72, 789, -1258, -840, 322, -494, -1179, -492, 202, -249, 240, -395, 56, -175, 254, -613, -796, -507, -813, -334, -44, 12, -610, -373, -887, 914, -1472, 52, 795, -225, 345, -422, -40, -425, -280, 315, 86, 697, -136, -236, -80, -684, -1077, 290, 96, 485, -1095, -611, 5, -340, 38, -276, -66, 153, -622, 213, -441, -554, 125, 562, -536, 10, 71, 55, 349, -668, -792, -398, -476, 27, 534, -418, 282, -323, -971, -570, 494, -105, 1298, 380, 929, 165, 128, 251, 692, -166, -416, -204, 671, 69, 591, -1167]
1843a167Q34K1N42l53j15J61K04K42p7l80K89k11j422J402P06m32q99O53n12P27
1863B13l39r9k04m53J036n81N48q08J121r31k74Q00l9M65l5j509J341l85J76p0
1883b7o29J311p23k69Q44n25q6K31o60N87k56o02M68q59N63J132o99M39L2K55
1903E27r23O76P38j526O65n9O6L7l07k80Q21k1o80L81o03q9M98R5O24p60K31n55
1925d44k4N89J97l73R86p49L44q65j90O45r10Q15O82n05K3M96q34K89j194J042
1945B0K04n21J51N3O21n99l03L40P23r53J76L79N01j445K56kn3J90n80J278J55
1966E91j116O83j067J583p99P79M3L31m42q97Q95n98L64k05J279n57j45m77k30
1985A5J15l08R31l71m33q23P98M93q54J61Q58J46m41r77R55J82l60j37n65P40
$$ y = [-1167, -333, -312, 230, -123, -238, -77, 127, 369, 292, -88, 201, -10, -1432, -30, 676, 244, -655, -2, -514, 213, -126, -225, -429, -882, 154, -427, 121, -687, 434, -497, -771, 29, -10, 455, 420, -1089, 252, -133, 43, -27, -656, 655, -68, -337, 507, -18, -104, 127, -533, 54, -202, -804, -336, -1195, -632, 500, -199, 240, 272, 527, -396, 280, 1018, -508, 157, 98, 164, 201, -106, -386, 435, 414, -266, 115, -488, -577, -79, 16, 640, -120, 111, -444, -468, 121, 318, -55, 931, 182, 526, -339, -529, 116, -794, 21, 703, 198, 221, 717, -117, 172, -1022, 20, 224, -297, -146, -93, 528, -71, -374, -34, 689, -264, -88, 291, 792, -653, -397, -399, -452, -262, -842, 436, 591, -525, 158, -909, 674, -125, 654, 697, 1028, 586, -311, 584, -14, 350, 145, 1424, 867, 722, 245, 15, 130, -178, 753, 382, -51, -874, -76, 417, -437, -276, 582, 728, 287, -690, 265, 447, 87, -50, -615, 125]
2005A25k26q24M08O2Q33n80L31o13M11o29Q74J65n12N66l98L21l88l67R59m83
2025C5j83m13q1J22J24M16k70N83o38L89Q04q7n46J96n55K09n73m51J815p43q50
2046f97M94P83j100Q39j058P48N82j17P1o13J51o65R9J102j210Q82p91J80L24
2065Do2J07L21r99L65l65R81j89j61o22J267j199J053N87j723O30j102J510o67
2084b64N41o48J97K87j210O78N08N88o96k88O46j49l53or0r6J119j701J357j236
2104h16N41P99M4M81J81j173j73m1N6K53l92j03L8K23J076j310m99P81K42m86
2124b78O24j54k65M91q79N26j19l85Q32L9q69L18l39K63N42m70m99K89J428r45
2144A50j082J794j014K22o82J139p5l36p3m49J57M08J70J64p62j2J60K3n64K45
$$ y = [125, -101, -925, -517, -455, 378, -202, 129, -484, -73, -702, 172, 337, -175, 391, -7, 314, -74, -441, 518, 35, -148, -561, -642, -520, -396, 20, -250, 333, -305, 84, 888, 801, 255, 451, -104, 105, -468, -919, 896, 153, -697, -203, 580, -520, 319, -739, 9, 591, 474, 545, -68, 83, -582, -483, 619, -591, 291, -500, -320, 4, -58, 49, 370, -629, -264, -629, 352, 163, 2, -620, 647, -552, 501, 1088, -635, -5, -1107, 403, -264, 277, -371, -174, 113, -1097, -419, 89, 677, -19, -307, 339, 190, -163, -169, -259, -355, 764, -937, 420, -816, -275, 524, 568, 1049, 1230, 57, -116, -157, -101, 152, -240, -343, -305, -82, 994, -316, -815, -34, 208, -278, 346, 192, -73, 418, -461, 65, -54, -439, 393, 432, -437, -119, -458, -195, 347, -123, -622, -333, 1095, 150, -932, 862, -152, 70, -612, 527, 452, 116, 43, -406, -249, 159, 329, 493, -269, -281, -121, -98, -662, -417]
2164d17R14K50o44j34q12M98J001n09m14l4M10J19j214J531J77j011k82m6R11
2183B94K11o41n94N04R12j056J521k131R67Q46j018Q46o39n2J69k50m79J35M92
2202C7r48M71J582o08j183N53N4n79M98L9J71J96j517J157n12J78M87M4K27n48
2222b01l43M32K21M96o41M16K55o43K01K0p76J50K03R06l47r39K6j23N77M42q3
2243B49Q9l42K19q5N30l23o0Q51k082N04P59M3m15j03J89l11k22Q74J80r97R3
2264c60N91l42k58O26N09j275P08K91n99o7K47N51p50M11k30m5N77q79R44m90
2284A60N61q31M87q79O61k80R1L17L83j234K95L71j87n70M64P26p17O52k75q7
2304A08m26M51m75Q30k42o48R30k01k77m63O14p19J58R5J594l36j684N86N51m2
$$ y = [-417, 497, 747, 103, -31, -843, -345, 656, 147, -267, -301, 109, 228, -986, 545, 722, -289, -571, -617, 294, 505, -136, -730, -226, 686, -370, 1151, -980, -13, 833, -185, 661, 22, -30, 139, -111, -590, -455, 37, -911, -440, 1142, 534, -649, -96, -42, -621, -123, -84, 87, 283, -1234, -77, -589, -411, 76, 120, 347, -201, -544, -112, 109, 605, -36, 380, 635, -8, 193, 213, -563, -413, -210, 696, 349, -590, -564, -687, -110, 332, 249, 338, -4, 215, 130, 660, 337, 277, 1128, -954, -450, 309, 352, -63, -166, 23, -288, -510, 364, 544, -453, -360, 231, -111, -369, 257, 766, -509, 199, 490, -109, -176, 71, 622, -128, 283, 53, 8, 585, -294, 650, 160, 721, -110, 377, -502, 159, -121, -30, 287, 670, -564, -269, 102, -85, -655, -191, 535, -182, 470, 195, 108, -318, 133, -342, 488, 246, -402, 528, 327, 50, -413, 201, -518, -360, -265, 1329, 993, -691, -105, 446, 404]
2324D04m41k40l61O99M44j188J320m43N02l54m00k77K62J46j094J225k38K30J95
2343C91o01J16LO21K83j039m71J469j097R75j075r4L4O31Q6j510Q11Q11n28L10
2363A26l13m45P07p13P78p88j40J249l42K16k04j35m72M11l61R19j588J626j121
2382e90J412o83O0n71M30k41K7l98K99PL02q58O19k03N99n06L83P05j199O34n10
2403b82L3R87j079k2kJ91R9l63J96R8N29n63K62k36k39m66J025j53O22p26n6K40
2425I5K85J97j304N48L27k67K63m47O18q56L60J48J55j181J246L28o03J2LK0M70
2446D17L47n91K58j96p40L7K36K77N91j371J015K1m95r84J507r68N50J43J51o55
2466d50J96k45Q47k71L18m03M43R0j057M17O95j06q61j74L47N64o53j32P3L73
$$ y = [404, -37, -277, -638, 61, 505, -683, 637, 194, 696, 342, -58, -335, -73, 73, -1021, 204, -34, 196, 391, -210, -94, -91, 530, 813, -226, -697, 772, -325, 650, -425, -519, -485, 146, 232, -1278, -467, 344, -184, 126, -187, -632, 75, -638, 140, -648, -788, 461, 119, 335, 131, -4, -476, -65, -426, 493, -1095, 531, -590, 822, 139, 199, -372, 58, -183, -156, -554, -255, -248, 54, -804, -185, -388, 211, -295, 88, 793, -406, 228, -282, -249, 738, -341, -363, -365, -174, -75, -438, -242, -144, 385, -178, 84, -152, -391, -857, 168, 15, 637, -89, -145, 95, 380, 577, -727, -179, 148, -119, 144, -303, 315, -541, -181, -33, 122, -1059, 187, 515, -88, -76, -73, -53, 417, 764, 173, 431, 235, -505, -468, -232, 45, 636, -735, 280, 301, -194, -1178, 329, -639, -89, 54, 205, -450, -254, -499, 348, 77, 395, -8, 435, 525, -532, -115, 580, 474, -387, -561, -214, 350, -303, -435, -362, 11]
2486A1k19k20j25M9j73M22P19k03k68l51M75J63k27K7j07o68R44m83m03P02m38
2507c73P02o14O72p78J201m24o01O27m74O52j086P14j32j090J600q94k00P78n92
2526c12j53P28r02P4Q56m51K32K76L14j044P09l53P83l62L80p97n02J114j325
2545g35R05k78K13O64j298q7R55r37L90Q00L50j009k27K31L0k42J2J09m57P21
2565A10L57k45Q68j191j196N48J037m27K33O72p63P18m04k88J84L82q89K90N42
2584E38O28q26j207Q82l3j10j80M08n31j17L70J108r71O92j325q2P51L8j96M8
2604a15Q99l04m9q21N71q06J79P16l14j60N41K24n02p4p0j29j71M24l21Q69p01
2625a14n70P08N1K27n4M23o56J93l64J26r5Q03j025k70l4R89L13j055j12M1O20
$$ y = [11, -208, -428, -553, -504, -677, -255, 464, 261, -7, -358, 117, 280, 53, 80, -27, -695, 249, -234, -637, 65, -373, 329, -285, 387, -391, 810, 386, -215, 412, -62, 590, -496, 218, 86, -1004, 596, -298, -498, 280, -312, -465, 263, -639, -565, 291, -160, 72, 348, 662, -382, 327, -26, 757, 395, 775, -22, -524, 590, -735, 170, -108, 105, 769, -529, -616, 339, -598, -208, 592, 942, -67, -294, -63, -33, -275, -263, -154, -611, 110, 467, 222, 1090, -101, -1297, -749, 288, -139, 94, 766, 3, 721, 317, 29, 213, 595, -294, -4, 538, 1166, 340, -867, 15, -18, -128, -308, 100, -431, -548, -178, 930, -41, 651, -674, -756, -5, 33, -163, -115, 784, 480, 431, -390, 181, -625, -446, 270, -44, -204, 337, 561, 59, -15, -85, -214, -385, 39, -282, 587, -114, -684, 24, 75, 302, 248, 671, 15, 208, -156, -30, -125, 678, -347, -617, -651, 338, 651, -404, -516, -475, 145]
2646A45l68J014n95L54k86k32j82M50j122J176m99o5R79n28j27l79l5L27N27n67
2666a3l59lM87L34K3m57p2j7l4k00J471j374J00M22j208J166o67Q4k37M47j46
2687b53n95O69R10l53L4n22K2q2m99O41q63J405j216M6J008n08l67K22K78M76
2707D53k63n76J213j362O50l31K39p14R31l50R9l29O52l35k08Q77k60m08J97K5
2727B00q18J025p92M38J35m78N94o09L38m37J89J65o17M15L76j10N76m63o41P2
2747d42Q59l17j12M75L17m82l92p13P86j97L87J14L9o56N5Q87K66j165J432j416
2767b75K97M18k02N49o83J7r97J471j123j93m95J326q17J046m7l20m41O88l70
2786a51L1q4P4M18p10Q09Q6n38O69r90o9n6O23O40m19J26o22N14l4o20Q58n45
$$ y = [145, -223, 791, 196, 550, 264, 32, -150, 300, -822, 354, -145, -210, 769, 241, 114, -265, -300, 27, 554, -13, -372, -375, 112, 446, 469, 12, -60, -77, -111, -311, 1160, -214, -114, 308, -900, 266, -401, -317, -554, -107, -253, -848, -179, 731, 378, 412, -110, -88, -170, -669, -28, -891, 514, -702, -656, 352, -156, -523, -301, -23, 453, 190, -386, 827, -535, 115, -216, 23, -691, 240, -110, -11, -340, 312, -23, -231, 646, 386, -22, 175, 200, -618, 407, -385, 53, 188, -290, 304, -305, 33, -404, -215, -50, -667, -252, 124, 14, 590, 127, -514, -442, 417, 100, -12, 463, 780, 298, -94, -807, -21, -218, 169, 283, 322, -334, -279, 608, 874, -291, 1141, -275, 22, 440, 238, 787, 104, 121, -876, 595, -528, -721, -1216, 110, -707, 339, 292, -28, -469, 219, -151, -120, -204, -130, 288, -422, 387, 473, -65, 604, -386, -455, -511, 112, 752, 333, 459, -163, 351, 317, -303, 555, 10]
2808A0k90J82M08k90m15L00N63j48J28q90Q11Q33q55r43K8L15k72l92J273K91
2828F47j024L20L12l12j10M51j10K4r87L73J42n02J810j576N48M6L15r01J153
2847F19k06k67L33K01j135m84L01j1L88K28n20J18J141n37Q27r84K46J63k52l72
2867b03O3M50k69j58m99R35m04O84l88k05N40n52P9r70M48K66O21m35k02L18q54
2888g35M77J111j81j261K34J006n20N03l32j214O10k23L55q5P33n82L27j17J39
2907B45k71K70p68O07M68K26p17P7m85l34Q52j104N19J012j939J478o71J55K76
2926a04K60j97M63m79L78p09P86m70o7k29J41P48j073O53n69J90l28P44r23N30
2946b55J86K22m77N15k11K95j76K11k89m16R88j286J437k89K54o49j1L68j82K29
$$ y = [10, -280, -98, 310, 20, -395, -95, 468, 320, 448, -442, 369, 1202, 347, -596, -568, -253, -525, -917, 356, 647, -377, -57, 255, -57, -167, 284, 174, 198, -789, -416, -274, -776, 1034, -542, 6, 52, 367, -534, 619, 413, 146, 479, 680, -455, -939, -638, -649, -261, -33, -553, -435, 706, 169, 996, 12, 258, 421, 169, -203, -140, 310, 41, -117, -616, 319, -85, 599, 211, 6, 546, -6, 73, -897, -449, -183, 438, 3, -199, 119, -735, -258, 853, 672, -589, -355, 651, 131, 634, 302, -912, -302, -525, -170, -255, 478, -104, 223, 106, 245, -26, 244, -524, 83, 551, 777, 60, 137, -348, -682, 170, -934, -415, 597, -1342, 136, -535, -380, -104, 156, -41, 422, -57, 321, -388, 398, -72, -139, -368, -227, 521, -552, 101, -468, -278, -606, 138, -785, -255, -69, 153, -324, 191, -20, 275, 99, 310, 21, -395, 593, -693, 744, 455, 709, 60, 49, 417, 235, 464]
2966D64n85j094J747n89n85M04J05k32k06L25M09qN23k93n27M53n26o14N38M35
2986A44l12p7J42O38j668J504k95n19J293j813J061j23j228J804o97j54m33P41
3004Hk93R67m75J14o07j68P29q82L99j9r12J991K83r72j555J049K58K64J93o48
3024b76o9P24j061L32L80l77J76m93J527p94r1K69J33j190M34J58Q1n96L64R12
3044E43L69L10o61l29k64r4MJ34K06k67l07J8K31j44K76O88Mo68j61N90r62K03
3066b81K7J54K83k16P9L26q44j19Q42p82J138n19R43q23J12n44O32r82N45O12
3086E83q1N7k0n43J08J60P9k7l40O23r72k18M2k18J134r73M83o0l96O25P38p44
3108D0l28M51r32J175o13J40n2N38j416Q67L42m1m2K33j659N25R61J55N7j39j09
$$ y = [464, -121, -1215, 532, -57, -642, -238, -133, -365, -571, -246, 163, 155, 678, 385, -142, 311, -215, -829, -291, 144, -168, -245, -103, 535, -1133, 371, 76, -443, 850, -963, 98, -25, -1253, 551, -146, -300, -733, 8, -285, 682, 207, 321, -286, -454, 275, -607, -208, -227, -1139, 852, 1135, 163, -1392, -343, -85, 179, 372, -276, -345, 379, -682, -350, 30, -347, -171, -664, 863, 69, -22, 247, 380, -810, -376, -218, -137, -733, -369, 543, 912, 1222, 561, 232, -32, -126, -122, 12, 218, -49, -356, -338, -107, -251, 25, 713, 717, 49, -112, 478, -484, -281, -254, -100, 183, -33, 46, 372, -472, -591, 251, -531, 607, 88, 1031, 208, 320, -224, 408, -574, -29, 583, 502, 559, 539, -4, 104, 264, 343, 316, -24, 599, -373, -591, -549, -767, 367, -606, -123, -183, -579, 46, 784, 40, -288, 163, -769, 406, -207, -67, -119, 419, -997, -130, 212, 171, 129, 362, -1297, -772, 189, 344, 401, 262, 153]
3129A53k69K61L08k89j68M23j52l97P12J57q50j87J36P99j522M01K24L99q13M80
3149a94m34J770j310M34l01K76L83j043O16n79K37O06m80J44q8j84Q36p43k64
3168c18L19l35N00o18Q74n79o6M77J49m96k67Q77p2n1l58K73l38j89M68q45N30
3189f5O48o88J54Q0l58K88p59O64L26p98M04N58m79n04K44K53k30N68K58l58p11
3210e05m73J388j42o0K27p75L60l08L84k54Q03m16k0r83J679k14q65J47Q5l04
3230b46l74J048L3q88Q35n47l32N44q85J108n52K37q3m02N38r3J36j16K43P14
3250I18o18k37J15j177J199m8L89j217R80k86J40j78n42J152K83j018l72R50j71
3269B62m22M11N60o55p37K83L65J7q85R16n99Q26q74J217j63K2n46m08M16M89
$$ y = [153, -116, 145, 453, 164, -4, 419, 267, -130, 582, 739, -111, -298, -162, 637, -885, -484, -260, 139, -674, -194, -628, 1142, -168, 266, -35, 241, 624, -419, 197, -382, -145, 461, -19, 125, 37, -147, 689, -54, -318, 1, -334, 166, -452, 422, -157, -223, 254, 403, -93, -360, 517, 445, 394, 36, 309, -29, -218, 250, -595, -65, 583, -105, 49, 129, -229, 59, -700, -36, 290, -508, -104, 454, -25, -529, -285, -32, -262, 306, 564, 206, -505, -978, 410, 268, 208, 435, -340, 20, -288, 96, -158, 645, 229, 209, -774, 905, 691, -174, -27, 58, -246, -620, 428, 461, -427, 408, -139, -471, 73, -812, 296, -256, -19, -102, -504, 34, -59, 77, -39, 204, 918, 300, 63, 178, -999, 200, 152, 541, -676, 304, 18, 158, -20, -562, 590, 873, -145, -517, 433, 262, -160, 251, 811, 156, -581, -298, 67, 84, -801, 115, -484, 342, -532, 685, 522, 544, -2, -410, 6, 495]
3289D95l50J21m64M07l72n8N09P2j3j430J630m75m06O36k8Qn29P22m08q92N28
3310b97K51j82O21n33O37j089M57k74M40Q11q11o59M79K30n38j29J13K56k9J08
3330a38J48j22m05O53R6l16l71J036r48K29j07L08l5K39K7n75O46l37j377J656
3350C07q09Q48J48p57k13l68P63M01m45M46o44P84j047O4K54L02J75M80m56J63
3370C96n8R0j11o0M68j242K86q2R95q42m03K66P46q48J234q40m28P83j199P72
3390g7R5O45M4J22r27k14jM4P89p89M4o18Q88l27nJ15j215J388j08M79k90o17
3412e35o7O60J51j40j150J656r36L67l61k40L82k46K07P3j65J63k18P50l11P42
3432G82j08p53o56j7J185q40nK19O59P01q98l81N19j86p40L56N52k71l5m52O31
$$ y = [495, 145, 266, -198, 209, -163, -221, 288, 360, 347, -1083, 547, 72, -334, 302, 274, 282, -247, 475, 67, -825, -297, -46, -228, 393, -140, 497, -592, -135, -409, 31, 842, 31, -628, -149, 81, -457, -586, -473, -217, -246, -138, 10, -112, -517, 136, 232, -84, -455, 581, -367, -138, -245, 63, 28, 267, 294, -281, 365, 28, -1349, 307, -502, 346, 494, -263, -476, -844, -81, 320, -125, 321, -323, 461, -586, -522, -268, 34, 209, 689, 233, 396, 338, 428, 317, 257, 725, -517, -231, -313, 682, -160, -563, -297, 449, -399, 835, -5, -433, 350, -849, -77, 18, 663, 707, 829, -98, -312, -313, -269, 520, -269, -225, -843, 45, -282, -287, -172, -1387, 1, -107, 372, 82, -535, -602, 58, 209, 69, -1081, 575, -361, 6, -355, -595, -213, -459, -252, -179, -344, -181, -399, 351, 40, 782, 674, -79, -735, -752, 433, -407, -412, -193, 466, 1167, 269, -112, 407, 221, -519, -163, 389, 118, 83, -369, 262]
3453B62q72M79l23Q90O01r44m97p51J906j313o4P64l0Q2m75l59J564j437J347
3472H30k53p94r44Q37k00M43j16l07k3J440j041O30o68J57O8l69Q70o21L12o89
3492d38J513j339R86j243R42n24m06k8N46M56j07P7M89j362j85J21O26m72L63
3511A5R63j298J563j588M33l45l49M45J14M56o36N83J59N91j461N45j26K21p10
3530d25J02P53r93K41J47J121j150l94K81m49LO50k14K01J53k89j64J407m61p75
3550b55Q74M73k015R08J32m2K64o07M63p71l9Q55r42P38o2j112J302j86K01q81
3570g02P03j97j76mK38K7P41J33j347J007r47O79J0K34l87K43N34p37m2m4L15
3591B81O03j271m6L55j50K45n88K62M97n67M30j93M1o84k64R37K66j18k55O22
$$ y = [262, -610, -131, -454, 436, 1037, 93, -404, -1155, 751, -562, -626, 138, 108, 190, -285, -644, 920, -517, 830, 577, -217, -1161, -324, -524, -81, -197, -504, -527, 913, -128, 502, -166, -9, 59, -310, 560, -61, 251, -438, 1075, -264, 722, -521, 421, -103, -509, -537, 9, 465, 358, 435, 924, -438, -623, -502, 124, -348, 15, 978, -320, 1243, -345, 88, -257, -606, -161, -47, 409, -227, 356, 515, 1106, -355, 190, 64, 285, -425, -323, 430, -563, -322, -175, 946, -204, -598, -317, -766, -763, -113, -327, -126, 27, -262, -426, 981, 520, -255, 619, 1092, -923, -15, 117, 75, 339, -268, 195, -576, -615, 240, -702, 36, -26, -1138, 164, -22, 179, -702, 1, -196, -372, -376, -138, -111, 630, 763, -584, 423, -524, 155, 165, 399, 12, 255, 789, 52, 10, -34, 281, 884, -387, -433, -78, -228, 17, -571, -309, 188, -379, 51, -142, -101, -785, -1049, -112, 154, 36, -219, 403]
3611D03k84J14j326J465p20J83Q26p80P68j647J424M81j289N0Q37L62o78k39K03
3630A53p22J120o7m62p98O95L95j63J25L23o57l50N23l69M19N68j57o54L0n73
3650f21O29P93p19l74R75j43q11K42n13M89n35N33l00l31J155m94l50l14N12J55
3670b2K07q59J232p47l69J146K42p91L17o77Q01l70m53M41n97O92k94k10O18l20
3690a3p9j12M32p87N67oN6n06Q02p61R6M35O20j228O19l30R51l71n23J80N49J95
3712G86o24k35m17K02R78k92J35l33n37M92p6J00j0p17K54L74j000J09j7Q28l48
3733c48J55oK92O54r70M51m83O8p6K31j0J55N81r57Q14j251k7J605j786P92O8
3754d8K83o44J060o41J15j49k50m84J178k86O29n34l30P9M10K66j322j37Q86j06
$$ y = [403, 119, 233, -1093, 372, -348, -165, 661, -119, 649, -998, 426, 907, -382, -332, 505, 867, 189, -50, 153, -569, 551, 484, 22, -776, -81, 314, 151, 276, 599, -58, -408, 115, -254, 165, 733, 576, -78, -48, -621, 8, 801, 82, -292, 683, 540, -271, -29, -542, -53, -588, -55, -355, -686, 469, -25, -375, -689, -177, -22, 185, -674, 558, -189, -558, 588, 830, 39, 356, -321, 480, 110, -343, 98, -499, 193, -101, -311, 307, -13, -92, -204, 228, -559, 8, 2, 58, -448, 354, -407, -311, 124, 744, -484, 135, -195, 756, 385, -138, 42, 591, 786, 162, -73, -490, -288, 690, 398, 533, 200, -337, 155, 79, 179, 169, -548, -294, 80, -920, -811, -828, 0, -348, -193, -199, 93, 747, -223, 228, -255, -187, -263, -32, -42, 113, 694, -263, 551, -700, -727, 878, -908, -116, -48, 235, -409, 651, 10, 125, -24, -274, -758, 420, 134, 763, 229, -101, -22, 388, 654, -668, -805, 81, -25]
3774b5j69K17J016j561J649j34o62o20J43j75O0L27J59k2j757J800J02r93J959
3793A314k09j097L11k36O0l75O62q24N26M80j85j333J178j31j20r5n34M25l17
3812e00O99o84L33K34P1J39l84M62J37K11r62J13O55n67MJ46m83N5O56j574O38
3833f01O2J003m63j91m07M13l22R0N80k3m66O33q09J84N55j08P44r11N3L33j571
3854a222O81J29%O84K60J51m31l5K72o33m17O65L03l83P16r96N90j083M42J11
3874a96J66m1p76Q16k93Q54p01L45M31q00J5O31q90N35n45J01L84n86Q49j085
3894g86J119j356J888m92no32k35O60K19m40J033q76O7n09L86Q35n88n58P00o3
3914C67J71j022O74j47L83p18K60Q5Q17m99L34p48q79R95j140J422r2k37j3J04
$$ y = [-25, -194, 23, 1039, -522, 1127, 993, 331, -289, -146, -321, -261, 66, 225, 203, -1554, 246, 348, -645, 1314, 1105, 8, 319, 83, 143, -232, 430, -394, 132, 612, 427, -906, 272, 141, 21, -74, -608, -183, -500, 199, -485, -152, 82, 153, 292, -92, 370, 507, 718, -244, -131, 524, -43, -39, 107, -376, -321, 335, -1239, -601, -539, 464, 1, -190, -597, -184, -506, -416, 164, 141, -325, 308, -501, -317, 238, 130, 874, -37, 16, 349, -1222, -541, -412, -412, 272, 532, 683, 252, 217, 489, -144, -561, 104, 407, 24, 740, -256, 334, -749, -307, -196, -30, -71, -847, -31, -324, 530, -171, 174, 605, -195, -180, 451, -439, 96, -449, -348, 36, -550, 299, -786, 333, -1023, 865, 373, 368, -264, -499, 161, 380, -60, 973, 97, 164, -345, 41, 876, 288, -270, 430, 367, 538, -484, 190, 43, 426, -292, -32, 53, 870, 371, 705, -43, -922, 73, -1067, 355, 263, 26, 13, 117]
3934A17K11r69O69J272j408l34l94J093R57j766J26K23P90q17k18K16K37m57N0
3953d02J028j734J315k26N30M25j609J498j462Q45k76Q86j95k71p73J372j267
3970c16J86L07m35O37o59J150j461J296j551O06Q65k81m24m70J913j969q9j69
3988h64J199j07q34R35J53p48R27j075R54m15m11P96o21K01J76m25M49p67K79
4007a98P24j621J552K19p19N44J12j370J37N07R47j419J034p57k84L75N59O1n40
4026a37J3j4rl06K51r04J492j32M61j053N15o58K65N58l85J314j527L07q3k4P1
4047A5O28r29m6Q17n56J11k80j048J246l71K58N91k74N4n91O8M19j3M50o21n43
4068f15Q88j075P15Q4M98O4l16L16o19L38r82P31n78P58m3P9J5p10L74J81r36
$$ y = [117, 328, -641, 28, 1300, -108, -442, -836, 257, 1214, -552, -426, -203, 587, -230, -448, -232, 5, -452, -402, 626, -1108, 207, -19, 511, 936, -673, 825, -637, 208, -68, 818, 623, 352, -421, 951, -316, -130, 177, -258, 379, -280, 870, -591, 705, -846, -240, 625, 344, -80, -550, 1363, -606, -695, -864, 335, 228, -606, 329, 482, -266, 661, -414, 540, 125, -286, 510, -111, 90, 266, -159, 290, -477, -198, 526, -1095, 457, 676, -43, 501, 613, -757, -620, -113, 834, -585, 449, -308, -592, -217, 342, 403, -137, -124, -138, -147, -453, -202, -1106, 386, 254, 715, -338, 177, -481, -216, 342, -43, 1271, -256, 51, -32, -56, 15, 643, -286, -332, 485, -71, 40, -240, -1288, -42, -413, -155, 436, 162, 216, -375, -307, 112, 99, 549, -72, -615, 273, -802, -87, -3, 495, 559, 243, 559, -60, 278, -704, 27, -551, 207, 164, 243, 258, -452, -78, 103, -833]
4089h33J62K06R17j518J582k6m35M19j318J580j255K33j22O27m07K73q5M18o91
4108b73N32j54k58P77J27q49M88o62j094J144n43J125q38N51M61j022J167l16
4126C63m15L49j01M41Q7p38J66J061o68l13m97J15J031p35q52J183j412M37l02
4145h00Q63q0q08J007p7m32j052J897K3j003O82n36K62n8o00R08n90Q66r50o02
4165a080J492o61p5o6m02J077j65o76O60K38k99k74Q27p01p17J041M4j020L37
4184d20J034m7j034J7k05P88o28P10l51Q46j99p67Q5k42Q14m37J49J69m0k47J031
4205A026j387J151q19j62Q7L30M00o74n30J357j196J378j099Q2p09J074l66K33
4223A76l42k52p62J064L78m41k07l22p1M48N53j62K16K19l21n52O46l97J83k1
$$ y = [-833, -671, -465, 452, -1066, 516, 490, 55, 474, -844, 736, -519, -286, -408, 219, -188, 85, 0, 418, -273, 259, 105, -153, 624, 751, -98, 390, -272, -1366, -222, -765, 360, -478, 73, 534, -488, 679, 363, -52, 297, 196, 637, 724, -14, 152, 1213, 545, 232, -265, -150, 881, 146, -706, 477, -935, -498, -800, 63, -17, -825, 182, 105, -327, -1379, 518, 541, -462, 220, -316, -54, -112, -712, 196, -394, 472, -478, -1080, 412, -249, -324, -390, -792, 285, 120, -556, 104, 342, 43, -231, 596, -105, -822, 219, 263, -757, -420, 614, 567, -467, -450, -655, 133, -495, 215, -136, 710, 511, -256, -171, -413, 401, -36, 113, 282, 242, -5, 1026, -361, 790, -29, -191, -104, 226, 626, -48, -578, 779, -417, 961, -138, -56, -765, 309, -57, 176, -166, -418, -1180, -116, 262, -179, -386, -708, -779, -331, 222, 60, 276, 495, 174, -378, 268, -129, 54, 33]
4243C3J26m50J50J35N46l37J62q80J232p75L05p46M95j94m70K22L43J175j113
4262d1k35N18l51k35J98j26O7Q52r14P99J72j599Q46m96J254j105J43k17K47q37
4282a060Q01o1K74N19j38k57k80L60j104J382n92L27N46j069K03R6K56m21K98
4301H0P1l22j5Q13k38n65R35p47m08k66P57j53J70K53k48N73j436R29J38j204
4321h83J508m07l67J447j630j4M75r77J487R6J17j046m8j05M83mr02P23O38j059
4341d68j68M56R15j020Q27n69M47q79N08L29r20O76m72O42m87O27k18m51P42l21
4361A96k0l52Q36j232R00J06l93o2j85L67m71j66P02M25j809J310m90Q84n99L10
4381B57j094J181m68k96N23j074J289J86k17r24Q32Q9r11Q29L6p67M45q75M93
$$ y = [33, 159, -291, -141, -6, 540, 203, 365, -515, 717, -58, 247, -499, -4, -198, -668, -446, -103, 1072, -41, -276, 242, -109, -344, -146, -272, -205, 647, -267, 532, 704, -895, -49, -545, 709, -396, -253, -470, -223, -1060, -259, -320, -46, 473, 335, 78, -202, 158, -946, 436, -156, 171, 717, -352, -149, -53, 203, -218, 80, 151, -171, -186, 627, 389, -176, 759, 12, -396, -662, 95, -58, 112, 365, 117, 690, -746, 183, 321, -883, 625, 218, -149, 1298, -332, -346, 129, -848, 639, 735, 852, -194, -242, -347, 136, 132, -770, -47, 591, -468, -636, -180, 735, -285, 542, -27, 420, -459, 49, 378, -542, 134, -338, 304, -183, 444, 226, -225, 517, 196, 176, -176, 660, -572, 328, 434, 41, -21, -206, 161, -310, -476, 226, 651, -1158, 152, -338, 546, -53, 257, -837, 344, -124, -420, 103, -971, 318, 504, 287, -637, 195, 284, -627, 202, 238, -529, -84, -959, -466]
4400d66N56J176o90q19j62J016q14Qj06k9P25j164R62k6K22j371N32J491k6j439
4420d24M93N98r76J064r55r0M94k52r5R30l44j645J450j74M12K40Q0q02O42r74
4440c28L74L70j77n44J023q47l5o91M6J024p15J605o91n50L62o16J83m36N91K02
4460A50L01l71K19j122N46l54N50m37J389p74p87Q15j43P37l17m25K28m8J51p65
4480d57j77q5L80K21n12K48N98n27j05l8L73L29k6N6O28j527M94O78j185J317
4500F83n56K03o49O37k54k08j01l57N62Q0rJ75M6n18L06l92N74k04j0l20J80O21
4522D89l86o74J57J258p63J33n04r32Q42M58P83p13J25L99j66l30j86o8K54k04
4542b8O26l59j53o2L1l04j00K50J73j58O78l08k70M88j319J352r63Lk16O89K12
$$ y = [-466, 90, 1266, 576, -243, -405, 611, -203, -195, -301, -330, 395, -769, 193, 167, 389, -982, -450, 1041, 1015, -424, 69, 667, -309, 755, -200, -290, 204, -48, -143, 787, 443, -1202, 248, 74, 486, 726, 806, 4, 646, -328, 46, 416, 239, -305, 718, -129, -164, -855, -809, 215, -500, 1105, 414, -136, 226, -390, -207, -643, -52, 150, 451, 80, 299, -823, -277, -631, -81, -518, 871, 97, -690, 125, -18, 719, 402, -23, 205, 157, 308, -457, -634, -719, -339, -118, -630, -382, 216, -311, -416, -454, -81, 248, 222, 278, 906, -621, -127, 551, -634, 683, 127, 330, -319, 318, 64, -144, -245, -602, -40, 40, 31, 206, 252, -266, 40, -352, 222, 18, 8, -312, -132, 489, 103, -571, -414, 844, 81, 214, -290, -1222, -380, 78, 861, 148, 273, 672, 506, 176, -10, -78, 176, -28, 598, 239, 86, 24, 55, -249, -349, -99, 74, -84, 594, 286, 16, 504, -815, 537, -426, -423, -639, 50, 262]
4563B62L03o65j42M12K91m64l52j24R73m36l01M98r55K99K31K06r7L83K68p37
4583a47jk1J24P71k59j33J20r05L29K62k75J72j74L5Q6M29j313J061q37Q91l63
4604a48J066q69Q69j391l11O14R1K73k64l8m14P22o8m28K63l27O33J18K08l62
4624B37l76O87p77K80j71M78p64m06P67l08M49J12n31k27J245m53j073K41P62
4643A72N55r77P13L53j019J28N19p23P39r73K07P25j566Q52O62p88K87k51M82
4662I7n14P04j51k79L68j067L48J17R9m84l32P97k91P65o73J108J58n71l77N81
4682D03K14p76M25J16j96L66p72L70j50N90j339O8M00l82j06N87J023j229J032
4701F44l76m30o20N70P85n15l86j67K15o87N99N78q0R4O10o98N0J91k19q06J472
$$ y = [262, 565, -100, -242, 170, 461, -3, -355, -479, 494, 58, -243, 255, -700, -401, -170, 36, -61, 322, 590, -147, -148, -169, -45, 726, 467, 334, 454, -451, -122, 140, -135, 37, -137, -102, -16, 413, -900, 161, -676, 215, -148, 918, 49, 918, -473, -784, -170, -79, 194, -70, -108, -522, 200, 132, -296, -33, -360, 273, 391, 599, 237, -139, 548, -229, 51, -120, 358, -406, -812, -45, -353, 96, 208, -323, -550, 695, 242, -831, -590, 172, 727, -250, 463, 816, -203, -75, 444, -279, 460, -513, -306, 419, -1147, -295, 367, -421, -134, -385, 97, -417, 287, 136, -143, 225, -842, -494, -377, -278, -762, -1094, -297, -588, 177, -496, 612, 770, 199, -178, 403, 617, -159, 266, 382, 186, 552, -220, 150, 0, 590, -749, -681, -281, -663, -769, -182, 841, -388, 644, 268, -162, -782, -212, 573, 58, -328, -495, -280, -967, -368, 210, 130, 224, 834, 136, 186, 377, 158, -648, 824]
4722H24j004lM99o04l6K18L68Q26j071J22m81k22J051o61J003n44n52pk35J70
4742c39m93M14j14J201J35j76R13k249R91p54J76Q87q37J71k69M90k82P7L54n39
4762b43M62r5K30m04K08k8o8p51J007k01N7j37k75K54r82L97Q71l02L53j099K27
4783e19m05J149k27N06O3m73R66o87l86K92p10L00P6K9K30j94N80n36m13J297
4803I38k09j074M73N58p46K23l85q1M24m84J80p82J695j204K51M2N75n08j84R46
4823F48p28N2o03O50P23N60j872M31O06o79j54K64J33R66l23l6j082J8L68M90
4843D32l09k54rK16L00j187M20P64n65N7M05m72L43p33O7K2l77O14M66J15m71
4864a56J09o7L30j06q1l22k4O7L64k25Q08n31l39K75K85l40R0l94k01J31R8Q48
$$ y = [824, -180, -183, 316, -288, -324, -106, 262, 1088, 17, 139, -342, -564, 487, -174, 829, 285, -267, -274, -509, -339, -832, -418, -532, 669, 804, 628, 1541, -708, 283, -471, -295, 592, -245, -74, -343, 147, -135, -58, 296, -243, 219, 124, 354, -50, 158, 130, 62, -689, 318, 117, 174, 37, -238, 16, -966, -569, 302, 0, 353, -746, -519, -924, 225, -2, 504, 567, 94, 1060, 373, -13, 279, -431, -131, -55, -26, 204, 10, 590, 54, -359, 938, 729, -345, 128, 686, -60, 163, -222, -303, 121, -363, -183, -965, 730, -474, -223, -181, 394, -114, -298, 648, -80, -28, -631, 19, 742, 1302, -570, -139, 467, -212, -366, -102, 31, 997, 674, 638, -444, -426, -58, 432, 123, -131, -140, 76, 376, -811, -391, 373, -192, -135, 270, -202, 141, -592, -525, -503, -880, -266, 200, 315, -156, -47, -114, 216, 110, 29, -293, -317, -250, 114, -111, 697, 166, -173, 102, 387, 47, 137, -257, -458, -327, -229, 619]
4886F19p26L34m80m23O70K11m96J52Q95p7q27M62P0m78l35Q30q21Q31j488J681
4906F04K10p95l09J20l07J68J237j311j00R0k43K44M77n30O70L67l74l12J359
4925A265q91N8m40q1l47M59j65K7M00N2k33o28J227j246R7Q07M11j449Q65k42
4945e4R87j431R60Oj39k01j53M51m19Q45j84M8r40J44PK93M80j219q4L01J100
4966G98P55j999K59l50M52L48j16N45j424R57j464J224j0m03P8M25Q04k26r39
4985b86P48j151M53R19n60L16j050L23j18L42q2J074j118R75p07L15k6j276J338
5004D29p65P18j190J556p49q25Q89l18P27m70P81m7j043M72l20Q04r34m8k81P52
5024A38L42l10r43Q92L63m12q54N27K45o20K42M67m36M37J79m37N19N9o36L21
$$ y = [619, -107, 227, -253, -676, -6, 205, -291, -139, 756, 679, -148, 314, 384, -94, -429, 401, -420, 411, -1077, 604, 814, 19, -290, -170, -477, -309, 928, -383, -483, -393, -636, -392, 85, -445, 225, 592, 218, -94, 1265, 374, 432, -8, -89, -436, 23, -142, -115, 285, 337, 104, -524, 703, -543, -446, 361, 772, -677, 188, -54, 933, -498, 462, 468, 329, 128, -25, 426, 7, 852, 668, 716, -224, -80, -73, 220, 700, -519, -603, -302, 798, 1553, -446, -187, -537, -85, 263, 147, 692, -732, 225, -1239, -15, -25, -428, -350, 75, 879, 653, -286, 462, -689, -236, 683, 123, 439, -611, -288, -406, -64, -146, 928, -190, 785, 78, 393, 367, -909, 429, -336, 382, -808, 748, -1, -826, 63, -255, 472, 2, 783, 736, -307, 165, -155, 649, -285, -333, -614, 138, 480, 170, -773, 119, 482, 70, -784, -257, -12, -632, -390, 77, -359, 78, 257, -180, 339, 398, -238, 83]
5044H3J7n1K07O3m13q53Q51p6L2J550j341m62K99N69r09k06P32k45O60l88n5M13
5066D77q30j23K14K01l55Q24k35m87R70j543P71J18M28o64N90l72J16N34o80M43
5086C97o79R55J14m84L6q48R37j051J086j97m75l11K23O05m22k01J092l91o8m96
5106a78O01l23j429J252j66L8j06l15l23J022R9Q68o06o42J72K21M22j072J230
5125G65k53j321J438j727O36L04R13r46M71m07n14N35J73N16p48K68m18K62J7
5144c6O9L13L6n67J26k70R40j131p5Q15j41J0l76L0K26J50l17M00r34J70K02O8
5166b92p8m20J524o44q2o43R56O3j01p51O65L93l43N35l19o93L57k70K90r6K04
5187B55j80k17n24J785m84j031R7%j19R30j400Q61l08q2K85J20L71K84Qj346N52
$$ y = [83, 100, 49, 256, 319, -94, -947, -96, -172, -140, 1410, 69, -393, -94, 475, -434, -640, 92, -153, 507, 119, 64, 477, -353, -476, -262, -61, -416, 408, 173, -314, 656, -887, -116, 2, 430, -234, 356, -16, 100, 634, -46, 397, -282, 673, 787, 303, 339, -509, 428, -623, 463, 266, -209, -520, -297, 308, -114, -315, 777, 386, 318, -178, 423, 100, -1329, -77, -243, -205, -311, -626, -949, 73, 172, 1040, 434, -208, -36, 185, 607, -465, 765, 512, -809, 629, -1098, -462, -158, 755, -191, 280, -127, -641, -106, 67, 583, -165, 103, -315, -53, -36, 33, 346, 382, -185, -59, -329, 611, -520, -595, 220, 79, 89, -287, -257, -31, 119, -198, 202, -732, -562, -360, -292, -370, -790, 734, 90, 8, -635, 321, 384, 283, -468, 197, 590, 247, 782, 463, -230, 127, -143, 147, 51, 255, 75, -142, -666, 1119, 635, -396, -299, -299, -418, 512, -888, -27, -335, -417, -132, -12, 359, 643, 651, -695, -143]
5208a43N82o72j82m6j90J769l72p08k85k28N23J65M89o82Q30m07o14J33j05O52
5228E09p06K96L4O09j088K87L62j532J573j146J409k78l50J001p77n97M33o90
5246f51P48n79J028q43n26J564o03r2P90j343J473j218j65P61j23o41K09M9k35
5265c97JK11N79n42l90m8J20O0O38Jj62M65q02P64j130N91o18O39M02L21m15j03
5287A85j108J765k80o27j4m59L25Q9L56n19M44j08M7N11K82l33q01K33k39l71
5307f22Q61K05j511R64k22l18M43P35r87K67J69j97l91J08J353j544m13J156k88
5326b32R80m46L57q33n25P12j58k70M28K51l92P72j121R8j76M59M11M1l12n26
5346d82J04N58o11J023o02M43n11l69N47j49m83M63L70L71k2j868J146Q99n40
$$ y = [-143, 439, -233, -415, -461, -651, 1118, 746, 38, -247, -475, 48, 213, 702, 20, 850, 443, -171, -38, -143, 509, -197, 99, 133, 742, -346, -59, 303, -1229, 344, -802, 607, 329, -21, 980, 203, -394, 39, -651, 97, -482, 546, -297, -823, 741, 138, 46, 836, -507, 966, -252, -417, 344, 221, -420, -211, -162, -397, -396, -185, 394, -148, -538, -586, -466, -406, 232, 233, 71, 536, -266, 498, -632, -41, -659, -20, 382, 703, 288, 185, -923, 842, 562, -65, -79, -538, -213, -124, 232, -287, 157, 49, 96, 607, 889, 556, -245, -12, -251, -622, 239, 444, -1067, -103, -325, -643, -200, 535, -452, -185, -16, -213, -604, -496, 857, -687, -1100, 56, -232, 748, 302, 659, -174, -699, 13, -145, -415, 13, 264, -128, 644, -477, -379, -555, -96, 315, 356, 44, -482, -378, 180, -431, 592, -10, 433, -78, -447, 100, -49, -532, -69, 301, 672, 650, -1218, -72, 827, 287]
5365B87j98M12n52J6o08K6P27m44L84K90o4p78O98l3N01q23m59O7L79L05j24P2
5387H1m32p04R37m59K28K65J40n8O12r10p3P21m00J7J13j23q8k12O36N5j05L49
5409E90j261R69k78O6L91j1j099O38R54j109K99l83J019J88j433L38l13o43J055
5428b3K58K27m50N5O27j116M82o86O80N8k24O69j064M14Q80j907R95r51Q17N93
5448C34j86k61n30L95p08J130j31l15M98R7l05k98P79q32P52j88M2p83O15q08
5468g03L93N0M15k6k47o31R16j56M34l65j20k96P86n67p58J147o10Q50j025J03
5488d10O4J174r21K8L26J75l62j65N26o09k9L66p26P62N31q20N15j183K72P84
5508B98p03L22O1K33K70q27L3M18J3q47L69N26r76P90K8P5n13J36P73j257J75
$$ y = [287, 89, 501, -51, -35, -643, -617, 110, -334, 50, 340, 276, -502, 196, 163, 664, -159, -618, -551, -172, 133, 9, 81, -351, -1055, -118, -577, -349, -84, 56, -2, 610, -300, -373, 348, -52, -35, 78, -45, -133, -345, 291, 346, 241, 590, -671, 298, 20, 86, 477, 466, -633, 5, 959, -150, 149, -234, 785, 973, -460, -122, -435, -1078, -23, 235, 462, 12, 67, 694, -422, 60, -626, 54, 112, -112, 557, -507, -93, 787, -1120, -125, -1076, -259, 334, 148, -113, -643, -248, -956, 174, 43, -272, 226, 323, 18, -280, 499, -333, 419, 231, 273, -510, 105, -703, -310, -260, 155, 129, -118, -749, 167, 11, 445, 80, -40, -336, 450, -117, -875, 272, -338, 512, -513, -410, -346, 828, -93, -65, 261, 436, 74, -91, 435, -174, -203, 163, -563, 199, 730, -90, 425, -758, -486, 298, -405, -83, -22, 211, 481, -346, -313, 105, 118, -729, -360, 166, -810, -20, 8, 83, -430, -294, 479, -778, -603]
5529f03J30M77l75P2K09P40M8q09k75Q07m23j67j45M44O83J78m33j035N93q30
5549g14M25N48j22r3P9O67n00L93m00k98r54J428k86k36O63j200K43K50L77m24
5569a54k86k61P74J6r78J200n0%p82R06q1j75j46M13q39K81M8QR55j294J67K06
5591g2O8m53o80R56k73J47J86K81n86N96n41J26J007n78L95k84k79M14k98k45
5611a13m32M45J85L06J46j59q5o88R74r33J137q74M72l85J29LK18qR3J67q64Q44
5633E78r07J001q51J70m93O14P09j856R97K33K6o52J278l75K78p00K2O55j509
5652g82L53P75l79j96L08J61J7o09J10Q89r41O75j455J258j02q92J430n34k34
5671a48K04k11l67N57j331J303o23O61M13l95K96k32L85o90J24K93l80M87N52
$$ y = [-603, -473, 4, -371, -299, -90, 650, 698, -111, -386, 421, -2, -169, -314, 130, 813, 991, 558, -477, 116, -714, -289, 259, 137, 44, 123, 790, 290, 683, 283, -15, -969, 459, 173, -63, 600, -600, -357, -107, 270, -154, -440, -701, 73, 89, -889, 311, 261, 261, -521, 385, 304, 129, -17, 396, -443, -162, -114, -106, 849, -445, -278, -72, -4, -457, -1137, -181, -454, -307, -121, 160, -426, 170, -371, -245, 762, 184, 579, 295, 16, 430, 132, -113, -545, -100, 85, 391, 537, 378, 293, -395, 579, -354, 783, -91, 381, -4, 125, 128, 346, 338, 431, 598, -266, 578, -329, 672, -179, -9, -502, 112, 821, -1035, -38, 195, 221, -431, 847, 472, 750, 50, 72, 727, -782, -429, 346, -33, -229, 79, 240, 257, -352, -242, 647, -294, 381, -1074, 184, 82, -810, 620, 86, -148, 56, -155, -522, 35, -1296, 7, -616, 45, 458, 63, 359, 127, 512, -178, -54, 239, -141, 346, 898]
5690H98r80K85J107n54k56j138R91K92p90l00l3m3M34o90R38K11P0q27%J19o81
5711i47M89Q30p85O86j429J577l5q92L12K41L96m34p51L11R63j749J955p1o95
5730b8P48q13J69p57M81K26J3l0j28n4K61k60n29M77p6J225p44L50l82k87K26
5751H8k15j85L08m9m93Q85k09j249P46J115q58m62J541j368o25K31M83J27Q11
5770F22j168O00O30o58J0M00k79Rj33p6K76k45O18j313P71m05K31j10O32l72j61
5791a21P5j8j81l82Q09J01O37j107N49q94J346l25Rm42m22j6k74M81n52L58Q34
5812D65o11K26j61m71P32r87L75Q65R7j040L53M98k32l65k3N76o64j37N13M00
5832D09m79p2N88J96q40K8P68j192K40M7N14m32k4l2Q32QP9r51O86n87J57m20
$$ y = [898, -82, 203, 1310, 756, 500, -638, 353, 645, -145, -445, -478, -521, -87, -777, 161, 372, 442, -385, -385, -266, -947, -458, 372, -413, 273, -1156, 421, 386, -506, -194, 47, 443, 9, -742, -431, 532, -1217, 738, 667, -28, 720, -93, 76, -681, -200, 26, 39, 9, -119, -173, 88, -172, -701, -224, -300, 925, 181, 531, 149, -138, 88, -127, -312, -4, -53, -546, 339, 130, -1119, -373, 742, -116, -578, 963, -405, -1030, -799, -316, -189, 622, -546, 54, 684, 26, 36, 436, 157, 166, 33, -43, 233, -12, 606, -707, 64, -341, -110, -220, 412, 40, -121, -46, -64, -245, -627, 182, 283, 920, -187, 362, -532, 814, 489, 498, 56, -366, -382, -656, -175, -727, -369, 465, -146, 80, -81, -552, 180, -807, -432, 433, 530, -510, -157, 341, 109, -256, -279, 297, -367, -504, 9, 409, -70, -142, 446, 642, -198, -170, 598, -594, -354, -307, 207, -225, -249, -281, 551, 559, 638, -313, 373, -214, -57, -477]
5854d77M77J41R5j248J170j50L42p95M99j00p8K39j44j89K62n40N64J24r19P72
5874D5n31O35l14K15j46o12J135l5l9J04m40J68P38j183n44J691j094N92o37R3
5894a59K2N60q61O76R6j009M17M20o78P06l11r9J67k54J09Q9o50R35N6k04N24
5915E52o41m66O16K79m55N28r49L76l87K63n67P39p32R49O66r94l88N83k24J97
5935e5k23K48M24q60N78n36J126m89m06Q35j46q34P84j90p17N69J15o0O01L73
5955A137p39p29k54P63q65M26K4o19N96O81o64J19j76Q26m29n29P15N94l69p79
5975b71J56l35j6j22J008l86r5L44O89j45l20q86N70M5N56j147j8P94n56P0m11
5996d76Q22n69k58J50O59L40q83k78M20M98p72P94m53N68k08o10J42P84j78n32
$$ y = [-477, 0, 141, 236, -1012, 158, 8, 350, -445, 54, -46, -124, 115, -29, -218, 44, -496, 68, 192, -727, 45, -486, 149, -165, 50, -96, -708, 427, 392, 353, 457, 17, 185, 923, -260, -804, 887, -207, 385, -252, -159, -137, 423, -438, 238, 334, -675, -258, 162, -516, 190, -121, -220, -53, -307, -198, -109, -759, 176, 232, 28, 552, -89, -555, 61, 340, -115, 413, -536, -160, -547, -284, -851, -112, -844, 105, 771, -223, -611, -28, -252, -55, -278, -30, 394, -466, 112, -424, 702, 213, -193, 642, 496, -338, 446, 256, -461, 108, 223, 163, 764, 1137, 398, -331, -585, 178, -687, -261, -237, -856, -260, 421, -243, -124, -300, 526, 97, -432, 283, 877, 508, -271, -115, -450, -466, -588, 420, 34, -61, 283, 972, 827, 507, -379, 191, 236, 792, -355, -373, 421, -135, -65, -476, 346, -223, -481, -331, 328, 668, -215, -493, -73, 425, -347, 447, -6, 562, 354, -256, -114, 670, 492, -40]
6016d0k95k80N47N02o93k75N56j6m19R33l13j40L79j057l1Q06n24K96k87J72K85
6037A06k77N7k68M16n29pP33n28M66n6K19L85l78l12J07L66j49j11P26n59K44
6058F51j156N82k59N45q06J117j063k67J560j081m45J038p27l80J179o72M1l56
6076d99Q63l1j63r49R02n61R78J3l92o4r5j14M79m56J39o03R08j77j8k52r01J531
6098E38p22K07q0M81n3K70j040O35On57O95n0l10K91J65j89m92O0J25n44O17o92
6120f39Q05o27K10L2L0J5j64J427j293Q04j089p3m44O59J53R89j237q6O35q55
6140g48P59J68L6p03J403j054J46K58m99R18o44m50n7O12j15K95r52J434q66j67
6160b26P88j242J047L68n08K3j30m66M37m87K32J18J35l10L25m9P26j135Q53q47
$$ y = [-40, -335, -615, -68, 434, -259, -534, 22, 6, -413, 520, 207, 67, 446, -611, -642, 164, -360, -64, -351, -179, 106, -171, -114, -382, 34, -495, -502, 231, -297, 169, 113, 332, 717, 339, 27, 134, 500, 351, 240, 966, 407, 651, -505, 77, -182, 363, -443, 674, -389, -656, 904, -177, -622, 416, -311, -691, 488, -184, -143, -499, 364, 333, 170, -779, 123, -438, 540, 553, 161, 97, 2, -112, 367, -89, 50, -553, 355, 178, 160, -92, -993, 538, -184, 23, -57, 424, 371, 641, -399, 236, 242, -315, 380, 330, 20, 311, 476, 287, -205, -145, -20, -564, 53, -639, 166, -461, -251, -219, -189, -174, -338, 1089, -204, 600, -489, -562, -1006, -347, -194, 795, -442, -528, 107, -748, 11, 179, 215, -488, 915, -139, 7, 265, -234, 684, 40, -410, -467, 145, 30, 325, -627, 807, -59, -226, 562, -680, 367, 735, 227, 250, 120, -346, 91, -396, -164, -46, 89, -221, 104, 55, 781, -354, 499, -348]
6180c48N8K8J36O39J80o32M27m4p0J12j130M10m69N47K14k54K87J96o58O35K04
6201D68J49q3j005P23p87R54l19L43q9m65l6r6k01j45L39J13J164r87j084Q77
6221a67O99K02r68L02q4L36N05j095K59l87J235j459L93O70o25L98j67m2K38J55
6241C98j62j299J094P03j091K56j066J374m38J83J102j516R59o9m85Q47l56m55
6259b1m91R02q84J88L85nn95L58q92O26K6M20m98O54j39K02NR3j96l92O81l45
6281H2p1O04q01O14j487R00l88M68N07o73N35n45n1j122R10K06K80P57j114m38
6301h27O38p2k99k93J028p5m28P70M00j315N92P98q51l37J263j696m9L98K11M51
6321C07n6K09Q8q13n52O85P45q36J82J87l90l68R56m76K6J25M42l26k32j96M4
$$ y = [-348, -290, -262, -126, 513, 693, 61, 488, 444, 374, 486, -644, -234, -703, -156, 58, -196, 91, 287, -371, 264, 468, 617, 534, -471, 252, -535, 419, 100, 443, 354, -111, -147, -243, -444, -589, -250, -137, 1027, 40, -1044, -167, 532, 734, -234, 68, -16, 320, 825, -270, -11, -398, 837, -622, -229, 441, -184, 214, 47, 5, 243, 398, 236, -1063, 31, 734, -357, -101, -1167, 207, -231, -48, 1054, -462, 497, 428, -57, 790, 434, -21, -512, 390, -494, -306, 79, 74, -521, -163, -1055, -429, -403, 17, -481, 173, 34, 236, 241, 334, 138, -254, 427, 82, 11, 615, -186, 428, -1059, -159, -547, -79, 428, -245, 290, -255, -306, -1428, -518, -312, -32, 725, -389, -827, -189, -261, -560, -853, 175, 100, -328, 442, 842, -473, 119, 917, 66, -271, 992, -704, -753, -355, -144, 307, 251, 460, 548, -265, -817, -132, 613, -223, -41, 146, -244, -612, 344, -132, -106, 19, 461, 135, -97, -293, -249]
6342b49j78L80n1j98J010n16q09O06K70m90j92L13N35o47L84j138J195j125O70
6361b30L85l80N4P40n75K47J28l74L02K54p79N4P4N62m83m18j26J79q2Q39m52
6382h1l25P29n23M25l30N44m64n67M10K4k75k30M85m34J33O34n50M29J16M53r97
6403c94P5M05o2P2n87N64r5J93K5J33p4N5l69l06J23p2m5J99O92j67n06l42M6
6426d37o2k55J031q36N25P40n52l54l15L13M19l06n87J119m77R97p01n42L01L2
6446E3k74L25J70l86q03J627j31o45m88J91O4J52J28j98J107k15l47O1n70K80
6466A01n5l31K17M45n4o36J115q62J57q32J500p55M09q61R5J68J86K1J81p29l34
6487h54J484o2p19k06K84K13K51q01N94N03l61l99J14q42J247m09n08N39j53O71
$$ y = [-249, -427, -47, -98, -296, 714, 198, -611, -5, 265, -225, -417, -104, 431, -216, 168, -970, 225, -900, -230, 155, -225, -171, 569, -6, 241, 369, -5, 297, 551, -228, -174, -100, 462, -21, -439, -565, -386, -468, 371, -81, -406, 323, -200, 225, -105, 439, -25, -592, -182, -158, -433, -663, -178, -612, -479, 155, -395, 34, 150, 603, -394, -319, 86, 24, 96, -491, 73, -22, 171, 196, 329, 255, 310, -59, -365, -242, -314, -359, -160, 532, 365, -141, -483, -437, -499, -754, 277, -559, -34, 706, 154, -200, -515, -202, 217, -89, -676, 443, -34, 963, 262, -280, 21, 53, -221, 104, 274, -112, -915, 712, 581, -64, -552, -361, -297, -145, -17, -215, 892, 677, 330, 391, -179, 101, 46, -285, -68, 377, 323, -313, 802, -60, 97, -735, 765, 10, 419, -442, -347, -179, 7, 28, 209, -520, -854, 630, 568, -151, -357, -73, 140, 391, -410, 184, 687, 326, -73, 41, -801, 446, 37, -471, 68, -85, 586]
6507E86n01j71K39r7r55J29R18Q9l98Q95j179O81j45K57L64q02R68o24o52k63
6527f61R25P48j335L49m29J548j181p39l08J280n18O42n66J09J25k48J23l9K95
6546A20l98m57L05O64j51K20n54j48O31P06r84j70P08j484O80o95K161n92j102
6565e40K42J008p41K43l20O4m0J68j3K40k65j95k66L20q2l40k77N38Q54m29j227
6586a058J629k06N7j393J008L17l53Q30l04K8q82O46j58j123L26M23R5O97N06
6605A085o83o11m9L8J50P37m3k68j146J21k4j64J421j38k68p11N46q7J09l90L48
6626b7j91J221o65k44M1o12l2R25l90p36O09N24j085M05N22nn69m50L00N86P4
6647B01J27r51K64k19J93J161l70l99j35j45l63J946j348k98L46N04L26k93j324
$$ y = [586, 85, -86, 153, 56, -899, -770, 148, 237, -161, 734, -445, 236, 91, 348, 712, -90, 878, 254, -398, -661, 264, 1012, -323, 26, -403, 1145, -36, -775, -1083, 197, -321, 321, -245, -136, -11, -259, -136, -175, 120, -278, -735, -430, 234, 83, 303, -251, -399, 232, 938, -46, -216, 492, -992, -312, -1007, 1154, 562, -540, -298, 710, -31, 212, -108, -44, -84, 84, 71, 311, 46, -149, -415, -95, -177, -517, -794, -256, 598, 169, -1058, 571, 365, 422, -971, 37, 354, 1, 831, 527, 555, -327, 319, 161, -962, -636, -213, -118, 579, 1085, 402, -209, -258, -220, -70, 667, 624, 356, -790, -669, -693, -857, 564, 426, 158, -553, -7, -94, 15, -375, -27, -218, 1003, 338, 94, 135, -477, -509, 416, 26, -710, -101, 423, -662, -257, 265, 260, -309, -759, -459, 127, 201, 328, -623, -359, -578, -385, 776, 406, 7, -128, -273, -636, 1310, -38, -336, 10, 514, 840, 547, -777]
6666g77J473j119j63J582j537m38J239m40l82J179J91p92m40m52L14P65j42M21
6684D82l01O7K43r39N47o60M81j32O84J79n17j37K26o54j37J19J108l97m3mJ14
6705C29o17p08R48k8Q15j041k41O98j56P8l5L7L9k27q50Q46P1K91k89L16j412
6726a136J095K14L50L87r20o6K83p00l6K83L6J201o79l18L8l85k30N06O84M7j047
6747c93O90m55J04k61K77L61K2k74j8M80j371O40l63Q62o50J7K58J60j06p47K05
6768e62J307j001J071r95R48q93k5J62k58R72q65J78K35o23k01L70M00p19J36
6787c63P78j59l89m92K47K89p28Q27l75O31K8j278J218l03o30J418j021Q18o06
6806i0J74M00J07j280R61l91R77p22Nq71Q42o85m4L47N06m36N26q82P0N01k55
$$ y = [-777, 696, -423, -586, 996, -541, -979, 260, -180, -562, 617, 808, 16, -424, -876, -562, 203, 61, 482, 181, 248, 491, -448, 99, -561, -80, -212, 472, 651, 134, -3, 223, -431, -568, -449, 659, 262, 219, 215, 329, -288, -996, -48, -76, 739, -302, -543, 155, -1, 77, 42, 79, 118, -109, -959, -113, -42, 249, -40, 276, -1136, -41, 173, 523, 910, -10, -76, 207, -493, -529, -246, -210, 991, 312, -6, 32, -353, -583, -77, 607, 654, -393, 297, -158, -54, -315, -38, 323, 345, 71, 53, 533, -838, -198, -561, 301, -349, -332, -74, 86, -20, -767, -562, 745, -256, 815, -180, 768, -125, -150, 12, -246, 726, -139, 39, 274, -349, -550, -180, 220, -499, -363, 415, 256, -133, -625, -378, -89, -817, 10, -365, 266, 294, -984, 234, -69, -699, 719, -302, 516, -90, 84, 484, 591, -689, 272, -119, 858, 136, 141, -730, 112, -573, -617, -270, 236, -200, 326, -556, -486, 15, -240]
6827b40J27K81K12j352J080q33Q01%N11m21j67l42k26N2N37o89M49o20R83j79
6847c6k67k55N27n84Q12O87o29j23j2M65j077L12p6P39K2P30q84n48N2J08P5Q43
6869H81p96M07j066J50J054n36M00J88L55l49j021P0j01K29K00l80Q09l90J18
6888B22j9N38j18j26j78n90L03K97r92J440j052K54Q85j148K77n63J054o83L70
6907A71p85k37R46l00N37K63p91J106j519O70J66j01N43j070J66n98M23O16J00
6926C06m66j65J83L30M37j328P74o03L8Q00q29R80L6k47J65L27q3L4l05p73L53
6947c6m10N60J86j97N01r49J588j577M04Q2k44qj074J264N56q59K84L74j017P04
6967A32k08J009q93K86n9M62j026L34l80O3L78o02o4N89o26M6R36l00n71O52q68
$$ y = [-240, -113, 168, 380, -972, 108, -725, 76, 76, 587, 166, -1, -343, -569, -517, 20, -669, -220, -840, 143, -36, -303, -558, -31, -615, 197, 884, 255, 132, 120, 585, -492, -180, -256, 483, 505, 1235, 351, -197, -145, -37, 38, 881, 85, 492, -574, -424, 630, 94, 494, 682, 1037, 688, -333, -263, -364, -135, 65, -315, 494, 104, 222, 203, 741, 623, 497, 319, -271, 32, 329, -663, 777, -275, -21, 864, -284, -7, -570, 484, -199, 171, -614, -851, 95, -205, 332, 595, -196, 910, -609, 61, 227, 126, 669, -401, -235, -833, -410, 206, 306, -160, -325, -142, 188, 625, -703, 71, -532, -494, 306, -523, 457, 493, 246, 411, 738, 655, 689, 384, -389, -36, -446, 114, 300, 103, 604, -345, 1243, -334, 70, 152, -92, -100, -1174, 90, 646, -213, 71, 445, -572, 132, -76, 933, 40, 326, 267, 729, -297, 37, -343, -280, 98, -504, -568, 21, -605, -559, 377, 77, -494, 158, -710]
6988g10Q33k2m25L25N55J94j186K11L52M40k35n69n14O63K61q87J161o5r3j309
7008a020J049k14L87n31J83O10N86j540m54O0O54O48p29m56O87N74l94K86o20
7027b34N16q5p93L52M9L82M37q97J135m10o21O99j31j160M89j72N48O64j235N13
7047D6L18p76J18J44J399j595L54M32o41m17J189K16j349L33j168J702q29k8N18
7066c4p05P56J00j143J201k18L85l00l06P31j39k89k08n34M25J39J39M67l53l33
7086b19P96L91j364J162k71k2m04m20K18J84K05r82O5N29J36J10m65J044p36j0
7106e3m77L90N92q63Q12J60j615K046p58l22J00k05K01M95l96j54K50M56k91k65
7126A03n37M83O71p37m00m1N71j51J3O39j45k40k6q2p98J63J325j158J00r0M30
$$ y = [-710, 123, 101, -324, 1, 556, 750, -436, -225, 127, 567, 332, -237, -751, -88, 173, -714, 447, 382, 289, -1020, 29, -185, 202, -329, -146, 464, 1050, -490, -944, -884, -230, 418, -311, -767, -80, 494, 100, 386, -234, 282, 197, -596, -244, -195, 187, 624, -273, 862, 452, -169, 530, 399, -761, -272, -444, 104, 768, -467, 46, 364, -412, -294, -150, 1249, -346, 8, 440, -201, -618, 571, 787, -562, -229, -1397, 305, -524, -552, -34, -739, 17, 117, -1026, 175, -43, 342, 42, -264, 467, 328, 39, -169, -703, -278, -139, 0, 467, 114, -219, 577, 968, -396, 766, 495, 473, 69, -351, -133, 51, 256, -726, -661, -132, 4, 114, -351, 693, -43, -53, -530, -140, 452, -411, 401, 561, -1054, 992, 234, -88, 12, -193, 8, 503, 107, -47, 203, 659, 368, 103, -434, 49, 720, -17, -417, -458, 113, -38, -25, 614, 469, 229, 203, 121, -677, -514, 811, -347, -247, -337, 93]
7147I3n38R7k83J583j165M96J58l99j619J929O11p44p18K16P20J34k60n19L46
7166A38N30k43m62n19Q33r62R13L90j73n32K23n59l9J8P98k61o34P68j54l30K72
7187A5n77K5J103p02P3J016j208O60j229J039J6p95J165n32J74J41m68N99m56
7206E9n91J45m19Q53k71P27l04n93J31N03j085J663j264M3P0O92l14K82m11L30
7226B46j040M66m68M38M38m33J64M00p02K42L5P66p49l5K48M71r41O01J39O80
7246I66j014k57q5K69l30J99P67j002N78j108J115q4k73l38J67J183j441Q13K10
7265C35m05N19q12N55O93q19K14k21M45n88m35K56N20m72J99n58N1N48j35R64
7285H54m36p3K22k73n61K35m54J391j787J77N87Q36q84j10k15Q20j01J9j417N25
$$ y = [93, -445, -348, -631, 952, -213, 283, 441, 42, -1577, 352, 963, 219, -499, -283, 437, 571, 311, -208, 138, 668, 425, -37, -556, 277, -685, 228, 618, 445, -87, 136, -423, -462, -444, 354, 93, -541, 227, 73, -257, 15, -562, -537, 566, -136, -63, 953, -255, 405, -824, 215, 231, -564, 601, 69, 243, 384, -84, 515, 59, -532, -387, -806, 47, -224, 503, 199, -394, -263, 240, -845, 818, -446, -403, -333, 359, 45, 327, -84, 246, -794, -328, -796, -358, 80, -353, -189, 211, -491, -249, -214, 552, -197, -232, 16, 487, -454, 147, 286, 966, -48, -305, -390, -121, -451, -252, 515, -487, 91, -1017, 98, 14, -259, -597, -430, 753, -688, 125, 335, -70, 449, -363, 192, 885, 66, 280, 59, 504, -84, -519, -263, 257, -215, -16, -574, -523, 25, -110, 854, 418, 345, 567, 294, -267, -32, -486, 905, -882, -705, -118, 718, -166, -276, -491, 329, 228, 247, -1170, -645]
7305f45J243r60k18J50P25o24R72j224j87k53P17J002q16J36M63p62M67n32P02
7324C56r1o82P89m45l64qM32R73q73n84M10n78n8N57J30K79R5n00m0K11l48J033
7346F94l53k41j47N25j00l17o68R84j32p51M56n72J288r33j74K33K88J75k58L
7366@k02P52k77m42O11n84o71Q07P74L50j931P92j18j17j41N40K54m0p28N11P6
7387B16l43p38K079n80j370P30p6oj14L23n32j52J490j420j76N58J97r88J438
7406E36n63M31j49k76o43J453q99M76n21K25L67q57J44l63L67l9R92j55r08O60
7426B78o49k64K32P38p77N18j32j64j51L51L76m97N8j33O16J63q48j21n7j3P81
7447C05J70q24L96r7Q00j272K099j792N93O2j43p11p2R21q54Q50k05L87j086M05
$$ y = [-645, 598, -362, -580, -430, 295, -329, 643, -581, -768, -1021, -304, 698, -118, 18, 481, -281, 186, -346, 356, 265, -417, 372, -73, -437, -445, -13, 960, 87, -497, -87, -665, -723, -166, -36, 243, 338, -162, -202, 9, -339, 694, 341, 100, -47, 478, 378, 61, -607, 377, 245, -506, -50, -622, 666, -267, -441, -208, 80, 255, -3, 0, -202, 550, 273, -169, 442, -142, -813, -6, 768, 1118, -813, -21, -139, -256, -397, 143, 397, 357, -371, 140, 216, -127, -865, 1214, 634, -736, -6, -82, -88, -202, 121, -411, -563, 927, -493, -669, -111, 86, -902, 536, -27, 404, 255, -21, -664, 789, -110, 366, -155, 70, 437, -420, -276, -639, -272, -311, 681, 526, -382, 278, -371, -635, -403, 335, -442, 76, -56, -220, -371, -20, 356, -141, -83, -216, 400, 563, -285, -406, -463, -476, 305, 475, -349, 47, -50, 750, -522, 1577, -215, 378, 440, 297, -414, -486, 435, -419, 431, 226, 613, -473, -68]
7467f8k51O99m07K30kJ58o86M4j84J460j157L35L2j69J56R7o3j2k9n71R06p65
7489b47J26K46l31O27o53j78q53J757j83m31n18J045p17L80O31M2l30j211P82
7508a6P00p41m98R34Q52j617K07O57q62Q57j419J151q03n62Q30J02K56p2Q88j183
7528c39K94p29J253j036M44n78N42K54N83q61l38R87pK14j41j76n40J153r86o6
7548g3P49j375k89J661o09L89q19O09M16j432Q89L34l62o2p9k66Q18l05K15m54
7568d5K13K17k21L89r6m40m30P59j58m56P65J10k24n96M36j38k77L54L7q02N83
7589b0l52J008j680L78K27l64J482p53K73p04P82L31j39n43M57j251J039O30n2
7608G49n66J90l22j36O67o59Q89m44l80M94J46j056O22p35J10J044m86k8R22o15
$$ y = [-68, -319, 380, -27, 203, 201, 359, -327, -283, -467, 993, -164, 171, 203, 34, 190, 287, 224, 212, 183, -388, 518, -247, -121, 125, -206, 421, -232, -410, -1263, 494, 311, -120, -638, 407, -310, 70, 701, 743, 413, -798, -16, 684, -57, -555, 379, 1231, -386, -179, 478, -384, 473, -946, 205, -598, -1160, -330, -228, 28, -44, 844, -339, -45, -774, 479, -557, -113, -691, -149, 105, 688, -173, -511, 476, 469, 683, 542, 366, -174, 979, -7, -73, 676, -699, -988, 673, 64, 453, -366, 243, 659, -773, 116, 450, 88, 26, -53, -319, 499, 194, 409, -45, 168, 385, 164, 553, 457, 17, -413, 346, 188, -268, 497, 607, 383, -213, 223, 85, -192, 162, 199, -603, -20, -372, 636, -1044, -666, -439, -803, 679, -74, 199, -505, 277, 608, 469, -74, 383, -868, 171, 801, 749, 183, 373, 51, -85, 582, -77, 812, 368, -12, 482, 628, -428, 194, -541, -431, 613, 127, 99, 1021, 406]
7628D06j149O8J315k36K73j70n60K92n7o2l34p3J32K06q06P26n67J116l16M22
7648F26p97K76J49R0o24J030L75j132J327j400M07q12Q01p16o34R90N70l30O6
7667B62On0j41r43R93j86q40L55o66J825n74j71J13M27N57j292K64l3J39M61n56
7688e0O4n67J128p72J062j21k20o14J006p12r2k9M6M44p04J35R8L47m82o64M55
7709b42J65N20o31O27l88k34QK23N66j236N74K45K03k09L05o68K30n66J242p4
7729F60k24p39n1J9O97k97p59R39k03l21M34K25p02P78l1l60q55R60q00n0N84
7750i6P17N5j11j174L75J54P26k97j99N9o86K26J53j8j86l63J89L31R29j294J285
7771G75p64j39m82L53P9p74R66M8j02l93p8M89j33k24m34P57P83m79o88L53N3
$$ y = [406, -743, -675, 640, 404, 677, 507, -53, 239, 182, 120, -214, -287, -155, 51, -755, -29, -596, 520, 204, 626, -171, 105, 254, 344, -280, 750, 1125, -7, 1320, -80, 327, -485, 316, -400, -1034, -44, 526, 196, 262, 268, 218, 77, -866, 127, -59, -899, -544, -1210, 615, 41, -130, -17, 410, 967, -325, -61, -94, 45, 506, -50, 14, -553, 575, -197, 865, 744, 524, -90, 916, 204, 112, 83, 129, 573, -131, 4, 102, 449, -33, -697, -242, -77, 443, -188, 439, 51, -183, -175, 48, 614, -622, -48, 197, 400, 191, 496, -172, 58, -508, 734, 660, 436, -303, -354, -335, 362, 65, -694, 245, 42, -279, 155, 380, -322, 456, 425, 65, -790, 170, -630, -680, -96, 621, 676, 565, -609, -234, -80, 646, 349, 150, 209, -477, -251, -98, -116, -302, -665, -476, -145, 784, -510, 775, 11, -128, -610, -257, -178, -952, 14, 62, -40, -433, -511, -22, -155, -379, -813, -56, 727, 248, -440, -87, -34]
7792c4J65P3q54M79N62k18M62p07k01m09O54K4j41M07n03P04j078R22m96J93l75
7813c71J94J81N05o32l44J38L63L93o18o3K85q94R03K3k17J68k6o90J86m1J165
7834F08o94L88n47L61k17O2j36Q40L9q82K19J33l32J79p23J67Q42p55N95N09l13
7855C43m73J47N6m13M96l5k47K11k50N3k35O80m40n82J038L7m20r31L65k15M35
7876c80J57j2Q64n94N91l07J25k95p54P85k13r17R81j074J153j47Q2O03n48k46
7896a46n46O74j28K31o97j3J465k29m10k31q4j16L20o09M35K65l25J064j049L46
7916B17P1j32J57q14J290o77o65O8j1K88N77m89NL01q68Q04q70P95J9j43n43J50
7938d70R48o49K41l08P1J31N84q44R67o74l49O80r22R43m52J252k106N11J47J199
$$ y = [-34, 131, 204, -650, -171, 391, 173, 635, -72, -273, -682, -28, -4, -145, 262, -241, 463, -615, 307, -189, 4, -371, -177, 4, 509, -123, -467, -329, 34, 427, -191, -254, 31, -863, 40, 63, -154, 14, -12, -702, -516, -557, 608, -86, 302, -245, 116, -101, -39, -175, 665, 704, -178, 41, 174, -158, 21, -702, -535, 307, -448, 147, 656, 343, -130, 17, 73, -340, 156, 121, -126, 85, -165, -112, -347, 333, -107, -689, 349, 386, -34, -965, -600, -815, -380, -223, -235, 629, 35, 626, 319, 444, 149, -605, 180, -33, -950, 31, -1043, 110, -37, 45, 648, 100, -146, -692, -18, -146, 85, -612, -625, 840, 611, 201, -30, -114, -230, 90, -519, -84, 181, -144, 920, -129, 217, 288, 156, 313, -501, 789, 112, -553, -485, -496, -208, 369, -120, -115, 186, -682, 122, -748, 47, 66, -77, -620, -470, 478, -171, 70, -238, -167, -36, 548, -296, 671, -3, -352, 328, -594, 349, -103, 1149, -957, -446, -299, 900]
7958I00p62J3m46K87M36p52N25j68k78J37M96l25n41J362r6p84rl17J074q51n92
7979f91K95N51K21n10k3k22j54J289j076J82O95j249q4J498m06k31m65OM52o93
7999f15J701j212N61p2j157R57m9L52q96M19k32J53k13Q10k60o14O94N86j694
8018g81Q79M49j20o69O94p8j42n43K74NL7M59o69N56k62Q66j50l94q94K51N28
8039B96l48K22l3k3p81Q53j65k02kL21q03K68P7P57n31P0M28o40j8R4J027o24
8061B43n18M53K20k08K71r59J893j327n13N49l24O09o41O7n7j15R1R8M0j47r4
8082c69J93O38o07k52N26P42q67K27q33J487j179P2o7O89k30l97O04M72k58j321
8102g30J353L69j532R47k3m60k13M84P43k281K067l00q03J86m22M40N7j25J45
$$ y = [900, 138, 151, -295, -8, 428, -324, 201, 33, -245, -108, 388, 63, -478, 884, 788, 4, -5, -322, 752, -99, -691, -396, 155, 376, -134, -157, -379, -533, 756, -320, -138, 557, -692, -776, 722, 316, 85, -380, -374, 78, -615, 1086, -126, 435, 363, -794, 163, 114, 466, -430, -11, -243, -90, -303, 507, 247, -367, 327, 913, -781, 98, 547, 427, -242, 452, 374, 232, -311, -37, -32, 5, 464, -205, 351, 89, 955, 805, 411, -483, -232, 296, -52, 170, 137, 114, -667, 186, 21, -181, -183, 138, -665, -397, -320, 437, -94, -24, 404, -236, -254, -160, 867, 243, -275, 178, 398, 190, 461, -498, 1395, 68, -445, 104, -220, 389, -252, -185, -242, -357, -266, -168, -128, -275, -369, -176, 462, -145, -397, 129, 871, 4, 231, -602, 885, -294, -222, -289, 400, 170, -227, 377, 849, 591, -730, 623, 992, -540, 407, 384, -76, -289, 195, 938, -1343, 724, 424, -379, -193, -615, -175, -118, -243, -98]
8121i8O23oJ12j536J218k5j19M49O7k4P91j706Q68l2k63m86k21M95m1k53j46L33
8143@o06R60j2J15p45K92K87o31M88r29J224n96k93J442j515O77j255J748j574
8162i23J026m84L38ol3j72M97N22k53l83o43Q12j96p0J093j337O89o83k09O92
8182B77o66O37j075J127K16K76p51j49N67
$$ y = [-98, 525, 519, 631, -905, 313, 288, 169, 618, 685, 661, 1452, -254, 614, 582, 319, -167, -388, 107, 66, -187, -333, 0, -606, 354, 342, 457, -288, 4, 291, -340, 148, -781, 443, -153, -446, 996, -519, 158, -1097, 651, -923, 103, -381, -43, -49, -82, -254, 243, 765, 512, 129, -514, 298, 102, 32, 1125, -212, 477, -206, -415, 277, -389, 248, -827, 300, 516, 792, 41, -108, 459]
8191D59
$$ Imaginary data points
##PAGE= N=2
##DATA TABLE= (X++(I..I)), XYDATA
0dMK4l0KMM2j19J48j29J22j65K56l21L30l49M22n38O41p02P65q86J052j203J334
24G00j469J645j878K123k358K613k923L292l703M135m611N189n882O690p612Q704
40D655j0027J1533j2800J0808L6604N98956o08304n94588R51857j46736p70206
51e28248O52387L05458q49218K91733O09505o75162j41377P41392l58979m60135
61d12644O38846J9425o20864L86247L34665n78565N6157N12208l85595k36080
71b86200N16821j04559m24142L67911J65579m51921J29879L46487l42282j10981
81a93408L95277j48516k81602L20247O3649l41090J55964K21003k85695k6222
91a20393K82568j53797j63745K44754q43k24489J38572J19491j97778Q921J72908
$$ y = [-4, 0, 24, -6, -4, 0, 42, -77, 71, -58, 64, -101, 155, -166, 164, -185, 237, -301, 340, -362, 403, -483, 569, -634, 700, -769, 876, -1002, 1121, -1237, 1376, -1547, 1745, -1958, 2177, -2434, 2755, -3127, 3563, -4049, 4655, -5372, 6161, -6639, 4169, 40773, 639729, 31425, -563163, 388694, 241958, -528248, 124139, 429597, -419621, -127888, 481617, -193545, -334922, 406470, 47491, -412644, 226202, 245627, -375237, 11010, 345675, -232890, -176733, 335475, -50120, -286200, 230621, 126062, -298080, 69831, 235410, -216511, -86632, 259855, -82427, -193408, 201869, 53353, -228249, 91998, 155647, -185443, -29479, 191524, -94171, -120393, 162175, 8378, -155367, 89387, 88544, -135945, 2627, 122118, -75660, -66739, 106169]
102A06169j08294r3402J50004J085j34413P0421Q4105j06429k5386J15669l3896
113B5633r7021Q3001N6396j18606P373J22051q0530q1110J37191k31j47960R7163
125C350R3369j65687J2452J67372j27113q6952J91694m2901j68786J61117O1724
136I9639k07042Q0479J53360j88415k3493K05266j16946j24659K02931j6453j89593
147a24926J45297Q8222k02261N1983J61874j60848n1781J94693q0462j35898J69397
158E5290K0255j80662J02041J08357j74016J0881J64601j20746q3088J77239l8134
169D2018j50251J39912N3399j74953O6386J29072j56036k0306J70491r8210j00962
180i9440J67684j7941j52674J24062O4118j66319N2855J26349j40332k4913J54004
$$ y = [106169, -2125, -95527, 54477, 55562, -78851, -8430, 75675, -30754, -56140, 59529, 25633, -71388, 11613, 68009, -50597, -43224, 78827, -1703, -82813, 54378, 54147, -93813, 3350, 96719, -68968, -56516, 110856, -16257, -103209, 88485, 45584, -123202, 37915, 99639, -107403, -26924, 126436, -61979, -85472, 119794, 2848, -121811, 81120, 64667, -124926, 20371, 108593, -93668, -41685, 120189, -40659, -92440, 102253, 21791, -114107, 55290, 75545, -105117, -3076, 105281, -68735, -57854, 106747, -13999, -97087, 80152, 42018, -108233, 31679, 85078, -89875, -23489, 105583, -50453, -70759, 99732, 1522, -99440, 68244, 50303, -102371, 21691, 85809, -80510, -27655, 98694, -41638, -66551, 87453]
191H7453q3764r1207J44119j1526j31483J01909N7621j38030M0726J03534j10211
202c0859k3340J20831o1466p2562J07461l267r9281O9451M6248r6070K1711P5251
214E4108p0555k2527P8840l1314n2421O4271N474o0525L2801L4994n1167J036
226a6985M3316k7733k1716L7809k884l2063K0524J6873k6602j484K5641j1213
238C483j9424K1760O297k4267O554K1500j9676r766K5112m137k3660J9263J1667
251A4706k8000M699K6240k0456j3370K9657n010k6842K4178J0234l1504R687K5284
264A9503k6504r807L3685j1943k6187L0399O003l5166J7359K5048l4817j827L8043
277B3789k5669k1135M1573p090l6628L2555J2552m2132J7501L0951m0896k037
$$ y = [87453, 3689, -87518, 56601, 45075, -86408, 15501, 73122, -64908, -24182, 79352, -30859, -54199, 66632, 5166, -67396, 40065, 36798, -62483, 6968, 53216, -42854, -21143, 54108, -16447, -38974, 39866, 8552, -43869, 20402, 25876, -34649, -1848, 33146, -18021, -16985, 26331, -1402, -23118, 14691, 11807, -20256, 268, 17141, -9461, -10945, 14696, 3483, -15941, 5819, 12116, -12151, -5597, 15903, -3773, -13539, 11573, 7436, -16224, 3039, 14706, -13294, -8595, 17645, -2811, -16181, 13476, 8466, -18376, 5802, 16036, -15468, -5781, 19503, -7001, -16808, 16877, 4934, -21253, 9146, 15149, -20017, -2658, 22390, -12427, -14254, 23789, -1880, -23015, 18558, 11468, -25160, 7395, 19947, -22185, -4684, 26267, -14629, -16666]
289a6666M1869k7069k3331M5519r070l9648L8293J1907m7722K3027L1403m6136
301a7624K003M3996l3934j9783M8277j5982l6055M2753O986m8727K9835K5693
313B7438m8556J0530M0486m0511j1954M8159k2351l0228M3598r46m2246L0881
325D300J8919m3380J2312L3296l5337p519L8967j9624k3436L5351k172l3043K3415
338B049J6549l3125O455K7231k3798j0664K9138q965k2616K3278P876k7393J0421
351c564K0638k4721l025K5732j4462j6036K4700k53k2754J6179R074k1444N198
364d738J7612j6968m880J7311o875j0605J3051J95j0235O278M944q538J258M214
378B024j344k202Q27J866k48l474K142N775q476j283J1880p199r068J5219j856
$$ y = [-16666, 25203, -1866, -25197, 20322, 11252, -28396, 9897, 21804, -25918, -2891, 28512, -17624, -15621, 28375, -5559, -25342, 22935, 6953, -29102, 13651, 20637, -28090, 1745, 27438, -21118, -10588, 29898, -10613, -22567, 25592, 3241, -26987, 16611, 15665, -26581, 4300, 23219, -20161, -7849, 25447, -9890, -17409, 21558, 1934, -21502, 13849, 11677, -21366, 2049, 18598, -14527, -8072, 19159, -4639, -15303, 13835, 4870, -17746, 5532, 13408, -13985, -3564, 17074, -7647, -10672, 15060, 598, -15438, 9262, 9009, -13745, 2434, 11508, -9936, -4738, 12874, -4094, -8974, 8337, 1462, -9143, 3908, 4103, -6132, 146, 5090, -3448, -2190, 2024, 680, -1522, -695, 1171, 923, -2551, -409, 5366, -3110, -4393, 7487, 288, -8780, 6439, 4583]
393D583j6321J3743R294k2632P407J9250k1730m713K6277j3407j9225K9021j908
406I639k7927K1827J3046l1158R018K6612l0010n245L3466j8895j8172K9020o44
419A0577l0409K3971J2863l2970R966K5865k6785o711L0820j4886k0501K8935
431A0735L05k7956J8371J4569k8835N196K4909k2070q316K6845j0569j9703K4393
444G874K614k6357J5444J4466k5407M079K3218j9475r763K5722q291k0066K3110
457G168K260k3615J4638J3649k4695M325K0693j9035n512K2329j0768j2590J8600
470G447j784j7077J3541P926j9350O929J1414j3164r14J3799r047o843J3047l762
484B162r184J0229Q16q994N492M182q399J707N289m111j201M664k713j764L418
$$ y = [4583, -11738, 2005, 11299, -11333, -3926, 15324, -6406, -11119, 15158, 1751, -17474, 11547, 9639, -18288, 3539, 16585, -14573, -5555, 21057, -8953, -14198, 19268, 373, -17799, 11221, 10577, -19832, 4139, 17002, -15968, -6002, 19863, -6922, -13633, 17187, 2301, -18200, 10735, 11040, -16916, 1455, 16024, -12811, -7615, 17294, -4776, -13092, 13753, 3184, -16519, 7874, 10488, -15869, -425, 14041, -11366, -7287, 15931, -3544, -13307, 12415, 4124, -15942, 7168, 9428, -14187, 451, 14100, -10595, -6270, 14423, -4612, -10124, 12205, 1437, -11153, 7447, 5663, -11414, 2127, 10053, -9297, -2368, 9046, -4118, -5032, 8767, -280, -7123, 5924, 2162, -7022, 3207, 4023, -4971, 521, 4703, -3696, -1989, 3300, -811, -2012, 2652, -61, -1825, 1593]
499A593j541K90j93m10n28P48n80j55K261k610q87L508j458j922L443k34m618
516c293M458P70m747K795L034m769q72O417m045l855O789r57o693N118M819r822
532d853K587Q073p350l813J0178k965p728Q815J347j1020O963O845j1382k0J1786
547G463q917n684J3481k602j2671J2219L434j4317O197J0585j3714r98J4028r624
561a120p183J5171l702j2034J2007L758j5249O717R227j2031l95J2256q360o969
575g907J4078l443j0167J0819J536j0990N719O633r417q33R353n694m232P310
589B765m99o322N253K232p046L331L722n881O8N109l137k704M646p27k888K392
605C14J250l921J668K203k137k08K352j603j103K463j691m21J228k45o99K019
$$ y = [1593, 52, 342, 149, -261, -789, -41, -621, -776, 1485, -1125, -2012, 1496, 38, -1884, 1559, 1325, -3293, 1165, 1935, -2812, -17, 3017, -1752, -2624, 3793, -252, -4107, 2682, 1725, -4968, 150, 4969, -4853, -2266, 5807, -1543, -5356, 4822, 1857, -5871, 2944, 4291, -6729, 234, 7079, -4303, -4323, 7463, -1454, -7138, 6343, 3741, -8930, 3289, 6723, -7594, -1397, 9188, -4526, -5524, 8504, -1120, -8303, 6868, 3166, -8868, 3139, 6897, -8352, -1635, 7592, -4439, -4834, 7422, -938, -7907, 6171, 2728, -7439, 3380, 4916, -6074, -355, 6278, -3139, -3972, 5381, -313, -4545, 2765, 2266, -4056, 1197, 3429, -3617, -286, 3436, -2445, -2377, 2732, -405, -3109, 1537, 810, -2078, 314, 1564, -2357, -689, 1514, -623, -831, 1521, -82, -1185, 1278, -413, -834, 394, 149, -550, 1469]
621A469r14k035K563m41j986J210J249k067J006K488m734O13L749k484j095M228
637B819k568l495N004J63n941N531J686o613K590M671n741q14O663m467k693O836
653C631k327o084O633N43o580M224L698o422J339N268n150j296N287l556l488
668d280O353j82m938M014R24m071N91L423l465J297K403j987j329K276n07k231
684a709K115M12j837L62K579l163q3L093j401j340J686n30q83J264p19p29J930
701A047M29k165L56J503j853m33J598q57o26J753p51r89K005n23j533P78R26k631
719a966J573J845k883J380K040k613j002L879k253k408L378o23k035K872M33l476
735a859K156K263n163J816L015k352k304N210j900l641M149p25l037L057P28l606
$$ y = [1469, 555, -1480, 1083, 642, -1344, -134, 1115, -952, 54, 2542, -2192, -1579, 2170, -314, -1409, 2819, 251, -3244, 1760, 1923, -4018, 1513, 3199, -3414, -824, 3847, -1894, -2708, 3955, -512, -3205, 3631, 1304, -4780, 1853, 2396, -4184, 40, 3738, -2684, -1345, 3923, -1227, -2523, 2764, -792, -4280, 2073, 1891, -3047, 967, 1891, -2180, -1589, 1834, -1631, -334, 2069, 82, -1247, 1029, 522, -1709, 406, 818, -1019, -657, 1922, -1241, -1324, 1769, 368, -972, 714, 184, -699, 565, -154, -883, 1047, 1476, -689, -333, 1170, -683, -1116, 482, -375, -1001, 752, 1, -988, 1017, 494, -1039, -261, 665, -1966, -393, 1452, -1431, -51, 1989, -624, -1626, 2253, 0, -2408, 970, 347, -1688, 1184, 1617, -1859, 297, 2560, -2603, -787, 2228, -124, -2428, 2782, 882, -2759, 1390, 665, -2372, 685, 1413, -2193]
751b193K190K210m131N07M308l434j892M050q50k918K938J57k724J119K819k589
767d33J64J554k164n25K834r57k163J736J700k054l3K243l517j03L179j690j069
784a298K363p53k449J563J858k685N10K108j308r62J976r80j596J791J017k108
800i53M57J741k327O24J027o49k38Q15r35L65M26q02J12Q87k44l27l63L35k20
819b69N80M4p97J839k037Q98N8k33M83m02q71M59J106J90k017J316R06k278M37
838e88J620j610m34J242O98j877J777M15k086R12J233k601P49J841j573l47K009
855A380r34k214K284J84k612J659K122j674o77K119j381k100K515l0j969J614
871B86J42j393P67J665k057n76K533r61k420K699k6j280p5K217k530M63J591q23
$$ y = [-2193, -3, 2207, -1924, -1417, 2891, -543, -2435, 1615, 765, -2153, 785, 942, -1782, -663, 2156, -433, -269, 1285, -879, -1404, 1430, 473, -1690, 46, 1746, -308, -341, 1902, -1615, -1718, 1461, -229, -1298, 1065, 312, -2137, -574, 1284, -1401, -891, 1217, -91, -1053, 923, -57, -1653, 138, 1155, -953, -496, 1245, -1082, -458, 569, -80, -318, 497, -438, -73, 353, -449, -337, 550, 306, -21, -384, -49, -269, 311, 355, -442, 1397, -640, 258, 316, 83, 566, 164, -707, -248, 858, 1048, -969, 347, 1253, -1025, -588, 1032, -578, -1012, 230, 928, -949, 828, 1243, -843, 69, 1302, -1299, -550, 1291, -282, -629, 1380, 446, -1768, 516, 700, -1912, -253, 1869, 195, -482, 1637, 256, -1844, 671, 641, -1328, 286, 428, -965, -198, 1467, -590, -1166, 1367, 406, -2014, 685, 659, -621, -696, 1521, -1009, -546, 1045, 222]
889B22j377J584n77j381K731q23j774J732k97r22N89O41o46l37J758k94j808N65
907d14P52j141m80J985j401m84J765r41m17J038M29q39L58R40k127P42O14l50
925B9n24J005o7j019RO41J11o8j13J41o16M37O44q22O21n01P22j250M87N62r30
946e01K13J62p17J192k54j140L41j47K47N46J142j556m27L28N28K70j031R58p80
965f26J92Q09K11q28J46L33L11n97l77R12o44J91K10o80M8P36m3q34Q93o43J16
986a64Q4K92n82L15j11m84J04J053j221P46O62r56P12n57o0j204K157k94j416
1005i24K274j496j37k9R28j156n2J100r70r63K133j078L38Q57n69j114Q11J278
1023A231k076O92M22n52k82J125j43p34M54M4m09K70l17O18j55M24kp69L5K09
$$ y = [222, -1155, 429, -148, -1529, 1202, 379, -1395, 337, 40, -882, -293, 348, -298, -635, 1123, 829, -979, -414, 338, -803, -1283, 702, -699, -1183, 582, -359, -776, 262, 691, -148, 210, 1150, -977, -235, 379, 29, -495, 510, 443, -576, -567, 74, 185, 117, 4, 145, -471, -34, 610, -212, 409, -92, 630, -620, -133, 429, -501, -288, -126, -843, 349, 95, -1045, -704, -851, -604, -58, 1084, -472, -899, -571, -43, 227, -804, 154, -626, -434, 375, 586, -242, -96, 237, 548, -49, -426, 486, -158, 33, 243, -437, -389, 347, 304, -530, 363, -280, -164, -80, 212, -370, -55, -166, -650, -546, 507, -714, 32, 694, -262, 450, -107, -167, -1371, 786, 492, -924, 1350, -146, -283, -312, 616, -540, -592, 508, -462, -1425, 708, -370, -32, 825, 256, -858, -47, 1231, -845, -153, 269, -283, -565, 560, 417, -317, 137, 181, -228, 42, -275, 343, 188, 612, 610, -159, -124, 85]
1043H5j119J144O57l95p89O73J62m57l05K24r15J388m87r2j95J79j53p58J360
1062B07K28j51n34L26n93P50m37k1K58L02j386J061n57P7p6J80q4O05R20j724
1082f49M93m51P2L18P1N28p39K2j57J350j070R7O82k24M03q08L76k53j430J644
1102B75m57r93J394j10o31o57J833q01j25P09L65q05m91p34J411l94J23J32O9
1121A13o91N48j38j24Q16q56M51j16j69r9L70p93O9Q09n99L61K75j2q70M90O48
1142D83j7l95l83j1K89K4K69n35M90O73o65N61r99l84M44l61P51p41o4K52L02
1163a7L14p15L4Q31P5j464Q28j65l63J043j111O16l70J583j726J033L01m77O78
1182I28j042k72j36M12J80N70j158O12J9O19n81o72N24k90q5O27n64N00o88M25
$$ y = [85, -1034, 110, 767, 372, -417, 256, 418, -39, -344, -120, -1035, 353, -134, -226, -421, -242, -395, -1153, 207, 435, 284, -250, 76, -517, 233, -204, -225, 33, 335, -1051, 10, -547, -470, -546, -366, -450, 155, 1075, -649, -156, -607, -535, -217, -146, 382, -357, -335, -492, 858, -212, -115, 567, 343, 746, -62, 314, 61, -1369, 275, -182, -1175, 219, 109, -522, -1179, 654, -147, -272, 437, 802, -3, -494, -1228, 183, -211, -88, 44, 113, -578, -30, -168, -292, 524, -332, 119, 3, -166, -265, 105, -688, -619, 190, -409, -48, 227, 215, -655, -165, 483, 466, 71, -312, -323, -34, -10, 259, -276, 214, 887, 222, 783, -216, -600, -156, -517, 234, -507, -571, -319, -17, 297, -418, -384, 447, 522, -942, -114, -279, -642, 401, -710, -94, -464, 1119, -607, 426, 727, 250, 928, -114, -386, -522, -110, 70, 640, -518, 94, 113, 732, 151, -521, 3, -287, -372, 255, -309, 191, -497, -72]
1202g2K24j03k83K65lq89K76Q46L8p39j80K8O21k40M40j171J248J7q22k71J382
1223F12m61m44l9M96r3K48j308J283l6m67L75l08L91j308J381n73k26P85p94M95
1243IK8r41P10K70m20j54N33M72q15RJ380n04j082K151j685R8J31o37P99k55j26
1264b9k70J65L41J52k52o43N87k59N6k37K91N6P18m66K64M0j179k9R59m02p84
1285i21P52K64l57J0o70O49M73q66M65MO26J86p01j48n7q7K59J04n4j92P2P43
1307E54q25m15L14j12J125k84q66J003j527R56pJ94l6k07j43M39o83P96L32J56
1327G64j421J301k58R5o25J66l94n33P36O3k51N77p8o40N67l68R26r89P66o50
1347b46l9N62J36q55J114m50l05l08O1M50n7N14M67q62J35p1j136R63m62O12l74
$$ y = [-72, 152, 49, -234, 31, 28, -861, -585, 261, 299, -440, -620, -592, 29, -211, 229, -942, 306, 323, -499, -770, 612, 151, -293, -332, 164, 71, 319, -989, 294, 258, -209, 166, -142, 249, -1059, 322, -251, -477, 308, -486, 9, 37, -904, -194, 76, -344, -498, 35, 507, -308, -299, 1081, 577, -505, 1646, -39, 59, 190, -447, 352, 97, -29, -299, -134, 207, 359, 107, -536, 51, -208, -152, -389, -98, -42, 676, 210, 474, 514, -665, -694, 265, -137, -921, -169, 95, -262, -252, -922, -273, 200, -666, -201, -197, 429, 615, -86, -234, -291, -378, -119, -15, -69, -261, -189, 554, -271, -686, -372, -484, 641, 357, -509, 494, -1033, -77, -84, 110, 74, -133, -276, 163, -520, 276, 608, 764, -657, 644, 386, 481, -144, 22, -372, -905, -169, -106, -357, 220, 142, -498, 69, -299, 627, -362, 404, -246, -285, 277, 413, -442, 672, 222, -83, -391, -330, 120, 63, 577, 1044, 182, 317, 246, -890, 73, -389, 223, -151]
1368a51N66J77j76j122M7J142j088J351l91J1k19q97Q47M93j067N11k8o23R50
1387C33m16o01R10r68L53K09j24M66M75j402M02j35O02l65L64K00p47N8O03m49
1407b32M47j339K147k93q13J44M28l59j416J430m99L42K9M34p15P82r71J287p41
1426I2ro68J374r25k50K32k04R35k48k62l83J634r75p69J286j153J44k22k10J004
1446D23n22n4Q70j089M78r8r23j91J342j071J452R2j085K63o7j016J484r50J166
1465E04L72j376P45n84P47p8o74N91P4m55j7J57j70p31J043k28m65N43J04m21
1485c19K78j8J85J2l74o20M37k26N98q12J245n9l94Q3j18m26l93O67J151n38r02
1506e43K80r2K90n50O57M2K16n30J054j64k13p42K70L14l3R26j559M9R37j317
$$ y = [-151, 415, 592, 416, -706, -659, 483, -605, 746, 355, 366, 147, -750, 97, 590, -477, 34, 6, -617, 333, -83, -684, 226, -742, -389, -180, -304, 162, 637, -765, -363, -498, 104, -261, 103, 303, -444, -386, 217, -232, 215, -1124, 1023, 730, -83, 61, 489, 130, -1286, 144, -355, -13, 16, 450, -265, 517, -454, 833, 92, 83, -585, 789, -136, -386, -154, -358, 577, 329, 67, -316, 1318, 343, -426, 860, -293, -149, -371, -581, 423, -99, -153, 717, -372, 106, 8, -915, -1106, 236, -835, 617, 709, -376, -113, -180, -1196, 288, -662, 504, 876, -500, 245, -339, 408, 330, -344, 247, 321, -134, -151, 6, -164, -895, 148, -80, -545, -2, 102, -319, -41, -59, 126, 138, -236, -856, -419, -645, -47, -859, 386, 327, -67, 16, -102, -528, -921, -254, 897, 359, -543, -263, -355, -65, -615, 42, 84, 300, -230, 824, 660, 447, -295, -25, 289, 256, 1182, -377, -328, 609, -708]
1526g08M25M27n91q7J755j739M42n97J205r31J09L34K21o71K1K70j59K66J169
1545A161q19j48O6k13j83N55m70j08K25k97K74n13N79J50l66j78R69q07J40k86
1565b69k29L73K47P6j76R89m68K2n85K29J88m45K52K98o83J82J90J95j164J274
1585D96P8n19l83N0Q23K04m00j49r8l50k12N43j38O39j348N79J346p66m13j62
1605a80Q27j059K53N91J04o62K6R9o0l47k66P96M37j231O65M0l84J015l34K40
1625E70m80K99J28j335N28k2Q31k52p92R89o9j237J290j017N94M64p90m5K38L63
1645B55J56n21n8R99q46L86o43m6o4L55J84P09n52o94R0O51m0p41P47K82q23j50
1667c64k66R45o94r3k29J522k047J293M60j433J404o46J35n46K83q78J493L16
$$ y = [-708, -283, 144, -447, -534, 1221, -518, -76, -673, 532, -399, -290, 44, 265, -406, -385, -115, -274, -8, 1161, 342, 194, 260, 47, -136, 419, -51, -159, 66, -231, 43, -470, 109, 259, -107, -285, 684, -123, 17, -269, -498, -125, 122, 198, 22, 1011, 543, 565, -20, 209, 397, -48, 204, 502, -181, 1, 191, 386, -778, 496, 574, 55, -328, -278, 545, 749, 349, 200, 102, -248, -460, 83, -55, 584, -764, -185, 1161, 395, -18, -180, 647, -412, -159, 432, 536, -126, -100, -1, -61, -408, -674, 122, 559, -672, -7, 33, -351, 664, 330, 570, 90, 389, 517, -818, -290, -312, 519, 267, -525, 464, 395, -842, 448, -569, 25, 489, -301, -346, -108, 255, 411, -110, -168, 831, -15, 371, -272, -318, -382, -27, 157, 866, 314, -380, -290, 361, 321, -420, 327, 609, -214, -364, -630, 315, -379, -472, -701, 821, -1226, 67, 527, -906, 498, -148, -13, -559, -276, -1154, 339, 655]
1685F55p70p15R52M75j46m78r48J271k66K66M01j115r5O80m21o99O02O5P7k82
1705d91O29O01j027L4J5p43O83J14K54l2M37j5r5l54L82m2l6k58L64j04l76M15
1727C55j97M30j376J289o70N78j182M33L22L03ln21j50Q13l71N47l85k43K61q6
1747A47R87j171l8L02P69p07l61j43K31J47J66j51P0m49m81L73R4k21L84J45N26
1768F19q53L78M13L67p59j139L97m3O38N33l4m18J90r62R06k94k21P46l77p5l76
1789c64J64K00L69L92l65K42o04n66L01K99k4J01M25o61J70n65N24O6n71O57o29
1810d39J294k19j142j6p56J322m1R6k30J99o39O24J44q82R06L69R96j634l0l89
1830d67R75r29J92J137n27n72n12N79J50n49R01p44K04lJ58N87R2k2p47Q29o74
$$ y = [655, -115, -830, 122, 597, 451, -27, -975, 296, 30, 296, 697, -418, -513, 167, -254, -953, -351, -286, -209, -491, 138, 739, -288, -254, -239, -982, -299, -185, 69, 37, 474, 459, 364, 10, 392, 350, 314, 56, 420, 316, -60, 355, 158, 588, -788, 501, -169, 409, -773, -340, -18, 285, 282, -239, -389, 424, 53, 600, 215, -28, 233, 147, 1134, -37, -75, 227, 996, 289, -72, -215, 16, 163, 329, 178, 248, -201, -682, -309, -215, -436, -52, 93, 619, -234, 144, 557, 924, 165, -974, -577, -620, 18, 551, 517, 99, 289, -673, 233, -61, -282, 464, 87, 12, -364, -200, 0, 369, 761, 396, 638, 34, -532, -231, 68, 44, 145, 570, -91, 79, -486, 38, 104, -467, 190, -439, 855, 636, -506, -522, -1278, 44, 3, 99, -131, 68, -571, 53, 197, -685, 221, 590, 1586, -48, -78, -467, 508, -421, -229, 908, 381, -191, -703, -124, 26, -523, 378, -366, -162, -165, -7, 580, 672, 650, -97, 732, 58]
1851E8k54K09j63N69n34j19K37J15K38l20p9L51n51N53o06J89j75K66j07p46N03
1872c66O74m72O26j93K8o16L90J99q48P16k79o83J607n00o48M33J45J56j223r5
1892i49J592n72k79J52m28K28N16M08r27l65M96o82Q73j29K4q2Mj84l78P11K39
1913B68R58j393N8R27n46j67J52N75r43o6m0K19j50m77P92k61M79o06J20J28n59
1934e32M38n32J705j116O98n08j032P94k37N0O09k4K97k58q01N19m95K30Q22o8
1954E59r36J026k05r21M09P59%j240L72j24L23l4j49NK83K37J43O44q48k47K60
1975C16p62J71P3R24n80L84j83o49q81J026j32m49M73M59m36k57L07J46j35P2
1995a13M29p57Q3J358j016l25N9M51l63P03l71m84P32o98N15K48r6l92P57n59
$$ y = [58, -196, 13, -150, 419, -115, -234, 3, 118, 356, 36, -43, 308, -243, 310, -296, -107, -282, -16, -123, -869, -366, 308, -164, 462, 269, 297, -319, 71, 270, -578, 138, -141, -824, 783, 283, -365, 68, 213, 369, -854, -949, 643, 71, -208, -56, -484, -256, 260, 668, -259, -624, -128, -810, 63, -66, -42, -124, -120, -304, -682, 29, 268, 1226, -167, -109, 818, 272, 105, 257, 832, -111, -177, -217, 2, -148, -625, 167, -94, 385, -221, -101, 27, -532, -94, -626, 1079, -37, 661, 153, -879, -85, -322, -272, 337, 313, 610, 352, -449, 70, -425, -195, 627, 559, -377, 649, 444, -477, -68, 691, 691, -549, -177, -301, 22, -12, -161, -156, 127, 364, 507, 1151, 303, 56, 316, -446, -275, -202, 722, 142, 526, 343, -306, -1187, -161, -293, -742, -269, 190, -246, -503, -196, -50, -185, -113, 316, -441, -358, 1000, -16, -341, -282, 169, -194, 509, 138, -346, 386, -312, 203, 451, 355, -37, 720, 161]
2015A61L27p73O47l00L72m68k40J103k31n9q05J69L46l93j032J213p9m03K8J20
2035b97K50l24J20M28O12m86M38n49J76N76j403M56m43N43L51p51N92j059O90
2054h0Q01j199L40J73J045j157n24N98N11M20q60M83M97r06p90L11K49L30j118
2073h76J110K25n94J11M3K03r9k86P50l40m76k89j88L49r06J414j69J45L40N49
2093A016k126J099n95M29N06j70n2J8k50j73L20n11J8J61O92r23M19M77j088M20
2113c13M00n77Q7n31J179j85K33k02k7N28p03pM13k37o32J111r98J78p4l62R40
2134B21J66n65l4J035j077J85K83R20n01j204J331q73l55m19N50J92k42j28J250
2153G35j000R82j181L84J26m71L70j73J168p07N20j173J162j323R83q24K30J53
$$ y = [161, 488, -285, 362, 62, 434, -34, -274, 829, 598, 539, -266, -97, 249, -144, -1176, 37, -42, -445, -417, -297, -47, -371, -251, 177, 789, 303, 741, 192, 368, 944, -459, -3, -446, 97, 448, -303, 289, -770, -80, 721, -478, -138, 35, 1080, -77, -601, -3, 508, 928, 68, 551, 1048, 142, -648, -337, -88, 242, -876, 234, 459, -135, -24, 19, 222, 123, -163, 587, 247, -229, -518, -706, -357, -1263, 151, -18, 127, 467, 1016, -1110, -11, -606, -177, 329, 159, 107, 125, -125, -298, 22, -489, -471, -310, 382, -541, -122, 355, -733, -313, 87, -490, -403, -934, 245, 60, 293, 91, 64, 592, -111, -118, 295, 58, -574, 537, -461, -283, -357, -719, 221, 387, -178, -212, 823, -254, -69, 214, 1134, 633, -571, 760, -113, -468, -887, -337, -145, -387, -515, 735, -265, 717, -464, -80, 46, -425, -55, -228, 940, 233, 753, -420, 742, -581, 402, -422, -192, -39]
2171c9q7L36J17n86k5O78k10k26O40l0l98L13j84o90J073o75K48o01J25p5J157
2192H61J25j642J089j27M24q35m70J281j174q99J678K69j38j722N13O20K21n92
2210e18K79P8m97R81r10N95L93q75rJ050R7n12k36l20Q69j705J324N30o87p1o1
2231b05j31J001j088N60M54J95q80m45j42J177l43M12l29K43r16J187p89j55J46
2250d8L43n83o9J42m62J076k12L9R3n3m03L22j68K79p18P32j056J155j311J329
2270D27o58P52r08J17k27J010p50P21j008k92K93k72Q60jL77j186Q30p29M34l67
2290e77J493j331P24p46j72J063o00J42L59K21n85Q09j199J235j266Q23K49j055
2308d13J74N86l19l08k95Q52N84j267L58P43l63L35j179P35P35o89k33J71Q5j027
$$ y = [-39, -126, 210, 327, -259, -284, 394, 184, -42, 598, 568, 170, 483, 299, -391, 682, 7, 255, -346, -221, -296, 861, 986, -656, 433, 306, 730, -105, -575, 706, -468, -1367, 311, 580, 442, -1280, -767, -147, 74, -518, -239, -161, -658, 323, -587, 8, 401, -474, -483, 567, 664, 152, -84, -404, 465, -1240, 84, 614, -73, -144, -205, -336, 665, -423, 137, 591, 786, -94, -539, -681, 496, 153, 565, 236, 479, -437, 750, -39, -194, -48, 295, -288, -357, -215, -677, 399, 187, 226, 319, 266, -137, 185, 17, 296, -422, 310, -746, 409, -902, 427, -231, 521, -387, -270, -497, 513, -237, 484, -524, -816, -523, -795, 65, 64, 441, -745, 85, -644, -210, -577, 916, -415, 309, -437, -609, 454, -146, -4, 355, 576, -9, 800, -399, 836, -430, 393, 642, -413, -239, 347, 28, -280, -575, 277, 861, -406, -48, 695, 332, 667, -512, 223, 958, 269, 36, 207, 292, -735]
2328g35J472q65P13l65Q2J04m08L02p17L67N61m57r2N8j68J028j763O69J81K52
2348B19j78K85j07p63P59l50N71j8o57M00J79r71l30N85M5O73n3k89o88L75N53
2369B40q75P93j57k5j41m15j8P88j42j72K43K90j448Q23o4o76J872j650L39L95
2389@%n90J419j817J132O7L97k83m01L3j146R77k03O80o06J373j400L84M71j127
2409f40O99m42L72J70l7l00j199J676m59n4m58P07k09Q40m67K07n7j90L52l34
2429A77K03j61K02r51n84J970j105Q5m0n27K52q5O18M23N6o33P62p72L07q58O80
2450A9n0L18n81M87J68n85Q43n56j3p35Q1j88O59q7n83J527r49K00l01M08q28
2471g46Q27K82n06Q5J32l54J19R49o58o68O18p10P98M83j96K75n46o91J51K13
$$ y = [-735, 737, -128, 585, 220, 302, 406, -2, 300, -417, -50, 511, 54, -38, 20, -148, 880, -883, -214, -33, 219, 41, 326, 219, -544, 215, -135, 436, 418, -239, 161, 340, -631, -961, -376, -331, 342, 289, 0, -688, -313, 240, -635, 158, 1, -24, -165, -580, -598, 190, 48, -124, 119, 409, -1039, -216, -280, -956, 916, -734, -395, 0, 0, -590, 829, -988, 144, 211, 608, 325, -76, -43, -1189, -212, -415, 265, -341, 1032, -368, 16, 487, -640, 59, -383, -11, 159, 122, -178, -1377, 299, -160, -214, -672, 35, -174, 666, 199, 406, 349, 159, 511, 177, 380, 219, 421, -530, -1114, 856, -249, -164, -204, -731, -479, -564, 54, 477, 533, -100, 662, -110, 197, -661, 19, -31, 287, -294, 193, 361, -224, 619, 63, 50, -685, -604, -792, -133, -220, -803, 724, -225, -25, -326, 82, -746, 81, 363, -143, -58, 74, -280, -161, 788, 130, -538, 80, -630, 168, 651, 455, 730, 184, -507, -356, -143]
2491a43n5n57N93L81O5n20L80M60l97P4p33Q02j002K51m67L67J016m39M80r76
2511d20K0mK95K84l33m40n2Q17j05m96k71L57K36M07n54N36Q7k23K60k80J35o61
2533d05n2n28J576n95n72P60J41j40q98Q14rq75J026m16j54j39L7L90K2m7p96
2554h60M58J33J402j719O99P62q18l70K36L81k3j023M87L65q17Q52L93m00N14
$$ y = [-143, -198, -755, -162, 219, 284, -236, 144, 604, 207, 281, -452, 350, -652, -401, -868, -501, 515, 76, 556, -420, -400, -404, -109, 175, -158, -598, -650, 167, 62, -434, -705, -348, -112, 295, -259, 277, 364, 141, 401, 121, 256, -405, -457, -985, 591, -4, -576, 184, 325, 185, -713, 101, 92, -783, 243, -173, -327, -466, -429, -39, -17, -64, -860, -402, -269, 1133, -586, 113, 875, 57, -313, -77, 304, 281, -742, -255, 110, -707, 145, 538, 138, 652]
$$ [...]
8191b76
##END NTUPLES=NMR FID
##END=
