##TITLE=1H_SAM_10.102'
 CDCl3, 8 sc, 
 8.2.2019
##JCAMPDX= 6.0         $$ Bruker NMR JCAMP-DX V2.0
##DATA TYPE= NMR FID
##DATA CLASS= NTUPLES
##ORIGIN= UXNMR, Bruker Analytische Messtechnik GmbH
##OWNER= root
$$ XWIN-NMR		Version 3.5
$$ Fri Feb  8 15:47:19 2019 Russian Standard Time (UT+4h)  she@DPX200
##.OBSERVE FREQUENCY= 200.115
##.OBSERVE NUCLEUS= ^1H
##.DELAY= (6, 6)
##.ACQUISITION MODE= SIMULTANEOUS
##.ACQUISITION SCHEME= undefined
##.AVERAGES= 56
##.DIGITISER RES= 16
##SPECTROMETER/DATA SYSTEM= spect
##.PULSE SEQUENCE= zg30
##.SOLVENT NAME= CDCl3
##.SHIFT REFERENCE= (INTERNAL, CDCl3, 0, 15.7039)
##AUDIT TRAIL= $$ (NUMBER, WHEN, WHO, WHERE, WHAT)
$$ ##TITLE= Audit trail, XWIN-NMR		Version 3.5
$$ ##JCAMPDX= 5.01
$$ ##ORIGIN= Bruker BioSpin GmbH
$$ ##OWNER= she
$$ F:/spectra/data/she/nmr/H-F/1/audita.txt
$$ ##AUDIT TRAIL=  $$ (NUMBER, WHEN, WHO, WHERE, WHAT)
(   1,<2019-02-08 15:45:54.28 +0400>,<she>,<DPX200>,
      <created by zg, POWCHK disabled, PULCHK disabled
       configuration hash MD5:
       00 E9 B6 7A A2 85 ED C7 34 08 36 98 17 FE 4E 26
       data hash MD5: 16K
       FF EC BF 40 C2 9E 54 6A 01 5B 44 F5 BF 2E 6E A7>)
$$ ##END=
$$ 
$$ hash MD5
$$ 58 FF BD A6 03 F5 DF 28 99 43 D8 B9 43 F8 10 75
##$RELAX= 
##$RELAX= 
##$RELAX= 
##$RELAX= 
##$RELAX= 
##$RELAX= 
$$ Bruker specific parameters
$$ --------------------------
##$DU= <F:/spectra>
##$EXPNO= 1
##$NAME= <H-F>
##$PROCNO= 1
##$TYPE= <nmr>
##$USER= <she>
##$AMP= (0..31)
100 100 100 100 100 100 100 100 100 100 100 100 100 100 100 100 100 100 
100 100 100 100 100 100 100 100 100 100 100 100 100 100 
##$AQSEQ= 0
##$AQ_mod= 1
##$AUNM= <au_zg>
##$AUTOPOS= <>
##$BF1= 200.13
##$BF2= 200.13
##$BF3= 200.13
##$BF4= 200.13
##$BF5= 200.13
##$BF6= 200.13
##$BF7= 200.13
##$BF8= 200.13
##$BYTORDA= 1
##$CFDGTYP= 0
##$CFRGTYP= 5
##$CHEMSTR= <none>
##$CNST= (0..31)
1 1 145 1 1 1 1 1 1 1 1 1 1 1 1 1 1 1 1 1 1 1 1 1 1 1 1 1 1 1 1 1 
##$CPDPRG= <>
##$CPDPRG1= <>
##$CPDPRG2= <>
##$CPDPRG3= <>
##$CPDPRG4= <mlev>
##$CPDPRG5= <mlev>
##$CPDPRG6= <mlev>
##$CPDPRG7= <mlev>
##$CPDPRG8= <mlev>
##$CPDPRGB= <>
##$CPDPRGT= <>
##$D= (0..31)
0 1.2 0 0 0 0 0 0 0 0 0 0.03 0 0 0 0 0 0 0 0 0 0 0 0 0 0 0 0 0 0 0 0 
##$DATE= 1549626353
##$DBL= (0..7)
120 120 120 120 120 120 120 120 
##$DBP= (0..7)
150 150 150 150 150 150 150 150 
##$DBP07= 0
##$DBPNAM0= <>
##$DBPNAM1= <>
##$DBPNAM2= <>
##$DBPNAM3= <>
##$DBPNAM4= <>
##$DBPNAM5= <>
##$DBPNAM6= <>
##$DBPNAM7= <>
##$DBPOAL= (0..7)
0.5 0.5 0.5 0.5 0.5 0.5 0.5 0.5 
##$DBPOFFS= (0..7)
0 0 0 0 0 0 0 0 
##$DE= 6
##$DECBNUC= <off>
##$DECIM= 2
##$DECNUC= <off>
##$DECSTAT= 4
##$DIGMOD= 1
##$DIGTYP= 9
##$DL= (0..7)
0 120 120 120 120 120 120 120 
##$DP= (0..7)
150 150 150 150 150 150 150 150 
##$DP07= 0
##$DPNAME0= <>
##$DPNAME1= <>
##$DPNAME2= <>
##$DPNAME3= <>
##$DPNAME4= <>
##$DPNAME5= <>
##$DPNAME6= <>
##$DPNAME7= <>
##$DPOAL= (0..7)
0.5 0.5 0.5 0.5 0.5 0.5 0.5 0.5 
##$DPOFFS= (0..7)
0 0 0 0 0 0 0 0 
##$DQDMODE= 0
##$DR= 16
##$DS= 0
##$DSLIST= <SSSSSSSSSSSSSSS>
##$DSPFIRM= 0
$$ [...]
##$SUBNAM2= <"">
##$SUBNAM3= <"">
##$SUBNAM4= <"">
##$SUBNAM5= <"">
##$SUBNAM6= <"">
##$SUBNAM7= <"">
##$SUBNAM8= <"">
##$SUBNAM9= <"">
##$SW= 260.267013134115
##$SWIBOX= (0..15)
0 0 2 0 0 0 0 0 0 0 0 0 0 0 0 0 
##$SW_h= 52083.3333333333
##$TD= 16384
##$TD0= 1
##$TE= 0
##$TE2= 300
##$TE3= 300
##$TEG= 300
##$TL= (0..7)
0 120 120 120 120 120 120 120 
##$TP= (0..7)
150 150 150 150 150 150 150 150 
##$TP07= 0
##$TPNAME0= <>
##$TPNAME1= <>
##$TPNAME2= <>
##$TPNAME3= <>
##$TPNAME4= <>
##$TPNAME5= <>
##$TPNAME6= <>
##$TPNAME7= <>
##$TPOAL= (0..7)
0.5 0.5 0.5 0.5 0.5 0.5 0.5 0.5 
##$TPOFFS= (0..7)
0 0 0 0 0 0 0 0 
##$TUNHIN= 0
##$TUNHOUT= 0
##$TUNXOUT= 0
##$USERA1= <user>
##$USERA2= <user>
##$USERA3= <user>
##$USERA4= <user>
##$USERA5= <user>
##$V9= 5
##$VALIST= <valist>
##$VCLIST= <CCCCCCCCCCCCCCC>
##$VD= 0
##$VDLIST= <DDDDDDDDDDDDDDD>
##$VPLIST= <PPPPPPPPPPPPPPP>
##$VTLIST= <TTTTTTTTTTTTTTT>
##$WBST= 1024
##$WBSW= 4
##$XGAIN= (0..3)
0 0 0 0 
##$XL= 0
##$YL= 0
##$YMAX_a= 741966
##$YMIN_a= -835764
##$ZGOPTNS= <>
##$ZL1= 120
##$ZL2= 120
##$ZL3= 120
##$ZL4= 120
##$ABSF1= 10
##$ABSF2= 0
##$ABSG= 5
##$ABSL= 3
##$ALPHA= 0
##$AQORDER= 0
##$ASSFAC= 0
##$ASSFACI= 0
##$ASSFACX= 0
##$ASSWID= 0
##$AUNMP= <proc_1d>
##$AZFE= 0.1
##$AZFW= 0.1
##$BCFW= 1
##$BC_mod= 2
##$BYTORDP= 1
##$COROFFS= 0
##$CY= 11.3945322036743
##$DATMOD= 1
##$DC= 2
##$DFILT= <>
##$DTYPP= 0
##$F1P= 18.9103706918063
##$F2P= -1.10871071338519
##$FCOR= 0.5
##$FTSIZE= 0
##$FT_mod= 4
##$GAMMA= 1
##$GB= 0.15
##$INTBC= 1
##$INTSCL= 1
##$ISEN= 128
##$LB= 0.24
##$LEV0= 0
##$LPBIN= 0
##$MAXI= 10000
##$MC2= 0
##$MEAN= 0
##$ME_mod= 0
##$MI= 1.114404
##$NCOEF= 0
##$NC_proc= 0
##$NLEV= 6
##$NOISF1= 3.799351
##$NOISF2= 2.8
##$NSP= 1
##$NTH_PI= 0
##$NZP= 0
##$OFFSET= 15.70392
##$PC= 1
##$PHC0= -8846.793
##$PHC1= 9.800191
##$PH_mod= 1
##$PKNL= yes
##$PPARMOD= 0
##$PSCAL= 0
##$PSIGN= 0
##$REVERSE= no
##$SF= 200.130013532006
##$SI= 16384
##$SIGF1= 3
##$SIGF2= 2
##$SINO= 400
##$SIOLD= 16384
##$SREGLST= <1H.CDCl3>
##$SSB= 0
##$STSI= 0
##$STSR= 0
##$SW_p= 3612.71676300578
##$SYMM= 0
##$S_DEV= 0
##$TDeff= 0
##$TDoff= 0
##$TI= <>
##$TILT= no
##$TM1= 0
##$TM2= 0
##$TOPLEV= 0
##$USERP1= <user>
##$USERP2= <user>
##$USERP3= <user>
##$USERP4= <user>
##$USERP5= <user>
##$WDW= 1
##$XDIM= 8192
##$YMAX_p= 0
##$YMIN_p= 0
$$ End of Bruker specific parameters
$$ ---------------------------------
##NTUPLES= NMR FID
##VAR_NAME=  TIME,          FID/REAL,        FID/IMAG
##SYMBOL=    X,             R,               I
##VAR_TYPE=  INDEPENDENT,   DEPENDENT,       DEPENDENT
##VAR_FORM=  AFFN,          ASDF,            ASDF
##VAR_DIM=   8192,          8192,            8192
##UNITS=     SECONDS,       ARBITRARY UNITS, ARBITRARY UNITS
##FACTOR=    1.92e-05,      1,               1
##FIRST=     0,             0,               0
##LAST=      0.1572672,     0,               0
##MIN=       0,             -835764,         0
##MAX=       0.1572672,     741966,          0
$$ Real data points
##PAGE= N=1
##DATA TABLE= (X++(R..R)), XYDATA
$$ [...]
$$ plain form
2707 -484 -6526 5304 2178 -6474 3430 4408 -6736 1105 4858 -6308 -447 6537 -4140 -2903
2721 -2903 6872 -2849 -4525 6412 -558 -5840 5690 1504 -6166 3722 3425 -6689 1468 4280
2735 4280 -6437 18 6589 -4881 -2631 5978 -2696 -3956 6436 -550 -5636 5569 1340 -6296
2749 -6296 3627 3144 -6639 1740 4546 -5230 -382 5729 -4266 -2022 6452 -2981 -4003 5671 -1381
2764 -1381 -5300 4885 1079 -6006 3600 3114 -5556 1668 4440 -5549 19 5581 -4439 -1987 5902
2779 5902 -3183 -3585 6792 -1571 -5085 5496 1127 -5976 3906 2474 -5546 1829 4519 -5480 314
2794 314 5504 -4190 -1553 6091 -2583 -3291 5601 -975 -4979 5416 813 -5818 3627 2161 -6340
2809 -6340 2301 4481 -5901 987 5405 -4671 -950 5404 -2948 -3254 5487 -1327 -4546 5333 380
$$ packed form
2707d84o042J1830l126q652R904R78j1144P841L753j1166N861O984j0677J237
2721b903R775r721j676J0937o970n282J1530m186p670R888k97j0114Q157K812
2735D280j0717O455O571j1470K250Q609q674j260J0392o986n086J1205m229p636
2749f296R923m83r783Q379K806r776M848O111r995K244Q474r433j022R674p052
2764a381l919J0185l806p085R606m86q670P224K772r989N568N562j0020K452P889
2779E902r085m02J0377q363l514J0581m369p103R882j432q020P375K690r999N794
2794C14N190r694K637P644q674p08Q892o576m004J0395m603o631R445j466q501
2809f340Q641K180j0382O888M418j0076L721O354q352l06Q741o814l219R879m953
$$ plain form
2824 380 -4971 3763 2503 -6300 2249 4155 -5018 -212 4757 -4109 -1754 5861 -2838 -2550 5856
2839 5856 -2066 -4180 4955 -221 -5150 4406 1751 -5658 1994 3374 -4842 517 4791 -3704 -1154
2854 -1154 4944 -4032 -1945 5818 -1721 -3993 5108 601 -5740 3557 1837 -5795 2898 3374 -5483
2869 -5483 1408 4599 -4914 -878 5001 -3338 -2929 5737 -1851 -4715 4766 42 -4451 3944 1727
2884 1727 -4908 3335 3913 -4785 749 4256 -4217 -990 5274 -3133 -2267 5605 -1663 -3915 4901
2899 4901 -511 -4147 4087 1045 -5040 3288 3069 -5024 956 4227 -4439 -224 5439 -3743 -2150
2914 -2150 5333 -1659 -3820 4591 -234 -4823 3939 830 -5493 2715 3026 -5233 1667 3966 -4357
2929 -4357 -57 4758 -3557 -1946 5639 -1658 -3272 5278 -319 -4122 4125 1267 -4698 2747 2905
$$ packed form
2824C80n351Q734j260q803Q549J906r173M806M969q866K355P615q699K88Q406
2839E856p922k114R135n176m929R556k655p409P652J380q216N359M274q495K550
2854a154O098q976K087P763p539k272R101m507o341R297j720p632Q693M76q857
2869e483O891L191r513M036N879q339M09Q666p588k864R481m724m493Q395k217
2884A727o635Q243N78q698N534L507q473L227O264q407Q66P872p268k252Q816
2899D901n412l636Q234l042o085Q328k19q093N980L271q666M215N663r182J593
2914b150P483o992k161Q411m825m589Q762l109o323Q208L11q259O900K299q323
2929d357M300M815q315J611P585p297j614Q550n597l803Q247k858n965P445J58
$$ plain form
2944 2905 -5024 1150 3580 -4543 -485 4320 -3594 -2173 5066 -1778 -3074 4909 -468 -3593 4043
2959 4043 582 -4719 2697 2581 -4748 1640 3632 -4044 701 4314 -3370 -1657 4981 -2409 -2565
2974 -2565 5043 -390 -3632 4249 514 -5078 3092 1662 -3977 1673 3391 -4538 902 4744 -3605
2989 -3605 -1519 4828 -2439 -2938 4601 -456 -3600 3761 468 -4704 2806 1810 -4417 1816 3191
3004 3191 -4497 729 4422 -3724 -1299 4832 -2716 -2621 3841 -1274 -3321 4181 726 -4479 3127
3019 3127 1900 -5089 992 2562 -4478 1166 4196 -3884 -599 4429 -2791 -2178 4452 -1119 -3273
3034 -3273 4588 347 -4150 2877 1883 -4329 2003 2960 -4311 1340 3857 -4053 -774 4031 -2715
3049 -2715 -1958 4555 -1043 -3277 5000 -31 -3598 2686 1498 -4766 2275 2232 -3786 374 3769 -3623
$$ packed form
2944B905p929O174K430q123M058M805p914J421P239o844j296P983n377l125P636
2959D043l461n301P416j16p329O388J992p676M745L613p684J713O638p390j56
2974b565P608n433l242P881l735n592Q170j430n639N650J718p929N440L842q349
2989c605K086O347p267m99P539n057l144P361l293n172P510r96o227O233J375
3004C191p688N226L693q146K425O131p548R5O462n115k047P502l455n205P606
3019C127j227o989O081J570p040N644L030q080L285N028p220O13O630n571k154
3034c273P861m241m497P027r94o212O332R57p271N651K517p910L279M805o746
3049b715P57O513n598k234Q277n031l567O284j188o264P041m3o018M160L395p392
$$ plain form
3065 -3623 -806 4356 -2412 -2261 4668 -574 -3274 4423 152 -3800 3302 1230 -4227 1825 2609
3080 2609 -3928 966 3240 -3896 -383 4473 -2971 -1697 4034 -2266 -3228 4044 220 -3883 3375
3095 3375 802 -3845 2169 1886 -3879 1331 3556 -3322 -149 3931 -2898 -1508 3853 -1839 -2374
3110 -2374 3813 -212 -3546 3268 1072 -3799 2156 2174 -3921 1265 3340 -3549 -39 3839 -2520
3125 -2520 -1609 4363 -1865 -2708 3477 -595 -3704 2859 630 -3719 2889 1924 -3694 1428 2074 -3725
3141 -3725 -357 3115 -2361 -925 4101 -1220 -2262 2939 -361 -3224 3392 948 -3553 3419 1541
3156 1541 -3512 1495 3096 -3415 -605 3739 -2956 -642 3705 -1927 -2487 3540 -528 -3428 3454
3171 3454 629 -3062 2584 1651 -3705 1530 1977 -2989 682 3041 -2939 -1520 3577 -1741 -2061 3533
$$ packed form
3065c623K817N162o768J51O929n242k700P697m271l952P102k072n457O052P84
3080B609o537M894K274p136L513M856p444J274N731o300r62P272l824m103P258
3095C375k573m647O014k83n765N210K225o878L173M080o829J390N361n692n35
3110b374O187m025l334O814k196m871N955J8o095N186K075o889L510L878o359
3125b520R11N972o228q43O185m072l109O563k229m349O608r65n618N122O46n799
3141c725L368L472n476J436N026n321j042N201l300k863O616k444m501O972j878
3156A541n053N007J601o511K810M344o695K314M347n632n60O027m068k900O882
3171C454k825l691N646r33n356N235M47m966L671K359n980J419N097n318l20N594
$$ plain form
3187 3533 -1063 -2817 2976 26 -3339 2081 2150 -3137 972 2958 -3561 432 3116 -2988 -1235
3202 -1235 3813 -1989 -1564 4115 -712 -3026 2919 355 -3116 1815 1019 -3080 1213 2034 -3706 431
3218 431 2923 -2797 -533 3823 -1994 -1837 3414 -1242 -2417 2857 -317 -3203 2764 1609 -3547
3233 -3547 1371 2250 -2873 244 3243 -3103 -1063 3806 -2756 -1781 3132 -917 -2317 3362 233
3248 233 -3578 1931 1174 -3618 1465 2069 -3019 547 2503 -2860 -1092 2635 -1402 -1238 3404 -1197
3264 -1197 -2059 3513 115 -3060 2377 813 -2770 2569 2272 -3000 726 2551 -2547 -595 3152
3279 3152 -1827 -1607 2772 -1275 -2241 2909 609 -3077 2725 414 -2952 1389 1891 -3544 616 2477
3295 2477 -2542 -119 3185 -2685 -1658 2972 -1298 -1988 2985 -606 -1840 2381 548 -2877 1660
$$ packed form
3187C533m596j754N793k950l365N420O9n287M109J986o519L993K684o104J753
3202a235N048n802M25N679m827k314N945k564l471M931p96m099M293Q21n740M137
3218D31K492n720K264M356n817J57N251m656j175N274l174k886N967j155n156
3233c547M918Q79n123L117K999o346K040M869o562R75M913m049j400N679l129
3248B33l811N509p57m792N083O04n088L566J956n363J768L727m037J64M642m601
3264a197q62N572l398l175N437j564l583N339k97n272L726J825n098J952L747
3279C152m979K20M379m047r66N150k300l686N802k311l366M341N02n435M160J861
3295B477n019K423L304n870J027M630m270o90M973l591j234M221j833l425M537
$$ plain form
3310 1660 1588 -3321 926 3250 -3055 -157 3082 -2309 -1234 3005 -1370 -1844 3177 -65 -2188 1591
3326 1591 1019 -2709 2223 1030 -2497 -1 2067 -3139 -547 2343 -2961 -1090 3050 -1099 -2191
3341 -2191 2453 -501 -2154 2701 -221 -3254 1906 1002 -3064 1023 2237 -2828 -126 2827 -2412
3356 -2412 -666 2581 -1085 -1546 2798 -899 -1965 2642 698 -2836 2131 1385 -3067 1104 2552
3371 2552 -2985 367 2649 -2122 -412 2741 -1182 -1853 2771 -814 -2080 2226 -23 -2971 2150
3386 2150 996 -2779 1265 1651 -2674 297 2577 -1859 -394 2921 -1414 -1813 2986 -1133 -1727 2563
3402 2563 418 -2363 2219 766 -3055 1263 1800 -2044 234 2591 -2397 -488 3105 -1012 -1163
3417 -1163 2772 -1306 -1702 2367 89 -2378 2332 1206 -2886 776 1933 -2427 768 2771 -2020
$$ packed form
3310A660p2m909M247K324o305K898L239n391J075M239m375m74N021l242k123L779
3326A591n72l728M932j193l527K496K068n206K592K890n304J871M140m149j092
3341b191M644k954j653M855k922l033N160r04m066M087J214n065K702K953n239
3356b412J746L247l666m61M344l697j066M607j944l534M967p46m452M171J448
3371B552n537L352K282m771J710L153l923o71M624l585j266M306k249k948N121
3386B150j154l775M044L86m325K971K280m436J465L315m335l99M799m119n94M290
3402B563k145k781M582j453l821M318N37l844K278K357m988J909L593m117j51
3417a163L935m078l96M069k278k467M710j126m092L662J157m360L195K003m791
$$ plain form
3432 -2020 -394 2641 -1151 -1270 2944 -1106 -2351 2602 270 -1711 1577 852 -2332 799 1472 -2206
3448 -2206 612 2166 -1932 -406 2548 -2100 -1444 2382 -1407 -1430 2642 196 -2155 1376 905 -2093
3464 -2093 1135 1167 -2882 214 1794 -2564 -661 2304 -1686 -719 2465 -1368 -1832 1948 -132 -2279
3480 -2279 2415 665 -2149 1114 1153 -1993 950 1431 -1899 -25 1979 -682 -1435 2598 -1513 -2648
3496 -2648 2034 -234 -2038 1634 591 -2312 1264 1203 -2489 593 1569 -2411 -488 1994 -1647 -344
3512 -344 2655 -693 -1395 2238 -58 -2158 2013 1083 -1643 1344 1063 -2820 462 1990 -2001 -212
3528 -212 1929 -2126 -610 2582 -464 -1079 1893 275 -1908 1492 644 -1931 1964 1096 -2260 827
3544 827 1392 -1790 95 2022 -1636 -918 2263 -710 -1710 1934 -271 -1098 1115 41 -1524 1603
$$ packed form
3432b020J626L035l792j19M214m050j245M953k332j981L288p25l184L131O73l678
3448b206K818J554m098J526K954m648O56L826l789k3M072k446k351L531m71k998
3464b093L228L2m049L096J580m358J903K965l990R67L184l833m64L780k080k147
3480b279M694j750k814L263L9l146K943M81l330J874K004k661p53M033m111j135
3496b648M682k268j804L672j043k903L576o1l692L082R76l980J923K482l641J303
3512c44K999l348p02L633k296k100M171r30k726K987k81l883L282J528l991J789
3528b12K141m055J516L192l046o15K972j618k183L400q48k575L895q68l356L087
3544H27N65l182J885J927l658P18L181k973j000L644k205q27K213j074j565L127
$$ plain form
3560 1603 1206 -2794 493 1798 -1833 -41 2313 -1676 -694 2296 -1631 -1337 2379 -875 -1621 2115
3576 2115 344 -2583 2058 524 -1807 1538 1185 -2551 123 1848 -1560 -282 1907 -1545 -1607 2734
3592 2734 -61 -1303 2134 304 -2140 1225 748 -2733 882 1522 -2262 769 1993 -1822 -302
3607 -302 1815 -1205 -1333 1921 -395 -1766 1811 -67 -2834 1329 700 -2010 1029 1803 -1965 307
3623 307 2192 -2028 -715 1621 -566 -953 1893 -473 -1177 2457 -436 -1373 562 1290 -2222 852
3639 852 1272 -1857 241 1609 -1604 -568 1847 -1372 -1144 2161 -463 -1682 2076 -31 -1972 1571
3655 1571 1295 -1237 1248 1109 -1992 74 1408 -1297 -539 2252 -861 -593 2033 -939 -1269 1636
3671 1636 469 -1520 1582 616 -1992 905 1191 -1831 56 1629 -1162 212 1962 -857 -899 1536
$$ packed form
3560A603l97m000L287J305l631J792K354l989R82K990l927K94L716l254p46L736
3576B115j771k927M641j534k331L345l53l736K674J725l408J278K189l452o2M341
3592B734k795j242L437j830k444L365m77l481L615O40l784L031J224l815J520
3607c02K117l020j28L254k316j371L577j878k767M163o29k710L039P74l768K272
3623C07J885m220J313K336k187l87K846k366p04L634k893r37J935P28l512L074
3639H52M20l129K098J368l213J036K415l219K28L305k624j219L758k107j941L543
3655A571k76k532K485j39l101K066J334k705P58K791l113K68K626k972l30K905
3671A636j167j989L102r66k608K897K86l022J887J573k791J374J750k819m2K435
$$ plain form
3687 1536 -430 -1167 1719 -651 -1347 2144 1030 -1822 1349 986 -2122 892 1233 -1972 -393 1659
3703 1659 -1337 -526 1951 -1116 -1056 1807 -421 -1271 1469 752 -1688 1228 520 -1137 817 1333 -2006
3720 -2006 -371 1550 -1684 -339 1495 -730 -1090 879 -331 -1866 1423 356 -1501 536 798
3735 798 -1878 885 917 -1349 162 2014 -1569 -271 2093 -826 -1230 1503 -263 -1406 1443 -59
3751 -59 -1462 371 942 -1195 410 1164 -1714 323 1328 -1373 -560 1669 -658 -1307 1929 -800
3767 -800 -1895 1608 142 -1413 1086 757 -1830 621 943 -1666 -78 1833 -1363 -923 1995 -982
3783 -982 -1538 1642 -417 -1775 1373 -12 -1648 1631 1055 -1946 323 632 -1514 -315 1456 -916
3799 -916 -25 1836 -1036 -1337 1909 -756 -1404 1395 323 -747 1564 354 -1580 505 1501 -1713
$$ packed form
3687A536j966p37K886k370o96L491j114k852L171l63l108L014L41l205J579K052
3703A659k996Q11K477l067O0K863k228q50K740p17k440K916p08j657J954N16l339
3720b006J635J921l234J345J834k225l60J969j210j535L289j067j857K037K62
3735G98k676K763L2k266J511J852l583J298K364k919m04K733j766j143K849j502
3751e9j403J833N71k137J605P54k878K037J005k701Q13K229k327o49L236k729
3767h00j095L503j466j555K499l29k587K451L22k609J588J911l196M40K918k977
3783i82n56L180k059j358L148j385j636L279n76l001K269L09k146J199J771k372
3799i16Q91J861k872l01L246k665o48K799j072j070K311j210j934K085R96l214
$$ plain form
3815 -1713 -231 817 -996 -572 1492 -1238 -1243 1266 -1287 -1733 1912 469 -1343 1230 699 -1650
3831 -1650 676 1038 -1879 619 555 -1358 459 1807 -1443 -943 1705 -389 -1071 1429 -51 -1097
3847 -1097 544 766 -1776 608 1067 -1997 92 1315 -1519 -155 969 -1469 -54 717 -380 -1394
3863 -1394 1300 -666 -1072 982 838 -1177 356 1067 -966 168 1539 -2189 -618 1748 -912 -664
3879 -664 1152 -116 -645 1925 292 -1719 1031 545 -1999 565 792 -1039 92 1005 -1571 -527
3895 -527 1387 -1212 -502 1733 -827 -988 1270 233 -1238 1469 693 -1217 1319 261 -1138 341
3911 341 1168 -1551 -528 2195 -634 -637 1664 -884 -954 1411 -229 -1641 1068 799 -862 999 637
3928 637 -1546 694 818 -1101 86 760 -1114 -287 1336 -665 -903 1230 -423 -1012 1312 -114
$$ packed form
3815a713J482J048j813M24K064k730nK509k553m46L645j443j812K573n31k349
3831a650K326L62k917K498o4j913J817J348l250N00K648k094o82K500j480j046
3847a097J641K22k542K384M59l064K089J223k834J364J124k438J415P71j097j014
3863a394K694j966m06K054j44k015J533P11k033J134J371l728J571K366k660K48
3879f64J816j268n29K570j633k011K750m86k544K564K27j831J131R13k576J044
3895e27J914k599P10K235k560j61K258j037j471K707p76j910K536j058j399J479
3911C41Q27k719J023K723k829lK301k548p0K365j640j412K709k69j661J861l62
3928F37k183K240J24j919J187O74j874Q27J623k001k38K133j653n89K324j426
$$ plain form
3944 -114 -1431 5 806 -1315 968 970 -1133 327 1033 -1424 -274 1754 -1228 -477 1341 -510 -1174
3961 -1174 1071 -116 -973 524 224 -1562 389 1397 -1501 438 1409 -1209 -492 1019 -788 -734
3977 -734 1448 -639 -1253 933 245 -1226 687 598 -1506 558 760 -1308 447 951 -950 -287 1032
3994 1032 -528 -609 1207 95 -1123 791 29 -1451 1392 97 -783 533 1395 -1464 224 953
4010 953 -1385 -241 1143 -656 -323 1327 -126 -1345 1487 566 -1249 811 31 -1310 403 643
4026 643 -1410 234 1044 -495 -439 669 -688 -1231 367 -820 -1241 1522 257 -1634 701 786 -1734
4043 -1734 833 407 -1240 245 1083 -527 92 986 -585 -656 1540 -886 -1748 775 -19 -1143 830
4060 830 149 -995 1021 761 -1162 85 1098 -1075 -133 1334 -688 -546 1480 -20 -933 297
$$ packed form
3944a14j317J436Q01k121K283Kk103J460P06k457J150K028k982P51J818j851o64
3961a174K245j187q57J497l00j786J951J008k898J939R71k618P17J511j807N4
3977g34K182k087o14K186o88j471J913q9k104K064K02k068J755N04j901O63J319
3994A032j560q1J816j112j218J914p62j480K843j295q80J316Q62k859J688P29
4010I53k338J144J384j799L33J650j453j219K832r21j815K060p80j341J713K40
4026F43k053J644Q10j539N6J108j357n43J598j187m21K763j265j891K335Q5k520
4043a734K567m26j647J485Q38j610O19Q94j571p1K196k426q62K523p94j124J973
4060H30o81j144K016k60j923J247J013k173R42J467k022J42K026j500r13J230
$$ plain form
4076 297 178 -806 666 556 -1126 167 733 -1162 -352 1015 -1249 -48 666 -910 269 1225 -84
4093 -84 -782 1235 -781 -1283 937 191 -952 1047 275 -901 157 1414 -1126 54 1267 -1330
4109 -1330 -3 717 -89 -696 1988 478 -529 1178 427 -157 596 643 -968 733 655 -1416 6
4126 6 1109 -614 -976 1678 -932 -629 961 25 -1225 601 275 -371 547 1427 -849 600 1157 -1342
4144 -1342 -698 995 -760 -119 1397 -529 -1094 1505 -362 -738 1061 147 -1114 629 449 -1008
4160 -1008 81 394 -976 213 885 -364 13 571 -395 -832 840 -673 -702 842 -170 -1255 450
4177 450 112 -871 321 896 -993 -291 1115 -1116 189 577 -535 -158 898 -447 -1201 1108 -380
4194 -380 -1159 877 346 -1208 825 877 -1031 -215 1180 -356 -936 898 -794 -394 1337 247 -1585
$$ packed form
4076B97j19r84J472j10j682J293N66j895Q10J367k264J201P14j576J179R56j309
4093h4o98K017k016n02K220p46j143J999p72j176J058J257k540J180J213k597
4109a330J327P20q06o07K684j510j007J707p51n84P53M7j611J701p8k071J422
4126FJ103j723l62K654k610L03J590r36j250J826l26o46R18Q80k276J449N57k499
4144a342O44J693j755O41J516j926n65K599j867l76J799r14j261J743j80j457
4160a008J089L13j370J189O72j249L77N58r66m37J672j513k9J544j012j085J705
4177D50l38r83J192N75j889P02J406k231J305L88j112L77J056j345p54K309j488
4194c80p79K036n31j554K033N2j908Q16J395j536n80J834j692M00J731j090j832
$$ plain form
4211 -1585 224 283 -584 607 331 -1572 713 721 -672 212 331 -574 -438 1019 -398 -371 1204 -367
4229 -367 -736 1294 26 -485 544 606 -1100 174 300 -977 45 737 -818 -40 1183 -55 -545
4246 -545 567 -125 -643 836 -84 -153 530 -315 -753 348 508 -600 -549 825 -722 -666 790 -580
4264 -580 -219 1056 -392 -998 452 335 -1017 653 308 -402 517 967 -483 -588 334 -834 -163 682
4282 682 -661 -495 81 -309 -371 699 159 -510 805 -137 -869 467 363 -641 -153 -69 -1049 58 776
4301 776 -40 -368 104 -261 -339 131 -240 -1012 311 -305 -1022 647 1419 -636 -434 322 -626 -423 551
4320 551 -1498 -346 883 -182 -530 556 346 -313 1278 258 -669 -314 775 -777 381 512 -512
4337 -512 276 1094 -669 62 711 -33 -59 893 -133 -377 1327 144 -708 60 170 -651 244 610 -801
$$ packed form
4211a585J809N9q67J191k76j903K285Qj393Q84J19r05J36J457j417K7J575j571
4229c67l69K030j268n11J029O2j706J274J26j277J022O92j555P78J223j238m90
4246e45J112o92n18J479r20o9O83q45m38J101J60j108N1J374j547N6J456j370
4264e80L61J275j448o06J450j17j352J670l45p10R19M50j450j05R22j168O71Q45
4282F82j343J66N76l90o2J070n40o69J315r42p32J336j04j004M88Q4r80J107P18
4301G76q16l28M72l65p8M70l71p72J323o16p17J669P72k055K02P56r48K03R74
4320E51k049J152J229j065l48J086k10o59J591j020r27L55J089j552J158J31j024
4337e12P88Q18j763P31O49p44k6R52j026k44J704j183q52P68J10q21Q95L66j411
$$ plain form
4356 -801 -335 1056 -440 -109 949 -777 -79 545 -289 -765 481 68 -756 169 179 -305 843 127
4374 127 -825 185 478 -322 -57 413 112 -683 1379 157 -5 422 143 -1820 803 873 -936 -57
4392 -57 196 -792 187 740 -299 -317 939 -508 -637 1132 -248 -801 1064 352 -815 780 -263 -168
4410 -168 -75 197 -692 12 185 -475 268 723 -428 -641 65 45 -1396 458 305 -676 919 437 -28
4429 -28 432 867 -316 -29 489 -531 -327 1095 -749 -253 155 -529 -211 535 74 -144 610 215 -456
4448 -456 496 956 -442 31 758 -822 -615 960 -926 -631 556 -465 -517 958 782 -897 186
4465 186 471 -577 707 575 -777 -35 653 -787 -210 649 -642 -254 682 -219 -401 932 -347 -175
4483 -175 449 198 -328 745 1015 -303 703 308 -408 -557 1105 -730 -269 643 505 -605 410 197
$$ packed form
4356h01M66J391j496L31J058j726O98O24q34m76J246m13q24R25J0m84J148p16
4374A27r52J010K93q00K65M70l01p95K062j222j62M27k79j963K623P0j809Q79
4392e7K53r88R79N53j039j8J256j447j29J769j380n53J865p12j167J595j043R5
4410a68R3K72q89P04J73o60P43M55j151k13P06k0j441J854j53r81J595m82m65
4429b8M60M35j183K87N18j020K04J422j844M96M08o84L18P46m61k18P54l95o71
4448d56R52M60j398M73P27j580K07J575j886K95J187j021n2J475j76j679J083
4465A86K85j048J284j32j352P42O88j440N77Q59j291L88R36r01j82J333j279J72
4483a75O24k51n26J073K70j318J006l95p16j49J662j835M61R12j38j110J015k13
$$ plain form
4501 197 -434 194 179 -408 277 -264 -577 846 -146 -397 55 1026 -974 -238 244 104 -541 726 408
4520 408 -741 841 258 -939 593 492 -704 365 508 -277 -213 67 -743 -186 308 32 -304 424
4538 424 -21 -409 576 -323 -503 681 -18 -540 483 241 -490 170 454 -380 -599 393 -59 113 -249
4557 -249 22 -582 -55 563 -605 96 688 -44 126 450 -357 -171 996 -513 -99 694 -94 -108 902
4576 902 -49 -415 594 203 -1033 -103 966 -977 112 722 -253 156 320 -954 -739 716 -593
4593 -593 -81 747 -299 -899 617 940 -608 61 -31 -659 728 5 -397 110 746 -495 94 935 -172
4612 -172 -376 63 -116 -489 496 -116 -28 432 189 -414 -121 106 -1164 10 972 -159 -102 284 -690 -380
4632 -380 404 -279 -147 372 52 0 -167 173 -975 -334 856 -99 66 252 -380 97 -40 175 -431 252
$$ packed form
4501A97o31O28j5n87O85n41l13J423r92k51M52R71k000P36M82j40o45J267l18
4520D08j149J582n83j197J532j01j196J069J43p85O4K80q10N57M94k76l36P28
4538D24m45l88R85q99j80J184o99n22J023k42p31O60K84q34k19R92m52J72l62
4557b49K71o04N27O18j168P01N92p32J70L24q07J86J167j509M14P93p88j4J010
4576I02r51l66J009l91j236R30J069j943J089O10r75M09J64j274K15J455j309
4593e93N12Q28j046o00J516L23j548O69r2o28J387p23m02N07O36j241N89Q41j107
4612a72k04M39j79l73R85o12Q8M60k43o03K93K27j270J174R62j131N7L86r74L10
4632c80P84o83J32N19l20n2j67L40j148O41J190r55J65J86o32M77j37K15o06O83
$$ plain form
4652 252 -226 -588 461 172 -620 614 314 -338 633 45 -569 506 542 -239 -275 647 -800 -222 320
4671 320 -439 -289 870 455 -973 418 449 -175 547 126 -21 386 155 -800 -139 255 -71 -178 897
4690 897 40 -504 500 -103 -133 361 434 -675 603 584 -523 541 -116 -390 -35 842 16 -289 45
4709 45 -154 -572 31 192 -818 -257 66 -293 25 -44 -869 251 175 5 -122 339 -91 26 539 -291
4729 -291 -648 72 64 -219 739 140 -441 896 105 -665 -210 325 -500 573 160 -775 -411 531 -541 -42
4749 -42 753 -48 -348 509 431 -240 -211 157 -354 -232 1178 -223 152 177 -727 -375 728 24 -655 402
4769 402 -678 92 844 -65 -254 952 331 -593 97 1018 -175 -481 1070 -708 -123 524 236 259 -177
4788 -177 192 -355 257 -23 -86 -139 359 -157 440 327 -484 744 875 -311 -369 117 -55 -321 237 194 -344
$$ packed form
4652B52m78l62J049k89p92J234l00o52R71n88o14J075L6p81l6R22j447N78N42
4671C20p59J50J159m15j428J391L1o24P22m21j47M07k31r55O61L94l26j07J075
4690H97q57n44J004o03l0M94P3j109J278j9j107J064o57k74L55Q77q26l05L34
4709D5j99m18O03J61j010N61L23l59L18o9q25J120p6j70j27M61m30J17N13q30
4729b91l57P20qk83R58n99n81J337p91p70M55N35q25J073m13r35L64R42j072M99
4749d2P95q01l00Q57p8o71K9L68n11J22J410j401L75K5r04L52J103p04o79J057
4769D02j080P70P52r09j89J206o21r24O90R21j193l06J551j778N85O47k88K3m36
4788a77L69n47O12k80o3n3M98n16N97j13q11J228J31j186n8M86j72k66N58m3n38
$$ plain form
4809 -344 788 95 -856 329 169 66 -214 -6 -399 -348 810 -64 -328 526 -366 -330 342 -247 231 606
4829 606 107 -137 97 266 -244 641 437 -305 485 49 62 -44 182 -498 14 303 -47 -309 130 206 -5
4850 -5 65 -530 -622 676 232 -597 -31 370 -522 -206 409 -51 126 329 -446 -467 236 685 -611 265 529
4871 529 -695 -20 348 -733 246 211 -140 213 560 -153 -28 607 -332 -202 426 530 -593 149 278
4890 278 -691 451 389 -664 999 483 177 160 93 -414 -325 436 26 -136 784 -162 -639 633 205 -564
4910 -564 350 314 -969 141 500 -316 130 388 -280 -257 570 10 -481 530 156 -1031 141 240 -525
4929 -525 174 327 -384 -318 273 537 435 -181 128 -306 513 -494 -88 1028 -327 -289 522 -36 -284 193
4949 193 531 -396 78 831 -150 177 487 -610 -462 -107 -396 7 565 -518 68 451 -608 -293 719
$$ packed form
4809c44J132o93r51J185j60j03k80K08l93N1J158q74k64Q54q92L6O72n89M78L75
4829F06m99k44K34J69n10Q85k04p42P90m36J3j06K26o80N12K89l50k62M39P6k11
4850eP0n95r2J298m44q29N66M01q92L16O15m60J77K03p75k1P03M49j296Q76K64
4871E29j224O75L68j081R79l5l51L53L47p13J25O35r39J30O28J04j123P42J29
4890B78r69J142o2j053J663n16l06j7o7n07Q9P61m10j62R20r46m77J272m28p69
4910e64R14l6j283J110L59q16M46K58o68K3Q27n60m91J011l74j187J172R9p65
4929e25O99J53p11O6N91K64j02o16L09m34Q19j007M06J116j355L8Q11n58k48M77
4949A93L38r27M74P53r81L27L10j097J48L55k89M03N58j083N86L83j059L15J012
$$ plain form
4968 719 138 -825 -254 -545 -341 -179 928 -518 -140 459 70 -671 349 124 -569 524 273 -88 288
4987 288 -25 -626 540 -183 -143 339 637 -978 55 495 396 626 589 -86 -749 162 -296 153 168 676
5007 676 -654 -70 -55 -232 352 475 -857 -346 548 -652 -443 442 -242 -109 -206 -145 216 143 -131 -139 466
5028 466 -163 -181 119 502 125 185 221 -61 34 376 -356 170 350 -225 -479 214 121 483 -65 370 -395 -246
5050 -246 698 140 -336 170 379 -789 179 -200 -293 333 -243 -280 458 -264 -189 41 -163 -510 9 -120 -555
5071 -555 102 32 -699 -222 1101 18 168 190 -599 -682 555 658 -521 408 206 79 -389 533 -568
5090 -568 361 399 -29 506 438 150 121 990 -67 -255 -112 -285 -768 346 907 489 84 -115 8 -223
5110 -223 337 -186 -672 663 -427 280 -169 23 -163 440 630 -180 269 -678 -213 -294 43 -286 -446 186
$$ packed form
4968G19n81r63N71k91K04J62J107j446L78N99l89p41J020k25o93J093k51l61L76
4987B88l13o01J166p23M0M82K98j615J033M40r9K30l7o75o63R11m58M49J5N08
5007F76j330N84J5j77N84J23j332N11Q94j200K09Q85o84J33r7O1L61p3k74qO05
5028D66o29j8L00L83l77O0L6k82R5L42p32N26J80n75k54O93r3L62n48M35p65J49
5050b46R44n58m76N06K09j168R68l79r3O26n76l7P38p22P5K30k04l47N19j29m35
5071e55O57p0p31M77J323j083J50K2p89q3J237J03j179R29k02j27m68R22j101
5090e68R29L8m28N35o8k88k9Q69j057j88J43j73m83J114N61m18m05j99J23k31
5110b23N60n23m86J335j090P07m49J92j86O03J90q10M49r47M65q1L37l29j60O32
$$ plain form
5130 186 -83 -674 318 108 -186 418 343 -556 208 135 -800 184 -83 -589 358 813 -39 222 388 -440 124
5151 124 599 -238 -180 422 -147 -672 243 178 -219 508 -414 -670 -500 269 -220 -108 507 -81 157 106 -132
5172 -132 286 5 -176 -213 397 -81 -688 299 499 -298 -71 507 -203 212 560 -270 -119 155 -234 -543
5192 -543 275 -545 -511 409 -48 -282 -39 840 -643 -92 115 -119 404 146 -393 45 370 616 -516 33
5212 33 429 23 523 58 -109 632 436 -480 541 -171 23 -466 552 -1040 140 777 98 -523 253
5231 253 101 66 128 -573 -468 131 -423 -323 196 -234 -404 35 751 -139 -40 -54 -13 -309 189 18 -338 521
5253 521 151 -157 1155 90 -464 217 -150 -272 -28 303 -205 -43 130 27 -27 220 -358 -163 341 -164
5273 -164 -476 -254 103 -344 -783 375 -222 1064 768 -157 -15 544 -182 -144 272 -683 135 727 309 101
$$ packed form
5130A86k69n91R92k10k94O04p5q99P64p3r35R84k67n06R47M55q52K61J66q28N64
5151A24M75q37N8O02n69n25R15o5l97P27r22k56J70P69m89J12O15n88K38n1k38
5172a32M18k81j81l7O10m78o07R87K00p97K27N78p10M15L48q30J51K74l89l09
5192e43Q18q20L4R20m57k34K43Q79j483N51K07k34N23k58n39M38L25K46j132N49
5212C3L96m06N00m65j67P41j96r16J021p12J94m89J018j592J180O37o79o21P76
5231B53j52l5O2p01J05N99n54J00N19m30j70M39P16q90R9j4M1k96M98j71l56Q59
5253E21l70l08J312j065n54O81l67j22K44L31n08J62J73j03n4K47n78J95N04n05
5273a64l12K22L57m47m39J158n97J286k96r25J42N59p26L8M16r55Q18N92m18k08
$$ plain form
5293 101 194 321 -240 82 396 -58 314 -335 -801 574 693 -39 -410 853 150 320 229 77 -255 207
5313 207 162 -307 188 -98 -390 12 -495 -151 -285 186 165 345 -617 37 170 77 -286 -659 340 228 -328
5334 -328 394 239 209 251 -296 -681 24 144 -327 -258 352 -440 67 193 -82 -29 58 -502 -167 261 316 -32
5356 -32 229 761 -288 4 219 -763 -290 252 -216 4 381 -553 -45 426 -289 -936 -350 553 -92 506
5376 506 18 -326 -499 -230 -501 -174 148 -161 200 376 -180 74 549 -238 195 -324 -227 95 153 289 -526
5397 -526 -37 767 214 -407 503 -789 0 544 -448 -66 -191 137 86 20 691 -380 277 363 399 684 546
5418 546 -399 -17 472 -54 9 -162 -311 -226 568 154 96 60 -402 182 -378 23 -280 293 149 -209 -433
5439 -433 955 -601 -357 146 -110 -1028 -444 -218 -39 32 -567 -701 -425 49 -62 231 402 -508 -122 840
$$ packed form
5293A01R3J27n61L22L14m54L72o49m66J375J19p32l71J263p03J70r1j52l32M62
5313B07m5m69M95k86k92M02n07L44j34M71k1J80r62O54J33r3l63l73R99j12n56
5334c28P22j55l0M2n47l85P05J20m71O9O10p92N07J26k75N3Q7n60L35M28N5l48
5356c2K61N32j049K92K15r82M73N42m68K20L77r34N08M71p15o47N86R03o45N98
5376E06m88l44j73K69k71L27L22l09L61J76n56K54M75p87M33n19R7L22N8J36q15
5397e26M89Q04n53o21R10j292P89N44r92L82j25L28n1o6O71j071O57Q6L6K85j38
5418E46r45L82M89n26O3j71j49Q5P94m14n8l6m62N84n60M01l03N73j44l58k24
5439d33J388j556K44N03k56r18N84K26J79P1n99j34K76M74j11K93J71r10L86R62
$$ plain form
5459 840 -190 -101 46 96 -655 248 -727 96 17 -94 -197 -175 -306 -71 -304 470 -448 -273 -50 -46 -164 809
5481 809 -23 115 670 395 -853 -667 -11 -522 -34 -556 -157 22 312 -372 -103 168 80 -416 363 50
5501 50 -264 474 -799 -90 88 303 -18 229 615 -340 24 87 191 -419 116 -527 -331 -16 26 463 453
5522 453 -124 -486 -114 69 -304 -203 -405 13 626 -357 113 337 -371 182 330 75 251 -657 -206 -286
5542 -286 -302 141 174 322 -71 50 111 252 154 -539 -568 502 -933 -133 490 59 25 474 -422 -342 -81 -293
5564 -293 127 219 -149 272 -63 -133 811 62 411 -241 268 358 -404 90 -34 391 -385 567 189 157 70 -213
5586 -213 -719 325 372 -535 250 514 -241 47 755 -449 181 -124 -135 158 640 -263 -672 256 -160 -11
5606 -11 158 12 -1026 373 -309 209 453 594 221 -227 705 -527 166 376 -126 -132 62 -648 193 237
$$ packed form
5459H40j030Q9J47N0p51R03r75Q23p9j11j03K2j31K35k33P74r18J75K23Mj18R73
5481H09q32J38N55k75j248J86O56n11M88n22L99J79K90o84K69K71q8m96P79l13
5501E0l14P38j273P09J78K15l21K47L86r55L64O3J04o10N35o43J96L15M2M37j0
5522D53n77l62L72J83l73J01k02M18O13r83M70K24p08N53J48k55J76r08M51q0
5542b86j6M43L3J48l93J21O1J41r8o93k9J070j435Q00O23m31l4M49q96Q0K61k12
5564b93M20R2l68M21l35p0R44p49L49o52N09R0p62M94j24M25p76R52l78l2q7k83
5586b13n06J044M7r07P85K64p55K88P08j204O30l05j1K93M82r03m09R28m16J49
5606a1J69j46j038J399o82N18K44J41l73m48R32j232O93K10n02oJ94p10Q41M4
$$ plain form
5626 237 50 -564 -77 454 -23 306 599 -317 238 -303 22 -280 -620 47 201 310 497 -29 504 469
5646 469 -235 -11 -236 -525 -21 341 -49 -189 433 91 -90 74 138 0 334 297 -562 552 569 168 326
5667 326 567 -777 -348 448 126 -245 487 -141 53 283 108 -321 -86 792 -581 225 269 163 -225 81
5687 81 -360 251 343 -156 -70 -480 -146 362 -42 -15 227 -42 374 -100 484 91 42 -218 -488 -1043 -616 240
5709 240 218 521 -519 -54 -755 444 68 233 218 -413 -196 -188 -103 -629 -53 716 -413 -425 624 -99 182
5730 182 -48 131 -190 206 122 288 511 217 -11 -160 337 325 24 435 -474 -483 863 -29 -342 616 -570
5751 -570 -172 253 195 -283 89 -302 309 339 385 22 -84 267 -582 -737 554 -173 503 -53 251 -257 290
5772 290 -221 -337 -628 563 -395 -90 254 -612 -527 -205 -92 -223 172 -32 -514 150 -267 253 -207 -341
$$ packed form
5626B37j87o14M87N31m77L29K93r16N55n41L25l02l40O67J54J09J87n26N33l5
5646D69p04K24k25k89N04L62l90j40O22l42j81J64O4j38L34l7q59J114J7m01J58
5667C26K41j344M29P96l22l71P32o28J94K30j75m29K35Q78j373Q06M4j06l88L06
5687H1m41O11R2m99Q6m10L34N08m04K7K42k69M16m74N84l93m9k60k70n55M27Q56
5709B40k2L03j040M65p01J199l76J65j5o31K17QQ5n26N76P69j129j2J049p23K81
5730A82k30J79l21L96q4J66K23k94k28j49M97j2l01M11r09rJ346q92l13R58j186
5751e70L98M25n8m78L72l91O11L0M6l63j06L51q49j55J291p27O76n56L04n08N47
5772B90n11j16k91J191r58L05L44q66Q5L22J13j31L95k04m82O64m17N20m60j34
$$ plain form
5792 -341 -162 637 37 -169 -8 186 -55 337 814 -380 -133 296 239 -17 200 -89 18 616 -299 -453
5812 -453 380 234 122 -194 107 -572 160 490 -745 -471 -122 94 -422 -242 44 -538 -152 164 -351 147
5832 147 -293 -610 195 -98 -330 243 101 -25 -477 -353 -184 311 -465 243 259 500 150 -267 225 64
5852 64 340 75 -387 127 -351 226 243 -61 597 -194 130 338 424 -115 -37 365 -13 -331 -75 -214 66
5873 66 390 -396 35 460 153 -132 -102 271 154 321 -315 -393 -197 -645 -319 -187 578 388 -254 -330 -327 -8
5895 -8 745 91 234 560 -42 -167 -277 -67 357 623 378 144 -4 -78 245 -526 -151 -390 -258 -109 -118 297
5917 297 589 -83 91 -203 -355 -295 294 -551 -169 -138 2 -19 576 601 -373 -389 -34 -348 -65 -17 -52 -697
5939 -697 729 -914 -350 219 -526 425 624 -716 -185 -188 907 -289 -113 -80 397 134 -398 -29 -622
$$ packed form
5792c41J79P99o00k06J61J94k41L92M77j194K47M29n7k56K17k89J07N98r15j54
5812d53Q33j46j12l16L01o79P32L30j235K74L49K16n16J80K86n82L86L16n15M98
5832A47m40l17Q05k93k32N73j42j26m52J24J69M95p76P08J6K41l50m17M92j61
5852F4K76k65m62N14m78N77J7l04O58p91L24K08Q6n39P8M02l78l18K56j39K80
5873F6L24p86M31M25l07k85L0L73j17J67o36p8J96m48L26J32P65j90o42p6LL19
5895hP53o54J43L26o02j25j10K10M24K66k45k34j48p4L23p71L75k39J32J49rM15
5917B97K92o72J74k94j52O0N89q45L82L1J40k1N95K5r74j6L55l14K83M8l5o45
5939f97J426j643N64N69p45R51J99j340N31lJ095j196J76L3M77k63n32L69n93
$$ plain form
5958 -622 789 110 -13 307 110 80 -32 72 49 -355 693 -196 88 -205 245 106 138 467 191 62
5978 62 -602 -251 560 313 -418 125 -361 -167 -89 212 4 211 -106 196 167 30 -1069 413 97 -446
5998 -446 236 112 197 38 155 -306 -277 379 492 170 325 -599 -19 -143 -153 -310 474 273 262 140 17
6019 17 205 -412 619 -41 -388 565 122 -437 51 -178 35 268 -380 -500 107 379 -128 31 120 107 -37
6040 -37 -270 -88 -47 851 169 347 152 -469 244 833 375 -169 -381 -457 213 -156 -396 -57 -261 395 -7
6061 -7 -131 41 -494 -566 292 552 -479 -44 -99 -97 -64 -81 -1 -533 337 -351 271 -119 338 49 120 178 -300
6084 -300 301 -81 360 143 360 -47 -563 -169 -661 -487 376 -546 -177 588 522 149 63 696 -116 -109 148
6105 148 -297 104 90 195 349 -703 584 -386 147 -46 -390 168 612 -158 183 195 -237 369 549 -696
$$ packed form
5958f22J411o79j23L20j97l0j12J04k3m04J048q89K84k93M50j39L2L29k76j29
5978F2o64L51Q11k47p31N43m86J94P8L01k08K07l17L02k9j37j099J482l16n43
5998d46O82j24Q5j59J17m61K9O56J13l22J55r24N80j24j0j57P84k01j1j22j23
6019A7J88o17J031o60l47R53m43n59M88k29K13K33o48j20O07K72n07J59Q9j3j44
6040c7k33J82M1Q98o82J78j95o21P13N89m58n44k12p6O70l69k40L39k04O56m02
6061gj24J72n35p2Q58K60j031M35n5KL3j7Q0n32Q70o88O22l90M57k89P1N8m78
6084c00O01l82M41k17K17m07n16L94m92J74Q63r22L69P65o6l73q6O33q12PK57
6105A48m45M01j4J05J54j052J287r70N33j93l44N58M44p70L41J2m32O06J80j245
$$ plain form
6125 -696 69 -290 -583 17 266 -48 -171 -102 -108 268 486 -71 -81 325 -301 -129 72 142 369 346 562 -107
6147 -107 -455 222 -238 -194 147 -184 -264 333 -166 -93 460 300 -82 -279 -206 -641 -466 -148 -297 161 168 219
6169 219 -128 -187 160 -378 293 -26 -121 310 413 200 805 -396 -251 295 198 -53 -302 58 219 977 -560
6190 -560 623 -131 -443 600 78 119 226 147 -2 -373 551 -56 -234 61 451 110 -792 -544 -253 195
6210 195 -14 131 -176 -202 -218 -443 35 415 -78 -474 644 -387 229 -35 -182 26 -84 838 -97 179
6230 179 -316 -137 295 405 -483 319 291 154 -279 359 805 100 289 570 -408 -48 563 63 -470 -742
6250 -742 288 431 504 -462 -589 -81 70 -595 -174 -650 -101 -115 -180 -141 -39 -28 -46 -520 -269 105 288 444
6272 444 209 -45 113 47 -152 -248 47 411 80 410 -457 590 -319 -80 -384 -169 -496 -545 -123 -102 -159
$$ packed form
6125f96P65l59k93O00K49l14j23O9oL76K18n57j0M06o26J72K01P0K27k3K16o69
6147a07l48O77m60M4L41l31q0N97m99P3N53j60l82j97P3m35J75L18j49M58PN1
6169B19l47n9L47n38O71l19r5M31J03k13O05j201J45N46r7k51k49L60J61P58j537
6190e60J183p54l12J043n22M1J07p9j49l71R24o07j78K95L90l41r02K48K91M48
6210A95k09J45l07k6j6k25M78L80m93l96J118j031O16k64j47K08j10R22r35K76
6230A79m95J79M32J10q88Q02k8j37m33O38M46p05J89K81r78L60O11n00n33k72
6250g42J030J43P3r66j27N08J51o65M21m76N49j4o5L9J02J1j8m74K51L74J83J56
6272D44k35k54J58o6j99r6K95L64l31L30q67J047r09K39l04K15l27m9M22K1n7
$$ plain form
6293 -159 -304 161 -431 345 -302 145 -95 174 -381 139 482 323 574 110 -820 -1 157 -124 104 -99
6313 -99 -443 -576 113 21 380 4 195 -390 278 -3 25 306 201 295 -24 40 -29 -512 508 -377 -287 -63
6335 -63 -83 -10 280 -48 371 -139 441 607 -220 641 609 552 -24 -124 -675 113 159 -4 161 -136 101 317
6357 317 -216 -10 13 295 -31 -648 951 -62 -520 -213 302 208 104 -293 206 657 -161 -257 149 994
6377 994 -236 -775 599 -343 13 -198 315 -134 503 205 -178 157 -37 -312 -46 324 -196 -60 512
6396 512 231 97 284 199 227 177 345 47 224 -68 10 -24 307 -331 -14 10 621 -236 -105 -793 -32 29
6418 29 183 -630 521 -66 -445 -42 -24 -271 101 62 277 432 249 -73 -294 38 223 98 -899 426
6438 426 596 309 -110 -742 -72 703 -714 -117 -500 86 144 -318 -2 70 313 334 81 148 -436 -538 -21
$$ packed form
6293a59j45M65n92P76o47M47k40K69n55N20L43j59K51m64r30Q19J58k81K28k03
6313i9l44j33O89r2L59l76J91n85O68k81K8K81j05R4l19O4o9m83J020q85R0K24
6335f3k0P3K90l28M19n10N80J66q27Q61l2n7n76j00n51P88M6j63J65k97K37K16
6357C17n33K06K3K82l26o17J599j013m58L07N15r4j04l97M99M51q18r6M06Q45
6377I94j230n39J374r42L56k11N13m49O37k98l83L35j94k75K66L70n20J36N72
6396E12k81j34J87q5K8n0J68k98J77k92P8l4L31o38L17K4O11q57J31o88P61O1
6418B9J54q13J151n87l79M03J8k47L72l9K15J55j83l22k21L32J85j25r97J325
6438D26J70k87m19o32O70P75j417N97l83N86N8m62L16P2K43K1k53O7n84j02N17
$$ plain form
6459 -21 148 -177 237 597 286 44 -167 18 433 272 -502 446 -494 -150 -421 -54 774 402 -22 -173
6479 -173 269 -390 -104 -259 182 -184 233 -52 -75 -16 360 52 -366 85 59 -288 126 -156 -860 -4 -442
6500 -442 -345 -212 541 12 -362 -278 180 -617 -135 579 251 -425 665 -507 514 194 261 367 -489 80
6520 80 -134 199 498 -202 -697 194 386 -177 383 -3 -874 -467 -43 -396 306 293 533 22 -228 483 736
6541 736 -561 391 -436 557 661 199 -448 -360 377 1 -520 61 138 -86 317 -180 -69 -185 27 -139
6561 -139 99 721 -194 -458 391 -503 -85 227 -712 -127 221 264 594 -162 303 -115 -20 146 -981 75
6581 75 219 46 79 59 -225 449 56 -123 170 -192 283 -128 38 1027 -124 441 96 -482 -238 -665 445
6602 445 521 788 -122 -125 -212 -345 204 138 488 488 482 94 341 -31 76 -503 -48 -19 -423 383 -675 -498 -734
$$ packed form
6459b1J69l25M14L60l11k42k11J85M15j61p74R48r40L44k71L67Q28l72m24j51
6479a73M42o59K86j55M41l66M17k85k3N9L76l08m18M51k6l47M14k82p04Q56m38
6500d42R7J33P53n29l74Q4M58p97M82P14l28o76J090j172J021l20O7J06q56N69
6520H0k14L33K99p00m95Q91J92n63N60l86q71M07M24l53P02j3K40n11k50P11K53
6541G36j297R52q27R93J04m62o47Q8P37l76n21N81P7k24M03m97J11j16K12j66
6561a39K38O22r15k64Q49q94M18L12r39N85L48M3L30p56M65m18R5J66j127J056
6581G5J44j73L3k0k84O74l93j79K93l62M75m11J66R89j151N65l45n78K44m27J110
6602D45P6K67r10lq7j33N49o6L50%ol88K47l72J07n79M55K9m04Q06j058J77k36
$$ plain form
6625 -734 -196 319 -230 -76 157 223 258 180 -144 -204 117 412 172 -422 -687 3 263 -142 77 136 176 -528
6647 -528 -100 132 -279 259 -20 -16 -21 75 -226 595 6 -270 -285 120 -95 -176 305 232 -47 25 185 -97 280
6670 280 375 -498 -144 223 183 176 94 -18 -265 -264 436 -734 -45 4 32 -59 -86 569 375 620 -126 -386 683
6693 683 282 -387 83 394 -435 -24 169 92 205 -453 -153 -272 -527 -494 367 280 25 112 -189 -134 445 -434
6715 -434 -453 -33 -172 164 426 234 597 -79 -65 -406 342 -185 -363 37 -418 580 -32 -206 -657 -327 -551
6736 -551 234 -261 -111 536 -663 413 102 -438 -577 -99 293 90 183 -62 183 504 185 -8 71 173
6756 173 604 -258 10 178 -190 111 -103 -272 -693 104 20 100 -194 368 31 106 -568 -302 -11 -196 -267
6777 -267 73 436 -863 285 779 -388 -681 -612 31 -127 -82 -251 -395 -387 88 -502 -312 -502 -39 397
$$ packed form
6625g34N38N15n49J54K33O6L5p8l24o0L21K95k40n94k65O90K60m05K19N9M0p04
6647e28M28K32m11N38k79MnR6l01Q21n89k76j5M05k15q1M81p3k79P2J60k82L77
6670B80R5q73L54L67m0pq2j12k47JP00j170O89M9K8r1k7O55j94K45p46k60J069
6693F83m01o69M70L11q29M11J93p7J13o58L00j19k55L3Q61q7k55Q7l01N5N79q79
6715d34j9M20j39L36K62j92L63o76J4l41P48n27j78M00m55R98o12j74m51L30k24
6736e51P85m95J50O47j199J076l11n40j39M78L92k03R3k45K45L21l19j93P9J02
6756A73M31q62K68J68l68L01k14j69m21P97q4Q0k94N62l37P5o74K66K91j85p1
6777b67L40L63j299J148M94j167k93O9O43j58M5j69j44QM75n90J90j90M63M36
$$ plain form
6797 397 368 346 95 486 -704 -373 179 817 110 -341 -176 -51 720 146 174 -238 -279 77 34 -103 -143 -204
6819 -204 -31 425 320 295 199 106 -690 501 377 -630 114 463 -231 -55 19 -58 198 -29 253 264 -743
6840 -743 -534 429 138 -586 -16 35 -109 518 86 191 -382 93 -343 626 -357 -391 -115 -309 -315 -678 404
6861 404 99 235 432 -350 -294 274 7 -163 -171 432 -454 -246 48 -592 360 147 -1036 -271 -121 17 749
6882 749 -51 -323 -210 283 116 225 23 -141 -81 260 -84 -54 -102 -370 20 -169 -201 15 32 195 -124 507
6904 507 610 -6 548 361 205 129 153 -214 259 -300 -695 -396 -608 -239 -515 297 39 183 -71 -173 -487
6925 -487 -26 -243 -510 -84 39 -144 -536 -106 -337 -445 159 -93 -55 189 459 -466 37 -194 -246 -200 1
6946 1 -557 -151 797 114 107 161 410 -241 116 186 -392 -373 417 -62 -318 220 131 489 -506 150 320 -243 504
$$ packed form
6797C97k9k2k51L91j190L31N52O38p07m51J65J25P71n74K8m12m1L56m3j37m0o1
6819b04J73M56j05k5r6r3p96J191j24j007P44L49o94J76P4p7K56k27K82J1j007
6840g43K09R63k91p24N70N1j44O27m32J05n73M75m36R69r83l4K76j94ol63J082
6861D04l05J36J97p82N6N68k67j70qO03q86K08K94o40R52k13j183P65J50J38P32
6882G49q00k72J13M93j67J09k02j64O0L41l44L0m8k68L90j89l2K16J7J63l19O31
6904E07J03o16N54j87j56p6K4l67M73n59l95K99k12L69k76Q12k58J44k54j02l14
6925d87M61k17k67M26J23j83l92M30k31j08O04k52L8K44K70r25N03k31n2M6K01
6946An58M06R48o83pN4K49o51L57P0n78J9P90m79k56N38q9L58r95O56J70n63P47
$$ plain form
6969 504 -20 28 104 -1 505 260 -264 -208 558 -49 529 -680 244 444 462 -213 54 117 -166 137 -585
6990 -585 125 246 35 -160 -298 -406 -89 -485 -250 -174 -194 -55 229 100 -115 539 163 537 -41 -71 -441
7011 -441 -551 -230 -17 -205 -269 -69 39 -301 -103 -10 -55 -202 609 146 26 -62 -48 -101 162 193 219 340 -19
7034 -19 86 -191 290 -586 422 443 -485 -48 658 30 -410 -6 -26 -321 -494 -458 360 659 -324 -214 -194
7055 -194 -256 -430 665 392 -64 397 -294 -472 394 74 -196 -758 -595 -285 471 262 -133 134 -66 169
7075 169 -270 -118 -22 130 156 -60 324 413 272 284 319 211 -176 182 24 17 -661 560 274 -172 33 -213
7097 -213 101 -336 -240 251 -248 -468 -239 217 861 -241 -380 -231 248 181 -723 19 82 -174 -42 189 -471
7118 -471 23 -242 -300 -682 290 -209 394 -26 -49 -681 -536 -210 26 -117 -107 19 -120 376 186 165 137 -290
$$ packed form
6969E04n24M8P6j05N06k45n24N6P66o07N78j209R24K00J8o75K67O3k83L03p22
6990e85P10J21k11j95j38j08L17l96K35P6k0J39K84j29k15O54l76L74n78l0l70
7011d41j10L21K13j88o4K00J08l40J98R3m5j47Q11m63j20q8J4n3K63L1K6J21l59
7034a9J05k77M81q76J008K1r28M37P06o28m40M04k0k95j73L6Q18K99r83J10K0
7055a94o2j74J095k73m56M61o91j78Q66l20k70n62J63L10P56k09l95K67k00K35
7075A69m39J52R6J52K6k16L84Q9j41J2L5j08l87L58j58po78J221k86m46K05k46
7097b13L14m37R6M91m99k20K29M56O44j102j39J49M79o7r04P42O3k56J32K31o60
7118d71M94k65n8l82R72m99O03m20k3o32J45L26K36j43J0J26j39M96j90k1k8m27
$$ plain form
7140 -290 -348 84 148 -67 -172 206 -62 -42 162 -370 -694 198 -89 604 -168 583 199 -533 360 235 413
7161 413 448 -338 -36 -161 355 376 -290 103 226 -24 -132 -56 -271 325 62 -134 756 74 -71 151 110
7182 110 331 590 -39 319 -46 -517 357 643 53 -68 713 -89 30 -125 197 -248 -118 131 -806 -28
7202 -28 -681 -344 -445 -89 -644 170 251 70 164 28 -127 145 268 -38 69 -163 406 -311 353 26 -118
7223 -118 -188 -97 178 -269 -125 306 -1139 246 -47 -227 -66 326 -662 45 364 -403 588 -256 278 -107
7243 -107 -325 -667 141 684 -52 -243 38 295 52 -238 268 -459 142 -497 -219 -389 -341 -259 685 253 -389
7264 -389 -143 295 191 -322 -456 -511 -505 -310 370 -145 715 -139 22 -109 -188 -627 -280 179 -114 528 318
7285 318 -56 -92 -394 -10 -421 107 -417 330 -220 641 237 112 -1 -45 67 131 -288 -209 185 -15 -271
$$ packed form
7140b90n8M32O4k15j05L78k68K0K04n32l24Q92k87O93p72P51l84p32Q93j25J78
7161D13L5p86L02j25N16K1o66L93J23k50j08P6k15N96k63j96Q90o82j45K22m1
7182A10K21K59o29L58l65m71Q74K86n90j21P81q02J19j55L22m45J30K49r37P78
7202b8o53L37j01L56n55Q14Q1j81R4j36j55K72J23l06J07k32N69p17O64l27j44
7223a18p0R1K75m47J44M31j445J385k93j80J61L92r88P07L19p67R91q44N34l85
7243a07k18l42Q08N43p36j91K81K57k43k90N06p27O01o39K78j70M8Q2R44m32o42
7264c89K46M38j04n13j34n5OJ95O80n15Q60q54J61j31p9m39L47M59k93O42k10
7285C18l74l6l02L84m11N28n24P47n50Q61m04j25j13m4J12O4m19P9L94k00k56
$$ plain form
7306 -271 54 512 8 93 -120 301 251 48 89 -547 -170 -103 21 -274 68 -20 -243 -364 -162 -234 -823 -135
7328 -135 -228 -290 561 206 -418 161 117 -37 114 490 -366 304 -484 -275 402 -913 -130 333 -166 -1 -448
7349 -448 -168 -371 -194 361 134 -229 -142 90 7 -373 -297 -9 -511 -236 -224 -154 -271 -385 -183 499 322 -8
7371 -8 -111 -32 216 -75 -274 146 167 270 -186 -96 -91 322 -39 422 272 -304 -402 451 -472 -163 -254 -202 -357
7394 -357 -38 -59 -487 69 -248 -286 579 523 -551 263 -51 -135 -315 -258 471 286 -152 -72 30 1101 459
7415 459 120 6 -528 -94 136 334 -71 -362 41 -26 154 -646 -339 -137 -204 -535 -128 -162 167 961 -378
7436 -378 17 -191 93 -97 59 449 293 -101 -577 811 -11 277 153 159 212 -197 -94 -181 453 285 58
7457 58 -470 222 -543 366 -195 208 97 -571 474 271 -126 -665 88 46 9 299 284 192 -116 -339 -65
$$ packed form
7306b71L25M58n04Q5k13M21n0k03M1o36L77O7J24k95L42q8k23j21K02p2n89O88
7328a35r3o2Q51l55o24N79m4j54J51L76q56O70p88K09O77j315P83M63m99J65m47
7349d48K80k03J77N55k27l63Q7K32q3l80P6K88n02K75J2P0j17j14K02O82j77l30
7371hj03P9K48k91j99M20K1J03m56R0NM13l61M61j50n76r8Q53r23L09r1N2j55
7394c57L19k1m28N56l17l8Q65n6j074Q14l14q4j80N7P29j85m38Q0J02J071o42
7415D59l39j14n34M34K30J98m05k91M03o7J80q00L07K02o7l31M07l4L29P94j339
7436c78L95k08K84j90J56L90j56l94m76J388q22K88j24ON3m09J03q7O34j68k27
7457E8n28O92p65R09n61M03j11o68J045k03l97n39P53m2l7K90j5r2l08k23K74
$$ plain form
7478 -65 -58 165 -251 38 80 279 -294 759 256 465 -415 -39 273 209 280 47 -329 652 428 38 -399 -80
7500 -80 880 -312 -57 -461 28 612 132 -112 83 -11 -292 70 -402 614 -441 -464 -103 220 103 127
7520 127 -131 358 486 173 29 -115 29 -4 321 -369 -360 -561 -275 -16 106 -137 303 -275 -232 497 249
7541 249 -205 -731 205 -153 121 115 56 -248 -122 -661 -196 -328 -299 243 159 251 325 636 400 45 793 673
7563 673 583 -17 -2 429 -286 -372 -2 126 348 -530 -76 392 -80 389 693 -251 29 -240 146 -123 144
7584 144 58 36 -33 161 66 331 496 -107 -160 262 95 24 254 -29 -142 -115 450 -350 239 257 -19 -35 385
7607 385 -570 137 -186 312 -22 34 493 -207 -287 -174 -12 204 164 -371 -170 -165 -273 -81 -426 -558 -105 358
7629 358 -307 469 77 -551 -606 -645 -528 828 510 -242 918 221 -402 47 -334 -370 -63 -465 407 157
$$ packed form
7478f5PK23m16K89M2J99n73J053n03K09q80L76L12o4P1k33l76R81k24l90m37L19
7500h0R60j192K55m04M89N84m80k44J95r4k81L62m72J016j055k3L61L23j17K4
7520A27k58M89J28l13j44j44J44l3L25o90Rk01K86K59J22k43M40n78M3P29k48
7541B49m54n26R36l58K74on9l04J26n39M65j32K9N42q4R2P4L11k36l55P48j20
7563F73r0o00J5M31p15q6L70J28K22q78M54M68m72M69L04r44K80k69L86k69K67
7584A44q6k2o9J94r5K65J65o03n3M22j67p1K30k83j13K7N65q00N89J8k76j6M20
7607C85r55P07l23M98l34N6M59p00q0J13J62K16m0n35K01Nj08J92l45j32M53M63
7629C58o65P76l92o28n5l9J17J356l18p52J160o97o23M49l81l6L07m02Q72k50
$$ plain form
7649 157 166 712 -143 -673 -35 -441 -120 -13 -232 32 200 -97 105 178 -53 84 12 -698 -549 514 -419
7670 -419 268 -562 300 48 -37 -614 157 -484 528 18 -480 35 370 -97 -118 68 151 -296 310 1061 -877
7691 -877 0 -54 268 -460 -357 463 685 647 0 262 134 -321 -54 -145 769 -96 538 116 151 402 230
7712 230 -251 114 -74 54 104 -6 236 -466 -183 -58 -345 -196 52 333 176 -179 -421 -383 73 -427 424
7733 424 507 28 962 150 36 976 -369 -84 -282 343 243 -324 -11 -22 165 249 -699 482 -113 -399
7753 -399 -556 163 -194 364 -305 95 -288 91 66 -296 -455 30 898 -404 -328 118 303 -124 286 125
7773 125 125 -83 461 -220 -354 -67 -192 -336 349 -145 498 248 -3 -405 -589 76 398 -599 117 -197 81
7794 81 -412 173 -260 142 -322 -142 -235 -305 51 504 92 466 518 -138 -209 -368 -14 -131 63 562 983 -121
$$ packed form
7649A57RN46q55n30O38m06L21J07k19K64J68k97K02P3k31J37p2p10J49J063r33
7670d19O87q30Q62k52q5n77P71o41J012n10m98N15L35m67k1J86Q3m47O06P51j938
7691h77Q77n4L22p28J03Q20K22l8o47K62j28m55K67r1R14q65O34m22L5K51j72
7712B30m81L65j88J28N0j10K42p02K83J25k87J49K48K81j57l55k42L8M56n00Q51
7733D24Q3m79R34q12j14R40j345K85j98O25j00n67L13j1J87Q4r48J181n95k86
7753c99j57P19l57N58o69M00l83L79k5l62j59M85Q68j302P6M46J85m27M10j61
7773A25%k08N44o81j34K87j25j44O85m94O43k50k51m02j84O65L22r97P16l14K78
7794H1m93N85m33M02m64J80r3p0L56M53m12L74N2o56p1j59L54j17J94M99M21j104
$$ plain form
7816 -121 219 -55 228 399 -98 505 -358 106 215 -323 -111 -400 140 61 -243 -302 522 535 -52 -362 -27
7837 -27 -290 330 -507 -389 68 746 18 138 233 -152 825 -568 5 80 -70 -110 -65 64 10 -33 144 137 207
7860 207 -193 -79 278 -150 248 770 -223 29 -391 -552 -437 -373 231 -1 -397 -557 456 -76 101 365
7880 365 -297 -244 -179 -162 537 302 307 508 -88 -246 -198 -281 -288 332 -20 340 -84 550 -1 -219 347 288 -225
7903 -225 -236 -147 296 476 -322 137 -286 -17 164 -194 59 -130 226 223 -191 -569 187 415 -610 147 -34
7924 -34 -137 -6 333 284 455 -90 191 91 327 -354 -258 272 -245 601 203 135 377 502 95 483 24
7945 24 -507 522 139 264 317 -458 -137 -247 186 366 247 -52 -187 92 -196 -290 393 -7 -138 -514 -210
7966 -210 282 -56 356 -346 -18 -353 -344 -149 -270 888 202 448 -363 157 -57 -1046 671 -120 -139 -61 178
$$ packed form
7816a21L40k74K83J71m97O03q63M64J09n38K12k89N40p9l04n9Q24J3n87l10L35
7837b7k63O20q37J18M57O78p28J20R5l85R77j393N73P5j50m0M5J29n4m3J77pP0
7860B07m00J14L57m28L98N22r93K52m20j61J15O4O04k32l96j60J013n32J77K64
7880C65o62N3O5J7O99k35NK01n96j58M8q3pO20l52L60m24O34n51k18N66n9n13
7903b25j1Q9M43J80p98M59m23K69J81l58K53j89L56lm14l78P56K28j025P57j81
7924c4j03J31L39m9J71n45K81j00K36o81R6N30n17Q46l98o8K42J25m07L88m59
7945B4n31J029l83J25N3p75L21j10M33J80j19k99j35K79k88r4O83m00j31l76L04
7966b10M92l38M12p02L28l35RJ95j21J158o86K46q11N20k14r89J717p91j9P8K39
$$ plain form
7987 178 -52 98 -239 681 79 254 -35 53 6 -170 -203 -610 486 243 303 33 -141 122 -412 -420 -389 -367
8009 -367 -450 -748 866 -187 -363 -576 -134 -430 7 316 -188 -31 -201 -2 40 -117 142 -122 280 100
8029 100 699 483 -15 658 -106 112 45 -222 216 -117 9 -480 -130 -123 -151 154 146 -178 166 -334 249 221
8051 221 -28 -488 -236 -57 -543 487 -173 636 -386 338 382 -113 -5 492 179 159 47 -74 -177 -179 -126
8072 -126 -125 302 18 -142 -318 849 121 189 -148 13 -198 125 -133 -30 -37 613 109 -100 -7 375 683 198
8094 198 -102 254 -82 85 -405 824 -19 -531 70 -29 48 201 245 -321 32 165 -13 -217 -23 -225 -287
8115 -287 -253 101 261 -63 -118 -317 -266 489 567 12 856 -415 -296 -252 -463 -295 164 74 330 122 214 649
8137 649 195 -470 335 141 -78 343 -443 127 -522 -232 -181 -92 -113 158 803 -163 -285 97 -72 18 163
$$ packed form
7987A78k30J50l37R20o02J75k89Q8m7j76l3m07J096k43O0k70j74K63n34qL1K2
8009c67q3k98J614j053j76k13M42k96M37L09n04J57j70J99M2j57K59k64M02j80
8029A00N99k16m98O73p64K18o7k67M38l33J26m89L50Pk8L05ql24L44n00N83k8
8051B21k49m60K52J79m86J030o60Q09j022P24M4m95J08M97l13k0j12j21j03kN3
8072a26JM27k84j60j76J167p28O8l37J61k11L23k58J03pO50n04k09R3L82L08m85
8094A98l00L56l36J67m90J229q43n12O01r9P7J53M4n66L53J33j78k04J94k02o2
8115b87L4L54J60l24n5j99N1P55P8n55Q44j271J19M4k11J68M59r0K56k08R2M35
8137F49m54o65Q05j94k19M21p86N70o49K90N1Q9k1K71O45r66j22L82j69R0J45
$$ plain form
8158 163 230 -336 -61 84 -447 -512 19 -235 -111 -98 45 -50 -152 177 -96 537 -105 141 -529 601 150
8179 150 -209 418 330 105 414 -208 -110 357 -449 -440 -214 -521
$$ packed form
8158A63O7n66K75J45n31o5N31k54J24J3J43r5j02L29k73O33o42K46o70J130m51
8179A50l59O27q8k25L09o22R8M67q06RK26l07
8191e21
$$ Imaginary data points
##PAGE= N=2
##DATA TABLE= (X++(I..I)), XYDATA
$$ plain form
0 -7 -55 58 -55 19 -48 104 -154 159 -145 177 -246 322 -365 395 -451 548 -654 751 -834 941 -1081
21 -1081 1242 -1408 1576 -1762 1983 -2229 2503 -2795 3130 -3496 3913 -4391 4940 -5583 6322
36 6322 -7191 8247 -9572 11265 -13473 16453 -20596 25657 -8200 741966 70862 -780983
48 -780983 517548 351187 -709658 134903 590785 -534196 -177428 602661 -231980 -398016
58 -398016 478169 31467 -436767 256899 212991 -358535 59681 253154 -207620 -66648
68 -66648 201273 -77941 -86844 98678 -12232 -32844 27465 -34193 39027 20401 -103102
79 -103102 72724 84491 -173214 38110 184285 -193179 -64955 269509 -135370 -193900
89 -193900 294835 -14108 -304547 243071 137011 -353535 122755 270084 -324811 -32241
$$ packed form
0gm8J13j13P4o7J52k58L13l04L22m23N68o87P60q46R99j202J405j585J775k022
21a081K323k650K984l338L745m212M732n298N925o626P409q304R331j0523J1905
36F322j3513J5438j7819K0837k4738K9926l7049M6253l3857P50166o71104q51845
48g80983J298531j66361j060845Q44561M55882j124981L56768P80089q34641j66036
58c98016Q76185m46702m68234O93666m3908n71526M18216J93473m60774J40972
68f6648K67921k79214q903J85522j10910k0612O0309o1658P3220j8626j23503
79a03102J75826J1767k57705K11324J46175l77464J28224L34464m04879n8530
89a93900M88735l08943k90439N47618j06060m90546M76290J47329n94895K92570
$$ plain form
99 -32241 349475 -226647 -177061 355550 -90830 -278913 297855 47747 -324181 197761
109 197761 161892 -311761 84292 233011 -261378 -19993 265613 -188447 -105322 263947
119 263947 -109380 -166461 240112 -33669 -206316 201401 38383 -229002 150111 103744
129 103744 -233449 88639 160125 -218720 19075 203288 -184198 -52202 226434 -131176
139 -131176 -119661 227833 -64622 -173879 205157 6607 -209125 162793 75395 -222611
149 -222611 106765 134947 -215298 41150 181645 -189657 -25076 210878 -147530 -91797
159 -91797 223551 -91028 -151103 215183 -23082 -199125 186072 49518 -229747 135362
169 135362 123857 -237120 64991 187111 -215793 -15421 229530 -167918 -98054 246276
$$ packed form
99c2241L81716n76122M9586N32611m46380j88083N76768k50108l71928N21942
109A97761l5869m73653L96053J48719m94389K41385K85606m54060Q3125L69269
119B63947l73327n7081M06573k73781j72647M07717j63018k67385L79113m6367
129A03744l37193L22088P1486l78845K37795J84213l87486J31996K78636l57610
139a31176J1515L47494k92455j09257L79036j98550k15732L71918q7398k98006
149b22611L29376K8182l50245K56448J40495l71302J64581K35954l58408N5733
159i1797L15348l14579o0075L66286k38265j76043L85197j36554k79265L65109
169A35362j1505l60977L02111J22120m02904K00372K44951l97448O9864L44330
$$ plain form
179 246276 -96516 -169169 230428 -13208 -218965 186574 70278 -240871 119827 143655
189 143655 -231802 42323 195308 -195947 -36816 221812 -140619 -105950 222032 -73427
199 -73427 -159579 200147 -3338 -195199 159884 62672 -208222 106550 118943 -202279 46445
210 46445 162747 -178431 -16933 191322 -139325 -75768 201868 -88487 -129753 195164
220 195164 -28637 -172331 168923 36400 -198866 125935 97561 -205990 67381 152425
230 152425 -190791 488 191818 -155067 -68349 209117 -99561 -129504 203178 -33285
240 -33285 -175917 173612 37373 -203908 124249 101884 -204843 62845 152832 -184442
250 -184442 -3517 184942 -145500 -66598 197200 -92941 -120379 189993 -33652 -160640
$$ packed form
179B46276l42792p2653L99597k43636k05757M05539j16296l11149L60698K3828
189A43655l75457K74125J52985l91255J59131K58628l62431L4669L27982k95459
199g3427q6152L59726k03485j91861L55083r7212k70894L14772J2393l21222K48724
210D6445J16302l41178J61498K08255l30647O3557K77636k90355m1266L24917
220A95164k23801j43694L41254j32523k35266L24801k8374l03551K73371Q5044
230A52425l43216J91279J91330l46885Q6718K77466l08678k9943L32682k36463
240c3285j42632L49529j36239k41281L28157k2365l06727K67688Q9987l37274
250a84442J80925J88459l30442P8902K63798k90141k7438L10372k23645j26988
$$ plain form
260 -160640 164483 26909 -185233 123265 84825 -191873 71654 133995 -180036 12458
270 12458 171140 -151332 -49961 192463 -105250 -108167 192905 -46880 -155629 171695
280 171695 18233 -186419 130606 81699 -194898 74599 134904 -180867 10454 171125
290 171125 -147331 -51402 186976 -98657 -105765 182720 -41558 -146400 158324 16204
300 16204 -170475 122068 70054 -178564 76443 116136 -169578 23876 151099 -146432
310 -146432 -32293 173755 -109134 -86464 180069 -59511 -134334 167886 -634 -168256
320 -168256 136150 60099 -185313 87169 115006 -180349 27449 158273 -152084 -35391
330 -35391 180268 -107994 -93301 180757 -50951 -136979 160255 8100 -164216 123415
$$ packed form
260a60640L25123j37574k12142L08498l8440k76698K63527O2341l14031J92494
270A2458J58682l22472J01371K42424k97713k917L01072k39785j08749L27324
280A71695j53462k04652L17025m8907k76597K69497O0305l15771J91321J60671
290A71125l18456R5929K38378k85633p108K88485k24278j04842L04724j42120
300A6204j86679K92543n2014k48618K55007L9693k85714J93454J27223k97531
310a46432J14139K06048k82889K2670K66533k39580p4823L02220j68520j67622
320a68256L04406p6051k45412K72482K7837k95355K07798J30824l10357J16693
330c5391K15659k88262J4693K74058k31708q6028K97234j52155j72316K87631
$$ plain form
340 123415 62291 -171662 76595 107537 -162295 25167 139562 -138820 -26075 159322
350 159322 -103416 -73897 164477 -60242 -115953 155120 -10693 -147732 130250 42090
360 42090 -165934 91783 92837 -167714 41053 135176 -150329 -15403 163229 -114518 -71314
371 -71314 171635 -65521 -118726 159982 -8715 -150903 129506 46562 -164513 86014
381 86014 94020 -160283 35655 129931 -139627 -15175 149995 -107389 -62868 157318 -65605
392 -65605 -103240 148953 -19108 -134049 129197 28788 -154468 95632 76605 -159664
402 -159664 52656 118328 -149517 1492 150557 -122077 -53316 165702 -78830 -104430
412 -104430 162415 -24411 -143070 137887 33013 -164518 96181 87127 -164718 43119
$$ packed form
340A23415o1124k33953K48257L0942k69832J87462J14395k78382J12745J85397
350A59322k62738K9519K38374k24719n5711K71073j65813j37039K77982q8160
360D2090k08024K57717J054k60551K08767R4123k85505J34926J78632k77747M3204
371g1314K42949k37156n3205K78708j68697j42188K80409q2944k11075K50527
381H6014Q006k54303J95938R4276k69558J24452J65170k57384M4521K20186k22923
392f5605l7635K52193j68061j14941K63246j00409j83256K50100j9027k36269
402a59664K12320O5672k67845J51009J49065k72634O8761K19018k44532k5600
412a04430K66845j86826j18659K80957j04874j97531K60699r054k51845K07837
$$ plain form
422 43119 128877 -144957 -12473 152558 -109247 -63993 157737 -62502 -104319 145136 -12423
433 -12423 -131503 118186 34698 -143601 82300 74726 -141352 40744 106305 -127090 -2056
444 -2056 127026 -102994 -42153 136733 -70406 -78876 135399 -32229 -110618 122728 10890
455 10890 -132068 98276 53313 -142758 62984 92154 -139113 18893 124534 -120336
465 -120336 -28362 144797 -88135 -75301 149867 -44077 -115388 136638 6415 -141866
475 -141866 106861 56487 -152568 64752 100795 -145136 14315 132596 -119900 -36336
485 -36336 148354 -82143 -81232 145975 -35666 -116075 128208 13045 -136824 96935 57611
496 57611 -141804 57409 94739 -132533 13877 119705 -110458 -29325 133993 -79329
$$ packed form
422D3119Q5758k73834J32484J65031k61805M5254K21730k20239m1817K49455j57559
433a2423j19080K49689q3488j78299K25901p574k16078J82096O5561k33395J25034
444b056J29082k30020O0841J78886k07139q470K14275j67628p8389K33346j11838
455A0890j42958K30344m4963j96071K05742K9170k31267J58006J05641k44870
465a20336R1974J73159k32932J2834K25168j93944p1311K52026j30223j48281
475a41866K48727n0374k09055K17320L6043k45931J59451J18281k52496Q3564
485c6336J84690k30497R11K27207j81641q0409K44283j15163j49869K33759l9324
496E7611j99415J99213L7330k27272J46410J05828k30163Q1133J63318k13322
$$ plain form
506 -79329 -69355 135187 -40490 -101577 122862 2008 -124387 100405 44291 -135986 64598
517 64598 83850 -132225 23617 114367 -114423 -21875 132065 -83704 -64685 135901 -44203
528 -44203 -99435 123358 48 -123014 97642 43249 -130873 62338 79630 -126098 21867
539 21867 106756 -107740 -17869 122096 -81091 -55191 125297 -46474 -86343 117121 -9876
550 -9876 -109899 99632 29167 -123986 71521 66553 -125746 35672 98545 -116097 -6169
561 -6169 121655 -91526 -47886 131326 -56906 -87064 126604 -13326 -115517 105378 32928
572 32928 -130036 71950 73308 -128306 29929 104385 -111460 -14205 120367 -81733 -53078
583 -53078 123545 -46124 -84854 113367 -7598 -105050 92503 28516 -114694 64872 60922
$$ packed form
506g9329R974K04542j75677o1087K24439j20854j26395K24792n6114j80277K00584
517F4598J9252k16075J55842R0750k28790R2548J53940k15769J9019K00586j80104
528d4203n5232K22793j23310j23062K20656n4393j74122J93211J7292k05728J47965
539B1867Q4889k14496Q9871J39965k03187K5900J80488j71771l9869K03464j26997
550i876j00023K09531p0465j53153J95507m968j92299J61418O2873k14642J09928
561f169J27824k13181M3640J79212j88232l0158K13668j39930j02191K20895p2450
572C2928j62964K01986J358k01614J58235P4456k15845R7255J34572k02100K8655
583e3078J76623j69669l8730J98221j20965r7452J97553o3987j43210J79566l950
$$ plain form
594 60922 -113800 32275 87274 -103377 -2047 105904 -83716 -37748 114694 -56181
604 -56181 -70540 112715 -21727 -96714 99989 16721 -113686 75028 54394 -117887 40354
615 40354 86792 -108733 792 108407 -87453 -37498 116565 -56215 -71257 112255 -19049
626 -19049 -95273 95448 17211 -108377 70319 50952 -110980 38782 79003 -102559 5795
637 5795 98014 -84900 -28456 109093 -59224 -60632 109468 -28327 -86373 98984 7510
648 7510 -105624 78550 43703 -114055 47817 75780 -108664 10320 100682 -90821 -27858
659 -27858 112765 -62556 -63321 112707 -25941 -90914 98420 11837 -106331 72624 46877
670 46877 -109576 40312 75598 -100642 6604 94863 -81343 -26778 102815 -54984 -56706
$$ packed form
594F0922j74722J46075N4999j90651J01330J07951j89620M5968J52442j70875
604e6181j4359J83255j34442p4987J96703q3268j30407J88714k0634j72281J58241
615D0354M6438j95525J09525J07615j95860M9955J54063j72780j5042J83512j31304
626a9049p6224J90721p8237j25588J78696j9367j61932J49762M0221j81562J08354
637E795R2219j82914N6444J37549j68317j408J70100j37795n8046J85357r1474
648G510j13134J84174l4847j57758J61872K7963j84444J18984R0362j91503O2963
659b7858J40623j75321p65J76028j38648o4973J89334q6583j18168J78955k5747
670D6877j56453J49888L5286j76240J07246Q8259j76206N4565J29593j57799j722
$$ plain form
681 -56706 100255 -25377 -78560 89779 5727 -93584 71130 36093 -99904 45521 63361
692 63361 -97471 15552 84307 -84656 -15067 98401 -63126 -46769 101839 -35038 -74322
703 -74322 94898 -2033 -93007 76759 31949 -101879 49814 61666 -99743 18231 84779
714 84779 -86302 -15371 98069 -63322 -46844 100232 -33819 -73248 91478 -2441 -89706
725 -89706 73961 30060 -97065 49028 57793 -94453 19411 78544 -82656 -11361 91930
736 91930 -62973 -41146 95828 -37329 -66039 90312 -7226 -83814 74700 23180 -93430
747 -93430 52481 51952 -93976 24155 74561 -84371 -6491 89984 -65436 -36581 95484
758 95484 -39188 -63479 90815 -9383 -83632 75373 22065 -93065 53043 50451 -93241
$$ packed form
681e6706J56961j25632n3183J68339q4052r9311J64714l5037j35997J45425J7840
692F3361j60832J13023O8755j68963O9589J13468j61527J6357J48608j36877l9284
703g4322J69220r6931r0974J69766m4810j33828J51693J1852j61409J17974O6548
714H4779j71081P0931J13440j61391J6478J47076j34051l9429J64726r3919q7265
725h9706J63667m3901j27125J46093Q765j52246J13864N9133j61200P1295J03291
736I1930j54903K1827J36974j33157k8710J56351r7538p6588J58514n1520j16610
747i3430J45911n29j45928J18131N0406j58932P7880R6475j55420K8855J32065
758I5484j34672k4291J54294j00198p4249J59005n3308j15130J46108k592j43692
$$ plain form
769 -93241 24024 72639 -81946 -6426 86727 -63564 -36037 91516 -37697 -59832 86289
780 86289 -9645 -77806 71935 18760 -86694 50290 45492 -86669 25521 65976 -78787
791 -78787 -1485 79328 -63024 -27741 85178 -41164 -52308 83863 -16169 -71397 72822
802 72822 11772 -83396 55040 38153 -86836 31525 62232 -80603 3738 77875 -66320
813 -66320 -24591 86403 -44574 -50182 85273 -17923 -70584 74073 10740 -82852 55617
824 55617 37138 -85160 31715 59303 -78943 5116 75144 -64859 -21243 83687 -44440
835 -44440 -46219 83431 -19959 -65791 73853 6589 -78897 57323 33319 -84046 34619
846 34619 55610 -79650 7598 73402 -67139 -19672 83335 -46884 -45094 83240 -20369
$$ packed form
769i3241J17265M8615j54585P5520R3153j50291K7527J27553j29213k2135J46121
780H6289r5934o8161J49741n3175j05454J36984m798j32161J12190M0455j44763
791g8787P7302Q0813j42352L5283J12919j26342j1144J36171j00032n5228J44219
802G2822o1050r5168J38436j6887j24989J18361L0707j42835Q4341P4137j44195
813f6320M1729J10994j30977n608J35455j03196n2661J44657o3333r3592J38469
824E5617j8479j22298J16875K7588j38246Q4059P0028j40003M3616J04930j28127
835d4440j779J29650j03390m5832J39644o7264q5486J36220k4004j17365J18665
846C4619K0991j35260Q7248O5804j40541M7467J03007j30219J790J28334j03609
$$ plain form
857 -20369 -65698 73600 7015 -78525 56025 32640 -82175 33092 55277 -76146 6702
868 6702 70261 -63691 -19530 77802 -43777 -41136 75868 -21480 -59269 68841 3089 -71495
880 -71495 54830 26913 -76074 35212 47875 -73525 12206 64372 -64738 -12732 74441
891 74441 -47367 -35597 77131 -26167 -56131 71487 -1459 -70234 58493 23593 -76673
902 -76673 38968 46735 -75277 14118 63469 -65268 -10778 73878 -48731 -34528 76119
913 76119 -26949 -53682 69546 -2789 -67427 56775 21805 -73814 38022 42440 -72818
924 -72818 16600 58958 -64936 -7074 70099 -49145 -30070 73798 -29484 -49326 70209
935 70209 -6196 -65376 58717 18226 -72771 41166 40238 -72293 18978 58357 -65413 -4780
$$ packed form
857b0369m5329J39298o6585q5540J34550k3385j14815J15267K2185j31423Q2848
868F702O3559j33952M4161R7332j21579K641J17004r7348l7789J28110o5752p4584
880g1495J26325k7917j02987J11286J2663j21400Q5731N2166j29110N2006Q7173
891G4441j21808J1770J12728j03298k9964J27618p2946o8775J28727l4900j00266
902g6673J15641P767j22012Q9395M9351j28737N4490Q4656j22609J4203J10647
913G6119j03068k6733J23228p2335o4638J24202l4970r5619J11836M418j15258
924g2818Q9418M2358j23894N7862P7173j19244J9075J03868j03282j9842J19535
935G0209p6405n9180J24093m0491r0997J13937r28j12531R1271L9379j23770O0633
$$ plain form
947 -4780 69278 -49346 -28314 73060 -30119 -48117 68774 -7190 -62560 57549 15714
958 15714 -70429 40529 37253 -70417 18953 53920 -63128 -2776 65474 -49642 -25148
969 -25148 69508 -30488 -44018 67257 -10124 -58695 57560 12685 -67243 41892 33222 -69189
981 -69189 21984 50418 -62754 141 63363 -50310 -22216 68406 -33496 -41462 66564
992 66564 -11742 -56108 57256 9509 -65324 42077 31002 -67109 23700 48067 -62136
1003 -62136 2418 60092 -51312 -19127 66476 -34608 -38406 65550 -14616 -53048 58413
1014 58413 7433 -63474 44493 28324 -66804 25562 46258 -62443 3576 59894 -51751
1025 -51751 -17505 66158 -35743 -37167 64716 -15445 -52566 56782 6381 -62595 42929
$$ packed form
947d780P4058j18624K1032J01374j03179j7998J16891p5964n5370J20109m1835
958A5714q6143J10958l276j07670Q9370L4967j17048O0352O8250j15116K4494
969b5148R4656r9996j3530J11275p7381m8571J16255m4875p9928J09135q670j02411
981f9189R1173K8434j13172O2895O3222j13673K8094R0622j01902p966J08026
992F6564p8306m4366J13364m7747p4833J07401j1075r8111R0809K4367j10203
1003f2136O4554N7674j11404L2185Q5603j01084l798J03956q0166l8432J11461
1014E8413n0980p0907J07967j6169r5128R2366K0696j08701O6019N6318j11645
1025e1751L4246Q3663j01901j424J01883q0161l7121J09348n0401o8976J05524
$$ plain form
1036 42929 26833 -64757 25179 43773 -60621 4921 56553 -50170 -15711 62777 -34212
1047 -34212 -34502 61335 -15896 -48318 55169 4444 -57767 42572 23095 -60713 26607 39873
1059 39873 -58498 7644 51657 -49536 -11545 58263 -36004 -29681 60421 -17958 -45140 54093
1071 54093 631 -55251 43574 19225 -59589 28560 36977 -58153 10837 49721 -51342 -8250
1083 -8250 58083 -37615 -27389 60522 -20588 -43422 55846 -2180 -54308 45774 17526 -59637
1095 -59637 29475 35887 -58951 11133 48734 -50793 -7584 58055 -38276 -26537 59633 -20413
1107 -20413 -42066 54795 -2124 -52080 44018 16650 -57474 30337 33453 -56622 12790 45754
1119 45754 -50052 -6049 54818 -38232 -24403 55892 -22271 -38450 53294 -3974 -49716 43791
$$ packed form
1036D2929j6096r1590Q9936J8594j04394O5542N1632j06723L4459P8488r6989
1047c4212k90R5837p7231l2422J03487n0725o2211J00339j9477q3808Q7320J3266
1059C9873r8371O6142M4013j01193L7991O9808r4267O323R0102p8379k7182R9233
1071E4093n3462n5882R8825k4349p8814Q8149Q417r5130O8990L8884j01063M3092
1083h250O6333r5698J0226Q7911q1110k2834R9268n8026n2128J00082k8248p7163
1095e9637Q9112O412r4838P0084L7601r9527M3209O5639r6331J1739Q6170q0046
1107b0413k1653R6861n6919m9956R6098k7368p4124Q7811L116r0075O9412L2964
1119D5754r5806M4003O0867r3050J3829Q0295p8163j6179R1744n7268m5742R3507
$$ plain form
1131 43791 14049 -55724 30340 30760 -55857 13721 43991 -49138 -5092 52927 -37555 -22151
1143 -22151 55031 -21899 -36885 51248 -4874 -47280 42963 12205 -52059 29301 27458 -52177
1155 -52177 14090 39975 -47006 -1776 48305 -37356 -17816 51570 -24160 -32747 50647 -9339
1167 -9339 -42960 44248 7910 -50704 33382 23779 -52995 18401 38134 -49404 1961 48167
1179 48167 -40098 -15992 53256 -26348 -32104 52194 -10166 -43791 45712 7709 -51538 32355
1191 32355 24848 -52505 16938 38367 -47736 584 47301 -38220 -15816 49951 -25114 -30440
1203 -30440 49097 -8834 -40599 42375 6704 -47264 32588 20719 -48875 18440 33526 -45521
1215 -45521 3135 43152 -39063 -12206 48018 -27198 -26615 48081 -12629 -38866 43563 3733
$$ packed form
1131D3791k9742o9773Q6064M20q6617O9578L0270r3129M4046N8019r0482J5404
1143b2151P7182p6930j4986Q8133n6122m2406R0243l0758o4264Q1360j843p9635
1155e2177O6267K5885q6981M5230N0081q5661J9540O9386p5730q587Q3394n9986
1167i339l3621Q7208l6338n8614Q4086r603p6774P1396J9733q7538N1365M6206
1179D8167q8265K4106O9248p9604n756Q4298o2360l3625Q9503l8003n9247Q3893
1191C2355p507p7353O9443K1429q6103M8320M6717q5521K2404O5767p5065n326
1203c0440P9537n7931l1765Q2974l5671n3968P9852j1869o9594O7315J5086p9047
1215d5521M8656M0017q2215K6857O0224p5216N83P4696o0710k6237Q2429l9830
$$ plain form
1227 3733 -46775 33362 18977 -48956 20120 33149 -46551 4279 42392 -37640 -11334 46739
1239 46739 -25958 -25852 46743 -12824 -36608 41928 2467 -44019 31955 17390 -45891 19731
1251 19731 29230 -43843 5432 37867 -37365 -7710 44082 -27520 -21290 45187 -15180 -33184
1263 -33184 41599 -362 -41281 34769 14027 -45460 22220 26931 -44514 8532 37260 -39457
1275 -39457 -6593 44703 -29295 -20642 45838 -15825 -33038 42983 -331 -42143 34372 13682
1287 13682 -45257 22542 27151 -43717 8484 37532 -37692 -6557 43337 -28267 -20345 43766
1299 43766 -15022 -31703 40394 -1197 -38958 32651 12341 -42172 22132 24458 -41663 9537
1311 9537 33827 -36141 -3170 40416 -27747 -16899 41727 -17360 -28443 39682 -4358 -36760
$$ packed form
1227C733n0508Q0137j4385o7933O9076J3029p9700N0830L8113q0032K6306N8073
1239D6739p2697J06P2595n9567k3784P8536l9461m6486P5974j4565o3281O5622
1251A9731R499p3073M9275L2435p5232K9655N1792p1602O230O6477o0367j8004
1263c3184P4783m1961m0919P6050k0742n9487O7680M711p1445N3046K8728p6717
1275c9457L2864N1296p3998Q653O6480o1663j7213P6021m3314m1812P6515k0690
1287A3682n8939O7799M609p0868N2201K9048p5224L1135M9894p1604P922O4111
1299D3766n8788j6681P2097m1591l7761P1609k0310n4513O4304K326o6121N1200
1311I537K4290o9968L2971M3586o8163J0848N8626n9087j1083O8125m4040l2402
$$ plain form
1323 -36760 33969 9750 -41301 24272 22391 -41252 10679 32350 -37202 -1686 39249 -29821
1335 -29821 -15839 42490 -18767 -26811 40359 -4691 -35797 34037 9095 -40906 24159 21691
1347 21691 -41503 11823 31877 -37254 -1120 38569 -28764 -14723 40974 -18196 -25090 39176
1359 39176 -5277 -33630 33628 7781 -39038 23381 18841 -39590 12748 29194 -37254 797
1371 797 36746 -29293 -12431 39742 -19407 -23344 38461 -7933 -32642 33069 5483 -38021
1383 -38021 25800 17470 -39517 14137 28463 -36622 1315 35621 -30010 -11409 39229 -19381
1395 -19381 -23337 38315 -7958 -31676 33097 5294 -37032 24453 17064 -37731 13495 27137
1407 27137 -34835 1972 33529 -29026 -9997 36333 -19090 -20345 36948 -8663 -30034 31843
$$ packed form
1323c6760P0729k4219n1051O5573j881o3643N1931K1671o9552L5516M0935o9070
1335b9821J3982N8329o1257q044O7170m5050l1106O9834k4942n0001O5065k468
1347B1691o3194N3326K0054o9131L6134L9689o7333J4041N5697n9170o894O4266
1359C9176m4453k8353O7258k5847m6819O2419m540n8431N2338J6446o6448L8051
1371G97L5949o6039J6862N2173n9149l937O1805m6394k4709O5711k7586m3504
1383c8021O3821q330n6987N3654J4326o5085L7937L4306o5631J8601N0638n8610
1395a9381l956O1652m6273k3718O4773k7803m2326O1485p389n4795N1226J3642
1407B7137o1972L6807L1557o2555J9029M6330n5423j255N7293m5611k1371O1877
$$ plain form
1419 31843 2447 -34478 25226 14364 -36876 15584 24055 -35407 4589 31343 -30278 -7759
1431 -7759 36144 -21550 -19038 37000 -10987 -27577 34063 496 -34128 26787 13033 -36918
1443 -36918 16845 23481 -35731 5333 31627 -30814 -7039 36652 -21443 -18189 36307 -11247
1455 -11247 -27430 33321 1503 -33384 26217 11999 -36207 16449 23161 -34759 4944 30273
1467 30273 -29760 -5467 33536 -20912 -16559 34589 -11376 -25637 31636 374 -32108 25559
1479 25559 10712 -34137 17472 20080 -33592 6463 28224 -29364 -4837 33010 -22142 -13700
1491 -13700 33765 -13689 -24548 32203 -1709 -30055 26780 9202 -34389 18319 19856 -33396
1503 -33396 7707 27151 -29817 -3133 32372 -22529 -13343 33627 -13470 -23209 31923 -2398
$$ packed form
1419C1843k9396l6925N9704j0862n1240N2460Q471n9462L9996K6754o1621K2519
1431g759M3903n7694K512N6038m7987j6590O1640l3567l4624O0915j3754m9951
1443c6918N3763O636n9212M1064K6294o2441K3775M3691n8095L254N4496m7554
1455a1247j6183O0751l1818l4887N9601j4218m8206N2656O712n7920L9703K5329
1467C0273o0033K4293L9003n4448M353N1148m5965j4261N7273l1262l2482N7667
1479B5559j4847m4849N1609K608n3672M0055K1761n7588K4527L7847n5152Q442
1491a3700M7465m7454j0859N6751l3912k8346N6835j7578m3591N2708J537n3252
1503c3396M1103J9444n6968K6684L5505n4901R186M6970m7097r739N5132l4321
$$ plain form
1515 -2398 -28917 25772 8000 -32592 18763 17666 -32053 8488 25789 -28746 -1997 30431
1527 30431 -22139 -12182 32142 -13749 -20591 31327 -4468 -27500 26764 5651 -32106 19456
1539 19456 16155 -31919 10745 24123 -29467 -226 29591 -24282 -10896 32046 -15338 -19714
1551 -19714 31332 -4674 -27542 26663 5690 -31178 19673 15514 -31922 9848 23592 -28760
1563 -28760 216 28660 -22406 -10480 31925 -14361 -19026 29798 -5309 -25570 25657 4873
1575 4873 -29850 19260 14116 -29828 10851 22004 -27582 870 26753 -22718 -9287 29901
1587 29901 -14833 -17129 29311 -6493 -23600 26241 3652 -28418 19399 12433 -29675 11334
1599 11334 20637 -28425 2478 25664 -23524 -7082 29744 -16509 -16074 29079 -8038 -22899
$$ packed form
1515b398k6519N4689j7772m0592N1355j097m9719M0541J7301n4535K6749L2428
1527C0431n2570R957M4324m5891o842N1918l5795k3032N4264k1113l7757N1562
1539A9456l301m8074M2664J3378n3590K9241K9817n3873J3386M2942m7384m376
1551a9714N1046l6006k2868N4205k0973l6868N0851m159m7436M1770J3744n2352
1563b8760K8976K8444n1066J1926M2405m6286m665M8824l5107k0261N1227k0784
1575D873l4723M9110n144m3944M0679J1153m9586K8452K5883m9471J3431L9188
1587B9901m4734k296M6440l5804j7107M9841k2589l2070M7817o966m2108M1009
1599A1334R303m9062L0903K3186m9188J6442L6826m6253M35M5153l7117j4861
$$ plain form
1611 -22899 25880 2077 -27689 20157 11801 -28876 11645 19217 -27322 2725 24786 -23468
1623 -23468 -6361 28038 -16497 -15300 27627 -7620 -21915 25133 1938 -26519 19481 10384
1635 10384 -28117 12425 17473 -26988 3666 23238 -23690 -5168 27035 -16768 -13295 28460
1647 28460 -8407 -20891 25010 -807 -25109 20276 9208 -27038 13666 16455 -26406 5165
1659 5165 22658 -23354 -4901 27459 -17342 -12681 27278 -8622 -19331 24856 -521 -24764
1671 -24764 19591 8395 -26350 13173 16452 -25957 4529 21557 -22211 -4214 24353 -16785
1683 -16785 -11083 26028 -9356 -17801 23886 -1016 -23109 19959 6636 -25093 13887 14012 -25386
1696 -25386 6584 20215 -22551 -1945 23803 -18212 -10140 25790 -10069 -16904 24716 -2539
$$ packed form
1611b2899M8779k3803k9766M7846q356m0677M0521P572m6539L0047K2061m8254
1623b3468J7107L4399m4535J197M2927l5247j4295M7048k3195k8457M6000r097
1635A0384l8501M0542N048m4461L0654J9572m6928J8522L2203m3803L473M1755
1647B8460l6867j2484M5901k5817k4302M5385j1068l6246M0704K789m2861L1571
1659E165J7493m6012J8453L2360m4801M661L9959l5900j0709M4187k5377k4243
1671b4764M4355j1196l4745L9523L279m2409L0486J7028m3768J7997K8567m1138
1683a6785N702L7111l5384q445M1687k4902k2093M3068j3323l1729L8980J25l9398
1696b5386L1970J3631m2766K0606K5748m2015Q072L5930l5859o835M1620k7255
$$ plain form
1708 -2539 -22407 21088 5559 -25149 14717 13197 -25353 6962 20366 -22074 -2078 24018
1720 24018 -17331 -9249 25221 -10587 -16710 24639 -2319 -21495 20334 4986 -23815 14091
1732 14091 12841 -24679 6921 18489 -21492 -743 22167 -17336 -8006 23841 -10191 -14815
1744 -14815 22871 -3660 -19939 19544 4027 -22951 14533 10962 -23473 7976 17202 -21265
1756 -21265 707 21440 -17540 -6975 23127 -11572 -13806 22886 -4091 -18845 20197 4064
1768 4064 -22241 14726 10654 -22788 8051 16325 -20951 1107 21096 -16886 -6543 23045
1780 23045 -11744 -13366 21871 -5191 -18406 18970 3104 -21726 15097 9276 -21956 9362
1792 9362 14935 -21435 1764 19830 -17562 -4755 21851 -11726 -12014 21885 -5569 -17250 19514
$$ packed form
1708b539j9868M3495j5529l0708L9866j520l8550L2315J3404m2440J9996K6096
1720B4018m1349Q082L4470l5808o123M1349k6958j9176M1829j5348k8801L7906
1732A4091j250l7520L1600J1568l9981K0749K2910l9503R330L1847l4032m624
1744a4815L7686k6531j6279L9483j5517k6978L7484l571l4435L1449R226l8467
1756b1265K1972K0733l8980J0565L0102l4699k234L6692k6977j4754L9042j6133
1768D064k6305L6967m072l3442L0839Q274l7276K2058J9989l7982J0343K9588
1780B3045l4789j622L5237k7062j3215L7376j5866k4830L6823n821l1232L1318
1792I362N573l6370K3199J8066l7392J2807K6606l3577k88L3899k7454j1681L6764
$$ plain form
1805 19514 1384 -21181 15235 8294 -21772 9088 14339 -21322 2519 18787 -18538 -4554
1817 -4554 21354 -12782 -11469 21555 -6203 -17146 19541 848 -20417 14968 7701 -21791
1829 -21791 9503 13932 -20740 2937 18635 -17796 -4854 20812 -12740 -10343 20595 -5831
1841 -5831 -16060 19348 890 -19046 15169 7591 -20886 8984 12749 -19677 3159 16866
1853 16866 -17330 -3475 19343 -13215 -9048 20741 -7199 -14938 19052 -963 -18852 15662
1865 15662 6123 -19776 10568 11681 -19445 4629 16656 -17335 -2283 19180 -13636 -8345
1877 -8345 20304 -7929 -14477 19078 -1871 -17125 15909 5447 -20074 10771 11117 -19884 4680
1890 4680 15790 -17754 -2369 18925 -13375 -7538 19830 -7911 -13953 18574 -1889 -17426
$$ packed form
1805A9514j8130k2565L6416o941l0066L0860N251l5661K3841J6268l7325J3984
1817d554K5908l4136J313L3024k7758j0943L6687j8693k1265L5385p267k9492
1829b1791L1294M429l4672K3677J5698l6431J2942K5666l3552K397L0938k6426
1841e831j0229L5408j8458j9936L4215p578k8477K9870L765l2426K2836J3707
1853A6866l4196J3855K2818l2558M167K9789k7940p739L3990k0015j7889L4514
1865A5662r539k5899L0344J113l1126K4074J2027l3991J5052K1463l2816N291
1877h345K8649k8233o548L3555k0949j5254L3034j0462k5521L0845L46l1001K4564
1890D680J1110l3544J5385K1294l2300N837K7368k7741o042L2527k0463j5537
$$ plain form
1902 -17426 15143 4948 -19404 11302 10157 -18870 4958 14893 -17643 -1696 18152 -13081
1914 -13081 -7677 19497 -8446 -12878 18447 -2130 -16984 15718 4108 -18275 11254 9681
1926 9681 -18992 5145 14541 -17086 -359 17398 -13818 -6140 18736 -7954 -11323 18672 -2460
1939 -2460 -15627 15571 2881 -17859 11099 9053 -18735 6145 14073 -16639 -416 16608
1951 16608 -13658 -6075 18379 -9279 -10396 17803 -3405 -14815 15853 2319 -17807 11279
1963 11279 8104 -17645 5952 13336 -17286 995 16345 -14427 -5203 17548 -8899 -10266 18102
1976 18102 -3928 -14227 15723 2300 -17026 12450 7463 -18065 6943 12114 -16704 1632
1988 1632 15517 -13708 -4505 17488 -9769 -9583 17363 -4264 -13669 15879 1552 -16684 11746
$$ packed form
1902a7426L2569j0195k4352L0706j145k9027K3828R935l2536J5947J9848l1233
1914a3081N404K7174k7943m432L1325k0577j4854L2702j1610k2383K9529j573
1926I681k8673K4137R396l1627J6727J7757l1216P678K4876k6690l369K9995k1132
1939b460j3167L1198j2690k0740K8958k046k7788K4880P928l0712J6223J7024
1951A6608l0266P583K4454k7658j117K8199k1208j1410L0668j3534k0126K9086
1963A1279l175k5749K3597P384l0622J8281J5350l0772R224K2751k6447j367K8368
1976A8102k2030j0299K9950j3423j9326K9476m987k5528K5008N171k8818J8336
1988A632J3885k9225R203K1993k7257J86K6946k1627r405K9548j4327j8236K8430
$$ plain form
2001 11746 6794 -17158 6775 11109 -16045 1987 15138 -13198 -3824 16954 -10469 -9274 16981
2014 16981 -5364 -12824 14843 551 -15706 12154 6556 -16450 6898 10665 -16255 2137
2026 2137 14014 -14234 -3107 15344 -9949 -8195 16195 -5078 -12199 15438 256 -15098
2038 -15098 12198 5662 -16801 8289 10149 -15766 2922 13899 -14270 -2484 15936 -10167
2050 -10167 -7682 16253 -5244 -11464 15178 -247 -14472 11949 4328 -15854 8238 9848 -15289
2063 -15289 3333 13139 -13872 -2590 14936 -10542 -7335 15793 -6265 -11181 14880 -680
2075 -680 -14392 12124 4027 -15422 7613 9290 -14851 3705 12740 -13672 -1477 14744 -11386
2088 -11386 -6693 16107 -6275 -10362 14147 -1611 -12642 11771 4139 -15105 8287 7854 -15395
$$ packed form
2001A1746m952k3952K3933M334k7154J8032J3151k8336R374K0778k7423J195K6255
2014A6981k2345p460K7667j4292j6257K7860n598k3006K3348L767k6920J8392
2026B137J1877k8248J1127J8451k5293J754K4390k1273p121K7637j5182j5354
2038a5098K7296o536k2463K5090J860k5915J8688J0977k8169J1786J8420k6103
2050a0167K485K3935k1497o220K6642j5425j4225K6421p621k0182K4092J610k5137
2063a5289J8622R806k7011J1282J7526k5478L207K3128k2058m916K6061j5560
2075f80j3712K6516q097j9449K3035J677k4141J8556R035k6412J2195J6221k6130
2088a1386M693K2800k2382m087K4509j5758j1031K4413p632j9244K3392m33k3249
$$ plain form
2101 -15395 4344 11170 -14362 -534 14344 -10025 -5349 14793 -6315 -9140 14871 -2755
2113 -2755 -13064 11895 2694 -14681 8245 7506 -14370 4170 11016 -13059 6 13341 -10271
2126 -10271 -4714 14138 -6673 -8635 13705 -2223 -12328 11858 3165 -13803 8848 6760 -14211
2139 -14211 4706 9996 -13378 383 12983 -10449 -4944 13888 -6895 -8448 13864 -2734
2151 -2734 -11570 12318 1630 -12992 8811 6348 -14297 4949 9894 -12871 282 13107 -10526
2164 -10526 -4137 13918 -8130 -8405 13919 -2575 -10595 12289 1182 -13448 9077 5616 -13431
2177 -13431 5058 9265 -12554 780 12150 -10483 -3658 13301 -7277 -7183 12717 -3414 -10424
2190 -10424 11430 811 -11926 9424 5311 -13058 5763 8962 -12447 1455 11647 -10445
$$ packed form
2101a5395J9739O826k5532J3828J4878k4369M676K0142k1108k825K4011j7626
2113b755j0309K4959r201j7375K2926p39k1876J8540O846k4075J3065J3335k3612
2126a0271N557J8852k0811j962K2340j5928j0105K4186q693j6968K2651k088k0971
2139a4211J8917N290k3374J3761J2600k3432N505J8832k0783j553K2312j6598
2151b734q836K3888j0688j4622K1803k463k0645J9246M945k2765J3153J2825k3633
2164a0526O389J8055k2048k75K2324j6494q020K2884j1107j4630K2525l461j9047
2177a3431J8489M207k1819J3334J1370k2633O825J6959k0578R4J9900j6131p010
2190a0424K1854j0619j2737K1350m113j8369J8821L199k1409J3902J0192k2092
$$ plain form
2202 -10445 -2699 12728 -7339 -6969 12895 -3791 -9578 12146 1111 -12093 9355 4633 -12585
2215 -12585 5648 7876 -11919 1802 10503 -10318 -2844 12313 -7912 -6067 12378 -3897 -9250
2228 -9250 11303 295 -12207 9142 3893 -12152 5214 7768 -12454 2092 10440 -10826 -1780
2241 -1780 11873 -7368 -5760 12436 -4115 -8721 11703 -754 -11084 9093 3788 -12641 5898
2254 5898 7472 -11720 2302 9709 -10259 -1420 11196 -7623 -4870 12080 -4563 -8868 10994
2267 10994 -492 -10596 9199 3250 -11087 6283 7211 -11843 3279 9164 -10094 -1089 11333
2280 11333 -7441 -5585 11510 -4258 -7758 11011 -1337 -10572 9583 2837 -11595 6517 6159
2293 6159 -11654 2868 8956 -9950 -342 10924 -7941 -4551 11534 -4836 -7059 10796 -2010
$$ packed form
2202a0445P746J5427k0067L70J9864j6686n787K1724j1035j3204K1448m722j7218
2215a2585J8233K228j9795J3721Q701k0821P474J5157k0225J845J8445j6275n353
2228i250K0553j1008j2502K1349n249j6045J7366K554k0222J4546Q348k1266R046
2241a780J3653j9241J608J8196j6551m606K0424j2457j0330K0177n305j6429J8539
2254E898J574j9192J4022P407j9968Q839J2616j8819K753J6950j6643m305J9862
2267A0994j1486j0104J9795n949j4337J7370R28j9054J5122N885j9258R005J2422
2280A1333j8774J856J7095j5768l500J8769j2348r235K0155o746j4432J8112l58
2293F159j7813J4522O088j8906R608J1266j8865L390J6085j6370k223J7855j2806
$$ plain form
2306 -2010 -9229 9283 1969 -11246 6286 5858 -11142 3461 8848 -10209 -348 10479 -7688
2319 -7688 -3860 10978 -5015 -7091 10531 -1521 -9478 9393 1894 -10454 7071 5605 -11076
2332 -11076 3394 8357 -10077 165 9742 -7790 -2939 10752 -4871 -6402 10448 -2190 -8565
2345 -8565 8843 1716 -9890 6507 5076 -10462 3732 7994 -10491 339 9791 -8159 -3241
2358 -3241 10021 -5240 -5760 10325 -2093 -8490 8765 1466 -10330 6557 4762 -10299 4220
2371 4220 7325 -10160 588 8985 -8468 -3198 10621 -5534 -5369 10208 -2973 -8414 9136
2384 9136 730 -9780 6985 3991 -10327 4540 7145 -9312 963 8562 -8177 -2384 9743
2397 9743 -5553 -5638 9835 -2736 -7248 8923 1220 -9399 6529 3870 -10199 3598 7122
$$ packed form
2306b010p219J8512p314j3215J7532m28j7000J4603N387j9057R861J0827j8167
2319g688L828J4838j5993k076J7622j2052p957J8871p499j2348J7525j466j6681
2332a1076J4470M963j8434J0242R577j7532M851J3691j5623j531J6850j2638o375
2345h565J7408p127j1606J6397j431j5538J4194M262j8485J0830R452j7950M918
2358c241J3262j5261n20J6085j2418o397J7255p299j1796J6887j795j5061J4519
2371D220L105j7485J0748Q397j7453N270J3819j6155J65J5577j3181n441J7550
2384I136q406j0510J6765k994j4318J4867K605j6457J0275P599j6739N793J2127
2397I743j5296q5J5473j2571m512J6171p703j0619J5928k659j4069J3797L524
$$ plain form
2410 7122 -9402 1884 8780 -7746 -1716 9936 -5762 -4929 9269 -3626 -7525 9192 773
2423 773 -9049 7229 3127 -9578 4918 5815 -9538 990 7925 -8074 -944 8904 -5740 -4614
2437 -4614 10063 -2981 -7120 8530 -224 -9072 7128 3118 -9102 5456 5585 -9333 1803
2450 1803 8167 -8091 -655 9030 -6294 -4579 9579 -3311 -6523 8779 -205 -7947 6798
2463 6798 2228 -9387 4498 5910 -9294 1881 6894 -8372 -1357 8337 -6081 -4344 9371
2476 9371 -3255 -5983 8943 -651 -8095 6901 2065 -9340 4629 5164 -8982 2753 6978
2489 6978 -7903 -619 8539 -6583 -3643 9433 -4118 -5700 9123 -1076 -7234 7189 1954
2502 1954 -9263 5312 4750 -8620 2805 6213 -7706 -812 8321 -6969 -3409 8853 -3676
$$ packed form
2410G122j6524J1286O896j6526O030J1652j5698Q33J4198j2895l899J6717q419
2423G73r822J6278m102j2705J4496Q97j5353J0528O935j5999P130R848j4644J126
2437d614J4677j3044m139J5650q754q848J6200m010j2220J4558J29j4918J1136
2450A803O364j6258P436R685j5324J715J4158j2890l212J5302q984p742J4745
2463F798m570j1615J3885J412j5204J1175N013j5266P015R694j4418J737J3715
2476I371j2626k728J4926r594p444J4996m836j1405J3969N35j4146J1735M225
2489F978j4881P284R158j5122K940J3076j3551j582J4823j0199o158J4423n235
2502A954j1217J4575n62j3370J1425L408j3919O894R133j5290L560J2262j2529
$$ plain form
2515 -3676 -5635 8356 -1224 -7582 7056 1195 -8794 4922 4287 -8527 2501 6946 -7911 62
2529 62 7810 -6049 -2596 8769 -3906 -5083 8445 -1944 -7179 7233 1449 -7757 5569 4204
2543 4204 -8497 2918 6150 -7636 922 7505 -6212 -2172 8887 -4017 -4797 8009 -2045
2556 -2045 -6895 7183 1105 -8390 5760 3347 -8576 2922 5906 -7658 357 7129 -6875
2569 -6875 -1958 7982 -4212 -4747 8114 -2029 -6357 7351 1339 -7491 5394 3274 -7984 3311
2583 3311 5538 -7965 1107 6684 -6710 -2039 7969 -4467 -4253 7691 -2229 -6567 6956 67
2597 67 -7510 5063 2278 -7707 3873 4873 -7999 1571 6596 -6152 -1089 7461 -4814 -3815
2611 -3815 7642 -1734 -5847 6499 58 -7033 5682 2326 -7642 3948 4489 -7310 1254 6665
$$ packed form
2515c676j959J3991r580o358J4638n861r989J3716o35j2814J1028M445j4857P973
2529F2P748j3859L453J1365j2675j177J3528j0389n235J4412n784r206J3326j365
2543D204j2701J1415L232j3786Q558O583j3717M040J1059j2904p80J2806j0054
2556b045m850J4078o078r495J4150k413j1923J1498K984j3564Q015O772j4004
2569f875M917R940j2194n35J2861j0143m328J3708o012q830J2885k120j1258J1295
2583C311K227j3503R072N577j3394M671J0008j2436K14J1944r920m338J3523o889
2597F7p577J2573k785r985J1580J000j2872R570N025j2748N063Q550j2275R99
2611c815J1457r376m113J2346o441p091J2715l356r968J1590N41j1799Q564N411
$$ plain form
2625 6665 -6579 -962 7118 -4849 -3013 7085 -2228 -5362 6766 41 -6357 5633 2387 -7368
2639 -7368 3933 4534 -7546 1119 6084 -6136 -767 7147 -4923 -3228 7332 -2518 -4700 6564
2653 6564 -60 -6160 5876 2240 -6734 3052 4204 -7364 1379 5490 -6618 -249 6262 -4805
2667 -4805 -3113 7087 -2933 -5032 7041 -970 -5966 5885 1675 -7460 3841 4001 -6891 2059
2681 2059 5817 -5978 -855 6522 -4785 -2330 6984 -2583 -4306 6997 -636 -5004 5382 1600
2695 1600 -6467 4326 3270 -6726 2114 4993 -5992 166 6193 -4833 -2247 6468 -2942 -4435
2709 -4435 6155 -1201 -5048 5411 1490 -6471 4198 3128 -5980 1720 4581 -5245 -163 5756
2723 5756 -4835 -1905 6505 -3034 -3775 6356 -787 -5192 5652 1162 -6731 3732 2810 -6066
$$ packed form
2625F665j3244N617Q080j1967J836J0098r313l134J2128o725o398J1990l246r755
2639g368J1301O01j2080Q665M965j2220N369P914j2070J695J0560r850k182J1264
2653F564o624o100J2036l636q974R786J152j1568Q743M111j2108O369O511j1067
2667d805J692J0200j0020k099J2073q011m996J1851m210r135J1301J60j0892Q950
2681B059L758j1795N123P377j1307K455R314r567j723J1303p633m368J0386l782
2695A600q067J0793j056r996Q840K879j0985O158O027j1026K586Q715r410j493
2709d435J0590p356l847J0459l921p961J0669j070r108P700K861r826N082N919
2723E756j0591K930Q410r539p41J0131p143m405J0844m490p893J0463r22q876
$$ plain form
2737 -6066 1730 4618 -5807 264 5610 -5307 -1716 6576 -2984 -3718 6572 -1654 -4971 5458
2751 5458 759 -6097 3510 2832 -6297 2102 3850 -5645 457 5625 -4702 -1243 5615 -3061 -3467
2766 -3467 6232 -1319 -4222 5607 125 -5923 4228 2912 -6146 2208 4214 -6068 174 5576
2780 5576 -4715 -1676 6137 -3003 -3027 6148 -1370 -4234 5170 -111 -5947 3593 2481 -6125 2276
2795 2276 3892 -5945 704 5810 -4909 -919 6001 -3465 -3272 5757 -1518 -4717 5415 -246 -5470
2810 -5470 3699 1855 -5862 2517 3918 -5881 743 4683 -4514 -828 6154 -3176 -2623 5947 -1843
2825 -1843 -4484 5584 -147 -4573 4477 2008 -5562 2823 3408 -5491 1216 4401 -4789 -626 5450
2840 5450 -3379 -2168 5896 -2420 -4104 4690 -559 -5621 4511 1703 -5123 2753 3163 -5509 1381
$$ packed form
2737f066P796K888j0425O071N346j0917L591Q292r560p34J0290q226l317J0429
2751E458m699o856R607o78r129Q399J748r495O102N168j0327L459O858q676m06
2766c467R699p551k903R829n482o048J0151j316r058Q354K006j0282O242N402
2780E576j0291L039P813r140k4R175p518k864R404n281n836R540j112q606Q401
2795B276J616r837O649N106j0719L990O920r466J93R029p275l199J0132n661n224
2810e470R169j844p717Q379J401r799O624L940r197L686O982r330N53Q570p790
2825a843k641J0068n731m426R050k469p570Q385N85q899O707L185r190M163O076
2840E450q829J211Q064q316j684Q794n249n062J0132k808o826P876M10q672O890
$$ plain form
2855 1381 4501 -4703 -256 5798 -3534 -2166 6029 -1873 -4423 5524 533 -4291 3596 1295 -4973
2870 -4973 3121 3132 -5091 1111 4319 -5012 -972 4660 -3698 -1727 5590 -1977 -3117 4988 -257
2885 -257 -4623 3921 876 -5818 2745 2678 -5109 1460 4410 -4787 -73 4160 -3584 -1862 5539 -2307
2901 -2307 -3547 5404 -843 -4606 3607 309 -5092 2980 2454 -4933 1999 3617 -4204 179 5194
2916 5194 -3452 -1888 5471 -2384 -2766 4759 -940 -3874 4533 891 -4302 3177 2448 -4850 1430
2931 1430 3778 -4292 -44 4262 -3754 -1321 4929 -2554 -2925 5066 -1163 -4398 4895 1001 -4993
2946 -4993 3485 2951 -4793 2373 3579 -4693 608 4679 -3559 -1010 4794 -2391 -3273 5282 -747
2961 -747 -3819 4718 473 -4923 3781 1693 -5003 1959 3582 -4891 468 4264 -4207 -931 4802
$$ packed form
2855A381L120r204M447O054r332J368Q195p902k550R947m991m824P887k301o268
2870d973Q094J1q223O202L208r331M040N632q358J971P317p567j140Q105n245
2885b57m366Q544l045o694Q563o7p787O569K950r197M714M233p744J722P401p846
2901b307j240Q951o247l763Q213l298n401Q072n26p387O932J618p821M383N015
2916E194q646J564P359p855l82P525n699k934Q407l642n193P479p29p298O280
2931A430K348q070M248M306q016K433O250p483l71P991o229l235R293l894n994
2946d993Q478n34p744P166J206q272N301M071q238K549N804p185q82Q555o029
2961g47l072Q537m245n396Q704k088o696O962J623q473N359L796q471L276N733
$$ plain form
2976 4802 -2746 -2326 4766 -1078 -3679 4310 -17 -4383 3022 1810 -4482 1557 3166 -4639 1218
2991 1218 4012 -4059 -916 4691 -2928 -2311 4243 -1241 -3103 4328 -145 -4914 3220 1672 -4616
3006 -4616 1999 3482 -4542 933 4652 -3979 -337 4724 -2534 -2058 4233 -2325 -3255 4064 -120
3021 -120 -4026 2589 1587 -4096 2152 2622 -4949 836 4320 -4650 -229 4210 -2798 -1582 5222
3036 5222 -1521 -3254 4441 -368 -3988 3626 861 -4181 2161 1412 -4152 1636 3340 -4036 -538
3051 -538 4144 -3274 -1987 4850 -1659 -3524 4235 -125 -3609 3466 1241 -4358 2235 2655 -3837
3066 -3837 1171 3581 -3833 -347 3459 -2604 -1113 4096 -1781 -2594 3994 -893 -3663 3678 465
3081 465 -3554 1924 1876 -4763 900 3193 -3865 52 3694 -3673 -1732 3990 -1315 -2480 4164 -251
$$ packed form
2976D802p548M20P092n844k601P989m327m366P405j212o292O039J609p805N857
2991A218K794q071L143N607p619O17O554n484j862P431m473m769Q134j548o288
3006d616O615J483q024N475L719q631L642N061p258M76O291o558r30P319m184
3021a20l906O615j002n683O248M70p571N785L484q970M421M439p008J216O804
3036E222o743j733P695m809l620P614k765n042O342p49n564N788J704p376L498
3051e38M682p418J287O837o509j865P759m360l484P075k225n599O593M20o492
3066c837N008K410p414L486L806o063J491N209n877q13O588m887k770P341l213
3081D65m019N478m8o639N663K293p058L917L642p367J941N722n305j165O644m415
$$ plain form
3097 -251 -3799 3395 459 -4008 2335 2444 -4669 1505 2791 -3405 21 3937 -3542 -1490 4331
3112 4331 -1332 -2470 4036 -296 -3273 3150 724 -2967 2193 1928 -5052 1121 3202 -3640 294
3127 294 3393 -3372 -1087 3965 -1590 -2241 3885 -321 -3225 3413 524 -2995 2877 2159 -3693 797
3143 797 2376 -3591 230 3287 -2864 -934 3425 -1793 -2245 3137 -1453 -2606 3899 275 -3529
3158 -3529 1644 1145 -3691 1179 2731 -3585 275 3400 -3226 -1094 4176 -2449 -1923 3621 -1284
3173 -1284 -2755 3053 53 -3139 2473 2299 -3531 1121 2658 -3297 -238 3076 -2857 -671 3305
3188 3305 -1579 -1625 3356 -901 -2307 2613 556 -2924 3366 1942 -3560 1705 2280 -4087 422 3018
3204 3018 -2901 -532 3424 -2454 -1495 3348 -1767 -2039 3197 -165 -3290 2056 1339 -3424 1834 1860
$$ packed form
3097b51l548P194k936m467O343J09p113O174J286o196L426L916p479K052N821
3112D331n663j138O506m332k977O423k426l691N160k65o980O173K081o842L934
3127B94L099o765K285N052n555o51O126m206k904O638k889l519N872p18n852M490
3143G97J579n967L821L057o151J930M359n218m52N382m590j153O505l624l804
3158c529N173m99m836M870J552o316L860L125o626K132N270o625N26N544m905
3173a284j471N808l000l192N612j74n830M652J537n955L059L314n933K186L976
3188C305m884m6M981m257j406M920k057l480O290j424n502N265N75o367M509K596
3204C018n919K369L956n878R59M843n115k72N236l362l125N346p17m763N258K6
$$ plain form
3220 1860 -2962 953 3141 -2948 -411 3621 -2300 -1378 3453 -1592 -2426 3118 -85 -3366 2537
3235 2537 1179 -3391 1335 2257 -3084 853 2272 -2825 -158 2982 -1713 -1418 3600 -1091 -2020 3310
3251 3310 -29 -3065 2668 1462 -3340 1543 1749 -3365 727 2546 -2696 -507 2943 -2312 -1164
3266 -1164 3394 -1148 -2328 2893 -565 -3484 2676 882 -3006 2052 1503 -3240 531 2482 -3412
3281 -3412 -505 3019 -2513 -857 3727 -1781 -2516 3858 -547 -3081 2140 561 -2973 2372 1295
3296 1295 -3318 523 2655 -2655 -416 3044 -2152 -627 3142 -1886 -1870 3978 -320 -2614 2791
3311 2791 286 -2596 2365 1620 -2628 889 2014 -2085 -298 3433 -2456 -555 3046 -1210 -1393
3326 -1393 2516 101 -3152 3156 360 -2314 2024 1908 -3315 852 2199 -2626 453 2965 -1974
$$ packed form
3220A860m822L915K188o089K537M032n921R22M831n045q34N544l203l281N903
3235B537j358m570M726R22n341L937J419n097K667L140m695K95N018m691r29N330
3251C310l339l036N733j206m802M883K06n114M092J819n242K189L450n255J148
3266a164M558m542j180N221l458k919O160j794l888N058n49m743L771J951n894
3281c412K907L524n532J656M584n508p35O374m405k534N221j579l534N345j077
3296A295m613L841K132n310K239L460n196J525L769n028J6N848m298k294N405
3311B791k505k882M961p45m248L517J125m099J787L731n889J901L601m256j83
3326a393L909k415l253O308k796k674M338j16n223M167J347m825L079K512m939
$$ plain form
3341 -1974 -999 2786 -2175 -1816 2690 -478 -2579 2433 411 -2164 2008 1082 -3283 1007 2073 -1997
3357 -1997 348 3064 -2219 -758 2693 -2150 -1955 2620 -428 -2714 3303 258 -2232 1765 1551
3372 1551 -2488 1266 1520 -3245 -170 2365 -2705 -995 2729 -1551 -1260 2631 -536 -2157 1704
3387 1704 84 -2354 2285 1000 -2616 1066 2041 -2950 868 2518 -2534 -780 3082 -1426 -1038
3402 -1038 3060 -1294 -2077 2027 345 -2889 2622 1058 -2614 1495 979 -2674 14 2007 -2466
3417 -2466 235 2143 -1743 -1340 2933 -1177 -1759 2025 195 -2209 1719 893 -2674 1173 1481 -2770
3433 -2770 262 1656 -2103 -282 3140 -1824 -1352 2880 -1067 -1198 2280 54 -2424 1955 414
3448 414 -2962 1520 1164 -2242 522 2487 -2682 -364 2486 -1495 -885 2128 -1463 -1394 2389 -938
$$ packed form
3341a974R75L785m961L59M506l168k101N012k022k575M172r26m365M290J066m070
3357a997K345K716n283J461L451m843J95M575l048k286O017l045k490L997k14
3372A551m039L754K54m765L075K535n070J710L724m280K91L891l167j621L861
3387A704j620k438M639j285l616L682R75m991L818J650n052J754L862m508L88
3402a038M098m354p83M104j682l234N511j564l672M109n16l653K688J993m473
3417b466K701J908l886M03M273m110n82L784j830k404L928q26l567L847L08m251
3433b770L032J394l759J821L422m964M72M232l947j31L478k226k478M379j541
3448D14l376M482l56l406K764J965n169K318K850l981O10L013l591O9L783l327
$$ plain form
3464 -938 -1900 1060 642 -2396 1186 1703 -2406 495 2121 -1960 -307 1771 -1546 -973 1739 -1098
3480 -1098 -1682 2436 -850 -2742 1951 923 -2647 1369 1216 -2528 755 1771 -2396 197 2433
3495 2433 -1239 -704 2309 -637 -1328 2592 -763 -1610 2093 431 -2552 1409 955 -2263 981 1522
3511 1522 -2320 721 1834 -1261 31 2325 -1647 -1139 2647 -300 -2132 1316 615 -2282 1700
3526 1700 407 -2154 959 1862 -2050 407 2084 -1392 -399 2880 -603 -1772 2575 -257 -1631
3541 -1631 2256 -116 -2069 1594 1510 -2342 950 1851 -2478 -149 2224 -1701 -536 2477 -1468 -931
3557 -931 2045 -429 -1166 1628 719 -2539 1782 709 -2157 1082 2156 -1701 536 1389 -2164 -537
3573 -537 2103 -1507 -758 2038 -474 -1512 2077 52 -1874 1962 528 -1952 994 1455 -2008 -129
$$ packed form
3464i38r62K960m18l038L582N17m109K901J626m081J653K078l317N73K712k837
3480a098n84M118l286j892M693j028l570M016j53l744L283J016m167K593K236
3495B433l672N35L013k946o91L920l355q47L703j662k983L961m54l218L244N41
3511A522l842L041J113l095J292K294l972N08L786k947j832L448p01k897L982
3526A700j293k561L113R03l912K457J677l476R93L279l483j169M347k832j374
3541a631L887k372j953L663q4l852L292R01m329K329K373l925J165L013l945N37
3557i31K976k474p37K794r09l258M321j073k866L239J074l857K237Q53l553J627
3573e37K640l610P49K796k512j038L589k025j926L836j434k480K946M61l463J879
$$ plain form
3589 -129 2675 -1864 -349 1872 -1550 -1414 1973 -757 -2178 1855 -678 -1976 1797 1075 -2339 764
3605 764 774 -2103 -57 2513 -1727 15 1578 -937 -1033 2272 -286 -1626 1927 373 -2417 1977
3621 1977 677 -2307 1483 974 -1954 333 1824 -1456 154 1742 -1241 -974 2067 -635 -1187 1530
3637 1530 -16 -1452 2252 746 -2581 812 1090 -2406 644 1605 -1497 -654 1430 -1363 -707 1524
3653 1524 -593 -1343 2108 -85 -1783 1795 447 -1885 997 1381 -1983 529 1820 -1248 528
3668 528 1673 -1530 -613 2195 -414 -1481 1815 -279 -1511 1417 -320 -1780 197 824 -2455 642
3684 642 1891 -1818 -747 1978 -1364 -698 1801 -772 -738 1452 -156 -1961 1727 583 -1634 866
3700 866 784 -1679 907 395 -1685 200 1783 -1512 -417 1851 -890 -766 1880 -31 -1383 1285
$$ packed form
3589a29K804m539J515K221l422J36L387k730j421M033k533j298L773p22l414L103
3605G64J0k877K046K570m240J742J563k515r6L305k558j340L553j554k790M394
3621A977j300k984L790n09k928K287J491l280J610J588k983K67L041k702n52K717
3637A530j546j436L704j506l327L393K78l496L050R61l102Q43K084k793O56K231
3653A524k117p50L451k193j698L578j348k332K882L84l364K512J291l068J776
3668E28J145l203R17K808k609j067L296k094j232K928j737j460J977O27l279L097
3684F42J249l709J071K725l342O66K499k573L4K190j608j805L688j144k217K500
3700H66q2k463K586n12k080J885J583l295J095K268k741J24K646j911j352K668
$$ plain form
3716 1285 653 -1843 1504 1533 -1999 724 1044 -1622 186 1475 -1499 -924 1625 -1111 -672 2243
3732 2243 -322 -1596 1833 311 -1544 1405 518 -1231 917 849 -1375 120 1520 -1041 -666 1238
3748 1238 -1036 -843 1798 -355 -1657 1278 110 -1147 1649 973 -1700 594 1251 -1459 133 1556
3764 1556 -1132 -454 1464 -1440 -1142 1206 -69 -355 1368 -524 -1618 1302 297 -1445 577 1281
3780 1281 -1804 -156 1520 -1158 81 1819 -380 -260 2060 -727 -1029 1622 261 -1472 1309
$$ packed form
3716A285o32k496L347K9l532K723L20k666J808J289k974N75K549k736M39K915
3732B243k565j274L429j522j855K949q87j749K148o8k224J495J400k561L75J904
3748A238k274J93K641k153j302K935j168j257K796o76k673K294O57k710J592J423
3764A556k688O78J918k904K98K348j275k86J723j892j094K920j005j742K022P04
3780A281l085J648J676k678J239J738k199J20K320k787l02K651j361j733K781
$$ [...]
8191d12
##END NTUPLES=NMR FID
##END=
