##TITLE=1H_SAM-33.2
 DMF, 8 sc, 
 25.08.2021
##JCAMPDX= 6.0         $$ Bruker NMR JCAMP-DX V2.0
##DATA TYPE= NMR FID
##DATA CLASS= NTUPLES
##ORIGIN= UXNMR, Bruker Analytische Messtechnik GmbH
##OWNER= root
$$ XWIN-NMR		Version 3.5
$$ Wed Aug 25 12:55:01 2021 Russian Standard Time (UT+4h)  she@DPX200
##.OBSERVE FREQUENCY= 200.131506
##.OBSERVE NUCLEUS= ^1H
##.DELAY= (6, 6)
##.ACQUISITION MODE= SIMULTANEOUS
##.ACQUISITION SCHEME= undefined
##.AVERAGES= 8
##.DIGITISER RES= 18
##SPECTROMETER/DATA SYSTEM= spect
##.PULSE SEQUENCE= zg30
##.SOLVENT NAME= DMF
##.SHIFT REFERENCE= (INTERNAL, DMF, 0, 15.7039)
##AUDIT TRAIL= $$ (NUMBER, WHEN, WHO, WHERE, WHAT)
$$ ##TITLE= Audit trail, XWIN-NMR		Version 3.5
$$ ##JCAMPDX= 5.01
$$ ##ORIGIN= Bruker BioSpin GmbH
$$ ##OWNER= she
$$ F:/spectra/data/she/nmr/H-F/1/audita.txt
$$ ##AUDIT TRAIL=  $$ (NUMBER, WHEN, WHO, WHERE, WHAT)
(   1,<2021-08-25 12:53:27.70 +0400>,<she>,<DPX200>,
      <created by zg, POWCHK disabled, PULCHK disabled
       configuration hash MD5:
       00 E9 B6 7A A2 85 ED C7 34 08 36 98 17 FE 4E 26
       data hash MD5: 16K
       AD AD 67 D3 EE 9D C2 64 C9 05 1F D1 2F 71 9B C9>)
$$ ##END=
$$ 
$$ hash MD5
$$ 58 DF 6B F3 76 BE 9F BB CC CB 4E BA 05 56 20 EB
##$RELAX= 
##$RELAX= 
##$RELAX= 
##$RELAX= 
##$RELAX= 
##$RELAX= 
$$ Bruker specific parameters
$$ --------------------------
##$DU= <F:/spectra>
##$EXPNO= 1
##$NAME= <H-F>
##$PROCNO= 1
##$TYPE= <nmr>
##$USER= <she>
##$AMP= (0..31)
100 100 100 100 100 100 100 100 100 100 100 100 100 100 100 100 100 100 
100 100 100 100 100 100 100 100 100 100 100 100 100 100 
##$AQSEQ= 0
##$AQ_mod= 1
##$AUNM= <au_zg>
##$AUTOPOS= <>
##$BF1= 200.13
##$BF2= 200.13
##$BF3= 200.13
##$BF4= 200.13
##$BF5= 200.13
##$BF6= 200.13
##$BF7= 200.13
##$BF8= 200.13
##$BYTORDA= 1
##$CFDGTYP= 0
##$CFRGTYP= 5
##$CHEMSTR= <none>
##$CNST= (0..31)
1 1 145 1 1 1 1 1 1 1 1 1 1 1 1 1 1 1 1 1 1 1 1 1 1 1 1 1 1 1 1 1 
##$CPDPRG= <>
##$CPDPRG1= <>
##$CPDPRG2= <>
##$CPDPRG3= <>
##$CPDPRG4= <mlev>
##$CPDPRG5= <mlev>
##$CPDPRG6= <mlev>
##$CPDPRG7= <mlev>
##$CPDPRG8= <mlev>
##$CPDPRGB= <>
##$CPDPRGT= <>
##$D= (0..31)
0 1.2 0 0 0 0 0 0 0 0.06 0 0.03 0 0 0 0 0.0002 0 0 0 0 0 0 0 0 0 0 0 0 
0 0 0 
##$DATE= 1629881607
##$DBL= (0..7)
120 120 120 120 120 120 120 120 
##$DBP= (0..7)
150 150 150 150 150 150 150 150 
##$DBP07= 0
##$DBPNAM0= <>
##$DBPNAM1= <>
##$DBPNAM2= <>
##$DBPNAM3= <>
##$DBPNAM4= <>
##$DBPNAM5= <>
##$DBPNAM6= <>
##$DBPNAM7= <>
##$DBPOAL= (0..7)
0.5 0.5 0.5 0.5 0.5 0.5 0.5 0.5 
##$DBPOFFS= (0..7)
0 0 0 0 0 0 0 0 
##$DE= 6
##$DECBNUC= <off>
##$DECIM= 32
##$DECNUC= <off>
##$DECSTAT= 4
##$DIGMOD= 1
##$DIGTYP= 9
##$DL= (0..7)
0 120 120 120 120 120 120 120 
##$DP= (0..7)
150 150 150 150 150 150 150 150 
##$DP07= 0
##$DPNAME0= <>
##$DPNAME1= <>
##$DPNAME2= <>
##$DPNAME3= <>
##$DPNAME4= <>
##$DPNAME5= <>
##$DPNAME6= <>
##$DPNAME7= <>
##$DPOAL= (0..7)
0.5 0.5 0.5 0.5 0.5 0.5 0.5 0.5 
##$DPOFFS= (0..7)
0 0 0 0 0 0 0 0 
##$DQDMODE= 0
##$DR= 18
##$DS= 0
##$DSLIST= <SSSSSSSSSSSSSSS>
$$ [...]
##$SUBNAM2= <"">
##$SUBNAM3= <"">
##$SUBNAM4= <"">
##$SUBNAM5= <"">
##$SUBNAM6= <"">
##$SUBNAM7= <"">
##$SUBNAM8= <"">
##$SUBNAM9= <"">
##$SW= 20.0188882624521
##$SWIBOX= (0..15)
0 0 2 0 0 0 0 0 0 0 0 0 0 0 0 0 
##$SW_h= 4006.41025641026
##$TD= 16384
##$TD0= 1
##$TE= 0
##$TE2= 300
##$TE3= 300
##$TEG= 300
##$TL= (0..7)
0 120 120 120 120 120 120 120 
##$TP= (0..7)
150 150 150 150 150 150 150 150 
##$TP07= 0
##$TPNAME0= <>
##$TPNAME1= <>
##$TPNAME2= <>
##$TPNAME3= <>
##$TPNAME4= <>
##$TPNAME5= <>
##$TPNAME6= <>
##$TPNAME7= <>
##$TPOAL= (0..7)
0.5 0.5 0.5 0.5 0.5 0.5 0.5 0.5 
##$TPOFFS= (0..7)
0 0 0 0 0 0 0 0 
##$TUNHIN= 0
##$TUNHOUT= 0
##$TUNXOUT= 0
##$USERA1= <user>
##$USERA2= <user>
##$USERA3= <user>
##$USERA4= <user>
##$USERA5= <user>
##$V9= 5
##$VALIST= <valist>
##$VCLIST= <CCCCCCCCCCCCCCC>
##$VD= 0
##$VDLIST= <DDDDDDDDDDDDDDD>
##$VPLIST= <PPPPPPPPPPPPPPP>
##$VTLIST= <TTTTTTTTTTTTTTT>
##$WBST= 1024
##$WBSW= 4
##$XGAIN= (0..3)
0 0 0 0 
##$XL= 0
##$YL= 0
##$YMAX_a= 104992
##$YMIN_a= -135656
##$ZGOPTNS= <>
##$ZL1= 120
##$ZL2= 120
##$ZL3= 120
##$ZL4= 120
##$ABSF1= 10
##$ABSF2= 0
##$ABSG= 5
##$ABSL= 3
##$ALPHA= 0
##$AQORDER= 0
##$ASSFAC= 0
##$ASSFACI= 0
##$ASSFACX= 0
##$ASSWID= 0
##$AUNMP= <proc_1d>
##$AZFE= 0.1
##$AZFW= 0.1
##$BCFW= 1
##$BC_mod= 2
##$BYTORDP= 1
##$COROFFS= 0
##$CY= 11.3945322036743
##$DATMOD= 1
##$DC= 2
##$DFILT= <>
##$DTYPP= 0
##$F1P= 2.36226072786647
##$F2P= -0.459571619588291
##$FCOR= 0.5
##$FTSIZE= 0
##$FT_mod= 4
##$GAMMA= 1
##$GB= 0.15
##$INTBC= 1
##$INTSCL= 1
##$ISEN= 128
##$LB= 0.24
##$LEV0= 0
##$LPBIN= 0
##$MAXI= 10000
##$MC2= 0
##$MEAN= 0
##$ME_mod= 0
##$MI= 1.114404
##$NCOEF= 0
##$NC_proc= 0
##$NLEV= 6
##$NOISF1= 3.799351
##$NOISF2= 2.8
##$NSP= 1
##$NTH_PI= 0
##$NZP= 0
##$OFFSET= 15.70392
##$PC= 1
##$PHC0= -13363.89
##$PHC1= 16.20099
##$PH_mod= 1
##$PKNL= yes
##$PPARMOD= 0
##$PSCAL= 0
##$PSIGN= 0
##$REVERSE= no
##$SF= 200.130013532006
##$SI= 16384
##$SIGF1= 3
##$SIGF2= 2
##$SINO= 400
##$SIOLD= 16384
##$SREGLST= <1H.CDCl3>
##$SSB= 0
##$STSI= 0
##$STSR= 0
##$SW_p= 3612.71676300578
##$SYMM= 0
##$S_DEV= 0
##$TDeff= 0
##$TDoff= 0
##$TI= <>
##$TILT= no
##$TM1= 0
##$TM2= 0
##$TOPLEV= 0
##$USERP1= <user>
##$USERP2= <user>
##$USERP3= <user>
##$USERP4= <user>
##$USERP5= <user>
##$WDW= 1
##$XDIM= 8192
##$YMAX_p= 0
##$YMIN_p= 0
$$ End of Bruker specific parameters
$$ ---------------------------------
##NTUPLES= NMR FID
##VAR_NAME=  TIME,          FID/REAL,        FID/IMAG
##SYMBOL=    X,             R,               I
##VAR_TYPE=  INDEPENDENT,   DEPENDENT,       DEPENDENT
##VAR_FORM=  AFFN,          ASDF,            ASDF
##VAR_DIM=   8192,          8192,            8192
##UNITS=     SECONDS,       ARBITRARY UNITS, ARBITRARY UNITS
##FACTOR=    0.0002496,     1,               1
##FIRST=     0,             0,               0
##LAST=      2.0444736,     0,               0
##MIN=       0,             -135656,         0
##MAX=       2.0444736,     104992,          0
$$ Real data points
##PAGE= N=1
##DATA TABLE= (X++(R..R)), XYDATA
0@%%%%%%%%%%%%%%pJ5j6J6j6K3l0L1l9M6n4O9p8Q6j00J17j35J55j76K00k28K57
$$ 0 0 0 0 0 0 0 0 0 0 0 0 0 0 0 -7 8 -8 8 -8 15 -15 16 -23 23 -31 38 -40 46 -54 63 -72 83 -93 107 -121 136
36A36k87L22l62M05m51N01n55O15o82P52q32R18j011J114j227J352j489J643j815
$$ 136 -151 171 -191 214 -237 264 -291 324 -358 394 -438 480 -531 583 -644 708 -781 862 -953
55i53K007k225K474k758L094l495L978m577N345o368P807r997J3770k2055P5560
$$ -953 1054 -1171 1303 -1455 1639 -1856 2122 -2455 2890 -3478 4329 -5668 8102 -13953 61607
70F1607n9820j00623J36987O6841n9480r3162J5295P6002K6847q4974l2121O4609
$$ 61607 1787 -98836 38151 104992 45512 -47650 -32355 43647 70494 -14480 -46601 18008
82A8008K1525o3530o751N0612j320n3215o527M9109L0357n0334n8120M0499Q6575
$$ 18008 39533 -23997 -30748 19864 18544 -34671 -41198 7911 38268 -12066 -70186 -29687 56888
95E6888k1913r5503l826R5224L2473p0409n1140M1340O4677n734o0163j3392M7125
$$ 56888 34975 -60528 -64354 30870 63343 -7066 -58206 -16866 47811 42077 -18086 -31478 15647
108A5647K3353k8205j7560J4316K624o852R077N337j6003j6652Q742K3418R33
$$ 15647 39000 10795 -6765 7551 10175 3323 12400 17737 1734 -14918 -6176 17242 18175
121A8175l0919j9308K4966K7660j5541l0516j914K1483J4827n377j8329j1224
$$ 18175 -12744 -32052 -7086 20574 5033 -25483 -27397 -5914 8913 3536 -14793 -26017
133b6017J3215K5549N217k5776k2276J9457M1961O0m5961j9089M4279L8527k9388
$$ -26017 -12802 12747 17964 -7812 -30088 -10631 31330 31390 -14571 -33660 10619 49146 19758
146A9758m7281J1492M8098L726m1571j5248L0410J5576k5595j5084K1488R443
$$ 19758 -27523 -16031 32067 35793 -5778 -21026 9384 24960 -635 -15719 5769 15212
158A5212k7584j3146L1769J9667l8329l4994L5266N1611k5072o5186O295P1969
$$ 15212 -12372 -25518 6251 25918 -12411 -47405 -12139 39472 14400 -50786 -44491 27478
170B7478J8926o6118m0119N4800N9118l3908o3770J6233O3567K017n3806j0853
$$ 27478 46404 -19714 -59833 -5033 54085 20177 -43593 -27360 36207 38224 -15582 -26435
182b6435M5399J6844l8373j8291L5466K0030l7222k7262L7821L4397l7121m8189
$$ -26435 18964 35808 -2565 -20856 14610 34640 -2582 -29844 7977 42374 5253 -42936
194d2936K6412N6493j2808o4601q361O0877K7060n2239m2971L6437N0483j8858
$$ -42936 -16524 39969 27161 -37440 -45801 15076 42136 -10103 -53074 -16637 33846 14988
206A4988m7977L855M1749Q439l0045j1580K3585J3815j7752r672J9714R729k0749
$$ 14988 -32989 -29134 12615 21054 -8991 -20571 3014 16829 -923 -10595 9119 18848 -1901
219a901j0396K3165J6098k0636k3636J3273K8690l472l2222r549K6825J6774j9055
$$ -1901 -12297 10868 26966 6330 -17306 -4033 24657 21185 -11037 -20586 6239 23013 3958
232C958k2882O152J8402L102j3142j0213K926J0512M472n389q946j561R005J0419
$$ 3958 -18924 -12772 5630 8732 -4410 -14623 -11697 -1185 3287 -2102 -11048 -12609 -3604 6815
246F815l667j3802m66J5600P557j1033p637P132Q316j833m770J908K715m664k266
$$ 6815 3148 -10654 -11120 4480 12037 1004 -6633 499 8815 6982 2212 4120 6835 2171 -95
261i5R261N229j5084j2483J5198J9274j3117k8214L179L0532O813l1454j9516
$$ -95 9166 14395 -689 -13172 2026 21300 8183 -20031 -16852 13680 20493 -10961 -30477
274c0477K4833K7628j6969l2164P597L1481J434k7282o107K3649J0167j8953r507
$$ -30477 -5644 21984 5015 -27149 -19552 11929 13363 -13919 -20026 3623 13790 -5163 -14670
287a4670J9246J1969j7973j4283K0560K0475j8875k6199J4891L2920o620l7262
$$ -14670 4576 16545 -1428 -15711 4849 25324 6449 -19750 -4859 28061 21441 -15821
299a5821m610L6348J5142l2489k6337K3173L0525j4265l3146L462K8974K698k5010
$$ -15821 -20431 15917 31059 -1430 -27767 -4594 25931 11666 -21480 -18018 10956 13654 -11356
312a1356p748J9774Q800j6894q975J5631J0435j4900j1936J5897J6883j2400k0219
$$ -11356 -19104 670 9470 -7424 -16399 -768 9667 -5233 -17169 -1272 15611 3211 -17008
325a7008R454K4607r87k4319o061K2469J3883j6333j7943Q882J8988k705j6515
$$ -17008 -7554 17053 16066 -8253 -14314 8155 22038 5705 -12238 -3356 15632 12927 -3588
338c588l466J0701M975o932n797K762J799k599p73K520j091n321k05O647K049
$$ -3588 -7054 3647 8622 1690 -4107 -1345 454 -2145 -2918 -398 -1489 -6810 -7015 -368 1681
353A681o640m599N193O843q86n754j691M416M881O52l577l217K196O217L202n303
$$ 1681 -4959 -9558 -4365 2478 1592 -4162 -5853 -1437 3444 4096 519 -2698 -502 5715 8917 3614
369C614p548L092J1165J072j2307o089R657R041o629j2223J526J0872J077j0609
$$ 3614 -3934 -842 10323 11395 -912 -7001 2656 11697 5068 -7155 -5629 5243 6320 -4289
383d289m384P822L663p278l261O302L256p519l824R138O837r014r993Q604J4878
$$ -4289 -8673 -851 2812 -4466 -7727 -1425 1831 -5688 -9512 -374 6463 -2551 -12544 -3940 10938
398A0938l959j6870j44J8703O714j5836j1032J2702J4783p228j5949K461J4908
$$ 10938 6979 -9891 -10035 8668 15382 -454 -11486 1216 15999 8771 -7178 -4717 10191
411A0191O77j3453l376J0380L510r809m896Q379M810r760p487R272R037q808j2588
$$ 10191 10868 -2585 -5961 4419 7929 -1880 -6776 1603 6413 -3347 -10834 -1562 7475 -1333 -13921
426a3921O271J4845k057j5190k737J5012P834j1199j0419Q139J2567l124j0453
$$ -13921 -7650 7195 5138 -10052 -12789 2223 10057 -1142 -11561 -3422 9145 6021 -4432
439d432J95R381K313o049k888M896K312m120j747M128J509n522l132N161L986
$$ -4432 -4237 5144 7457 1408 -1480 3416 5728 1608 -139 3989 5498 -24 -3156 2005 5991
454E991n629o297K592O569n99p344l196N944M527l771n137P57M758J687k026k501
$$ 5991 362 -5935 -3343 3226 2627 -4717 -7913 -1969 2558 -1213 -6350 -5593 -835 852 -1174 -3675
470c675N52K599K535n49k256m76K633L012p44l384j25K862J977k012k348P15J416
$$ -3675 -3123 -524 2011 1462 -794 -1270 1363 4375 3631 247 122 2984 4961 2949 601 1316 2732
487B732l91r21j59p06j913M13K207l18m349k206L962M248l596o283J378P013J591
$$ 2732 2341 1420 1261 555 -1358 -945 1262 944 -3405 -5611 -1649 2599 -997 -7280 -5902 1111 2702
504B702o596l647N745O103k812o008J373O412R01m409j158M171J246k805j084
$$ 2702 -3894 -7541 -1796 4307 1495 -4513 -3140 3272 4173 -236 -1394 2777 4023 1218 134
519A34L386J436m471j841M474K470m662n020L146O056j957p969q05P039K778o606
$$ 134 3520 4956 485 -1356 3118 5588 926 -4094 -948 5108 3151 -4818 -5623 1416 4194 -2412
535b412n176M494N548k450n309M56M771J227l497j269L515J044j907l79L185J044
$$ -2412 -7588 -3094 2454 4 -5305 -4849 -78 1149 -2348 -3617 -102 942 -965 -1344 1841 2885
551B885l047j030L725K715l201l439J993M633n51n155j767M486K258l500l656
$$ 2885 -162 -1192 2533 5248 2047 -1392 601 5234 4683 -472 -2239 2247 4505 1005 -2651
566b651R24L242j78k971j772J787Q62o22p70m37M09J63N59Q75o22j039R50J774
$$ -2651 -1727 1515 1337 -1634 -3406 -1619 -757 -1379 -2149 -2586 -2177 -2014 -1455 -580 -1202 -2241 -1291 483
584D83P63j266j083J414K177Q2j359q87J201J368L03j553j246N00J622K05k077
$$ 483 1246 -20 -1103 311 2488 2570 1211 324 1525 2893 3196 1643 397 897 2519 2724 647
601F47j797P06J891l54k474j307J363J830r12k253k84J494P94q90n30K94P32K45
$$ 647 -1150 -444 1447 1093 -1381 -2688 -1325 505 -407 -2660 -2944 -1450 -656 -1546 -2076 -1782 -1050 -805
619h05M1L80m1l29J016J556r0j387o82J712K105j045k322K3K465R22k299k023
$$ -805 -764 -384 -425 -754 262 1818 1728 341 -341 1371 3476 2431 109 132 2597 3519 1220 -803
637h03J134J721l60k338j045J079J419j657j113L47N23n72k99O03o1l47l2J038
$$ -803 331 2052 1692 -646 -1691 -612 807 -850 -1963 -1616 -1093 -1665 -1964 -1361 -1422 -1769 -1801 -763
655g63P54o93j295J162K163K8j502m63J427J743q17j279k78K068P67j694r93M04
$$ -763 -9 -702 -1997 -835 1328 1356 -146 -609 818 2561 1744 465 187 2255 3022 1328 335 739
673G39R93l09n61j096J62J84j15m23o05n75L03M36J57n92q21L18J052N53j243
$$ 739 1732 1423 862 -234 -72 112 -3 -426 -1031 -1606 -1303 -867 -710 -1302 -2123 -1805 -753 -200 -1443
692a443n97Q55J557k51l86m20Q20J415J17j281J24J005N04j21q51j13L49L56m3
$$ -1443 -2040 -1185 372 121 -265 -685 135 1550 1667 386 510 1515 2019 1898 1047 934 1283 1639 1596
711A596r64o58L76K83m32o41o26j64N40M16r64p60L76Q75o0m02l94K76J030K37
$$ 1596 632 -26 350 633 201 -440 -1066 -1230 -690 -274 -1238 -1998 -1622 -747 -807 -1209 -1603 -1327 -297 -60
731f0k61k42J01R55M22j75j97l10J053O62m37m62m56Q55M89o15r54J96P03o0j184
$$ -60 -321 -563 -462 493 915 740 543 233 1286 1948 1511 1049 593 1448 1937 1322 368 564 1267 1207 23
752B3o24L00K51r1p89j5l08R0k3Q0po21M69N42M27p59n53Q82J454l43n59j68J160
$$ 23 -601 -301 -50 -141 -930 -945 -1253 -1163 -1186 -1106 -1113 -1734 -1265 -723 -296 -1055 -1608 -726 728 385 -174 -342 818
775H18Q42o41p42K19J012M48j004n23M51K03n6o36k17L30n47jN1j83n37m58M83
$$ 818 1660 1019 277 496 1508 1956 952 429 880 1083 1027 391 174 504 -43 -44 7 -176 -713 -1171 -688
796f88K55m62p51J12R56M21q65m97Q20R63R0p85j40R59L67j76n44J97Q99J56J58
$$ -688 -433 -895 -1646 -1534 -578 -157 -1022 -1519 -699 264 354 -431 -571 388 755 579 35 232 1131 1287 1445
817A445m55l24K36R3R7k12l48l78M70j59p01m17K20J05l28R6n97N3R7M10k37l15
$$ 1445 990 666 902 995 1092 880 532 154 624 465 -236 -653 -433 -328 -656 -560 -1157 -1104 -1007 -597 -834 -1149
839a149L09J64M38n76K0L73O12M58n82J6N09M36K68n83J7K86J56P9l53l61k00
$$ -1149 -840 -676 -238 -814 -794 -421 191 649 67 83 592 1028 1296 713 730 1016 1172 1251 898 537 337
860C37M52j84q8n81j69k54O19j33r04N3m4L58k82j19l62O34L92k54k83L1M90L06
$$ 337 789 605 517 -64 -233 -487 132 -1 -905 -852 -896 -538 -820 -939 -1301 -667 -275 -529 -812 -781 -291 15
882A5P2k20P7M52L57%j15j21K07N07k74l99J60k0J32k49l42K76m09J04l95j33
$$ 15 87 -133 -56 396 753 753 638 517 724 1231 957 558 718 698 830 581 239 515 106 210 -185 -318
904c18q7k48K39k9k45n11M11J98p3j4k27j27R83q4l97M09J82N09j62k65L34q1
$$ -318 -405 -653 -414 -443 -688 -1199 -788 -590 -663 -677 -904 -1031 -48 -132 -529 -120 62 571 409 144 478 397
926C97N43j30k86j31L89m1J43n0l94k56Q8L10m67m47k99L38J78n87k45J62M48
$$ 397 940 810 524 393 782 741 884 834 440 184 272 582 115 -332 -631 -293 -115 -702 -947 -785 -337
947c37l22l54L45P7M2J71l56L51L23l7J00K13k44J82K18M74L88r05p3M46M57n18
$$ -337 -659 -1013 -668 -591 -549 -378 -734 -383 -60 -97 3 216 -28 154 372 846 1234 329 256 702 1159 641
969F41m57M3N50K5q17J02R3K06r97j35M07J68l72k27N56R0q06k14M72P63n47o91
$$ 641 184 227 777 802 -15 87 180 386 -611 -746 -339 -171 -543 -770 -214 -124 -930 -1144 -672 91 -456 -1147
991a147L58J052O0p03k34J257L02n26p23O06J148o79r94M75O65r6o94l07J212
$$ -1147 -789 263 323 -380 -614 643 945 419 -304 302 1450 771 -223 252 917 821 127 -180 1032
1010A032l01r12O1N54P5q54o36O75O01r27m52K71Q11P3j069j82J160J74m95m59
$$ 1032 731 -181 -120 434 509 -345 -981 -306 295 -632 -1084 -813 -2 71 -998 -1180 -20 154 -341 -800
1030h00N97N75l32j95K37M45k68j18kP90J44p87m6M92J86p80k1L45L40q45k56
$$ -800 -203 372 40 -155 82 527 259 141 139 929 1073 286 240 732 918 138 117 462 802 -43 -299
1051b99K30L72l76m80j8L13k46r9R3J5J83k39K10k5l0j81O61M14o48l95P47M62
$$ -299 -69 303 -73 -553 -571 -258 -504 -603 -510 -495 -312 -551 -341 -366 -396 -577 84 498 -150 -545 202 664
1073F64Ol66l57Q17J37o16j6L04K11p19k04N76K17m88p66M32P00n21r86N08O23
$$ 664 670 304 -53 764 901 285 269 573 784 65 -139 437 654 166 -600 -168 532 11 -975 -467 156
1094A56oj044m13J236K34p51m74P22R71m75j121M20J016Q3j256K06J349K77j007
$$ 156 150 -894 -1307 -71 163 -588 -1062 -340 631 156 -965 -545 471 554 -702 -496 853 1130 123
1113A23l19R41K60q06l83M05J290q47j182J76J225k16j122m50Q71P50j223m90
$$ 123 -196 745 1005 199 -184 221 1511 664 -518 -342 883 667 -455 -905 -34 716 -507 -997
1131i97L03J001n27r12M45O89M6q07J29O30M50n90n55P61P55p12k12K34P42k04
$$ -997 -694 307 -220 -1132 -687 2 48 -759 -630 0 450 -140 -695 66 821 109 -103 131 873 669
1151F69n55J89L14K84m99o35O98K12n84K46m26L25k80nk11k1K31j92r9j5j70K52
$$ 669 114 303 617 901 402 -233 465 677 93 339 -87 238 -42 -47 -258 -279 -48 -240 -339 -354 -524 -272
1173b72Pl7J2J51Q3j55L25j99K77j7k2j68J57L12j55j33L78P1m58j64J03L66K84
$$ -272 -265 -302 -290 -139 -56 -211 114 -85 192 175 153 -15 142 454 299 166 544 615 157 -7 96 462 746
1196G46p48k94M45K32m20m14N20K87m78n96J74N68L2q54L06M05K6j90l38N86K48
$$ 746 -2 -296 149 381 -39 -453 67 354 -124 -720 -546 22 54 -800 -494 -89 -63 -253 -591 -5 243
1217B43l35k99O28K13j87m20K19P27j56n35j88M57L89j52p30L68L11n4n71l29
$$ 243 -92 -391 237 450 263 -157 62 789 633 98 -90 367 756 604 -126 242 553 499 -72 -401
1237d01O72n1o35j36K53M45n87k66L92J1j31k32K14O17q1p24P9O85j54O5j06n9
$$ -401 271 220 -415 -551 -298 147 -440 -706 -314 -303 -434 -666 -452 165 84 -640 -561 124 -30 35 -71 -130
1259a30M51M3j12j78O22j97q1M8k82K4M6l86J22L07n9j10O4q9k36L5k09p4J91
$$ -130 321 364 252 74 696 499 418 466 184 208 254 -132 -10 297 238 128 192 103 -133 -98 -307 -381 -190
1282a90k10o4N5J45L3j45o7K21j04L78k05l6K78J67m7j16J76n7K29r5l03K95l7
$$ -190 -400 -464 -409 -264 -231 -376 -443 -222 -326 52 -153 -189 89 256 209 93 269 212 441 346 43 338 301
1305C01K57m71Q1p5J03k37q7l4J54k25k76K82P8n23K05M63k84P7l89N82J64k72
$$ 301 558 87 168 93 196 -41 -128 -162 -8 -233 -509 -227 -149 -672 -467 -4 -288 -211 -600 -18 146 -126
1327a26l09L52j80J10j80K29J08L94j07l22L89j90N7J25q8j70J54r7K24J16l81
$$ -126 -435 -83 -263 -153 -333 -104 4 398 291 -31 358 168 225 350 262 92 246 149 373 489 108
1348A08l51J51R3n5j26m8J17k1K0l36J01K71k98J71K37rr8j8P6R0p8j36L48J96
$$ 108 -243 -92 1 -54 -180 -228 -111 -132 -112 -448 -347 -76 -374 -203 34 25 -73 -91 -15 75 -3 -139 209 405
1372D05m46q7J54K36K32k08n1KK78l20j12l6N65n19l82N9M16l36j30J67l41K53
$$ 405 -41 -128 26 262 494 286 235 237 515 195 83 47 612 93 -289 -230 186 -150 -280 -113 -454 -201
1394b01j69L0K63L1k25j56K11o6K1J95m1q5L22l20K97L07L7j66r2J79q4J0r8J82
$$ -201 -370 -340 -77 -46 -271 -427 -216 -282 -261 -66 -107 -192 130 -190 107 414 451 285 193 372 288 298 200 382
1418C82k63K18k88M0r3J07l66M02k85J52k2l43o5l0K19O7J1p9MN0J78l94J98M01
$$ 382 119 337 49 89 -4 103 -263 139 -146 6 -16 -359 -424 -454 -235 -168 -157 -236 -232 -182 -4 -398 -200 201
1442B01J08l08K23k93K61K66l06k29N00j14p7j49k8ML18n66J65J63l5k31M4L8
$$ 201 309 1 224 -69 192 458 152 -77 423 309 232 83 55 59 377 -189 -24 139 104 -127 -83 -45
1464d5K13k78k77J95J62j05m41J64K74l8K0j47mN35m93oM40K27l59o3j72O08k80
$$ -45 168 -110 -387 -192 -30 -135 -576 -412 -138 -176 -156 -303 -307 228 -265 -271 169 396 37 -26 -198 410 130
1487A30k62K48J21J61j01k39MK50k00l38M9J05j31oK62K3k84r0L4MK45j03p7o6
$$ 130 -132 116 237 398 297 58 62 312 112 -226 -177 -72 -203 -209 53 76 -208 -298 -264 -260 -15 -118 -195 -261
1511b61L51k27k85J33J12J99p7m9J22K90o3k33J90J06j38j1N4m9r2o6k93N96n04
$$ -261 90 -137 -422 -289 -177 22 -55 -104 18 308 245 12 202 308 170 159 213 164 72 6 -287 309 -195
1534a95P2J72P4R6n14J57O1k15K93j48j44jR0J75k58J84Pp0NJ16K33o45M42j09
$$ -195 -123 49 123 219 -295 -138 -77 -292 1 -147 -291 -292 -202 -27 -285 -101 -94 -164 -159 -43 190 -455 -13 -122
1558a22K43l04K54J39K39r6k17K14J24m48j61M05o4q0l27R0K17l3j04k75M33j27
$$ -122 121 -183 71 210 449 353 136 350 474 26 -135 270 206 126 -201 -111 106 73 -31 -306 127 0
1580@k26j80OM35k87P1k58O08k98k17J22M92rk65j86J14N25k02k33M91p4K4k34
$$ 0 -226 -406 -400 35 -252 -181 -439 169 -129 -346 -224 268 259 -6 -192 -78 447 245 12 503 429 453 219
1603B19m27O46j76m33M6K92L81m89k4r9M09l12n42O13O0l46m43L14L20J90o59
$$ 219 -208 438 262 -171 -125 167 548 59 35 -64 345 33 -509 104 164 -182 -625 -311 9 199 -460
1624d60L41j25L26J5j39J06L36l57q8l8K11p6R5J9O6m8j50J11J98l88k22N36p8
$$ -460 -119 -244 82 97 -42 64 400 43 -45 -83 128 52 147 166 232 184 34 145 343 -45 -267 269 191
1647A91k89q7Q9L94k60k75Q2M31k15m71j8M64J35n32M4M42K17p53r4M74N90l95
$$ 191 -98 -185 -96 298 38 -237 -155 276 61 -410 -428 36 171 -361 -317 125 342 -411 -505 -31 559 164
1669A64q37M55Q18j56r27J82Q19L25q62k07N82M89q08o90N24P71o25o43Q0R02
$$ 164 -673 -218 600 444 -483 -301 518 843 -19 -226 356 845 37 -653 -129 642 17 -626 -546 356
1689C56o9q75l12J223K69j014l81P58O86q91m31K95J120k41j203M50J009k9j168
$$ 356 287 -588 -900 323 592 -422 -803 -45 641 -250 -681 -386 734 493 -710 -260 749 720 -448
1708d48k22J013M41o65r00P19J151r57q82M70R46kj124%P72R6p10k62P97L0n32
$$ -448 -670 343 784 119 -781 -62 1089 132 -750 -280 666 664 -460 -460 312 408 -302 -564 233 263 -269
1729b69l67N63M87n88k52M5R46m96l35j23K69L80n29J34N6J27j80q2K72L32l51
$$ -269 -636 -73 414 -174 -426 -381 565 69 -266 -389 -120 260 -269 -135 -79 48 -132 -214 58 390 39
1750C9L7J06K49n92L81J5K47o98m3N45J15l99n42M25L78m86m62N51M05m94o28
$$ 39 76 182 431 -161 220 235 482 -216 -259 286 401 2 -540 -115 263 -223 -685 -134 271 -223 -851
1771h51O58P39j30j285L13J094L79j192o17J244O23j076j053J013J622r13j652
$$ -851 -193 546 416 -869 -556 538 917 -275 -892 352 975 -101 -1154 -141 1481 568 -1084
1788a084O51J274J66j732q0J635L90j593j026J693J273j373j679R25J569n38j937
$$ -1084 -433 841 1007 -725 -805 830 1220 -373 -1399 294 1567 194 -1485 -560 1009 471 -1466
1805a466N15J830R4j685r60K546N91j994j149J401J638j001j717Q34J997n99j677
$$ -1466 -951 879 973 -712 -1672 874 1465 -529 -1678 -277 1361 360 -1357 -523 1474 875 -802
1822h02k67K039M61j903p79J794J239k044j141J245J230o02j827P03J672j14j530
$$ -802 -1069 970 1431 -472 -1251 543 1782 -262 -1403 -158 1072 470 -1357 -654 1018 904 -626
1839f26m64J444N58j490l94J054P37r21j058J172Q40m69j268M40J270n13o90L93
$$ -626 -1090 354 912 -578 -972 82 819 -102 -1160 12 852 383 -885 -445 825 312 -378 15
1857A5L84j17n96J0O90P9p41k90R28n4o44R1M62L24p83k37O67K30o13n54J067
$$ 15 399 282 -314 -304 386 465 -276 -566 362 308 -336 -245 217 541 -242 -479 188 418 -195 -749 318
1878C18O38j264o45J123O74q36q12K96J513p88j353L55J706K75j924q28K428O95
$$ 318 956 -308 -953 170 844 8 -804 -508 1005 217 -1136 -781 925 1200 -724 -1552 876 1571
1896A571j840j200J913J274j414j705P73K436q41k443L08K662L43k937q03K623
$$ 1571 -269 -1469 444 1718 304 -1401 -628 1808 967 -1476 -1168 1494 1837 -1100 -1903 720
1912G20J513k739j852K066K240j457k733J099L130o73k946j20L018Q02k958j426
$$ 720 2233 -506 -2358 -292 1948 491 -2242 -1143 1987 1314 -1632 -1752 1266 2068 -890 -2316
1928b316K772J706k251k043J939K466j415k734O88L085j85l253k39K982J045k768
$$ -2316 456 2162 -89 -2132 -193 2273 858 -1876 -1188 1897 1712 -1541 -1780 1202 2247 -521
1944e21j400K022K099j933k458J401K602o99k912N06K535J07k495o89K257R47
$$ -521 -1921 101 2200 267 -2191 -790 1812 1113 -1799 -1293 1242 1349 -1146 -1835 422 1369
1960A369j704j444J538J882j353j670Q79J645m62j571nJ800j33j199l72J509j03
$$ 1369 -335 -1779 -241 1641 288 -1382 -503 1142 680 -891 -896 904 771 -428 -800 709 606
1977F06p47n62Q37N45q14o48J020P2l80n21L26P26q01n44J052N66j190m48J211
$$ 606 -141 -703 134 679 -135 -783 237 309 -71 -592 -266 460 -341 -885 167 733 -457 -905 306
1996C06O25r28r49P41J400p84j804P26J831k45k149J96K234O50k661j249K675
$$ 306 931 3 -946 -205 1195 411 -1393 -667 1164 919 -1230 -1034 1200 1850 -811 -2060 615
2013F15J412k241j808J960K467j706k849J185L027m71l338j69L161J006l428j578
$$ 615 2027 -214 -2022 -62 2405 699 -2150 -965 2062 1591 -1747 -1916 1245 2251 -1177 -2755
2029b755L101K310k423k984J740L485j211l481K8M049N23l832j194L502K144l495
$$ -2755 346 2656 233 -2751 -1011 2474 1263 -2218 -2190 1859 2382 -1450 -2644 858 3002 -493
2045d93k176K617L105k141l818J698L829o84l965j74M001Q37l694j376K674K411
$$ -493 -2669 -52 3053 912 -2906 -1208 2621 1937 -2028 -2202 1799 2636 -1058 -2434 240 2651
2061B651k657k970K483K878j351l076M35L107K28l132q13L275J217k822j677K313
$$ 2651 -6 -2976 -493 2385 1034 -2042 -1607 1500 1728 -1404 -2217 1058 2275 -547 -2224 89
2077H9J853j706j639N32K519q28j991Q6J962L77j769m81J388Q70j445p31R86O62
$$ 89 1942 236 -1403 -871 1648 820 -1171 -1085 877 1254 -515 -996 392 1262 -183 -914 72 734
2095G34o79o53L30P46q58k18L30Q13q37k83Q03L67q73l26P57M13r12p84J070J124
$$ 734 55 -598 -268 478 -380 -598 -268 545 -292 -575 228 595 -278 -604 153 566 -346 -1130 -60 1064
2115A064q56j451P13J759o54j881M82J991N9k410k46K386Q36k056j678K023K127
$$ 1064 208 -1243 -530 1229 575 -1306 -824 1167 1226 -1184 -1430 956 1792 -264 -1942 81 2208
2132B208j755k367J057L000p21l326N4L381L81l084j249K964J899k712k445K444
$$ 2208 453 -1914 -857 2143 1422 -1904 -1850 1531 1912 -1172 -2421 543 2442 -270 -2715 -271
2148b71K741j384l760J247L809n75l419o54L383J475l117k192L034K650k453l266
$$ -271 2470 1086 -2674 -1427 2382 1807 -1612 -2266 1117 2592 -525 -2717 317 2967 514 -2752
2164b752J807L365o90l955K18L673M58l204j535L072K109k580k664K199K984j670
$$ -2752 -945 2420 1730 -2225 -2007 1666 2124 -1080 -2615 457 2566 -14 -2678 -479 2505 835
2180H35l135J069K974k46l042j07K570R40k299j481K154J722j637k088J196K059
$$ 835 -2300 -1231 1743 1497 -1545 -1652 918 1858 -441 -1922 232 1954 317 -1771 -575 1484
2196A484l93k113k8K132N9k025m6J289P09q63j270J199N39o31m71J6J002k03o90
$$ 1484 1091 -1022 -1050 1082 1141 -884 -930 359 1068 205 -1065 134 673 42 -429 -413 589 386 -304
2215c04K64L64l49m72M96M3j20k71O89J15p59j87N99L52p01m91P84J123j092j195
$$ -304 -40 324 -25 -497 -1 42 -78 -349 340 455 -304 -491 108 460 -241 -732 52 1175 83 -1112
2235a112R21J454n98j761J62J824L12j801q22J806J314j776j686J215K190j102
$$ -1112 -191 1263 665 -1096 -934 890 1202 -599 -1421 385 1699 -77 -1763 -548 1642 540
2251E40k282O58K309J33k535p06K779J031k408j569K074J925j669k295R86L127
$$ 540 -1742 -1084 1225 1358 -1177 -1883 896 1927 -481 -2050 24 1949 280 -2015 -1029 2098
2267B098m79l144J8K616R20k799j281K473J802j935k620J658K595j112k697L79
$$ 2098 1619 -1525 -1507 1109 2029 -770 -2051 422 2224 289 -2331 -673 1922 810 -1887 -1508
2283a508K923L07k781q73K743J026j924j679J713J905j146k247O89K227k81k438
$$ -1508 1415 1722 -1059 -1932 811 1837 -87 -1766 -53 1852 706 -1541 -852 1375 1094 -1344
2299a344QK056N73j736r71J558J233j180j246P79J580p02j169j56J216L04j517
$$ -1344 -1336 720 1293 -443 -1414 144 1377 197 -1049 -270 1310 608 -561 -717 499 803 -714
2316g14l7R16K88l10o54NJ222p28m24j6P20L22p69L0K52l42L36r7J89r8k36N98
$$ -714 -751 165 453 143 -511 -506 716 -12 -436 -452 268 590 -179 -149 103 -239 97 0 189 91 -145 453
2338D53m15m23K86L73K46r60k96J064K07n95o33M25J068m20j359L97J281k19j071
$$ 453 38 -385 -99 274 520 -440 -736 328 535 -60 -693 -268 800 380 -979 -582 699 480 -591
2357e91lQ32O82j267q39J343J048j273r88P26J498l78j895m8J569Q04j921m73
$$ -591 -594 238 920 -347 -1186 157 1205 -68 -1056 -330 1168 790 -1105 -1153 416 1220 -701 -1174
2375a174J738P68j495j361J140J672p91j921O94J701K77j750o27J589J082j785
$$ -1174 564 1332 -163 -1524 -384 1288 497 -1424 -730 971 1248 -502 -1129 460 1542 -243
2391b43j027J055J586n09k043N08J514O2j838l11J885L98j345r92J433J120j136
$$ -243 -1270 -215 1371 862 -1181 -673 841 903 -935 -1246 639 1037 -308 -1300 133 1253 117
2408A17j232O60J301k27j436j4J308K31r84n50J048N44o47j063Q11J064m73q12
$$ 117 -1115 -455 846 619 -817 -831 477 708 -276 -826 222 766 119 -944 -133 931 458 -354
2426c54K22O54j78p07k97P28M86p56L2jM37k75l99L55J54j84q8M6j8L34k20P6
$$ -354 -132 522 344 -363 -660 68 554 -202 -170 -171 266 -9 -408 -53 101 -83 -171 -125 -143 191 -29 47
2448D7L2Qk13K95j2j92k22N20j24m06J8M02L02n26m92O06M76p83k14L42O59k46
$$ 47 79 87 -126 169 157 -35 -257 263 139 -267 -249 153 455 -71 -563 43 519 -264 -478 -136 523 277
2470B77n81k14P52K48r30k15R12L66o47n69O56N55l99p06L05J017k72j102j52
$$ 277 -304 -518 234 482 -448 -663 249 615 -32 -601 55 610 211 -495 -190 827 555 -547 -699
2489f99J050L89j033k93N20P70q40p24N18P77M8j115o4J229K32j159l20Q32N24
$$ -699 351 740 -293 -586 -66 704 -136 -860 -342 435 483 -632 -696 533 765 -394 -714 118 642
2508F42o04p07N84N49l55p50K66Q02j58n74j77M72Q30q72m93N45N89l15n37o0
$$ 642 38 -669 -85 464 109 -641 -375 427 269 -305 -482 -10 820 -52 -545 0 589 274 -263 -323
2528c23P32j47p81J33O22M3m66m7K83J72k48j95Q5K66K50l86j68J52J01k40J77
$$ -323 409 262 -519 -386 236 279 -187 -234 49 221 -27 -222 -137 129 379 -7 -175 -23 78 -162 15
2549A5N1rk11P2k18J52L30k96M0j05L71k73J28p9J04J80k79J32j9l14L62K5n58
$$ 15 66 57 -154 -82 -300 -148 182 -114 -74 -179 192 -81 47 -32 72 252 -27 105 86 -228 134 159 -399
2572c99M72K60m83r6O9M03r4j61m18K44K27k87K64j27M88J07o46j50L06K76l37
$$ -399 73 333 -150 -246 -177 226 132 -29 -447 -203 24 -263 1 -126 362 469 -177 -327 -21 255 -82
2593h2l62P40j1l20n16M41K02J83n05J2O54j66j44k49J20L46o08J51q3O40l88
$$ -82 -444 296 285 -35 -551 -110 92 275 -230 -218 436 270 126 -123 -3 343 -265 -114 -197 443 55
2614E5m70K65L55k01l3j61N7O39o69j71L85K73k79l46M39j87L20l75q9M5J83J8
$$ 55 -415 -150 205 4 -29 -190 -133 506 -163 -334 51 324 45 -301 138 -49 271 -104 -193 -148 35 53
2636E3l65K51K33k16j4k3K22m1l11M0K68m9j23K3n2K21r2m43K00K59K1k45n0M14
$$ 53 -312 -61 172 -44 -58 -81 141 100 -211 -171 97 48 -75 -52 -104 117 25 -418 -218 41 62 -183 -233 181
2660A81j25j17J45k33K02l14K38k78M44j11P5m18L02L3j3j54M23o28L05J73k19
$$ 181 56 -61 84 -149 53 -261 -23 -301 143 32 107 -311 -9 24 11 -143 280 -348 -43 130 -89
2681h9J29l69L66K6K5j75j19K96M9r6j1k6j87N0J68l9Q8j58J11N5o4j38Lj9J10
$$ -89 40 -329 37 63 88 -87 -206 90 139 43 32 6 -181 -131 37 -2 86 -72 39 94 30 -108 -105 -124 -14
2706a4m9K7J37J82m19PJ66j54K09m2J76k00J3J87k91J9J05r8j62L6K68q0N4J62
$$ -14 -63 -36 101 283 -136 -129 37 -117 92 50 226 26 39 226 -65 -46 59 -39 -201 -165 103 23 77 239
2730B39l04K99j28j38K48k34p9J30K7k44J31R2k38L10j30n3J88k21J87J66l68
$$ 239 -65 234 106 -32 216 -18 -97 33 60 -184 -53 39 -199 111 -19 -72 116 -105 82 248 -120
2751a20J76n6J4j32K69j66K4k97L90j51o9J16O2Q6j54J46m97K08M8k45L55j48
$$ -120 56 0 14 -118 151 -15 9 -288 102 -49 -118 -2 60 146 -8 138 -359 -151 -103 -348 7 -141
2773a41J68J60l48j33K38K83j95k40K68PM23m54L0L3j26k76K11L15k92K0K02n8
$$ -141 27 187 -161 -294 -56 227 32 -208 60 67 490 36 66 99 -27 -303 -92 223 -69 -49 153 95
2795I5k7Q1n26N39l12J41J73J10M2k8m34L3Q6J34N6j73J38k66K14k12M4M33l90
$$ 95 68 149 -377 162 -150 -9 164 274 316 288 -146 -113 -27 107 163 -10 128 -138 76 -136 -92 341 -49
2818d9J07j94o5K95R9k10K62j76j53L24n88K49J30k90J92l4P2k32J48J49J29k86
$$ -49 58 -136 -201 94 193 -17 245 69 -84 240 -348 -99 31 -259 -67 -101 -29 -261 -113 36 165 -121
2840a21K99l35j4K22L3l15K40J17j64q1J82K10k18j30o4J13k49K45P7k13K50J59
$$ -121 178 -157 -171 51 84 -231 9 126 -38 -119 63 273 55 -75 -139 -26 -275 -30 47 -166 84 243
2862B43l18n6J63K02l17K22n8j45J90j82M03m22j17j05J34L39k90j4J72r1l7K59
$$ 243 -75 -131 32 234 -83 139 81 -64 126 -56 347 -75 -192 -297 -163 176 -114 -128 44 -47 -84 175
2884A75k68J01o2K41j86j67J17J3J71QJ20j91r6r4L03P7k19k56K51P9j26J74k02
$$ 175 -93 8 -54 187 1 -166 -49 -36 135 143 263 72 -24 -118 185 262 43 -213 38 117 -9 165 -37
2907c7k96L54J5Nj77L19m24K92L31l81J26o8k08J60r6j94K41J56l6j15j05p4K05
$$ -37 -333 21 36 41 -136 183 -241 51 382 1 127 59 -149 11 -85 -279 -38 118 82 -33 -138 -212 -7
2930gL9j53J30j2l4lO4K44k26j88J04K33j87J15j10m29O79m00M9J35j94QJ16N7
$$ -7 32 -121 9 -3 -37 -40 24 268 42 -146 -42 191 4 119 9 -420 259 -141 -92 43 -151 -143 -27 30
2954C0J30l30j18Q9M91m56J90pK0R1k28K32m1j55k61M85r7R7l22K65j86j10m4
$$ 30 160 -170 -288 -199 292 -164 26 19 39 130 -98 134 93 -62 -323 162 65 162 -160 105 -81 -191 -235
2977b35K97j92j6Q8q8J67KO8n9k06L9L88m09L10l91K56p2J26j1j15o0J23q2J88
$$ -235 62 -130 -146 -58 -146 21 23 91 32 -174 -135 253 -156 154 -237 19 -53 73 62 -53 -113 10 -72 116
3001A16j78J57j11j16M0JO0q4O9L3j86L11J87k14j9j88J37N3j29%J21k41K44o6
$$ 116 -62 95 -16 -132 -92 -91 -31 -115 -46 -13 -199 112 299 85 66 -122 15 68 -61 -61 60 -181 63 -3
3025cJ21j06j53J82k6Q0l8l9l9J08n9j0l6J72Q2j58k77K42o3J06p7J82J15m92
$$ -3 118 12 -141 41 15 95 57 18 -21 87 28 18 -18 154 236 78 -199 43 -20 86 9 191 306 -186
3049a86K77j34M0J54k84k2J92j75K86J6n7J14m42L83j48q2J10N5l93L91O8k98
$$ -186 91 -43 -3 151 -133 -155 37 -138 148 164 107 221 -221 162 14 -68 42 97 -296 95 163 -135
3071a35J60j38L60m26J70m6L7O5Q4r8j19M67o29M18j64j43j05K68j12K31j57j05
$$ -135 25 -113 247 -179 -9 -55 -18 47 131 33 -86 381 -248 170 6 -137 -242 26 -86 145 -12 -117
3093a17J17k4k54K85J70N2o5j2j45K87j78j69J42j85q1R5L06R8m50K33l43o3M26
$$ -117 0 -24 -278 7 177 229 164 152 7 294 116 -53 89 -96 -177 -82 224 322 -128 105 -238 -301 125
3116A25k31K17j70K60lq1k46K49l67L35j96K42j65j22K73J1m8j52k18K52k5j3
$$ 125 -106 111 -59 201 198 117 -129 120 -247 88 -108 134 -31 -153 120 131 83 -69 -287 -35 -60 -73
3138g3J66j69J73l80J37K9J91k31J0M59nj43N9k45K16k65J13k33J94j6k11L12
$$ -73 93 -76 97 -283 -146 -117 74 -157 -147 312 307 164 223 -22 194 -71 42 -191 3 -13 -224 88
3160H8l59M51k08j5R9p5p5N9J80J59k34p1m6q1K11j06j04J39k69M67l32Lm1j15
$$ 88 -271 180 -28 -43 56 -19 -94 -35 145 304 70 -1 -47 -128 83 -23 -127 12 -257 210 -122 -119 -160 -275
3184b75L2J30J59j22N5J17J69m91j3J38NJ37k33l7M48o4j44J32j40k75J83j96
$$ -275 -243 -113 46 -76 -21 96 265 -226 -239 -101 -96 41 -192 -229 219 155 11 143 3 -272 -89 -285
3206b85M27k81j54K45j28K02J86j93MJ15m09K26k32K94K06k25j3k6k82M11R4k41
$$ -285 142 -139 -293 -48 -176 26 212 19 23 138 -271 -45 -277 17 223 -2 -15 -41 -323 88 182 -59
3228e9mPJ22m53J76J54k4P7o3K8J96l45K34pk81K9M16k80O1k0J17l16K72q4Q3
$$ -59 -63 -56 66 -387 -211 -57 -81 -4 -67 -39 157 -188 46 39 -242 -213 203 -77 -16 -36 81 -235 37 -47 36
3253C6J39k53O0J03Mj26K58k68j20K19j77K37o8r5K02j37N2l1p8J53k28M33n26
$$ 36 175 -78 -18 85 89 -37 221 -47 -167 52 -125 112 44 -51 151 14 66 35 -43 110 -118 315 -211
3276b11L7J74O0J33l77J53o9L50l01j53J54J15J86k63J55j16K5j23n1j02K07Q3
$$ -211 -174 0 60 193 -184 -31 -100 250 -51 -204 -50 65 251 -12 143 27 52 -71 -122 -224 -17 66
3298F6P4n8r4k18M9L68m33K37j09K6J11j01j26J80J94l32K53n5J4R3l32L83kj87
$$ 66 140 82 -12 -230 -181 187 -246 -9 -118 -92 19 -82 -208 -28 166 -166 87 32 46 139 -193 190 188 1
3322Aj79L45j85N6j10L1Rpl1L08l51q0J32J0J19j23O7q2Q4N3L25n71K93k39K34
$$ 1 -178 167 -18 38 -72 -41 -32 -39 -70 238 -113 -193 -61 -51 68 -55 12 -70 14 67 392 -179 114 -125 109
3347A09jM7k1n8m5L8k29K47j40M66k46k50J66j0Mn1j14J44r4K8k12M07J9q7j43
$$ 109 108 155 134 76 31 69 -160 87 -53 413 167 -83 83 73 77 26 -88 56 -38 -10 -222 185 204 117 -26
3372b6j41O0J08K1k5j59J70j3J8k1k82M62j71m3J5J26k14j00J78m2K04j18k37
$$ -26 -167 -107 1 22 -3 -162 8 -5 13 -8 -290 172 1 -42 -27 99 -115 -215 -37 -79 125 7 -230
3395b30L03j07J42p7J07m7O9k64J08qo1n0M07j80p9P9j65L4L5Q0j84n5L36k64
$$ -230 73 -34 108 31 138 91 160 -104 4 -4 -65 -115 292 112 33 112 -53 -19 16 96 -88 -143 193 -71
3419g1N7J61j82J91O9j50j26L25l15r2L57j75j83L00m90L62j28J05J40j36j02
$$ -71 -14 147 -35 156 225 75 -51 274 -41 -133 224 49 -134 166 -324 38 -90 15 155 19 -83
3440h3K19o2J7m3M9k4r3n2J38R6p9J29q6j31j11J39L6l98L10R5k94O9K91j89K85
$$ -83 136 74 91 48 97 73 -20 -72 66 162 83 212 126 -5 -116 23 59 -339 -29 66 -228 -159 132 -57 228
3465B28r0k68L26k40l5no7J89k2l65M38M9n1j84O4J24j1j59J1J8J95J54j11J13
$$ 228 138 -130 196 -44 -79 -84 -151 38 16 -349 89 138 87 -97 -33 91 80 -79 -68 -50 145 299 188 301
3489C01k33k32K02N4J51k63j63QK34l8m4Q2nm3j57K2K05R7k61J75j23q8p8K08
$$ 301 68 -164 38 92 243 -20 -183 -175 59 21 -23 59 54 11 -146 -124 81 178 -83 92 -31 -119 -197 11
3513A1Q5l1j5o8n6K49l09j18J68J92o4l45M65k96K74j89JK7Q4J14j29J27k04j4
$$ 11 96 65 50 -18 -74 175 -134 -252 -84 108 44 -301 164 -132 142 -47 -46 -19 65 179 50 177 -27 -41
3537d1J34k3k31L71k06r9J63k6L32m14J7L72m61K68p7K7k5j40J5j5J70k59L71
$$ -41 93 70 -161 210 4 -95 68 42 374 -40 -23 349 -112 156 79 106 81 -59 -44 -59 111 -148 223
3560B23j76k08J33n1J56O6j94o6n1K85J03j89p8k5K81l01K4K64k79K82j82N0l4
$$ 223 47 -161 -28 -79 77 143 -51 -117 -168 117 220 31 -47 -72 209 -92 -68 196 -83 199 17 67 33
3583C3q1P2p5K9j3k0P3lj74J11j04Q1N8j59J99j7K84l31R2Mj23L08l54K8M05k64
$$ 33 -48 24 -51 -22 -35 -55 18 15 -159 -48 -152 -71 -13 -172 27 10 294 -37 55 59 -64 244 -110 -82 323 59
3609E9j58%k45L45K27l17j43J48J58k57K36k0kK43j60q9J20k02j92J37K70l63
$$ 59 -99 -99 -344 1 228 -89 -232 -84 74 -183 53 33 31 274 114 25 145 -57 -249 -112 158 -205
3631b05J58p1L4K89k74k38L32J42J8j27k67J77p3O2J05k38R1P6l4j27M47k51o
$$ -205 -47 -118 -84 205 -69 -307 25 167 185 58 -209 -32 -105 -43 62 -176 -85 -9 -43 -170 277 26 20
3654B0n0q9M0J60m8l53L73l96M26k84J75n8M03l10J31k49Q5J11PK3L9j27L9J93
$$ 20 -30 -119 -79 81 33 -320 53 -343 83 -201 -26 -84 319 9 140 -109 -24 87 94 117 156 29 68 261
3678B61l50K35j61J0n8O5j34K9J53nj58J03R7j61K36j04j09J36r1r2J73K3O8k34
$$ 261 -89 146 -15 -5 -63 2 -132 -103 50 45 -113 -10 87 -74 162 58 -51 85 -6 -98 75 98 166 -68
3702f8m9j0kJ60J08l25K1K71J7j36Q3l3m9q2K2Rq6R7J97Nk31j5K3M53k11l18K24
$$ -68 -117 -127 -129 31 139 -186 -165 106 123 -13 70 37 -12 -94 -72 -63 -149 -52 145 150 -81 -96 -73 380 169 -149 75
3729G5j59Q7J60j9J00m20L55k23J38P0Rk59j18J16lK73k02J49k51P4k59J70J96
$$ 75 -84 3 163 144 244 -176 179 -44 94 164 173 -86 -204 -88 -91 182 -20 129 -122 -48 -307 -137 59
3752E9r6j58K37K84m78R4p7k50K96J03M5R5k06J46k63Q1R5k6K9k8J55j71J23j1
$$ 59 -37 -195 42 326 -152 -58 -135 -385 -89 14 59 154 -52 94 -169 -88 7 -19 10 -18 137 -34 89 78
3776G8J87k47Pj66K21K13k06j64R5O0k94J71O1m3J79j77m0J43j09J42j05K42l67
$$ 78 265 18 25 -141 80 293 87 -77 18 78 -216 -45 16 -27 152 -25 -65 78 -31 111 6 248 -119
3799a19o9J24R9K12n22R2J44N8k09L92k06k7K92k49Qk27L21k27M1P4n7o8oL92
$$ -119 -188 -64 35 247 -275 -183 -39 19 -190 202 -4 -31 261 12 20 -207 114 -113 -72 2 -55 -123 -129 263
3823B63m09M25m39J69j5J58l12l7L85j26N2k1J79m32R5P6o9K23k26K63k50L2L4
$$ 263 -146 279 -160 9 -6 152 -160 -197 188 62 114 93 272 -160 -65 11 -58 165 -61 202 -48 -16 18
3846A8m1j1J46K74m56J83j64L03k92j50K29J6k0O7j72J14k2l18L88J60l57J81
$$ 18 -23 -34 112 386 -70 113 -51 252 -40 -190 39 55 35 102 -70 44 22 -296 92 252 -105 76
3868G6n1M6l18o1K88K11j88n5N7QJ50l49K61j34K61k51k61K37j1n5J10j00M20
$$ 76 25 71 -247 -308 -20 191 3 -52 5 13 163 -186 75 -59 202 -49 -310 -73 -84 -139 -29 -129 291
3891B91n04J76j16J63j5J14k14J31P7k44m9K11J26J81m39j43L88J2P6l96K55J34
$$ 291 -213 -37 -153 10 -5 109 -105 26 103 -141 -190 21 147 328 -111 -254 134 146 222 -174 81 215
3913B15k56j85L63K37k82k07O6rL4r5K17mk38j17P5L47p8k44r4N9L75l10Q3K81
$$ 215 -41 -226 137 374 92 -115 -49 -58 -24 -119 98 94 -144 -261 -186 161 83 -161 -255 -196 179 -131 -48 233
3937B33j1m49K3N09J3k27m7j87J44K3n7k04J62K12k40k05J83J04k73J08jL34j22
$$ 233 222 -227 -204 305 318 91 44 -143 1 24 -33 -237 -75 137 -103 -308 -125 -21 -294 -186 -187 147 25
3960B5j49J38K26k80k33J15M52l99m7K08J36j34j47J45K16p6j36k8K30j74r3j78
$$ 25 -124 14 240 -40 -273 -158 294 -105 -152 56 192 58 -89 56 272 196 60 32 262 88 -5 -183
3982a83K08j69L11k68L7K35q8J22n56M46l4j66k12N13k4m26P1M96j4l60j88P4
$$ -183 25 -144 167 -101 -64 171 83 205 -351 95 61 -105 -317 196 172 -254 -183 313 299 -61 -249 -175
4004a75M87k05l11M2J31K98m22n8L72Q2n77J00P9M05k52k5L3L01j58l93N4M72
$$ -175 312 107 -204 -162 -31 267 -155 -213 159 241 -336 -236 -157 248 -4 -29 4 305 147 -246 -192 280
4026B80j31k77J34L27P6l98j25L86M4m04j51L7L63k90j87J75J97O3p9J4k22N91
$$ 280 149 -128 6 333 409 11 -114 272 316 -88 -239 -202 161 -129 -316 -141 56 119 40 54 -168 423
4048D23l55l60J49K65N7k71o7M40l03k25K25L38m59O7J91P6K2l21NJ17J25r0r0
$$ 423 68 -292 -143 122 179 -92 -159 281 -22 -247 -22 316 -143 -76 115 191 213 -108 -103 14 139 49 -41
4071d1R7N6J50j47k77M06k57j76K36j7J99k62j01l5L70m11J96J03Q0j88p5P9J09
$$ -41 56 112 262 115 -162 244 -13 -189 47 30 229 -33 -134 -169 201 -210 -14 89 169 -19 -94 -15 94
4094I4j30k64R1Qk4J11k1L76o4l95K75J66N5m33R0J92K94o88o9M24L97n45m18
$$ 94 -36 -300 -209 -201 -225 -114 -135 241 177 -218 57 223 278 -155 -65 127 421 -267 -336 88 485 -60 -478
4117d78N72J73j12l08qM59M0m12k59K62J28k52r3L84K09l21l81N08J63k80m17
$$ -478 94 267 155 -153 -161 298 338 -74 -333 -71 57 -195 -288 96 305 -16 -397 111 274 -6 -423
4138d23L41L21q4n45J92J77K38k11j91J15J71j00k49J96J97j23n77N36K69j56
$$ -423 -82 239 155 -390 -198 -21 217 6 -185 -70 101 1 -248 -52 145 22 -555 -19 250 94
4158I4j98R3M3K27m78NN0K39M2j52K0Q5j14k46K45M28n07k4J1K36J86l67k18J39
$$ 94 -104 -11 32 259 -219 -214 -164 75 117 -35 -15 70 -44 -290 -45 383 -124 -148 -137 99 285 -82 -300 -161
4182a61J73J83l85N3J34J92l18N1M54l96oJ45J32j90J3j53K01Mk42J57Q8rk14
$$ -161 12 195 -190 -137 -3 189 -129 -78 376 -20 -26 119 251 61 74 -79 122 126 -116 41 129 120 -94
4205i4qK25K6j55o3R9J09k85o5L54L43n21J10j85L23n22r7n0J071n55ok53L31
$$ -94 -102 123 149 -6 -69 30 139 -146 -211 143 486 -35 75 -110 213 -309 -406 -456 615 60 54 -199 132
4228A32J45l85P1Q4J31n2j34l42N28K8l12Q1J99k32j50N6k3L95k03k47K31L13
$$ 132 277 -108 -37 47 178 126 -8 -350 178 206 -106 -25 174 -58 -208 -152 -175 220 17 -230 1 314
4250C14k27j23p1K57K03n64J21k77P15n00L8P0K69l26j27K43K91j0n58K79J79
$$ 314 87 -36 -107 150 353 -211 -90 -367 348 -152 -114 -44 225 -101 -228 15 306 296 -262 17 196
4271A96P4k08J9J90r9Om25M37j50R9k28j9K44o9k74J05P5R9j75K06L2M6k02m8
$$ 196 270 62 81 271 172 178 -247 190 40 139 -89 -108 136 67 -207 -102 -27 72 -103 103 135 181 -21 -69
4295f9n0N7J5j12K85L22k78l72K23j49J67J38k17O8J8k78J46K14n26L78k6K31
$$ -69 -119 -62 -47 -159 126 448 170 -202 21 -128 39 177 -40 28 46 -232 -86 128 -398 -20 -46 185
4317A85p7l33M64j96j31k25J35J73p7n6J25P5j13n0j05LM92o8m35M1M28o9k61
$$ 185 108 -225 239 43 -88 -313 -178 -5 -82 -138 -13 62 -51 -101 -206 -203 289 221 -214 -173 255 186 -75
4340g5r5K86k3l45O6L85K53l30j10k33K29J40n45K88K81j09n23M90J01j35p2j2
$$ -75 -170 116 93 -252 -186 199 452 122 12 -221 8 148 -397 -109 172 63 -460 30 131 -4 -76 -88
4362h8J3K30k13k06L04K86k24j11N0J48j77j63J3J56L9j39j51K76L14j83k38R4
$$ -88 -75 155 -58 -264 40 326 102 -9 41 189 12 -151 -138 18 57 -82 -233 43 357 174 -64 30
4384C0J54n9j29O6J63j25k77k01M51J44O0o07K66K10j48l97K76L3K59j75J0r7
$$ 30 184 125 -4 62 225 100 -177 -378 73 217 277 -330 -64 146 -2 -399 -123 -90 169 -6 4 -93
4406i3M16m09J81r7J85Qj58j33J3K7K5L00K3j70N7k78PN1lN9Lj6r2O9J73j18k91
$$ -93 323 -86 95 -2 183 191 33 -100 -87 -60 -35 265 288 118 175 -103 -96 -45 -48 11 14 -2 -94 -25 148 30 -261
4433b61L67J05j90lJ7j25K28m9j32j75K99l87L55m03N50m15J10J02j66J10p8K09
$$ -261 106 211 21 18 35 -90 138 89 -43 -218 81 -306 49 -354 196 -219 -109 -7 -173 -63 -141 68
4455F8j6%N9p3R5j36J07l55M45l0j21j81k3L31O5l51p6L63j3k02p8M0K62k8k98
$$ 68 52 52 111 38 133 -3 104 -251 194 164 43 -138 -161 170 235 -116 -192 171 158 -44 -122 -82 180 152 -146
4480a46J35J29N1k11J06K09j90J24l79L87p5j20p0J9j01M48l60k7l0k49J73k00
$$ -146 -11 118 169 -42 64 273 83 207 -172 215 140 20 -50 -31 -132 316 -44 -71 -101 -350 -177 -377
4502c77J10K4K75n4L87k86r2l7P0J23k19l2j00J48J95q9J74n02J97M5P8k36M5
$$ -377 -267 -243 32 -22 365 79 -13 -50 20 143 -76 -108 -208 -60 135 46 220 -282 -85 -40 38 -198 -153
4525a53K97k23J30n6K7MK04J04l65q8j6L71J9j58N7L5k84J45K34l26j54K80J26
$$ -153 144 -79 51 -5 22 26 230 334 -31 -119 -135 236 255 97 154 189 -95 50 284 -42 -196 84 210
4548B10j74K49l78L65k08M0j63Q9K49m74L09l53L32j70R0j86R9P5k96J06K94k2
$$ 210 36 285 -93 272 64 104 -59 30 279 -195 114 -239 93 -77 13 -173 -74 1 -295 -189 105 83
4570H3L9k10p3K67Kj07q6J49j02J2p6J48Q5J59l73J83K0j34J45k31K55J11l80
$$ 83 122 -88 -161 106 108 1 -85 64 -38 -26 -102 46 131 290 -83 100 120 -14 131 -100 155 266 -114
4593a14R0Q5K10k88r1mJ1J90j33J48N1j25k11P2j00L76p3j22qk3J80k19K5J59
$$ -114 -24 61 271 -17 -108 -112 -101 89 -44 104 155 30 -181 -109 -209 167 94 -28 -36 -59 121 -98 -73 86
4617H6Q2N8m35L89k4l36K6L90l84K67k51J65m1L06j83j64J67qj10J0L04l01j7
$$ 86 168 226 -209 180 156 -180 -154 236 -148 119 -132 33 -8 298 115 -49 118 110 0 10 314 13 -4
4640dl07M43N1j68K37j62J13k57J11q1j08J49j18M0k7L34l96rJ22O9O4j51K52
$$ -4 -311 132 183 15 252 90 203 -54 57 -24 -132 17 -101 -61 -88 246 -150 -159 -37 32 96 -55 197
4663A97l63M1J01oJ81m9j57j60M1K6m4J83J96l80N3j08M50l17j5Q0j1N3p3j29
$$ 197 -166 -125 -24 -30 151 102 -55 -215 -174 -148 -192 -9 187 -193 -140 -248 202 -115 -130 -50 -61 -8 -81 -210
4687b10M41j7m11k41L51Q6j0k2J71j66L8l9O7kK9j71q9L35j16m4j03K87j10k3
$$ -210 231 214 -197 -438 -87 -1 -11 -33 138 -28 10 -29 38 36 65 -106 -195 140 24 -20 -123 164 54 31
4711C1o9k73J88M3N8j31J78L7K3P4l42K36k09J77k34L54j61J64l8N6l88K87j54
$$ 31 -38 -311 -123 -80 -22 -153 25 62 85 159 -183 53 -156 21 -213 141 -20 144 106 162 -226 61 -93
4734i3R6J86k39j0J21L2j37k16J75%L41l32PJ74K3m47K75K53j77j5j43q4L02j2
$$ -93 3 189 -50 -60 61 93 -44 -260 -85 -85 256 -76 -69 105 128 -319 -44 209 32 17 -126 -210 92 80
4758H0r9Kk2p1k2K13l67K95J61l02m4J79j73L5L50k88j04L37L7k30K06k71R2K43
$$ 80 -19 -17 -39 -110 -132 81 -286 9 170 -132 -176 3 -170 -135 215 -73 -177 160 197 -33 173 -98 -6 237
4782B37j85k02o4K89jo2l0J17j86n7j03L78o0l00K17m0N3k7J95p8r2o7R8k43K16
$$ 237 52 -150 -214 75 74 12 -18 99 -87 -144 -247 131 71 -229 -12 -52 1 -26 169 91 -1 -68 30 -213 3
4807CQ7l44M76k61l5m9J95r4K47k11j7M4J52j03j36K41k99M1q2J75l7K31l85M2
$$ 3 90 -254 222 -39 -74 -123 72 -22 225 14 -3 41 193 90 -46 195 -104 -63 -145 30 -7 224 -161 -119
4831a19j48K49k20J03K54n8o3r1n2L0J93j05L41n62K29j76M2k2K50j54rj92k7
$$ -119 -267 -18 -238 -135 119 61 -2 -93 -145 -115 78 -27 314 -248 -19 -195 -153 -175 75 -79 -88 -280 -307
4854c07J96K32J23k55J03k12r0L29J40k59j65J55J97j22Ko8j37L79k75j07L45
$$ -307 -111 121 244 -11 92 -120 -210 119 259 0 -165 -10 187 65 67 -1 -138 241 -34 -141 204
4875B04j30K32j54m2r5j68J89l6k27K29K05k30M7Q2n6j26J47o4K16l11J29J61
$$ 204 74 306 152 110 15 -153 36 0 -227 2 207 -23 24 106 50 -76 71 7 223 -88 41 202
4897B02l40J63k6K5r3O6NJ75l78J80k9K47k92o9J97j20R7J52q5J17j38J09j89
$$ 202 -138 25 -1 24 -69 -3 2 177 -201 -21 -50 197 -95 -164 33 -87 10 162 77 194 56 165 -24
4920b4J39J5P0k60J85Rj75J5J88P4k64J12q1M9m2O2k05J93J28k78L9P4o9K2p3
$$ -24 115 130 200 -60 125 134 -41 -26 162 236 -28 84 3 52 10 72 -133 60 188 -90 -51 23 -46 -24 -97
4945i7J45k00p3L52m13L99K9o7J51j36k4k14L70k65K80j32J31k25l07N00k47j51
$$ -97 48 -152 -225 127 -286 113 142 75 226 90 66 -148 222 -43 237 105 236 11 -296 204 -43 -194
4967a94L40j75j65J95j6P1Pk94K34M3k3q7Q7J28r4J14l52M03k64j6J93l5r8r2
$$ -194 146 -29 -194 1 -15 56 63 -231 3 46 23 -64 23 151 57 171 -181 222 -42 -58 135 100 2 -90
4991i0R6J20m5j2j7k0L4j31oP2j89K51l48K34L20k79%L44m63L71j98j18j64K12
$$ -90 6 126 81 69 52 32 66 -65 -71 1 -188 63 -285 -51 269 -10 -10 334 -129 242 44 -74 -238 -26
5015b6J30m3j03Q2J17k22L43k09j96K11j50J32OM2m2k34K02n0j71p7L44k18O6
$$ -26 104 61 -42 40 157 -65 278 69 -127 84 -66 66 72 114 72 -162 40 -10 -181 -258 86 -132 -66
5038f6J44K7k42o6J28L4J20j32L5O7l3Jk46L47n2r5J32q8K82j12j63K9m6oJ28
$$ -66 78 105 -137 -203 -75 -41 79 -53 -18 49 16 17 -229 118 66 -29 103 15 297 185 22 51 5 -1 127
5063A27P9j21LJ09M7p5j75K8o5j25K15l4L16j62j64QJ96l16J71Kj46k6J29K7j07
$$ 127 206 85 88 197 244 169 -6 22 -43 -168 47 13 329 167 3 11 207 -109 62 64 -82 -108 21 48 -59
5088e9L17p6q1l0Q7k71J98k59J47M5J95k97J11m8J87l68K44k92K5K06lJ12o1k9
$$ -59 258 182 101 71 158 -113 85 -174 -27 18 213 -84 27 -21 166 -202 42 -250 -225 -19 -22 90 29 0
5112@r8M5K58k34lq8M7J39j53j50N07k60k49K86K07k09j18K15l53O63m28K4l20
$$ 0 -98 -53 205 -29 -32 -120 -73 66 -87 -237 270 10 -239 47 254 45 -73 142 -211 452 24 48 -272
5135b72K56l3k6J81j43J56m19N08k37J0J03L4n4M9j87L06k49m11L88j5L66l09
$$ -272 -16 -49 -75 106 -37 119 -300 208 -29 -19 84 118 64 113 -74 232 -17 -428 -40 -55 311 2
5157BN3j07P2L1J44n8k33KL9K5N4k30K98J9r7k61J94m9J37J39m34K31L45k67K6
$$ 2 55 -52 20 51 195 137 -96 -94 -55 -30 24 -206 92 111 14 -247 -53 -102 35 174 -260 -29 316 49 75
5182G5R6l93L87o5k15R0P9k39J45J4K22l25J37O4P1R8r7q8m0J87l57K88L0j76
$$ 75 171 -222 165 100 -115 -25 54 -185 -40 -26 196 -129 8 72 143 241 144 56 16 203 -154 134 164 -12
5206a2K48l50K32j02j77P6R1R8q4%L0J15RL7k47r5J32J52l95J08O0K93j50Q8M2
$$ -12 236 -114 118 16 -161 -85 6 104 20 20 50 165 174 211 -36 -131 1 153 -242 -134 -74 219 69 157 199
5231A99j88l6O8K97m13J63k03k3m6K11k65K48R3j88K02%k46J56k63J74K1L12k77
$$ 199 11 -25 43 340 -73 90 -113 -136 -182 29 -236 12 105 -83 119 119 -127 29 -234 -60 -39 273 -4
5254dJ20j23q1K46j1j21j85K78k44J38j5K65m02J5J8p9K49J26l15j0L59j7l50
$$ -4 116 -7 -88 158 147 26 -159 119 -125 13 -2 263 -139 -124 -106 -185 64 190 -125 -135 224 207 -143
5277a43L3J85J31k57p6J56J96j83P5j44K2R1J15l11q8K04p9J26P0m9j42J80k72
$$ -143 -110 75 206 -51 -127 29 225 42 117 -27 -5 86 201 -110 -198 6 -73 53 123 74 -68 112 -160
5300a60L06l39M81k33k8k80j04K07J08K57k43L0O3j28P6QJ52k58j5O5j00J32J82
$$ -160 146 -193 288 55 27 -253 -357 -150 -42 215 -28 2 65 -63 13 21 173 -85 -100 -35 -135 -3 179
5323A79k49O8j23J38K7O0k27K1J81j40J5J40P1j31k40K13N7k05J94j24r5K65o1
$$ 179 -70 -2 -125 13 40 100 -127 -106 75 -65 -50 90 161 30 -210 3 60 -145 49 -75 -170 95 34
5346C4K08k44K3L0p7j32J91N2k84N77l28k85K31j00KJ92k46L0RJ54RJ53k37r1
$$ 34 242 -2 21 51 -26 -158 33 85 -199 378 50 -235 -4 -104 -102 90 -156 -126 -117 37 46 199 -38 -129
5370a29K55k80L04k19K08k8p2K9ol7j42J05K39m88K14J02N2k52J13J5Nk43L63
$$ -129 126 -154 150 -69 139 111 39 68 62 25 -117 -12 227 -261 -47 55 107 -145 -32 -17 -12 -255 108
5393A08k1k39J99J18j92QkP0O7j73K1J36j90J18p3jP3J9k00K41K2o2R4j41K30
$$ 108 87 -152 47 165 -27 -19 -21 49 116 -57 -36 100 -90 28 -45 -46 27 46 -154 87 109 47 141 0 230
5418B30j49k03J56l07K64P0q9K54l19M7J56j55j53J53j98K52j00K43j02Mk0m17
$$ 230 81 -122 34 -273 -9 61 -28 226 -93 -46 110 -45 -198 -45 -243 9 -91 152 50 54 34 -383
5440c83L64j06q6J47J28M0k38L19k99J71J6p3QL4j67k04Q4M30l35K47M6j63pK19
$$ -383 -19 -125 -211 -64 64 104 -134 185 -114 57 73 0 8 42 -125 -329 -245 185 -150 97 143 -20 -27 192
5464A92l99K95%l77K85J67J43l81L14k23j47K8n6P1J62l29J19k2J03J63l4R7k48
$$ 192 -207 88 88 -289 -4 163 306 -75 239 16 -131 -103 -159 -88 74 -255 -136 -158 -55 108 74 171 -77
5487g7K27j41J10p8r8j67M81j30k86Q3K94k99J31j99j67J40K32p4J43J9j64Ml1
$$ -77 150 9 119 41 -57 -224 257 127 -159 -76 218 -81 50 -149 -316 -176 56 -18 125 144 -20 -16 -47
5510d7O3m1oq0R8j12J36Q8l37J63J35O3l18M60j41k05K15j59O3k29K28M0q0k30
$$ -47 16 -25 -31 -111 -13 -125 11 99 -238 -75 60 123 -195 265 124 -81 134 -25 38 -191 37 77 -3 -233
5534b33L53P2l41K12j92K42j27j22j62L12R1O6k62L28j85k84K58j70j32M16j77
$$ -233 120 192 -149 63 -129 113 -14 -136 -298 14 105 171 -91 237 52 -232 26 -144 -276 140 -37
5555c7l44M99K11k64j01K1k06L40j13j96J01jK67n5l84J61L34k25J28k85k3r4
$$ -37 -381 118 329 65 -36 -15 -221 119 6 -190 -89 -90 177 122 -262 -101 233 8 136 -149 -172 -266
5577b66l1L29J40q1j72J67k53K93l6j90J45K20l24j35M20l44K86j44K13k83J42
$$ -266 -297 32 172 91 -81 86 -167 126 90 -100 45 265 -59 -194 226 -118 168 24 237 -46 96
5598I6o8J70l08J86j72j43J47K70j69M1j24J17k32K02L41l59p5m8j14K24rJ82
$$ 96 28 198 -110 76 -96 -239 -92 178 9 50 -74 43 -189 13 354 -5 -80 -128 -242 -18 -27 155
5620A55j26m0K9L13l70J64j27k9K28k30L4K99k32J90k58K5LP7l56M41l51K07J44
$$ 155 29 -11 18 331 -39 125 -2 -31 197 -33 1 300 68 258 0 25 28 105 -251 190 -161 46 190
5643A90j26j45p8n5K06n9L7J10k89K67Q4l97J67J84k4j93J25k49J72J00l83L41
$$ 190 64 -81 -159 -214 -8 -67 -30 80 -209 58 142 -255 -88 96 72 -121 4 -245 -73 27 -356 -15
5665a5K65r3J80k49J32k49m4J16O4k73L66m27L24l8L9k18J90o8M2J59j64J36j67
$$ -15 250 157 337 88 220 -29 -73 43 107 -166 200 -227 97 59 98 -120 70 2 44 203 39 175 8
5688HJ39r7pq0J29j15Q0m8J7m5J56j10N5P6or4K80k49M8k42O5L02l36J54m2k79
$$ 8 147 50 43 -37 92 -23 57 9 26 -19 137 27 82 158 152 58 338 89 137 -105 -40 262 -74 80 38 -241
5714b41J32J59J00Qj38k21K99j78J31J23k31L1n2K25j80J52j84J69m8l24J63J81
$$ -241 -109 50 150 158 20 -201 98 -80 51 174 -57 -26 -78 147 -33 119 -65 104 56 -268 -105 76
5736G6o7J00N9m92K86J16o9J4j05K13j42PqK0K86j71O2P6k24N4j81K79l54J2L45
$$ 76 9 109 168 -324 -38 78 9 23 -82 131 -11 -4 -12 8 294 123 185 261 37 91 -90 189 -165 -153 192
5761A92j74q8K50m54K31k75O38k16l5j01K2%j88K03m0K15j38pk0J16L5k57J17
$$ 192 18 -70 180 -274 -43 -318 320 104 69 -32 -10 -10 -198 5 -35 180 42 35 15 131 166 -91 26
5784B6l7j18K3%N6MJ61k83J69k8K0j74J22J98k78Q3R4j06J77K5k02M5P2j78L9
$$ 26 -11 -129 -106 -106 -50 -46 115 -168 1 -27 -7 -181 -59 139 -139 -56 38 -68 109 134 -68 -23 49 -129 -90
5809i0J55J89k97j14J1J09J84j76j88L25p9j40L13R8m72R9J45j06k83K24pN0K96
$$ -90 65 254 -43 -157 -146 -37 147 -29 -217 108 29 -111 202 300 -172 -73 72 -34 -317 -93 -100 -50 246
5832B46K4l25Oj17K65J20K8l40O9j7O3J21o7k7j79P1QN6j8J36j61K7J7J9p4l0
$$ 246 270 -55 -49 -166 99 219 247 -93 -24 -41 22 143 76 49 -130 -59 -51 5 -13 123 -38 -11 6 25 -49 -79
5858g9O9q7J4R8K45k89Q8m6J84l19N7Q1k11J35J19k82L74R5k25J34m31L87P2j25
$$ -79 -10 -97 -83 15 260 -29 59 13 197 -122 -65 16 -195 -60 59 -223 151 246 21 155 -276 111 183 58
5882E8j6n1J11j20O7j16JJ99K25m39r0K68r2J15j25j55R1J17J37k42J71l11J93
$$ 58 42 -9 102 -18 49 -67 -66 133 358 -81 -171 97 5 120 -5 -160 -69 48 185 -57 114 -197 -4
5905dJ52r5k03J36J42j24ol48J86J82J92k01l1j47K16NO0p2K32k61J02j82m4L29
$$ -4 148 53 -150 -14 128 4 -2 -350 -164 18 210 9 -22 -169 47 52 112 40 272 11 113 -69 -113 216
5929B16l84J19L25j89O6kk27K9P0K5r9J53m07K81KP6p0J40j86L5K2k69J84L5J46
$$ 216 -168 -49 276 87 153 151 -76 -47 23 48 -51 102 -305 -24 -22 54 -16 124 -62 -27 -5 -274 -90 -55 91
5954I1j82J49rj44r6p7L22j32J05q5J23j01j7k68K10J27k0O7k57J40J39k88K87
$$ 91 -91 58 49 -95 -191 -268 54 -78 27 -58 65 -36 -53 -321 -111 16 -4 63 -194 -54 85 -203 84
5977H4N7k67J9K38N3j05Q5j40j41l4L31k51J2r9J07NJ70j85M07k63M2J8j08q9
$$ 84 141 -126 -107 131 184 79 164 24 -117 -151 180 -71 -59 -158 -51 -46 124 -61 346 83 125 143 35 -54
6001e4N8j80N00m97J64k4j17K72K3j35N9q7k7l5K21n5K11j43l10J05P8J01r4K10
$$ -54 4 -176 324 -173 -9 -33 -150 122 145 10 69 -18 -45 -80 141 86 297 154 -156 -51 27 128 34 244
6025B44m7n0k96J37j8l6q9M5L51m8P2m71M44l67j7P7N8K27j86N3LL8j61n4O6K5
$$ 244 197 147 -149 -12 -30 -66 -155 -110 241 193 265 -206 238 -129 -146 -69 -11 216 30 83 86 124 -37 -91 -25 0
6051@k2M2l2L0l7r8R6J83k2j03O7j20K64l45P2K40k21L5p3j89L46J86l55J06R5
$$ 0 -22 20 -12 18 -19 -117 -21 162 140 37 104 -16 248 -97 -25 215 -6 29 -44 -233 113 299 -56 50 145
6076A45K3n1l61L96r1j41m6L01j15j2K5J29j26j22q7l5J62J6K2J1n5LJ17j87j03
$$ 145 168 117 -244 152 61 -80 -126 175 60 48 73 202 76 -46 -133 -168 -6 10 32 43 -12 -9 108 -79 -182
6101a82k6K62L3j9J88l01k48K65k7J2L6j79JM30j64P4Ql6j05j54L35k11n7n8K84
$$ -182 -208 54 87 68 256 -45 -293 -28 -55 -43 -7 -186 -185 245 81 155 163 127 22 -132 203 -8 -65 -123 161
6126A61k53R9Ql51L56J32k61j10K29K24k1o2l51K81r6k21K64j83J57R7j75N2k24
$$ 161 -92 7 15 -336 20 152 -109 -219 10 234 213 151 -200 81 -15 -236 28 -155 2 99 -76 -24 -248
6149b48J82j46J03j7J37Jj41R8j0P5j95K06j22n2J19j1J59n7m65K42L13r1j09
$$ -248 -66 -212 -109 -126 11 12 -129 -31 -41 34 -161 45 -77 -129 -10 -21 138 81 -384 -142 171 80 -29
6172b9J14q3J99j94j45J45j42N2J46K68l52k9p1J3L7J04N7q6m2Mp9J35j33R2J07
$$ -29 85 2 201 7 -138 7 -135 -83 63 331 -21 -50 -121 -108 -71 33 90 4 -38 -34 -113 22 -111 -19 88
6197H8j98nK37K5k61J61P2j69n8M55k48m68L73K8K8j19J47j37J97k26o6K78l35
$$ 88 -110 -115 122 147 -114 47 119 -50 -108 347 99 -369 4 32 60 -59 88 -49 148 -78 -144 134 -201
6220b01L22j59j41N5L3m3L63l84J42J1k28J68K69k76K7L06k88J64k90J16L13l82
$$ -201 121 -38 -179 -124 -91 -134 229 -155 -13 -2 -230 -62 207 -69 -42 264 -24 140 -150 -34 279 -103
6242a03Q2P9j15J38j50q2L20J2j49j94K38j83Q0j97K3L68q2k5R7q7j43J10m4M4
$$ -103 -21 58 -57 81 -69 -151 169 181 32 -162 76 -107 -27 -224 -201 167 85 60 157 70 -73 37 -7 37
6266C7k5l2k55J88K22k15K74k91M79j62mk3j63M9j93J75j24J4j0m0M3O3o4J54
$$ 37 12 -20 -275 -87 135 -80 194 -97 382 220 216 193 30 79 -114 61 -63 -49 -59 -99 -56 7 -57 97
6290I7j21j09K54Mj77P3j41j39J31R9J45J23j03k90L21n49N80j94L8Q3k79K33
$$ 97 -24 -133 121 125 -52 21 -120 -259 -128 -29 116 239 136 -154 167 -382 198 4 42 125 -154 79
6312G9p2j5J53k35n6K90l22J52J90p4k71K49l2k16K07j66P9M9m4l4k10J50L6j23
$$ 79 7 -8 145 -90 -146 144 -178 -26 164 90 -181 68 36 -180 27 -139 -60 -11 -55 -89 -299 -149 -113 -236
6336b36N64K4m63K1K42R7j44P0O7l48Q8J06j34L75j67l15P0kJ30L27n19K96j89
$$ -236 328 352 -111 -90 152 249 105 175 242 -106 -18 88 -46 329 162 -153 -83 -85 45 372 -147 149 -40
6359d0j3K95j46J43k44qN0K29n2m21J90j52L47k08K61j93q5K3K91k47j12L20j8
$$ -40 -53 242 96 239 -5 -13 37 266 214 -207 -17 -169 178 -30 231 38 -47 -24 267 20 -92 228 210
6382B10l35L76k47l9K33o46M61J27l36m1O68o21Q4K19l65J61Q4m5q0K55k06j27
$$ 210 -125 251 4 -35 198 -448 13 140 -196 -237 431 -190 -106 113 -252 -91 -7 -52 -132 123 -83 -210
6404b10K77M9r1K55k91k06J04Q8k2k15K87k99M1J85p7R5K14j98j7j22J86k05L7
$$ -210 67 116 25 280 -11 -217 -113 -25 -47 -262 25 -274 -233 -48 -125 -30 184 -14 -31 -153 33 -172 -135
6427a35J88j8n7P4q1j33J72J02J73l42n0N6p5K85m4N7r8j6J81m81J98K51j33L1
$$ -135 53 35 -22 52 -29 -162 10 112 285 -57 -107 -51 -126 159 115 172 74 58 239 -242 -44 207 74 105
6451A05r4Q7k27M21jl35N9j57N56m66J40j98K77q0j62j17K83j26r1L83l00LR9
$$ 105 11 98 -129 292 291 -44 15 -142 414 -52 88 -110 167 87 -75 -192 91 -35 -126 257 -43 -40 59
6474E9Nk72J97k03K07L6q4J16j28O6K95j65q3qJ40J53k34l12K53K60j11j93N0
$$ 59 64 -208 -11 -214 -7 29 -55 61 -67 -1 294 129 46 38 178 331 97 -215 38 298 187 -6 44
6497D4N9J28m1k13P1J00k62O4O8j7R4k5k0j39J97k23J47j72J34Q3k13M3O3p3M27
$$ 44 103 231 190 -23 48 148 -114 -50 18 1 95 70 50 -89 108 -115 32 -140 -6 77 -136 -93 -30 -103 324
6522C24k42n5j78J23O6m1k51M38j90l16K62j45J53oj6J22M5J14k27o1J90K8m1
$$ 324 82 27 -151 -28 38 -3 -254 184 -6 -322 -60 -205 -52 -58 -74 48 93 207 -20 -81 109 137 96
6545I6k03K94m46K48J74N4k58K2KJ43q8o0j39J32Q6p7K0L74m99L9p5m4K16m8J07
$$ 96 -107 187 -259 -11 163 217 -41 -19 -17 126 38 -22 -161 -29 57 -20 0 374 -125 -86 -161 -205 11 -37 70
6570G0k67J72jl1K8J64m33M71j12j26J47j71K87k27J24j83M02o16K38j94L72j34
$$ 70 -197 -25 -26 -57 -29 135 -298 173 61 -65 82 -89 198 -29 95 -88 314 -302 -64 -258 114 -20
6592b0k04PK86k48J40p6K03K3k84J22n6%J46l6k8J25J17k17l7J60K07q5j81l0
$$ -20 -224 -217 69 -179 -39 -115 88 111 -173 -51 -107 -107 39 3 -25 100 217 0 -37 123 330 245 64 34
6616C4j3J59j41j26K70r8p0K27k77J65q4L6M5N9l38n6M79k19O8R8j64J43l40P4
$$ 34 21 180 39 -87 183 85 15 242 -35 130 46 82 127 186 -152 -208 271 52 120 218 54 197 -143 -69
6640f9j10j00M90l26R7L18k39l22M23j91Kj00J34L7j47K12M4j42j35r4L56L1q6
$$ -69 -179 -279 211 -115 -18 300 61 -261 162 -29 -27 -127 7 44 -103 109 153 11 -124 -218 138 169 83
6663H3o9J1J26j1j05n5k1K5N1l0rj41Q9l06L31k5J18p3j60K75J23k52P1j08K36
$$ 83 14 25 151 140 35 -20 -41 -16 35 5 -4 -145 -56 -362 -31 -56 62 -11 -171 104 227 -25 46 -62 174
6688A74l5r1j48l4K03p5m2q1J5L7K46j83K5J63j75J61j68N3j6q9j2k34K96J83
$$ 174 139 48 -100 -134 69 -6 -48 -129 -114 -77 169 -14 11 174 -1 160 -8 45 29 -60 -72 -306 -10 173
6712A73l3j83L3o5J10J5j1j20K43k91J72q8k20L79J69j31j15q3m7K09l25K5M80
$$ 173 140 -43 -10 -75 35 50 39 -81 162 -129 43 -45 -265 114 283 152 37 -46 -93 116 -209 -184 296
6735B96l93J38Q4Q0l44J03M07l37R5j77o6k4M03j41j71j20M62m08J61r7k41L51
$$ 296 -97 41 125 205 -139 -36 371 34 129 -48 -114 -138 265 124 -47 -167 295 -113 48 -49 -290 61
6757F1k23J57k51L71r2K10k22K54k36K6q8m4J40K0o4M0k56K79r4J82j83PK03q9
$$ 61 -162 -5 -256 115 23 233 11 265 29 55 -33 -77 63 83 19 59 -197 82 -12 170 -13 -6 197 108
6781A08j0j1K04k97Rl4J59j72K03j77P4j51K43r9K04j46J64r8m15K82K49r8k49
$$ 108 98 87 291 -6 3 -31 128 -44 159 -18 56 -95 148 49 253 107 271 173 -242 40 289 191 -58
6804e8L3Or5J94On3j87q1N41m45J40Q9jk67l2L51j82L7K87k58J18J63K7N2m43
$$ -58 -25 -19 -114 80 86 33 -154 -235 306 -139 1 90 89 -178 -210 141 -41 -4 283 25 143 306 333 385 -58
6829e8J76N4m2k1j05J04q1J33k34k2M4K80k38J1j3k5q1P8l3JK12j85p3J40j8J5
$$ -58 118 172 130 109 4 108 27 160 -74 -96 -52 228 -10 1 -12 -37 -118 -40 -73 -72 140 -45 -118 22 4 19
6855A9N5j67O6Q3mk7K92l83r1J86K77k98P8J01n4m9k90J23K58l19Q8J53l63J07
$$ 19 74 -93 -27 56 52 25 317 -66 -157 29 306 8 86 187 133 84 -206 -83 175 -144 -56 97 -266 -159
6879a59j07N53l79j25L66j04o0J62j50k8j07J09O1j70O9j28m3K79J71j50l80N38
$$ -159 -266 287 -92 -217 149 45 -15 147 -3 -31 -138 -29 32 -138 -69 -197 -240 39 210 60 -320 218
6901B18k75J64j87O6j1P6M1l24K94q8J21l00K43k19N6J05J25M1Q8k74J18k39L29
$$ 218 -57 107 -80 -14 -25 51 92 -232 62 -26 95 -205 38 -181 -125 -20 105 146 234 -40 78 -161 168
6924A68M4j61j13K85k81Q4PP1L57m43k25J76p0L81l16r5N5L97k69j94J62j54J80
$$ 168 212 51 -62 223 -58 26 33 104 461 18 -207 -31 -101 280 -36 -131 -76 321 52 -142 20 -134 46
6947D6N9j73J66K43m96R5J8jJ51j25l4j9K7J84k00K8m0K86k24k1k74J44J87J00
$$ 46 105 -68 98 341 -155 -60 -42 -43 108 -17 -51 -70 -43 141 -59 -31 -71 215 -9 -30 -304 -160 27 127
6971A27p6q5k9J58q2p3k44M14k38K77k36O2q6J52r5j88K74jJ32j33R1l03K78j
$$ 127 51 -34 -63 95 13 -60 -304 110 -128 149 -87 -25 -111 41 -54 -242 32 31 163 30 121 -182 96 95
6995I5L5j55Q4L7N2j07J8j14j28L88j10P0j4P2j14j58L10l71K69O8k67L39k28
$$ 95 130 -25 59 96 148 41 59 -55 -183 205 95 165 151 223 109 -49 261 -110 159 227 -40 299 71
7018G1l0J05l8J06j61J27L9j15l23M07l09P9J5J19P4L5m71L47J3j51K9k29K17
$$ 71 41 146 108 214 53 180 219 104 -219 188 -121 -42 -27 92 166 201 -270 77 90 -61 -32 -261 -44
7041d4L31l92J6L65j36L5l7J70k10J07o4j35m1j09K24j8rr6m6Q1j17N8J22m0J3
$$ -44 287 -105 -89 276 140 175 138 308 98 205 141 6 -35 -144 80 62 53 -43 -89 -8 -125 -67 55 15 28
7066B8J24j07j43K3J49m38K14M66n34J90J64k41J36j5j88J73L9j56K30O9j41l21
$$ 28 152 45 -98 -75 74 -364 -150 316 -218 -28 136 -105 31 16 -172 1 40 -116 114 183 42 -279
7088b79M55j54lQ2j34j70K80K0k38M27j15m6m60J27M31l97K07j40L5K39k28K04
$$ -279 176 22 19 101 -33 -203 77 97 -141 286 171 125 -335 -208 223 -174 33 -107 -72 167 -61 143
7110A43m31K59j93J32J67o5k02J48J22j15k54K72k29J72R8J77j86r3L06k38J77
$$ 143 -288 -29 -222 -90 77 12 -190 -42 80 -35 -289 -17 -246 -74 24 201 15 -78 228 -10 167
7131A67r3k57L66l43J20j32K80l1J22l23J43j05j58K65k3P2j77K32Lj98j07P9
$$ 167 74 -183 183 -160 -40 -172 108 77 199 -124 19 -86 -244 21 -2 70 -107 125 128 -70 -177 -98
7153i8ppn0K60k60K09K9j36J20N6J46l5k82K47l53K37Q9k45L70l73J52O9Q9n70
$$ -98 -105 -112 -162 98 -162 47 76 -60 60 116 262 227 -55 192 -161 76 165 -80 290 -83 69 138 227 -343
7177c43J48J94J4j56M37k55o3j3l21M78l36M8J10%qJ72O6k10p4J18N1j43K06j61
$$ -343 -195 -1 13 -143 294 39 -24 -37 -358 120 -216 -168 -58 -58 -66 106 172 -38 -112 6 57 -86 120 -41
7201d1K41j00M8k8j33J13O7l68k7J99l1N0J22k1l27J00K94j72l24L38q4J16rJ38
$$ -41 200 100 148 120 -13 100 167 -201 -228 -29 -60 -10 112 91 -236 -136 158 -14 -338 0 -84 32 23 161
7225A61K4o4j77l3P1J17k30L10k11l2l1M44m91K93k82J02Q2k3k34M6J12K16lj26
$$ 161 185 121 -56 -89 -18 99 -131 179 -32 -64 -95 349 -142 151 -131 -29 53 30 -204 -158 -46 170 167 41
7249D1n1r1L37k50l2J5J17r3J81k15j19K84j85K17j66j07J58j0j53N5J03r9j73
$$ 41 -10 -101 236 -14 -46 -31 86 -7 174 -41 -160 124 -61 156 -10 -117 41 31 -122 -67 36 -63 -236
7272b36O2K80k34P3m6J06M6M0m4P1J12n04J14K27j46j27m8L13P8j84L6pk3j4J35
$$ -236 -174 106 -128 -55 -101 5 51 91 47 118 230 -274 -160 67 -79 -206 -254 59 137 -47 -11 -18 -41 -55 80
7297H0j64M9j21K22jj87j94N10k42M5oR7m0k9k31K01l21L47J66p8k9k2J9k24L47
$$ 80 -84 -35 -156 66 65 -122 -316 194 -48 -3 -9 88 48 19 -212 -11 -332 15 181 103 74 52 71 -153 194
7322A94l92L78l72K35j41q6L1K72k46J41R6m9l14P0k0J02L0R8l6K13k11J40k70
$$ 194 -198 180 -192 43 -98 -184 -153 119 -127 14 110 61 -253 -183 -203 -101 -71 27 -9 204 -7 133 -137
7345a37o3m3K29L79k24R8j70O8k50m1K60L5j16J36j44l3l2l3J23k08K7L80j39
$$ -137 -200 -243 -14 365 141 239 69 137 -113 -154 106 141 25 161 17 -16 -48 -81 42 -166 -139 241 102
7368A02r7J33k39L27m34J24J32L2n9l37M31j33j36O9k12K65J94k97K99j54n8J06
$$ 102 5 138 -101 226 -208 -84 48 80 21 -316 115 -18 -154 -85 -297 -32 162 -135 164 10 -48 58
7390E8j1k84L02R6k10j5J55J9Qj56L24l64J49k88Q0J81K80j14j4k72K66j24k8
$$ 58 47 -237 65 161 -49 -64 91 110 118 -38 286 -78 71 -217 -137 44 324 210 196 -76 190 66 38
7413C8q8K03j14j11O8K3j51M53m74K38J1j78O8j10j7j3K27r0P5o6r3R6p8J93j44
$$ 38 -50 153 39 -72 -4 19 -132 321 -153 85 96 -82 -14 -124 -141 -154 73 -17 58 -8 -101 -5 -83 110 -34
7438c4j15L63n1k07K02r7M9Mp0r7O7j53j44J96n2L66L2k83j9Q6j21L2J69M3l57
$$ -34 -149 214 163 -44 158 61 110 114 44 -53 14 -139 -283 -87 -139 227 259 -24 -43 43 -78 -46 123 166 -191
7463a91K10O4l17L07Q2P6l26K80l31P6R5Q6j33k16M13K85o25K93n9l74J68K34
$$ -191 19 83 -234 73 155 231 -95 185 -146 -70 25 111 -22 -238 175 460 -165 128 69 -305 -137 97
7485I7q5J68j02l0l1N7j07J2j04K20N8R0m13K87K01n04M34l22J93o6O4j97K54
$$ 97 12 180 78 48 17 74 -33 -21 -125 95 153 243 -170 117 318 -186 248 -74 119 53 117 -80 174
7508A74j88j83M16k21J87k69J77P9j85J07R5j87n02M58o8n2j9N9Q8q2O5q3K51
$$ 174 -14 -197 219 -2 185 -84 93 172 -13 94 189 2 -500 -42 -110 -162 -181 -122 -34 -116 -51 -134 117
7531A17k0j63J67j01j05J64K21J53l99n8j20l9L26n4N6o2%p5L56m30n9K38k12
$$ 117 97 -66 101 0 -105 59 280 433 34 -24 -144 -183 143 89 145 83 83 8 364 -66 -125 113 -99
7554i9K03r9K67j93j47O6J89j56LP5j48K50l82j80M80k20L7K71j97J87J29j67
$$ -99 104 5 272 79 -68 -2 187 31 34 109 -39 211 -171 -351 129 -91 -54 217 20 207 336 169
7576A69r0j90J59j24K02k5j44L5l13K88j37L57j68k12K80j06q2L6M6L70l66J45
$$ 169 79 -111 48 -76 126 101 -43 -8 -321 -33 -170 187 19 -193 87 -19 -101 -65 -19 351 -15 130
7598A30l18L3q3L68j24k8L36o77M92k01R6j02K6J92j32J23l47K87r4K42j55L1
$$ 130 -188 -155 -238 130 6 -22 314 -363 129 -72 24 -78 -52 140 8 131 -216 71 -23 219 64 95
7620I5jL6j66P0R8q9R8r2r3pQ7o4J78j05o9J18k83J56J05l4j21J17j35K98j04
$$ 95 94 130 -36 34 132 43 141 49 -44 -51 36 -28 150 45 -24 94 -189 -33 72 38 -83 34 -101 197 93
7645I3J48o7k64J61o8J72l25L3L71l14lJ92l41L00L9P4j40o0O5j08M7q7J48K64
$$ 93 241 174 -90 71 3 175 -150 -117 254 -60 -63 129 -212 88 127 201 61 1 66 -42 5 -82 66 330
7669C30k66P0j53m7O7jL7k07L83n04K34N3o5L26m19K23j86L20j32m4L7k30j15
$$ 330 64 134 -19 -66 1 0 37 -170 213 -291 -57 -4 -69 257 -162 61 -125 195 63 19 56 -174 -289
7692b89L93l6j7k26J99J1K16k10k76K87j62K40l33K45K75l61oQ4M6k00K82k97
$$ -289 104 68 51 -175 24 35 251 41 -235 52 -110 130 -203 42 317 -44 -50 34 80 -120 162 -135
7714a35K94q7j31m2J09j59O7J56j63PJ43j51J08P6k72K48L35l70j12J67j48n0
$$ -135 159 72 -59 -101 8 -151 -84 72 -91 -84 59 -92 16 92 -180 68 403 33 -79 88 -60 -110
7736a10R0K30k21L24k34J0J55k30l9mk96L52p7K34j95r1J71R2k07j3J40k73K55
$$ -110 -20 210 -11 313 79 89 244 14 -25 -29 -325 27 -50 184 -11 -102 69 161 -46 -59 81 -192 63
7759F3j17L26k46j23L89j48n6p5J45j61J12j61P9K22l26Q9J10k02m4J74R5k12
$$ 63 -54 272 26 -97 292 144 88 13 158 -3 109 -52 27 249 -77 12 122 -80 -124 50 145 -67
7781f7P3o8J69K20k34j06K7P7Jk26p0K64J26j2j36m2%j16P4L9j56J11l4N8O3j08
$$ -67 6 -62 107 327 93 -13 14 91 92 -134 -204 60 186 174 38 -4 -4 -120 -46 -7 -163 -52 -86 -28 35 -73
7807g3j22M44m3j23k2j40J25n1J96m35J85J00qk53L68p5Pk04M61m42j34L33k8
$$ -73 -195 249 206 83 61 -79 46 -5 191 -244 -59 41 33 -220 148 73 80 -124 337 -105 -239 94 66
7830F6N9j14j21K56l06n3J50J80r1o3J1K03j41J38j34k49p2K68n6r1R9L13j08
$$ 66 125 11 -110 146 -160 -213 -63 117 26 -37 -26 177 36 174 40 -209 -281 -13 -69 -160 -61 252 144
7853A44k07k0J4K42q3R8k92j1R3j4m7K45k95L89l81K34l39L50j26L7q7J09m3J59
$$ 144 -63 -83 -69 173 90 188 -104 -115 -22 -36 -83 162 -133 256 -125 109 -230 120 -6 31 -56 53 10 169
7877A69J5m2J87P2m43m4R6J97m10K38k21j21K35J62R0k38q8K63l80K06K9j21j05
$$ 169 184 142 329 401 -42 -86 10 207 -203 35 -186 -307 -72 90 180 -58 -146 117 -263 -57 -28 -149 -254
7900b54L39J4k42j34K04J3J34l01K86k24j1L32l11R1M9J13PJ34l55m2K36k27M5
$$ -254 85 99 -143 -277 -73 -60 74 -227 59 -165 -176 156 -155 -64 -15 98 105 239 -116 -158 78 -149 -104
7923a04K94r0N2j28l23K41M6k6R6j34j8r0J49NQ6k0K22q1n12K94J70m31K69l7
$$ -104 190 100 152 24 -299 -58 -12 -38 58 -76 -94 -184 -35 -30 56 36 258 177 -335 -41 129 -302 -33 -70
7947g0j04J79L7o6J05K8k05j23J94K74l5l87L07j75O7p5k12L68R9l01R5J88p1
$$ -70 -174 5 42 -24 81 109 -96 -219 -25 249 214 -173 134 -41 26 -49 -261 107 206 -95 0 188 117
7970A17q3L8j03P6k27J87L08p9m5k10p0J05J25J36k86k3L7j35J29J5m0J14j87
$$ 117 34 72 -31 45 -182 5 313 234 189 -21 -91 14 139 275 -11 -34 3 -132 -3 12 -28 86 -101
7993a01K77m64L31p4MJ07K01l12j0j16J57K6p4K34m3j67k8j37K20j19j0N6J02
$$ -101 176 -288 43 -31 -27 80 281 -31 -41 -157 0 26 -48 186 143 -24 -52 -189 31 -88 -98 -42 60
8016F0j82p1L30j68Q1l2j76J20J33k06P0k14K92Q1k28K71l5k46J12qK85n32J55
$$ 60 -122 -193 137 -31 50 18 -158 -38 95 -111 -41 -255 37 118 -110 161 126 -120 -8 -16 269 -263 -108
8039a08P3n9K77Kl79J37l4K07j94L33Pm16N20o12L51k32J08nq6R1j11O1R7j40
$$ -108 -35 -94 183 185 -194 -57 -91 116 -78 255 262 -154 366 -246 105 -127 -19 -24 -110 -19 -130 -69 28 -112
8063a12J3j87N02J8l7l31L21O7l89j99K85K82j93J74l75Q0L35p7m27K72L5l3R9
$$ -112 -99 -286 216 234 197 -134 187 254 -135 -334 -49 233 40 214 -161 -81 254 177 -250 22 57 24 123
8086A23nk13K43k85j74L90j11j72K18k82J88n0r4J83P4l41K28K3L68j10m0j71
$$ 123 118 -95 148 -137 -311 79 -32 -204 14 -268 -80 -130 -224 -41 33 -308 -80 -57 311 201 161 -10
8108a0j40K1J11O8M6j69k16L88j36K89k18K59l75N0K25k74j3J49O6k79K13J2j22
$$ -10 -150 -129 -18 50 96 -73 -289 99 -37 252 34 293 -82 -32 193 -81 -94 55 121 -158 55 67 -55
8131e5j83pK00J63j61L67k62Mj49o6q6Q9O0K64K43m32R5o8k1M8o5J24p3J22j6
$$ -55 -238 -245 -45 118 -43 324 62 66 -83 -149 -235 -146 -86 178 421 -11 84 16 -5 43 -22 102 29 151 135
8156A35j17J49k99J10J6J48K3j54O8J03l42L12q9o7r8K34j88m3J34J24l8o8o0
$$ 135 18 167 -132 -22 -6 142 165 11 79 182 -160 152 63 -4 -102 132 -56 -99 35 159 121 53 -7
8179gQ1N0l82J91m0R5J08J9j17j26K22n2
$$ -7 74 124 -258 -67 -107 -12 96 115 -2 -128 94 42
8191D2
$$ Imaginary data points
##PAGE= N=2
##DATA TABLE= (X++(I..I)), XYDATA
0@%%%%%%%%%%%%%%%%Pj5J6j6J6j7K4l1L2l9M7n2O0p0P9q9J03j17J32j49J66j84
$$ 0 0 0 0 0 0 0 0 0 0 0 0 0 0 0 0 0 7 -8 8 -8 8 -9 15 -16 16 -23 24 -28 32 -38 41 -48 55 -62 70 -79 87 -97
38i7K07k31K56k85L17l50L85m26M71n19N72o30O94p65Q43r30J028j139J264j407
$$ -97 110 -121 135 -150 167 -183 202 -224 247 -272 300 -330 364 -401 442 -488 540 -599 665 -742
58g42J574j773K012k304K674l157L817m781O326r183J6157o4155q2121J59181
$$ -742 832 -941 1071 -1233 1441 -1716 2101 -2680 3646 -5537 10620 -53535 -135656 23525
72B3525P2020q9000q2192M1239Q1397J5005q2545k8977P5357L1753o7155j2862
$$ 23525 95545 6545 -75647 -34408 46989 61994 -20551 -49528 25829 57582 -9573 -22435
84b2435N3757J272n3480l72M7431J6804n2955m5664M5136P1210l3606r5284Q633
$$ -22435 31322 32594 -20886 -21258 26173 42977 -9978 -55642 -10506 60704 27098 -68186 -59553
97e9553R7472J7375q3676m4803N5987O0646k2712o2224m512N6520K2084l6307
$$ -59553 37919 55294 -28382 -73185 -17198 43448 20736 -41488 -46000 10520 32604 -3703
109c703j9736K2218J2240p405N300O314j3436r104J5074J9557m377k8407j0929
$$ -3703 -23439 -1221 11019 3614 8914 15228 1792 -7312 7762 27319 22942 -5465 -16394
122a6394K8473K3183k2329l1745N206K5626P357j5783j9535m466J5690J8367n747
$$ -16394 12079 35262 12933 -18812 -13606 12020 19377 3594 -15941 -20407 -4717 13650 7903
135G903k7864j4335K3856L2747r680m4968r036M7697L0574l6054m2882K2329N0487
$$ 7903 -19961 -34296 -10440 22307 12627 -32341 -41377 6320 36894 840 -42042 -19713 30774
148C0774k011m4054r114L7171J7691k7011j5123K2993J2281k4085j1143K9330
$$ 30774 28763 -15291 -24405 12766 30457 3446 -11677 11316 23597 -488 -11631 17699
160A7699J4220l6557k8187L6735M2221l2810o0686J5284O8628M403p1167l0832
$$ 17699 31919 -4638 -32825 3910 46131 13321 -47365 -32081 36547 40950 -30217 -61049
172f1049O0950N0170m4735o2833K4979O5287n825n8353o143N0567J5800m0041
$$ -61049 -99 50071 5336 -57497 -32518 32769 26944 -31409 -37552 13015 28815 -11226
184a1226j6720L7492K0629l5120k2101L8672L0861l7593m0803L2682N2726k0901
$$ -11226 -27946 9546 30175 -4945 -27046 11626 42487 4894 -35909 -3227 49499 28598
196B8598o1521J925O2773J7088n8462l6782M3164M6734k8797n1396R927M4653
$$ 28598 -32923 -30998 31775 48863 -9599 -46381 -3217 43517 14720 -36676 -26749 17904
208A7904K223l6699j0883K6334J2517j9726j0731J8237R982j9449q583K3104J4044
$$ 17904 20127 -16572 -27455 -1121 11396 -8330 -19061 -824 9158 -10291 -18874 4230 18274
221A8274k1131j8747J8457K8062q026l0555k255L0465J4205k3459k0577J2790
$$ 18274 -2857 -21604 -3147 24915 16889 -13666 -15921 14544 28749 5290 -15287 -2497
233b497K1096j912j7271p725P139R898K00r497q247R69Q502N628p539j2981J219
$$ -2497 18599 16687 -584 -8309 -1170 8728 8928 -569 -8816 -7847 655 6283 -1256 -14237 -13018
248a3018J4869M219j3499p841R351R213l543o240K618M617k381q70P855L936j1356
$$ -13018 1851 6070 -7429 -15270 -5919 3294 -249 -6489 -3871 746 -1635 -2505 5350 9286 -2070
263b070p746J6088J6567j4644k3851Q826K9493J353l2152j3468K7597K3648k2253
$$ -2070 -9816 6272 22839 8195 -15656 -6830 22663 24016 -8136 -21604 5993 29641 7388
276G388l1646J1770L1385m093l0316m571K4519P831k1476j0197J8689J1201j8490
$$ 7388 -24258 -12488 18897 14804 -15512 -20083 4436 12267 -9209 -19406 -717 10484 -8006
289h006j2796J9930J7806j9380k2811J8563L0434j0582l4403K242L7932J0708
$$ -8006 -20802 -872 16934 -2446 -25257 -6694 23740 13158 -21245 -19003 18929 29637
301B9637l4412k0584K8294K9134j8798l2245Q509L0866l37k7847o189K1624P864
$$ 29637 -4775 -25359 2935 32069 13271 -18974 -10465 20401 20064 -7783 -13972 7652 15516
314A5516j9037r868J5418Q720j5956j1712J5005J3835j4333j9062J1368K2684
$$ 15516 -3521 -13389 2029 10749 -5207 -16919 -1914 11921 -2412 -21474 -10106 12578
326A2578m726k4667k095K4533J0760j9177j5538J3824J9339m700j7458k7J4402
$$ 12578 7852 -16815 -18910 5623 16383 -2794 -18332 -4508 14831 10131 -7327 -7354 7048
339G048M813q900n094M695L678k180j719K146j055m647k1N646O53p484m474N436
$$ 7048 11861 2961 -2133 2562 6240 4060 2341 4487 3432 -1215 -1236 4410 5063 -2421 -6895 -1459
355a459N066l536o853o14M788L317j827m830j521L260N507J065n831m822N406
$$ -1459 3607 71 -6782 -7396 -2608 709 -1118 -5948 -7469 -4209 1298 2363 -3468 -8290 -2884
370b884J0127m26j1070k929J1375Q414p718j0830M159J1959Q5j1218l243R021
$$ -2884 7243 6817 -4253 -7182 4193 12607 4889 -5941 -1782 10177 10262 -956 -4199 4822
384D822L770p883m267O177K429p238m069P484M690r433r025Q486J2345o570j6460
$$ 4822 8592 709 -3558 2619 5048 -2190 -6259 1225 5915 -3518 -12543 -4057 8288 1718 -14742
399a4742K453J8135L599j6791q881J4424J4219r438j5350N690J6509J6j3826j781
$$ -14742 -12289 5846 9445 -7346 -16227 -1803 12416 2978 -12372 -6682 9827 9843 -3983 -5764
413e764J1994L794r687l857Q766M507r276n846R159P498r857j0816P083J2779
$$ -5764 6230 10024 337 -3520 5246 9753 477 -5369 3790 11288 1431 -9385 -2302 10477
427A0477m619j5968m37J4700M825j3734r242R495J1678n637j1658J765J0371J776
$$ 10477 5858 -10110 -10547 4153 8978 -4756 -13998 -4503 7175 1538 -10120 -8355 2016 3792
441C792p607j947N920L121l792j648M289K564m639j827N580L692n358m903M167
$$ 3792 -3815 -5762 158 3279 -513 -2161 2128 4692 53 -1774 3806 7498 2140 -2763 1404
456A404O587k171p680j161O333L102n348n380J557M804O7m039k469Q41K371Q15
$$ 1404 7991 5820 -1860 -3021 3312 6414 1066 -4314 -2757 2047 2114 -1925 -4394 -3553 -1182 -367
472c67j398k659j38K908K087j576k525K99L662J926k118j901K089K180P6j082
$$ -367 -1765 -4424 -4562 -1654 433 -1143 -3668 -3369 293 2219 101 -1800 289 2469 2545 1463
488A463M11M76p11O97J919m99l623j139M237K516l961n841J614O240pp363l573
$$ 1463 1874 2350 1639 2336 4255 3756 133 -1006 3231 5747 1786 -4055 -2441 3799 3792 -3571 -7144
505g144O003N021m623o254K217N786r9n192j009M630K000l458p03L616J140l311
$$ -7144 -1141 3880 -743 -6997 -4780 1006 907 -4285 -5294 -664 1336 -2122 -2825 791 1931 -1380
521a380p45N011K408m818l204M310N815k889p145K92Q136J497p393m343N252N128
$$ -1380 -2125 2886 5294 476 -2728 1582 7397 4508 -2637 -2345 5791 7288 -105 -4448 804 5932
537E932l695o153P92M825J60m501j722L233J059k584j052K640R00l025p52L710
$$ 5932 2237 -3916 -3124 1701 1861 -2640 -4362 -1129 -70 -2654 -3706 -1066 -166 -3191 -3943 -233
553b33K003l233k619L069M478p99m655j01M941K464l552l328K539L565n45l210
$$ -233 1770 -1463 -4082 -1013 3465 2666 -1989 -2090 2851 5315 1763 -1565 974 4539 3994 784
569G84j115K051J228j578j435j40K60l19Rr0j174j126L27J508O7j795q31J419
$$ 784 -331 1720 2948 1370 -65 -205 55 -264 -255 -345 -1519 -2645 -2318 -810 -743 -2538 -3369 -1950
587a950J545j95j813j92J841J298L84j522n75J830J511K77j440j061J521J992
$$ -1950 -405 -600 -2413 -2605 -764 534 918 -604 -1179 651 2162 2439 999 -62 1459 3451
603C451l51k443p23K087J144j362j885j28J144M01j723j134M03O80n42l85j79
$$ 3451 3100 657 -66 2021 3165 1803 -82 -210 934 1335 -388 -1522 -1119 -439 -981 -1366 -1545
620a545j15n38M17J037j86j277k24J830J376j000j809O62L126O38k308q42J657
$$ -1545 -1660 -2198 -1781 -744 -930 -2207 -2431 -601 775 -225 -2034 -1372 1754 2392 84 -758 899
637H99K027k37k375m1J807P27j211j507O78O39m03n39l09l83n12p3N87j88j004
$$ 899 2926 2689 314 273 2080 2807 1596 89 767 1406 1003 464 155 -228 -740 -813 -226 -414 -1418
656a418j080Q68J423m24k211J45J875J106j204j373P44K122Q24j322o16Q29J185
$$ -1418 -2498 -1630 -207 -631 -2842 -2697 -822 284 -920 -2293 -1549 573 1397 75 -541 288 1473
673A473N25j168k01P18O19n7k09m25l06K61K22m76o70q12J63O80l11j242m83L16
$$ 1473 1998 830 629 1347 1966 1909 1700 1275 969 1230 1452 976 306 -506 -343 337 26 -1216 -1699 -1383
693a383R52j63j303n13J139N97l1j027J33R35J056o47n59K36J162O22O6q16k06
$$ -1383 -431 -594 -1897 -2410 -1271 -674 -705 -1732 -1599 -664 392 -255 -814 -578 584 1206 1272 456 250
712B50J294K36k58l44n08J80O18K00j224o98Q71R2l21o82r60O32L60k79r22k32
$$ 250 1544 1780 1522 1178 670 850 1468 1668 444 -254 617 709 388 -294 -1254 -622 -262 -541 -1463 -1695
732a695L84K57N2j97m02o0J257N30n47j107N40J504M95p05p14Q55J334k38p31
$$ -1695 -1311 -1054 -1002 -1199 -1601 -1661 -404 126 -421 -1528 -988 516 1011 306 -408 447 1781 1543 812
751H12j74P17L41l6q40Oj00J69k25k17p52j78O5K93k1j148l15O96O98o32q27k62
$$ 812 638 1355 1696 1660 820 826 726 895 670 453 -299 -477 -412 -119 -140 -1288 -1603 -907 -209 -841 -1668 -1930
773a930J435M63q94o39K50J227O78q79k81Q77M12L52p08K60M78k4L3OJ40p72o2
$$ -1930 -495 -32 -926 -1565 -1315 -88 590 -289 -570 307 719 1071 363 623 1101 1077 1110 1116 1256 484 422
794D22L77M50j077k93J96M40k24r51k77J85P90o40o90j58N60L88l60k39k7O38
$$ 422 799 1249 172 -121 75 515 291 -660 -937 -752 38 -602 -1292 -1450 -890 -502 -862 -1101 -1128 -490
814d90L18j67J92l48Q80L90j76N2j86L96M62k17l46rJ96L73k48n24k05k4J62k96
$$ -490 -172 -339 -147 -495 385 775 599 651 465 861 1323 1106 760 751 947 1320 1072 548 343 319 481 185
836A85j79l20l40N29r9o74m11L62p5M05p12J63M42K46K01o09L29J71M73j15K36
$$ 185 6 -314 -654 -125 -224 -898 -1309 -947 -1022 -617 -1329 -1166 -724 -478 -277 -886 -557 -386 87 -28 208
857B08M4q2M52K87m01J73j51L22K84j52n18l92P27N8m16o92p8N17M2n92n25q0
$$ 208 252 170 622 909 508 681 530 852 1136 984 466 74 801 859 443 -249 -327 190 232 -360 -885 -965
879i65N73j38k75m03L61J57l8J74k84K87L56L4k56J17N09N7N11l40J08J27M97
$$ -965 -392 -530 -805 -1208 -847 -690 -728 -554 -838 -551 -195 -161 -417 -300 209 266 777 437 545 672 1169
900A169k5l35p3m9j28J09K1m11l81K43N50m66o35m41J79L52k22m65m12O17N70
$$ 1169 1144 809 736 687 559 668 689 278 -103 140 690 224 -411 -852 -673 -321 -543 -1008 -1420 -803 -233
921b33m22k73K09L24n4K53k28N47J0q1K74J89k47J56K24L11j43l97p1P76m53k29
$$ -233 -655 -928 -719 -395 -449 -196 -424 123 133 52 326 515 268 424 648 959 816 419 348 1124 671 442
943D42K2J72Mk03p55pL89l7n12K87k73k00k47O6J41l5j69L7P64j14n85K03P09
$$ 442 464 636 640 437 -318 -325 64 27 -485 -198 -471 -671 -918 -852 -711 -746 -915 -878 -114 -228 -813 -610 99
966I9M94n03n77P76N64j71l00j43P09L4o37J01M69p1n98n4L80M7p96l11P54j5
$$ 99 593 90 -487 289 853 682 382 239 948 982 345 446 915 844 246 192 572 619 -177 -488 266 251
988B51m98p57K62Q85l41j177R9Q96M98p47o13R60K71k08m07K42R14Qp67K44L86
$$ 251 -247 -1004 -742 143 -198 -1375 -1276 -380 118 -629 -1242 -282 -11 -219 -626 -384 530 538 -229 15 401
1009D01M49o48N8Q13o7q87k58Q63K91o83r48Q17N62j34j266k91J034P2n69n99
$$ 401 850 202 260 1073 1006 119 -139 724 1015 332 -616 201 763 629 -637 -928 106 178 -391 -990
1029i90M10M89m30o90N58N03k56k80K6M77J63k70J18M77Q2l48J94M07K63l94k95
$$ -990 -580 -91 -521 -1211 -653 -150 -406 -686 -660 -183 -20 -290 -172 305 387 39 233 640 903 509 214
1050B14K39M79k86m41J69L36j19k57k63J3o1l03K39N5m88l67L85N55q35j51K61
$$ 214 453 932 646 205 374 710 591 334 71 84 23 -280 -41 14 -474 -841 -456 99 -736 -887 -626
1071f26M37j20o01J19Q55N1n09J74M34K91n29R9O27L49p63k42N21N72o44q40M52
$$ -626 -189 -309 -910 -791 64 115 -394 -220 214 505 -24 75 702 1051 288 46 567 1139 495 -345 107
1092A07R03k96j110j49J057J98j113m39O29P68p36j312O86R99N6j076k16J084
$$ 107 1010 714 -396 -545 512 710 -403 -842 -213 555 -181 -1493 -807 192 248 -828 -1044 40
1110D0J99j156k79J268O94r61o61P13J010k52j288O11J520n61r63l20J273N13
$$ 40 239 -917 -1196 72 766 -195 -856 -143 867 615 -673 -62 1458 897 -66 -386 887 1400
1128A400j199m51L67P27m38r02L42P13j04q81q2M30K02o68m24Q08J47k95o89O00
$$ 1400 201 -250 117 844 406 -496 -154 559 455 -426 -508 -78 124 -544 -968 -160 -13 -308 -997 -397
1148c97O17l59m64jQ10J73l74k13N54J86m84k5L09K0P3r6R0m2L8j15p9j41J16
$$ -397 220 -139 -603 -604 206 379 5 -208 346 532 48 23 332 352 425 329 419 377 415 300 221 80 196
1171A96k85J76J22m03M2j51o9J28l18K53j43q4p8J70L70j69k23M15K01k15l0J91
$$ 196 -89 87 209 -194 -152 -303 -372 -244 -562 -309 -452 -536 -614 -444 -74 -243 -466 -51 150 -65 -95 96
1193I6L23k15k53j21N27M62n12m52O12L55k21o86K63L10Ko22M2J71Rn08m8M43
$$ 96 419 204 -49 -170 357 819 307 -145 467 822 601 -85 178 488 490 -132 -90 81 90 -418 -466 -23
1215b3K54n82n36O23L17k13n31k2P45M1m65k2M65K67p4p98O50O00j34n19P7O23
$$ -23 231 -351 -887 -264 53 -160 -691 -713 32 73 -392 -414 51 318 244 -554 96 696 562 43 120 743
1237G43k76m93Q2L08K03k37m60N80p2k95l99J67M09k23l92J34n6O0j94k67M79
$$ 743 467 -26 56 364 567 330 -130 450 378 83 -316 -149 260 37 -355 -221 -277 -217 -411 -678 -199
1258a99L5j54O0J32J46m9j30J75r7Q3L92k31L6J10J61n09L9L83o6L19l03j45L6
$$ -199 -164 -318 -258 -126 20 -29 -159 16 -81 2 394 163 199 309 470 -39 0 383 317 636 333 188 224
1281B24J52l48j6j01J78k59k43J64J48k17O6j36k2J78l4o3P2P5N2J4k12M83Jj04
$$ 224 376 28 12 -89 89 -170 -413 -249 -101 -318 -252 -388 -410 -232 -266 -329 -257 -182 -130 -116 -328 155 156 52
1305E2J79K6P0K0K14l91L12k65J6P0q2k8p8N4j3K56m61k29K15jk32j46K6k1L14
$$ 52 231 257 327 347 561 170 482 217 233 303 221 193 115 169 156 412 -49 -278 -63 -64 -296 -442 -416 -437 -123
1330a23j29m67N60kl69L00Q2J9m0J42p7K13k57K06k5K42r8k38M57l62L06k04L03
$$ -123 -252 -719 -159 -161 -530 -230 -148 -129 -169 -27 -104 109 -148 58 33 275 177 -61 396 34 340 136 439
1353D39p2k48J55j24M5J8o27M09j72J66n59K27L5J65P1k88J17M9J15k53OL44k46
$$ 439 367 119 274 150 195 213 -414 -5 -177 -11 -570 -343 -308 -143 -72 -360 -243 -194 -79 -332 -326 18 -228
1376b28n2J9L06K77k37N6J18K92m57p2K11N15l16j10j77K37k21j40K38j13j69
$$ -228 -280 -261 45 322 85 141 259 551 94 22 233 748 432 322 145 382 161 21 259 146 -23
1397b3M8m23L51j92K45k63j36Q4j02L76k14m9L95k40k46L71j12N01k25L2r5M5
$$ -23 25 -398 -47 -239 6 -257 -393 -309 -411 -35 -249 -298 97 -143 -389 -18 -130 371 146 178 83 128
1419A28L74l72R6j28N2o8J9K24J31l24J9n7k5j54K11q5j48k7P8k08j89J84Pk40
$$ 128 502 130 226 98 150 82 101 325 456 132 151 94 69 -85 126 41 -107 -134 -56 -264 -453 -269 -262 -502
1443e02M8L93q0P3n04L28J45K58l37L57l59M27j87j99K45R5k12P4n5K35j40N1
$$ -502 -454 -61 -141 -68 -572 -244 -99 159 -178 179 -180 247 60 -139 106 201 -11 63 8 243 103 154
1465A54k25r3M35j69l94N2N04k49l69J36K02L39o54M7K0K07j80n1K17M3J61l60
$$ 154 -71 -164 271 102 -292 -240 264 15 -354 -218 -16 323 -331 -284 -264 -57 -237 -288 -71 -28 133 -227
1487b27J92J77j3j48r9P5L24j71M9o5K33k50l7j39L06Q1l52k54K80K41j32l29
$$ -227 -35 142 129 -19 -118 -43 281 110 159 94 327 77 40 -99 207 288 -64 -318 -38 203 71 -258
1509b58K03L73l93l54L78j32o4NJ46M1k11J32p1L62r3r9o5j85O57l17k74L20k6
$$ -258 -55 318 -75 -429 -51 -183 -247 -242 -96 -55 -266 -134 -205 157 64 -35 -100 -285 372 55 -219 101 75
1532G5J95j32M4r8K40j05k37R8P1j28kR2qm6j96L39q7r3m85K22pp4N6L7q4K34
$$ 75 270 138 182 84 324 219 -18 80 151 23 21 113 105 59 -137 202 115 22 -463 -241 -248 -322 -266 -229 -313 -79
1558g9k64Q2k9O1L4J36L0J28K90p02M61J0J11l36Q6K49J04k38k64N47J19k01l64
$$ -79 -343 -261 -290 -229 -195 -59 -29 99 389 -313 148 158 269 -67 19 268 372 134 -130 417 536 335 -29
1581b9J58L32l32m22K8L68K3m35P0J84m1k55j5K43K16m52J20J77N7l4k75K41M35
$$ -29 129 461 129 -293 -265 103 126 -309 -239 -55 -96 -351 -366 -123 93 -359 -239 -62 -5 -39 -314 -73 362
1604C62j79n69K29N62J21n74j08K96M27m81j23j29L82k21l88L89m2K16m68M2K03
$$ 362 183 -386 -157 405 526 -48 -156 140 567 86 -37 -166 216 -5 -393 -4 -46 170 -298 -256 -53
1625e3L08n26J30L1J76l12j44K80J52k40M3J15R7J71n80O23j40L6j0p0K0n3l00
$$ -53 255 -271 -141 -110 66 -246 -390 -110 42 -198 -155 -40 57 228 -352 271 131 167 157 87 107 54 -246
1648b46N53j59j84J13n4L30l39q8o6M77j15p15K39L79M0m95k28M25O38m44o74
$$ -246 307 148 -36 77 23 353 14 -74 -140 337 222 -493 -254 125 165 -330 -558 -133 505 61 -613
1669f13J66P69o5j064L74N83K76q95l22Q68L24l13p49N53P11j47j081L33R07J45
$$ -613 -447 322 257 -807 -433 150 426 -469 -791 77 401 88 -661 -108 603 456 -625 -292 615 760
1689G60j269L6P88L01q39n41R89L37o87n64K25R15m4j140K44R98k12q32r2Q77
$$ 760 -509 -473 315 616 -223 -764 225 562 -125 -689 -464 451 407 -733 -489 509 297 -535 -627 250
1709B50K17q26l82R46N02n05q37Q29N63l15p54j87R28L74j165j50R07K30o44m78
$$ 250 467 -359 -741 205 707 202 -635 194 757 442 -312 -499 429 803 -362 -512 395 625 -19 -497
1729d97L36M43k03m76M01M08m39l99M11P9M7k00l28M22M11n91j33M83J30n92O1
$$ -497 -161 282 79 -397 4 412 -27 -426 -15 64 111 -89 -417 5 416 -175 -308 175 305 -287 -226
1750b26K43M02q41J54L33K5j06l30P76K8m07k50P0O81o37l88J93J044l15j235
$$ -226 17 419 -422 -268 65 90 -16 -346 430 458 51 -199 -129 552 -85 -473 -280 764 449 -786
1770g86M16Q99L1j066P5R29Rj159k07R63N67p25j008J188J051j063j182N87J500
$$ -786 -370 529 560 -506 -431 498 507 -652 -859 104 671 -54 -1062 126 1177 114 -1068 -481 1019
1789A019r4j879l7J641Q80j865q12J564R30j244j458J088J810j153j592O17J893
$$ 1019 925 -954 -991 650 1530 -335 -1147 417 1347 103 -1355 -267 1543 390 -1202 -585 1308
1806A308k59k147k96K022N31j678r77J518J388j289j624R25K006q12k145M50J977
$$ 1308 1049 -1098 -1394 628 1159 -519 -1496 22 1410 121 -1503 -578 1428 616 -1529 -1079 898
1823H98L47k192m37J914J032j686j505J754J458j067j731O90J729l91j860J99
$$ 898 1245 -947 -1384 530 1562 -124 -1629 125 1583 516 -1215 -525 1204 813 -1047 -848
1839h48J852k8j280o61R80J207j251j040J014O59p38p90j7J600l11j290K39J021
$$ -848 1004 976 -304 -965 15 1222 -29 -1069 -55 604 -134 -924 -941 659 348 -942 -703 318
1857C18J18r47J00Q67M1p36k05O53q6k55j82O43J11o69j24P83L71r90k60R85J11
$$ 318 436 -511 -411 456 497 -239 -444 209 123 -132 -314 329 440 -229 -353 430 801 -189 -449 536 647
1878F47n67r34R01J043j272p91N29J331p38j095Q4K013n35j560j79J826N70k005
$$ 647 80 -854 47 1090 -182 -973 -444 887 149 -946 -862 1151 616 -944 -1123 703 1273 -732
1896g32o27J461J426j633j686J202K230p01k557M97K568Jk511q61K690J230k213
$$ -732 -1359 102 1528 -105 -1791 -589 1641 940 -1617 -1120 1448 1449 -1062 -1923 767 1997 -216
1913b16j953K365J958j769k508J532K510q10l102L60L206M07l316r77K940J313
$$ -216 -2169 196 2154 385 -2123 -591 1919 1109 -1993 -1633 1573 1980 -1336 -2313 627 1940
1929A940j965k280J801K975k151k543J178L042r04l047J05L034J013k996j482
$$ 1940 -25 -2305 -504 2471 320 -2223 -1045 1997 1093 -1954 -1849 1185 2198 -798 -2280
1944b280L022J582j880k517J454K966j373k572M63K507L73k888k95K111R06j854
$$ -2280 742 2324 444 -2073 -619 2347 974 -1598 -1135 1372 1745 -1143 -1438 673 1579 -275
1960b75j520J782J638j595j674J310J624p29j588M71J197K26j682k99J406Q05
$$ -275 -1795 -13 1625 30 -1644 -334 1290 561 -1027 -556 641 867 -815 -1114 292 1097
1976A097j468l64J245L07q95n23J010L11j213p7N02O94j025j63Q42O36r87q19
$$ 1097 -371 -735 510 817 -78 -601 409 720 -493 -570 -68 626 -399 -562 280 916 -71 -890
1994h90J416K59o22j133O76J213q53j165P18J760p16j836J57K243L33k403r95
$$ -890 526 785 163 -970 -294 919 66 -1099 -381 1379 663 -1173 -1016 1227 1560 -843 -1838
2011a838K688R61k176j504J697K119j210k819Q91L445o56l379LL284R58l437j402
$$ -1838 850 1811 -365 -1869 -172 1947 737 -2082 -1191 2254 1598 -1781 -1778 1506 2464 -973 -2375
2028b375K969K200k883k595K046L306j439l839J058L484K43m012o32L566J542
$$ -2375 594 2794 -89 -2684 -638 2668 1229 -2610 -1552 1932 2175 -1837 -2469 1097 2639
2043B639l280k169K983K849k508l654J903L584p40l832J63L969Q19m044j275L597
$$ 2639 -641 -2810 173 3022 514 -3140 -1237 2347 1607 -2225 -2062 1907 2726 -1318 -2593 1004
2059A004J857k900k702K456K835j542l270P90L531m98l093l59L209P44k960j130
$$ 1004 2861 -39 -2741 -285 2550 1008 -2262 -1472 2059 1561 -1532 -1891 1318 2062 -898 -2028
2075b028K005J915j750k027J518J694n12k156M93K077j61j961k75J655P83j205
$$ -2028 -23 1892 142 -1885 -367 1327 815 -1341 -848 1229 1068 -893 -1168 487 1270 65
2091F5j105J070Q55p94q37O15R08p84n20O45J92m93j43M41L85n24m04O58J85l72
$$ 65 -1040 30 885 91 -746 -131 777 -7 -527 118 310 -183 -326 115 500 -24 -428 230 415 43
2111D3p95N54J018q11j010O68J334o06j349L49J786j63k091k20K013J038k334
$$ 43 -752 -198 820 9 -1001 -333 1001 395 -954 -605 1181 1018 -1073 -1293 720 1758 -576
2128e76j096K056J630j846k187J404K780j148k992P66K824L92l585n40L119J521
$$ -576 -1672 384 2014 168 -2019 -615 2165 1017 -1975 -1209 1615 2007 -1578 -2118 1001 2522
2144B522k977k320K643K738k052l309J116M000m80l926j54L563R02l741j239K817
$$ 2522 -455 -2775 -132 2606 554 -2755 -1639 2361 1881 -2045 -2199 1364 2266 -1475 -2714 103
2160A03K588k397l127K052L493j951k976N02L770L26m010p23L424J516k994k033
$$ 103 2691 294 -2833 -781 2712 761 -2215 -1713 2057 2383 -1627 -2350 1074 2590 -404 -2437
2176b437K468K560j785l107J260L030m27l291j12K929R98k844j195K055J627j515
$$ -2437 31 2591 806 -2301 -1041 1989 1562 -1729 -1841 1088 2086 -758 -1953 102 1729 214
2192B14j895J351J817n68k179K52K169j34j676l88J767K74j174r31J133Q47o74
$$ 214 -1681 -330 1487 919 -1260 -1008 1161 1027 -649 -1037 730 1004 -170 -1101 32 879 205
2209B05p11K65J123p39n50J80O69l88k00J69k0r6l42N11j52m8l45N97M95j072
$$ 205 -506 -241 882 143 -407 -227 442 54 -146 23 3 -93 -435 76 -76 -124 -469 128 623 -449
2229d49k07O65R70p76j156O28J209j70j471J14J610J01j898l65J802Q48j732j380
$$ -449 -656 9 979 203 -953 -325 884 714 -757 -643 967 1068 -830 -1195 607 1455 -277 -1657
2247a657J431K010j406k282J083K459m11k447m46K504J014k319j921K733J936
$$ -1657 -226 1784 378 -1904 -821 1638 1227 -1220 -1666 838 1852 -467 -2388 345 2281
2262B281k079k390J572K603q89l037K56L265M26l188p49K498J558k313k056K249
$$ 2281 202 -2188 -616 1987 1098 -1939 -1683 1582 2008 -1180 -1929 569 2127 -186 -2242 7
2278GK188j711k352N20L020q1k859p1K194R43k455j522K329J819j472k439J381
$$ 7 2195 484 -1868 -1348 1672 1591 -1268 -1339 855 1798 -657 -2179 150 1969 497 -1942 -561
2295e61K124m32k556j75K370N54j857r42J853Q10j125j519Q51J840j005j075J77
$$ -561 1563 1131 -1425 -1600 770 1324 -533 -1475 378 1188 63 -1456 -605 1235 230 -845 -668
2312f68J211N3j230j0R65O17j098l60K46Q67k61n82p0O32j93m07J65j4K8J46J06
$$ -668 543 596 -634 -644 321 938 -160 -520 -274 593 332 -250 -320 312 119 -288 -123 -137 -109 37 143
2333A43j19n0K27j22P6l77j62Q36l19q59J72R81R6n18o72Q45O15n95j012N40J131
$$ 143 24 -26 201 79 155 -222 -384 452 133 -726 -554 427 523 5 -667 178 793 198 -814 -274 857
2354H57k93j402l7J535N28j673n71J163J044j090j181Q95J317j98j906L13J460
$$ 857 564 -838 -875 660 1188 -485 -1056 107 1151 61 -1120 -225 1092 894 -1012 -699 761
2371G61L56j822n25J621R96j520j454R53K064j185j611O20J760L9j870j74J792
$$ 761 1117 -705 -1230 391 1387 -133 -1587 -634 1430 245 -1366 -746 1014 1053 -817 -991 801
2388H01N48j628j105J469J278j130j501P21J655k28j930J39J546L87j515m39R00
$$ 801 1349 -279 -1384 85 1363 233 -1268 -547 1108 880 -1050 -911 635 1022 -493 -932 -32
2405c2J302j233j092J001Q90l12j653O85J088K54j214n06J114O77q60q38O98P68
$$ -32 1270 37 -1055 -54 836 524 -1129 -444 644 898 -316 -822 292 969 109 -729 -31 737
2423G37l99q03Q8Q85r8n87l67P85J81n74m23M61O01k32o33J37O85k33m18j81M50
$$ 737 338 -465 -377 508 410 -177 -544 241 422 -152 -575 -114 487 255 -378 -241 444 211 -207 -388 62
2444F2mNl48K96q1P3k9j79J06L42j7j57k95k6O99j58j34l60L49L25m64k73n9Q00
$$ 62 58 63 -285 11 -70 3 -26 -205 -99 243 226 69 -226 -252 447 289 155 -205 144 469 5 -268 -327 473
2468D73k67n63L3P00K10q66l52R79J20n68o27M37J105p65o95J55R92P1j528K29
$$ 473 206 -357 -324 376 586 -280 -632 347 467 -101 -728 -291 814 49 -646 -491 501 572 -956 -727
2488g27Q82O92j307k45Q67M82m06j171O39R24k46r74k2P56M43q73k84P44L92n97
$$ -727 155 847 -460 -705 162 644 238 -933 -294 630 384 -590 -612 144 587 -286 -570 174 566 -31
2508c1o74P42O88k62j413P30P91k20p88pP56J11n15l47K19N76J19r09J52P79l67
$$ -31 -705 37 725 463 -950 -220 571 351 -437 -444 312 423 -92 -439 -220 356 475 -434 -282 497 130
2529A30m97J86K20K67n43O7L40K48l76k48m3L60K03m43k71N02o7K02p09K99L25
$$ 130 -367 -181 39 306 -237 -170 170 418 42 -206 -249 111 314 -129 -400 102 35 237 -472 -173 152
2550A52k91J8j26J60L1P8k76J83o4J37j77N37l70nj16K59k71K40m9J1r6Nk5Q8
$$ 152 -139 -121 -247 -87 -56 22 -254 -71 -135 2 -175 362 -8 -13 -129 130 -141 99 50 61 -35 -30 -55 33
2574C3k10M8M70l12j37J65n0L59l44k67L18K27j81n03J17N24l7l29n35Q98j75
$$ 33 -177 -129 341 29 -108 57 7 366 22 -245 73 300 119 -384 -267 257 220 -109 -644 254 79
2595G9L4n06L53M12j49l63o8P27l75l78J5J14L13p8n97K86M44l56J57j61K32j00
$$ 79 113 -393 -40 372 223 -140 -208 519 144 -234 -219 -105 208 130 -467 -181 263 -93 64 -97 135 35
2617C5R3j77K86Ok27l35K87J70k59k85L15L90k40Rj06J75M3j63L1r0q5L31k45
$$ 35 128 -49 237 243 16 -319 -32 138 -121 -406 -91 299 59 68 -38 137 180 17 48 -42 -127 204 -41
2640d1K93k36M1r3j38L76L4n11L9P1L55j52N0k30J51K39l64k0J24K00m02k5M97
$$ -41 252 16 57 -36 -174 202 236 -275 -236 -165 190 38 88 -142 9 248 -116 -136 -12 188 -214 -239 258
2663B58m73J55j87J25O5K62l16n5J15K0J44qO6N4l25L9k38L51l9k07L07k27o1
$$ 258 -215 -60 -247 -122 -57 205 -111 -166 -51 -31 113 105 171 225 -100 -61 -299 52 13 -194 113 -114 -175
2686a75r1J70K52k5P1l1j46j3M49k52J9k06j04j88L29r1K96m14R6L42m50L47M7
$$ -175 -266 -96 156 131 202 171 25 12 461 209 228 22 -82 -270 59 -32 264 -150 -54 288 -162 185 232
2709B32l87J37J35o4j12N8N0N6j06J62j50j18J47k5j87K63M1j10lj21Q2Q1k79
$$ 232 -155 -18 117 53 -59 -1 49 105 -1 161 11 -107 40 15 -172 91 132 22 19 -102 -20 61 -218
2732b18J13K73j83k02L6L42j26k3M3q0K37j56j20J68J3r2k78K58N1J32l9m7k12
$$ -218 -105 168 -15 -217 -181 161 35 12 55 -25 212 56 -64 104 117 25 -253 5 56 188 149 102 -110
2755a10L38l7l08o3J67K64l96R2J58M6j87j86J44L39p1jl11nK86k03P8j47K75
$$ -110 228 191 -117 -180 -13 251 -145 -53 105 151 -36 -222 -78 261 190 189 -122 -127 159 -44 34 -113 162
2778A62l18J28j1J23o9o8N0j39K29p1P2j69M5J86j95O0j7j29J3P3l1J56k40J21
$$ 162 -156 -28 -39 84 15 -53 -3 -142 87 16 88 -81 -36 150 -45 15 -2 -131 -118 -45 -76 80 -160 -39
2802c9j75N09j60k73ML1M59n40N2O6j06J5L3M16o48K54K11OJ01k17k16Q7J69j25
$$ -39 -214 295 135 -138 -134 -103 356 -184 -132 -66 -172 -157 -124 292 -356 -102 109 115 216 -1 -217 -130 39 -86
2826h6KJ49r5j81M0L8L08k5k27n1L05Km0m0k66nK28M1l26N57m30j8Q2K4J10j7
$$ -86 -84 65 -30 -211 -171 -133 175 150 -77 -128 177 179 139 99 -167 -172 56 97 -229 328 -102 -120 -38 -14 96 79
2852G9k87o0L04n7J43R6Pj37K2q3k20M23k32r1O9N1J6j76K12l9NM6J89j48j22
$$ 79 -208 -268 36 -21 122 218 225 88 110 27 -193 230 -2 -93 -24 27 43 -133 79 40 45 91 280 132 10
2877A0L75k49j73Q7o6j00K69r5n5j09J43J69P9k49j2k30K69Q1M7j46q5p2J34K8
$$ 10 385 136 -37 50 -16 -116 153 58 3 -106 37 206 285 36 24 -206 63 144 191 45 -40 -112 22 50
2901E0j21K00k31J04K09j23j90J41j45K00o5m4N0J19n37K73k2P5k21K85Q3k85
$$ 50 -71 129 -102 2 211 88 -102 39 -106 94 29 -15 35 154 -383 -110 -132 -57 -278 7 90 -195
2923a95K63l1j90L22p3k7j34k0L07Q0l40q6M69l64L0j92L05r6M6J26j88J91l37
$$ -195 68 37 -153 169 96 69 -65 -85 222 302 -38 -124 345 -19 11 -181 124 28 74 200 12 203 -134
2946a34K92k43J04R6p8p4r7L41j84k06J16J52j15j8j6K2K04j43l1m8P5M8k7p3
$$ -134 158 -85 19 115 37 -37 -134 207 23 -183 -67 85 -30 -48 -64 -42 162 19 -12 -60 15 63 36 -37
2970c7J2M5k21K36k2n3J67j55O4q8l1K02k00o5M8M8P0K7Lj15q9O9K07k31J48j22
$$ -37 -25 20 -201 35 13 -40 127 -28 36 -52 -83 119 -81 -146 -98 -50 20 47 50 -65 -154 -85 122 -109 39 -83
2996h3j4K67n4K1J4Ol00K44j6L4j64K9L1j38J87k27L17j8k02J49p9J12j62m2L3
$$ -83 -97 170 116 137 151 157 -143 101 85 119 -45 -16 15 -123 64 -163 154 136 -66 83 4 116 -46 -88 -55
3021e5O7L0K6M8k14N8K65k53l4J16j13K02o2qj70o3M91k33j17j79K04M4j05o5
$$ -55 12 42 68 116 -98 -40 225 -28 -62 54 -59 143 81 73 -97 -160 331 98 -19 -198 6 50 -55 -120
3045a20K31r2l3j87J29J18l04L75k66K06n1k6K8K68m03L92k62r7R4m8O7q3K23
$$ -120 111 19 -14 -201 -72 46 -258 117 -149 57 6 -20 8 276 -127 265 3 -94 0 -48 19 -64 159
3068A59k39q2J83J99j88j21J74j0K67l30m4K72r6J5j90J74j80K36k65J11J12J7
$$ 159 -80 -162 21 220 32 -89 85 75 342 12 -32 240 144 159 -31 143 -37 199 -66 45 157 174
3090A74k24J50P1k39p6j31M17j84M17m42K08N5k16L2M3P8l06L2J61j30n8P5J61
$$ 174 -50 100 171 -68 -144 -275 142 -42 375 -67 141 196 -20 12 55 133 -173 -141 20 -110 -168 -93 68
3113F8L74n08K05l89L47k72J54R8l25L30L1k20R3J65k23J56k88L39k70j74L05
$$ 68 442 -66 139 -250 97 -175 -21 77 -248 82 113 -107 -14 151 -72 84 -204 135 -135 -309 -4
3134dP1L82m51J83l29L17m7k12M5K03k31K18k73L78J57n27j8L68k26J52k31pK80
$$ -4 67 449 -2 181 -148 169 122 -90 -45 158 -73 145 -128 250 407 -120 -138 230 4 156 -75 -82 198
3157A98o2l47L78j73k5P6k38K42L20l18j11j32J58p7K14k35m4M4j29L23j05K59
$$ 198 136 -211 167 -6 -31 45 -193 49 369 51 -60 -192 -34 -111 103 -132 -176 -132 -261 62 -43 216
3179B16n6k35k7J26J49O1j16l79J17L62j93R4m19R8l7L92k86j1Q2R3J32m22M06
$$ 216 160 -75 -102 24 173 234 118 -261 -144 218 25 119 -300 -202 -239 153 -133 -144 -62 31 163 -259 147
3202A47J7j38j78L93j39k48J41p8L21j93r0J95k88J35j63J21Q1j6j40J35L2K29
$$ 147 164 26 -152 241 102 -146 -5 -83 238 45 -45 150 -138 -3 -166 -45 36 20 -120 15 47 276
3224B76j82lqM1j20J20j51J85J63nk85k94K90M4k62K94l0l1J26k88K99N9m13K23
$$ 276 94 91 83 124 4 124 -27 158 321 316 31 -263 27 71 -191 103 73 42 168 -120 179 238 -175 48
3248D8j82K76k21J83k38J40N9l5L1j96K01K15k86j89J80j59K88q0lj24K12K45
$$ 48 -134 142 -79 104 -134 6 65 30 61 -135 66 281 -5 -194 -14 -173 115 35 32 -92 120 365
3270C65l31j91L2L24j72n1J50k88K1J51J01J51j62k7j73L99l87q6J23J80l00M6
$$ 365 34 -157 -125 199 27 -24 126 -162 -141 10 111 262 100 73 -100 299 -88 -174 -51 129 -171 -125
3292a25K32n5K10J13k03j56k23K83k22J38J95l03K51r1k46L21k15q0J6J63j42
$$ -125 107 52 262 375 172 16 -207 76 -146 -8 187 -116 135 44 -202 119 -96 -176 -160 3 -139
3313a39J92R3j28J18k74K92R5k34Q3j43j89M44j65j65j87K12j9J13o1O4q3rQ3
$$ -139 53 146 18 136 -138 154 249 15 98 -45 -234 210 45 -120 -307 -95 -114 -1 -62 2 -81 -90 -7
3336gK16j46p9k00M09k03J7N5p8r6J79N1j66l1m7J25L93n22l2K33j95J88j99J69
$$ -7 209 63 -16 -216 193 -10 7 62 -16 -112 67 118 -48 -79 -126 -1 392 -130 -162 71 -124 64 -135 34
3360C4j9K09k63J83J21k80k0J55j94q2J38n7lJ42l3N7J08j41k42P2J16K38k11
$$ 34 15 224 -39 144 265 -15 -35 120 -74 -156 -18 -75 -78 64 31 88 196 55 -187 -115 1 239 28
3383B8m4j54Q0J54k9r1Q0M0p1k05J29K04rM8j44O0K74l68j11J93j12j09j2P6r1
$$ 28 -16 -170 -90 64 35 -56 24 64 -7 -212 -83 121 112 160 16 76 350 -18 -129 64 -48 -157 -169 -93 -184
3408a84L82k35k02J14K27M8k86J74J02L7k84J5P1K46k64Ol5J38k38R7K30k28K16
$$ -184 198 -37 -239 -125 102 150 -136 38 140 177 -107 -92 -21 225 -39 -33 -68 70 -168 -71 159 -69 147
3431A47q9L1l16Q9NN0L31k51j23K39Q6j66o2r1L78l39j2P5j45K56k2j00L07k98
$$ 147 58 89 -227 -138 -133 -83 248 -3 -126 113 199 33 -29 -120 258 -81 -93 -18 -163 93 71 -29 278 -20
3455b0q4K04k11n9K88j6p5rm6j02K87q5J37LJ23k73j51J06K3J67j12o9J10j86
$$ -20 -104 100 -111 -170 118 102 27 18 -28 -130 157 72 209 212 335 62 -89 17 40 207 95 26 136 -50
3479e0L28j74Q3j41o7j87K23o5j25K27K4J1j29l9K23j97K24q1k10L28m47N95j86
$$ -50 278 104 187 46 -21 -208 15 -50 -175 52 76 87 -42 -81 142 -55 169 88 -122 206 -241 354 168
$$ [...]
8191A64
##END NTUPLES=NMR FID
##END=
