##TITLE=1H_SAM-33.1
 DMF, 8 sc, 
 25.08.2021
##JCAMPDX= 6.0         $$ Bruker NMR JCAMP-DX V2.0
##DATA TYPE= NMR FID
##DATA CLASS= NTUPLES
##ORIGIN= UXNMR, Bruker Analytische Messtechnik GmbH
##OWNER= root
$$ XWIN-NMR		Version 3.5
$$ Wed Aug 25 12:45:54 2021 Russian Standard Time (UT+4h)  she@DPX200
##.OBSERVE FREQUENCY= 200.131506
##.OBSERVE NUCLEUS= ^1H
##.DELAY= (6, 6)
##.ACQUISITION MODE= SIMULTANEOUS
##.ACQUISITION SCHEME= undefined
##.AVERAGES= 8
##.DIGITISER RES= 18
##SPECTROMETER/DATA SYSTEM= spect
##.PULSE SEQUENCE= zg30
##.SOLVENT NAME= DMF
##.SHIFT REFERENCE= (INTERNAL, DMF, 0, 15.7039)
##AUDIT TRAIL= $$ (NUMBER, WHEN, WHO, WHERE, WHAT)
$$ ##TITLE= Audit trail, XWIN-NMR		Version 3.5
$$ ##JCAMPDX= 5.01
$$ ##ORIGIN= Bruker BioSpin GmbH
$$ ##OWNER= she
$$ F:/spectra/data/she/nmr/H-F/1/audita.txt
$$ ##AUDIT TRAIL=  $$ (NUMBER, WHEN, WHO, WHERE, WHAT)
(   1,<2021-08-25 12:44:29.67 +0400>,<she>,<DPX200>,
      <created by zg, POWCHK disabled, PULCHK disabled
       configuration hash MD5:
       00 E9 B6 7A A2 85 ED C7 34 08 36 98 17 FE 4E 26
       data hash MD5: 16K
       0E 64 49 EC EB 58 C2 61 28 27 51 21 78 59 3C 1F>)
$$ ##END=
$$ 
$$ hash MD5
$$ 98 3C 52 8C CC 02 86 4D 60 C5 FD A5 05 EE 34 8A
##$RELAX= 
##$RELAX= 
##$RELAX= 
##$RELAX= 
##$RELAX= 
##$RELAX= 
$$ Bruker specific parameters
$$ --------------------------
##$DU= <F:/spectra>
##$EXPNO= 1
##$NAME= <H-F>
##$PROCNO= 1
##$TYPE= <nmr>
##$USER= <she>
##$AMP= (0..31)
100 100 100 100 100 100 100 100 100 100 100 100 100 100 100 100 100 100 
100 100 100 100 100 100 100 100 100 100 100 100 100 100 
##$AQSEQ= 0
##$AQ_mod= 1
##$AUNM= <au_zg>
##$AUTOPOS= <>
##$BF1= 200.13
##$BF2= 200.13
##$BF3= 200.13
##$BF4= 200.13
##$BF5= 200.13
##$BF6= 200.13
##$BF7= 200.13
##$BF8= 200.13
##$BYTORDA= 1
##$CFDGTYP= 0
##$CFRGTYP= 5
##$CHEMSTR= <none>
##$CNST= (0..31)
1 1 145 1 1 1 1 1 1 1 1 1 1 1 1 1 1 1 1 1 1 1 1 1 1 1 1 1 1 1 1 1 
##$CPDPRG= <>
##$CPDPRG1= <>
##$CPDPRG2= <>
##$CPDPRG3= <>
##$CPDPRG4= <mlev>
##$CPDPRG5= <mlev>
##$CPDPRG6= <mlev>
##$CPDPRG7= <mlev>
##$CPDPRG8= <mlev>
##$CPDPRGB= <>
##$CPDPRGT= <>
##$D= (0..31)
0 1.2 0 0 0 0 0 0 0 0.06 0 0.03 0 0 0 0 0.0002 0 0 0 0 0 0 0 0 0 0 0 0 
0 0 0 
##$DATE= 1629881069
##$DBL= (0..7)
120 120 120 120 120 120 120 120 
##$DBP= (0..7)
150 150 150 150 150 150 150 150 
##$DBP07= 0
##$DBPNAM0= <>
##$DBPNAM1= <>
##$DBPNAM2= <>
##$DBPNAM3= <>
##$DBPNAM4= <>
##$DBPNAM5= <>
##$DBPNAM6= <>
##$DBPNAM7= <>
##$DBPOAL= (0..7)
0.5 0.5 0.5 0.5 0.5 0.5 0.5 0.5 
##$DBPOFFS= (0..7)
0 0 0 0 0 0 0 0 
##$DE= 6
##$DECBNUC= <off>
##$DECIM= 32
##$DECNUC= <off>
##$DECSTAT= 4
##$DIGMOD= 1
##$DIGTYP= 9
##$DL= (0..7)
0 120 120 120 120 120 120 120 
##$DP= (0..7)
150 150 150 150 150 150 150 150 
##$DP07= 0
##$DPNAME0= <>
##$DPNAME1= <>
##$DPNAME2= <>
##$DPNAME3= <>
##$DPNAME4= <>
##$DPNAME5= <>
##$DPNAME6= <>
##$DPNAME7= <>
##$DPOAL= (0..7)
0.5 0.5 0.5 0.5 0.5 0.5 0.5 0.5 
##$DPOFFS= (0..7)
0 0 0 0 0 0 0 0 
##$DQDMODE= 0
##$DR= 18
##$DS= 0
##$DSLIST= <SSSSSSSSSSSSSSS>
$$ [...]
##$SUBNAM2= <"">
##$SUBNAM3= <"">
##$SUBNAM4= <"">
##$SUBNAM5= <"">
##$SUBNAM6= <"">
##$SUBNAM7= <"">
##$SUBNAM8= <"">
##$SUBNAM9= <"">
##$SW= 20.0188882624521
##$SWIBOX= (0..15)
0 0 2 0 0 0 0 0 0 0 0 0 0 0 0 0 
##$SW_h= 4006.41025641026
##$TD= 16384
##$TD0= 1
##$TE= 0
##$TE2= 300
##$TE3= 300
##$TEG= 300
##$TL= (0..7)
0 120 120 120 120 120 120 120 
##$TP= (0..7)
150 150 150 150 150 150 150 150 
##$TP07= 0
##$TPNAME0= <>
##$TPNAME1= <>
##$TPNAME2= <>
##$TPNAME3= <>
##$TPNAME4= <>
##$TPNAME5= <>
##$TPNAME6= <>
##$TPNAME7= <>
##$TPOAL= (0..7)
0.5 0.5 0.5 0.5 0.5 0.5 0.5 0.5 
##$TPOFFS= (0..7)
0 0 0 0 0 0 0 0 
##$TUNHIN= 0
##$TUNHOUT= 0
##$TUNXOUT= 0
##$USERA1= <user>
##$USERA2= <user>
##$USERA3= <user>
##$USERA4= <user>
##$USERA5= <user>
##$V9= 5
##$VALIST= <valist>
##$VCLIST= <CCCCCCCCCCCCCCC>
##$VD= 0
##$VDLIST= <DDDDDDDDDDDDDDD>
##$VPLIST= <PPPPPPPPPPPPPPP>
##$VTLIST= <TTTTTTTTTTTTTTT>
##$WBST= 1024
##$WBSW= 4
##$XGAIN= (0..3)
0 0 0 0 
##$XL= 0
##$YL= 0
##$YMAX_a= 108300
##$YMIN_a= -168446
##$ZGOPTNS= <>
##$ZL1= 120
##$ZL2= 120
##$ZL3= 120
##$ZL4= 120
##$ABSF1= 10
##$ABSF2= 0
##$ABSG= 5
##$ABSL= 3
##$ALPHA= 0
##$AQORDER= 0
##$ASSFAC= 0
##$ASSFACI= 0
##$ASSFACX= 0
##$ASSWID= 0
##$AUNMP= <proc_1d>
##$AZFE= 0.1
##$AZFW= 0.1
##$BCFW= 1
##$BC_mod= 2
##$BYTORDP= 1
##$COROFFS= 0
##$CY= 11.3945322036743
##$DATMOD= 1
##$DC= 2
##$DFILT= <>
##$DTYPP= 0
##$F1P= 2.36226072786647
##$F2P= -0.459571619588291
##$FCOR= 0.5
##$FTSIZE= 0
##$FT_mod= 4
##$GAMMA= 1
##$GB= 0.15
##$INTBC= 1
##$INTSCL= 1
##$ISEN= 128
##$LB= 0.24
##$LEV0= 0
##$LPBIN= 0
##$MAXI= 10000
##$MC2= 0
##$MEAN= 0
##$ME_mod= 0
##$MI= 1.114404
##$NCOEF= 0
##$NC_proc= 0
##$NLEV= 6
##$NOISF1= 3.799351
##$NOISF2= 2.8
##$NSP= 1
##$NTH_PI= 0
##$NZP= 0
##$OFFSET= 15.70392
##$PC= 1
##$PHC0= -13366.08
##$PHC1= 22.20099
##$PH_mod= 1
##$PKNL= yes
##$PPARMOD= 0
##$PSCAL= 0
##$PSIGN= 0
##$REVERSE= no
##$SF= 200.130013532006
##$SI= 16384
##$SIGF1= 3
##$SIGF2= 2
##$SINO= 400
##$SIOLD= 16384
##$SREGLST= <1H.CDCl3>
##$SSB= 0
##$STSI= 0
##$STSR= 0
##$SW_p= 3612.71676300578
##$SYMM= 0
##$S_DEV= 0
##$TDeff= 0
##$TDoff= 0
##$TI= <>
##$TILT= no
##$TM1= 0
##$TM2= 0
##$TOPLEV= 0
##$USERP1= <user>
##$USERP2= <user>
##$USERP3= <user>
##$USERP4= <user>
##$USERP5= <user>
##$WDW= 1
##$XDIM= 8192
##$YMAX_p= 0
##$YMIN_p= 0
$$ End of Bruker specific parameters
$$ ---------------------------------
##NTUPLES= NMR FID
##VAR_NAME=  TIME,          FID/REAL,        FID/IMAG
##SYMBOL=    X,             R,               I
##VAR_TYPE=  INDEPENDENT,   DEPENDENT,       DEPENDENT
##VAR_FORM=  AFFN,          ASDF,            ASDF
##VAR_DIM=   8192,          8192,            8192
##UNITS=     SECONDS,       ARBITRARY UNITS, ARBITRARY UNITS
##FACTOR=    0.0002496,     1,               1
##FIRST=     0,             0,               0
##LAST=      2.0444736,     0,               0
##MIN=       0,             -168446,         0
##MAX=       2.0444736,     108300,          0
$$ Real data points
##PAGE= N=1
##DATA TABLE= (X++(R..R)), XYDATA
$$ [...]
1960A410j325j377O99K139r19j615J43J536K11j367o71J463P79j211q41J003Q83
1977I40o27j059M87R11m27r92O04Q14m19p77K5Q13k46n25q3R25o3o82q1Q22j04
1998B56o83lJ027j72r92N2J082J73j100m37J124Q58j238j414J599J165p96j636
2016a135N75J867n39j939K03K008N04k186j254K231J524k010k124J579K505r24
2032H85k733Q97K547p9k757o05L114Q45k662j499K051K186j700k599J304L254
2048B449r56l485M52K890M32k871o30K421J426k274k184K139K600j926k404P68
2064a153K746k40l028J76K432P62k201j361K084J634j667k012J155K367o45k517
2080a468L94K164p5j823m46J720Q56j485j158J360J010q56j067N82J290n52q69
$$ plain form
1960 1410 85 -1292 -593 1546 627 -988 -845 691 902 -465 -1136 327 1106 -105 -946 57 940
1977 940 313 -746 -259 652 225 -767 -163 651 232 -545 -520 293 47 -478 -561 364 301 -381 -462 360 256
1998 256 -427 -430 597 425 -567 -515 567 740 -360 -797 327 1185 -53 -1467 132 1297 501 -1135
2016 -1135 -560 1307 768 -1171 -968 1040 1544 -642 -1896 335 1859 -151 -2275 -696 1809 885
2032 885 -1848 -951 1596 1517 -1240 -1845 1269 2114 -548 -2047 4 2190 490 -2109 -805 2449
2048 2449 1493 -1992 -1540 1350 1782 -1089 -1719 702 2128 -146 -2330 -191 2409 483 -1921 -1153
2064 -1153 1593 1353 -1675 -1499 933 1695 -506 -1867 217 1851 184 -1828 -673 1694 1049 -1468
2080 -1468 -1074 1090 1015 -808 -1254 466 1322 -163 -1321 39 1049 193 -874 -292 998 446 -423
2097d23k90J092J04j114N4R60j69o33Q7N68l0m81R1L41J0n13J11P92j59q12n3
2118d67J205l21o96k41J124K91j059o27R54Q76j004j281R76J594q89j780L16K048
2136A019k7k008n90K261Q56j947j329J434K067j638k142J043K590j76k901k59
2152a747K994L07j922j575K186K130k215j998J369K387p62k905N33L207k81k888
2168a180p64K758J146k104j923J954K321j782k771J363K567n78k656J02K605O42
2184A700k607r69K063J543j742j838J556J650n26k258M72J927Nj629m60J482Q22
2201A191j574p41J056J073p93j210N83J023n2j091r2J045K02j105j96P24N07p55
2219b05j11M17J70k12l99O03m40k19M18Q1j83k77J10Q24p8q52QP62L74j227j08
$$ plain form
2097 -423 -713 379 483 -631 -577 383 214 -419 -332 236 206 -275 -184 157 167 -346 -235 557 398 -414 -467
2118 -467 738 417 -279 -520 604 895 -164 -791 163 1039 35 -1246 -270 1324 435 -1345 -1029 1019
2136 1019 992 -1016 -1606 655 1511 -436 -1765 -331 1736 98 -2044 -1001 1589 1413 -1488 -1747
2152 -1747 1247 1554 -368 -1943 243 2373 158 -1840 -471 1916 1154 -1751 -1218 1989 1708 -1180
2168 -1180 -1944 814 1960 -144 -2067 -113 2208 426 -2345 -982 1585 1007 -1649 -1547 1058 1700
2184 1700 -907 -1876 187 1730 -12 -1850 -294 1356 830 -1428 -956 971 976 -653 -1113 369 1191
2201 1191 -383 -1124 -68 1005 212 -998 -415 608 556 -535 -627 418 620 -485 -681 43 550 -205
2219 -205 -316 101 271 59 -340 263 -177 -396 22 103 -80 -357 -247 577 499 -353 -345 417 791 -436 -544
2240e44Q29N85j072r25Q95J160q30j180O56J271N5j630m83J901N87j781j008J502
2258a2J317j230j677J140J690n09j965L59K006J67k220k51J779J063j796j586
2274a725J703J484q29k250Q73J847K66k340l82K026Q86k088j203K023J261j123
2290D29j762R35J843o93j944J40J974K88k098l78J785J029j600j085N99J801o46
2307F17j523Q0J547K99j323n11J152M91r01p86P51J208r17p85M79Q42n67k55l47
2326d49P63J45p45P2J92N29p33o2J14L91m02L59k82n8L07k67K41l74J66L36r6
2347A47j58m42J60O52m90k32K95M56R5n79p39Q42M68k77r64N64Q23k36r15Q3J026
2368E79J90j205k73P81N86o66j124R38J033m90j058R6J330K7j284l01J300P16
$$ plain form
2240 -544 285 870 -202 -1127 -232 928 98 -1082 -426 845 900 -730 -1213 688 1275 -506 -1514 -12
2258 -12 1305 75 -1602 -462 1228 719 -1246 -887 1119 1286 -934 -1185 594 1657 -139 -1725
2274 -1725 -22 1462 633 -1617 -744 1103 1369 -971 -1353 673 1559 -529 -1732 291 1552 429
2290 429 -1333 -398 1445 752 -1192 -1052 922 1210 -888 -1266 519 1548 -52 -1137 -538 1263 617
2307 617 -906 -826 721 1020 -303 -814 338 829 -72 -858 -107 1101 184 -601 -122 720 153 -102 -449
2326 -449 314 459 -286 -214 -22 507 -226 -288 -174 217 -185 174 -108 -166 141 -126 115 -259 -93 243 147
2347 147 -11 -453 -293 359 -131 -363 -68 388 483 -96 -835 7 475 198 -766 -202 621 385 -530 -447 579
2368 579 769 -436 -709 72 658 -8 -1132 -194 839 349 -709 -613 717 744 -540 -841 459 1175
2386A175j198q20J041P25o99j127M99J283l59j398J59J314k9q56o05J194O58q88
2404F9j066N65J293o64j169N18R18n5j067j49R58N66p90o50Q13N84o03m63r5R35
2424D48J17j073J09O31L64o55m48M43P10l28p81K97N04q7p67J74M23m8k62PK64
2445D2K10j94k1j58K07K9k78K02l9J31J86j85O9n50M78n9o5k5J26j04r7k19J55
2468a59L22J07l50j58K67J52k16n16M18L05j55n46J83R03k86p39k3N58K86k98
2488E5n70O39L68k09n23N3P57k36n10j69O93Po47j10O72K08j10q92L09P99l59
2509B25r27M08M92N1m78l7M74M01o29m71M07N06n30l43L37O07j06p21OL82L16
2530C70n18j74N08K59m07l46K84N15n46n35M53L02Pl70L0J91L81n46l8K2J81j00
$$ plain form
2386 1175 -23 -843 198 923 224 -903 -404 879 520 -878 -719 595 566 -290 -895 299 957 69
2404 69 -997 -432 861 197 -972 -454 464 409 -658 -807 151 717 -73 -723 90 674 71 -392 -487 448
2424 448 565 -508 -399 232 596 -59 -507 -64 646 318 -463 -166 338 251 -516 -342 81 33 -229 -222 42
2445 42 252 58 37 -121 86 115 -163 39 0 131 317 132 201 -349 129 70 5 -20 106 2 -95 -314 -159
2468 -159 163 270 -80 -238 29 181 -35 -551 -133 172 17 -529 -346 557 271 -468 -491 67 353 55
2488 55 -515 124 492 283 -240 -187 570 334 -176 -345 348 355 -292 -402 270 478 368 -524 -215 584 225
2509 225 -702 -294 198 249 -229 -266 208 609 -20 -491 -84 422 -108 -451 -114 493 387 -334 -328 54 370
2530 370 -148 -322 186 445 38 -308 -24 491 -55 -590 -137 165 172 -198 -168 23 404 -142 -180 -158 23 -77
2552g7J79l67O92j24m01J93k57O2J38n6Q3R9q9j14K48k38j25L1j08J28Q9L76m19
2575e7LK10k1Pk67J21P5Pp1N7l7J59o8k32P0L6j35K68j53r4J93n4k60K83jK79
2601C18n41J77J82Q9m92J38K7L15p9m29M7L93J43m59n5J89N01m18k71J40M29l91
2623d7n0l0L05j08k30Q6J51k27J38l0J98L9j52n47N47l6j0k63j4L01K69l53j38
2646b01K33J01j23k43L11j47K34l95K10J79l5r5k66J14O3M4k11K3J52j98R9O6
2668h5Kk04L00N8j7J28m05K64p8L4Lj34J51K78l59k1K35k11j30J05R1R3r6J02
2692A04m9k23J98K63j27r3j83l3NK96j77j5J57N5n1j66JJ33k95L58K7k56Q8r4
2716g7n5k0J6J5K8R7p0j35j05L76j86J00K1l98O13m04J65J6J22k25J17n7j13L36
$$ plain form
2552 -77 102 -265 427 303 -98 95 -162 -100 38 -18 65 164 75 -39 209 -29 -154 -123 -231 -103 -14 362 -57
2575 -57 -54 156 135 142 -125 -4 71 78 7 64 27 186 118 -114 -44 -8 -143 125 -28 -122 71 17 -243 40 39 318
2601 318 -223 -46 136 225 -267 -129 -102 213 134 -295 -248 145 288 -171 -226 -37 464 46 -225 -85 344 -47
2623 -47 -97 -127 178 70 -160 -74 77 -150 -12 -42 156 195 43 -504 43 7 -3 -266 -280 21 290 -63 -201
2646 -201 32 133 10 -233 78 -69 165 -230 -20 159 124 29 -237 -123 -60 -16 -227 -204 -52 -250 -151 -85
2668 -85 -83 -287 13 71 54 182 -223 41 -37 -3 0 -134 17 295 -64 -85 150 -61 -191 -86 5 98 2 104
2692 104 55 -168 30 293 166 73 -110 -143 -138 158 -19 -34 123 178 127 -39 -38 95 -200 158 185 -71 17 -77
2716 -77 -132 -152 -136 -121 -93 4 -66 -201 -306 70 -116 -16 5 -393 220 -184 -19 -3 119 -106 11 -46 -159 177
2740A77l03K17k09M07l27J33R4o7l10K41J0k66M70l78j7J75J40k73K04k02r2J69
2762gO9k60J00K84L0O0k71K67m08o4M41j77k48K70j3j52L14k01j42k9L90j37l3
2785H3L2k38K97l35L95r7k03M34q5j65l21J13L40m07n0L53j12j58o6K84r8ll48
2808c55N24j91Q6k90K00R8k54J74K4K07j06j58j00k45O61k60j7k3j49L8N7o9K23
2831G5K62j69k96J08k4J78p1J32j93l3J22P7Jj84j81L86j46k17J87l1K00l98L79
2854A64l27L65J9k06j61J75k61n4L80j77l7q7J92Q2j26O5L0j26L6m1P0J78j06
2877D7m2J19k74K18O6j22j60J92J43j36m5l8L6j61K12p2j59j2J46J10J44r6k86
2900a70J58j26K76l9J6l8q4j13m5L14m8k45M49l34J96P0l9j76j81L74j14k59K20
$$ plain form
2740 177 -126 91 -118 289 -38 95 189 122 -188 53 63 -203 267 -111 -128 47 187 -86 118 -84 -176 -7
2762 -7 62 -198 -98 186 216 276 5 272 -136 -200 241 64 -184 86 73 -79 235 34 -108 -137 253 116 83
2785 83 115 -123 174 -161 234 137 -66 368 283 118 -203 -90 250 -157 -207 146 34 -124 -190 94 -4 -7 -355
2808 -355 169 -22 64 -226 -26 72 -182 -8 16 223 117 -41 -141 -386 275 15 -2 -25 -174 -136 -79 -148 75
2831 75 337 168 -128 -20 -44 134 63 195 2 -31 91 168 169 -15 -196 190 44 -173 14 -17 183 -215 164
2854 164 -163 202 221 15 -146 29 -232 -286 94 -83 -120 -207 -15 67 -59 6 36 -90 -54 -95 -25 153 47
2877 47 5 124 -150 68 134 12 -148 44 187 51 6 -32 4 -157 55 -17 -176 -188 -42 68 212 116 -170
2900 -170 -12 -138 138 99 115 77 -7 -120 -165 149 101 -144 305 -29 167 237 198 22 -159 215 101 -158 62
2923F2m3j43K03l88J92K37l5K1k20L14k51m8N3J39J4J22j08j62Q3r0J16j75K15
2946A08k23K05q6J0j50Q3Q7o7k64L10p3P5K13J4k72r0K62Op3j80K64o9Pm71K34
2971a40l3q6K84M8J00k00q2J54j96L15k24m6K68q6n1p0J41n4J15k96J39Q1k88
2994b07K24N0k63K3M4J61j4j25N5M3N7J65q1o9n2k42L96j85L00q8Q8m25L15lk78
3019a11O3M0j1q3N9J04Q5j97j79L70k42J35l51M80K3K8l7l22R6OJ64l20L9J29
3043c2j38J80K7j05K5Q7n5J95Pq5k28m2J74J28m1l8k01K99l79J35J32j76K14m82
3067c99M83Q1k34K98m00K89k00L78l57k4J56j87j03N8J86j83L9K27l6O2l45O8
3089a43J10J03O0j22k2j06L48l51n1L16k07j54L81j32K90m36J81K6o6p5L7L2k62
$$ plain form
2923 62 19 -124 79 -309 -117 120 85 106 -114 200 -51 -99 -46 93 107 229 121 -41 42 -48 68 -107 108
2946 108 -115 90 4 14 -136 -53 34 -33 -297 13 -60 15 228 242 -30 -120 142 148 75 -105 159 90 97 -374 -140
2971 -140 -173 -259 25 73 173 -27 -109 45 -151 164 -60 -106 162 76 25 -45 96 42 157 -139 0 81 -207
2994 -207 17 67 -196 -173 -129 32 18 -107 -52 -9 48 213 132 63 11 -231 165 -20 280 192 280 -145 170 167 -111
3019 -111 -48 -8 -19 -102 -43 61 146 -51 -230 140 -102 33 -318 162 185 213 176 -146 -50 -44 120 -200 -161 -32
3043 -32 -170 10 37 -68 -43 44 -11 184 191 106 -122 -164 10 138 97 59 -142 157 -222 -87 45 -131 83 -399
3067 -399 84 165 -69 229 -171 118 -82 296 -61 -85 71 -116 -219 -161 25 -158 -119 108 72 134 -211 -143
3089 -143 -33 70 130 8 -14 -120 228 -123 -174 142 -65 -219 162 30 320 -116 65 91 25 -50 -13 19 -243
3112b43k8KlM49j89o5K58N8l94j14M08j93k32L96n7P7J06k91j12M14j10j30P9
3135H6R4J1Kj11l4R5j19p4pK57l56K93k75O2m7L1N0J5R1j5k58J31O4R2k33J40
3161a5Q5m12K40N9q9K40J3k49O3Q1J17K8J15j37n7k5j6j96L84j58j53L48k30k65
3185b29J53K67rm85K50R8J2l0M7j4k15K80k33K61q9J9l7N3J31k91K39k44L47k61
3209B0N2k1j41N3j18J99j22m0M8J23JJ90q4l41L36R0j16k17r2J74j0p7n5Q4M6
3234a8P1k2n8L09l08N8r4K7r4k0j4o3L95k73r8L49k64J30m2qM8r8K33k80K1J24
3260A1p2o8J54m3p6J2J83j11K04j59o9k3O2n0K09k84J40j08J90k0l01K06J99k85
3284i9O7J0RJ36k79J43L59l05j46j51L29o6J2ql2Q7L0J44k25k4J68j29l7j5n9
$$ plain form
3112 -243 -271 -269 -272 177 -12 -77 181 239 -155 -269 139 -54 -286 110 53 130 236 -55 -167 247 137 7 86
3135 86 180 191 193 82 48 143 24 -50 -57 200 -156 137 -138 -76 -123 -92 -42 -27 64 49 -209 -78 -14 78 -155 -15
3161 -15 70 -342 -102 -43 -132 108 121 -128 -65 16 133 161 276 139 82 57 41 -155 229 71 -82 266 36 -229
3185 -229 -76 191 182 -303 -53 45 57 27 74 60 -155 125 -108 153 64 83 46 99 230 -61 178 -66 281 20
3209 20 72 51 -90 -37 -155 44 -78 -118 -70 53 54 244 160 -181 155 245 129 -88 -180 -6 -16 -93 -148 -64 -18
3234 -18 53 31 -27 282 -26 32 -62 -35 -129 -149 -163 -226 169 -104 -202 147 -117 13 -29 -37 11 -87 146 -134 -113 11
3260 11 -61 -129 25 -18 -94 -82 101 -10 194 35 -34 -57 5 -45 164 -120 20 -88 102 82 -219 -13 186 -99
3284 -99 -32 -22 -13 123 -156 -13 346 41 -105 -256 73 7 19 11 -21 66 96 240 15 -9 159 30 -7 -22 -81
3309h1l8J59j13L7K23r9l26K31j24q2J31j3J67k09M5K04Pj32l4j3j40J92j70K14
3333C6qO9J2J40L3j95o9P8k59J32k6P5K33j28j45L6p9j5q1J98N2l32L38k17J75
3358E3m8k09J90P2r4n2J14o6K21j55k6j93J82k08N80k02j17m2O7J04l75L10mK9
3382A31p3M5l3NK3j13K80l18r6J78K04l84K33m1o7o0j7R4N9J15k44j2J29k56R2
3407a26J97p3j90L1j59L85J50l09K67k71K1J24p0j61K75O4q4k8nJ11j11l68L04
3430b6L9j76J16K69l15J37ok42K13J55o6O9k98L70l62J42J01j23J60l08K40l20
3452b31L23j92K0J88O5lj4N1k91L3j9J65r6k32K68N3k29RO9J62J11q4j07o7J8
3477c0nO2n5o8J7P3n4j64L54j60N3p6k4j0J48J8j98j4O8J82j97K48j52K67r8k07
$$ plain form
3309 -81 -119 40 -73 -36 187 88 -238 -7 -131 -213 -82 -95 72 -137 -92 112 119 -13 -47 -60 -200 -8 -178 36
3333 36 28 97 109 249 282 87 18 96 -163 -31 -57 18 251 123 -22 14 -65 -80 -161 37 89 -243 95 -122 53
3358 53 5 -204 -14 58 -36 -88 26 -40 181 26 0 -193 -11 -219 361 159 42 0 67 171 -204 106 102 131
3382 131 58 103 70 75 98 -15 265 -53 -149 29 233 -151 82 41 -26 -86 -103 -9 50 165 -79 -91 38 -218 -126
3407 -126 71 -2 -192 -161 -320 65 215 -94 173 -98 -77 47 -23 -184 91 155 71 43 38 149 38 -330 -26
3430 -26 13 -163 -47 222 -93 44 38 -204 9 164 98 167 -131 239 -123 19 120 -3 157 -151 89 -231
3452 -231 92 -100 -80 108 173 170 156 207 -84 -51 -70 95 -1 -233 35 88 -141 -132 -63 99 210 126 19 -48 -30
3477 -30 -35 27 -28 -96 -79 -6 -60 -224 130 -30 23 -53 -77 -87 61 79 -119 -133 -65 117 -80 168 16 283 185 -22
3503b2K05l50K16n7J81k91N9K58k41K00k81J0k0K9m2oK16k12L07j29K1k10K93
3526A34l37L11j74K84j27k63O1L03k34Q7L72m08J24J3k44KN9L1Q7q5%J13j6l8
3550E5k2o3J42n2J0k62Q9K4m7J11O9k8m3k21L39l2j01K08l16J39o2J41O4l39L52
3575A55j80Kl98M01J58p0P1J22k40K54k35m6j78N2J82pKj63J40o1L14l73k04J67
3599a35L52j80j21J9J56J20m77J23k54J69K14J03j51K72l99l3J33L95j87q6L5
3620F8O9N4j79J49k04K26j70k4q4J86K9k1j95R8j12J74M3m5L67n87oj70K58K7
3644d9K5l9k20O3K24q8L00k00o9j58L78m64J96M2K09l30L82j57q0J74np8l31M35
3668A60n0k68J19n2Q5q0J81l16J18J82k88J45j1K8j36L88kj08j86J95j36q6J95
$$ plain form
3503 -22 183 -167 49 -8 173 -118 -59 199 -42 158 -123 -113 -133 -104 -146 -152 64 -148 159 30 51 -159 134
3526 134 -203 108 -66 218 91 -172 -111 192 -42 45 417 9 133 146 -98 -96 -37 -6 81 -4 -4 109 93 55
3550 55 33 -30 112 60 70 -192 -103 -79 -126 -15 54 26 -17 -238 101 69 -32 176 -140 -1 -63 78 142 -197 155
3575 155 -25 -23 -421 -20 138 68 139 261 21 275 40 -6 -184 -132 50 43 45 -118 22 -39 275 -98 -302 -135
3599 -135 217 37 -84 -65 91 211 -266 -143 -397 -228 -14 89 -62 210 -189 -222 -89 306 119 33 68
3620 68 137 191 12 161 -43 183 13 -11 -95 91 120 99 -96 2 -110 64 107 62 429 -158 -164 -334 -76 -49
3644 -49 -24 -63 -283 -220 4 -84 216 16 -53 -211 167 -297 -101 -59 150 -180 202 45 -35 139 134 56 -275 160
3668 160 110 -158 -39 -91 -6 -86 95 -221 -103 79 -209 -64 -75 -47 -183 205 203 95 -91 104 -32 -118 77
3691G7J29k20K33l65j10J01J23J59j56j8q1K66j3j73j0J69N9j84J90k42j49k9
3713b44J59L79k57N8k03j31M21l80J75P7L08k94l97L75p5nj00K51%k64M4K39k27
3736i1P3j47K29j75O6k24M41J30l63J38l02L00j0r1O2j00K85j16j8M4k59L66n95
3759c57L83j9RQ8j45M27k71q5j59L46J00l49j10J26J71Mk46K24k46j67L26n1j44
3782a45K16K8K1J14Q9j99q1J41l3l76L17P1k20M1q0K51j39M85n17j09O0J25o2
3805bN4M5j50J33k10P5K82P2n19M50k5k49j7N1O6Q9k2k60K33lm12K35j63L86P9
3830B18l39m12O72k96k25M26k3J18p1j21J72k13J12q7K0L65m35J97k74K03k31
3851b24M28k48J34r2P6L5J56k88j70L52q7r8q0N9Q4N8l52j16M70J23k81nQ8r7
$$ plain form
3691 77 206 -14 219 -146 -256 -155 -32 127 -29 -47 -128 138 125 -48 -58 111 170 -14 176 -66 -215 -244
3713 -244 -85 294 37 95 -108 -239 182 -198 -23 54 362 68 -329 46 -29 -34 -134 117 117 -147 -103 136 -91
3736 -91 -18 -165 64 -111 -45 -269 172 302 -61 77 -225 75 65 -26 36 -64 221 105 87 131 -128 238 -357
3759 -357 26 7 16 104 -41 386 115 30 -129 217 317 -32 -142 -16 155 159 -87 137 -109 -276 50 -1 -145
3782 -145 71 99 120 234 323 124 43 184 151 -225 92 163 -57 -16 -96 155 16 501 -16 -125 -65 60 -2
3805 -2 52 97 -53 80 -130 -55 227 299 -220 230 205 -44 -61 -10 56 145 123 -137 96 93 -319 -84 -247 139 218
3830 218 -121 -533 139 -157 -382 44 21 139 68 -53 119 -94 18 -69 -49 316 -119 78 -196 7 -224
3851 -224 204 -44 90 -2 74 109 265 -23 -193 159 72 -26 -106 -47 37 95 -257 -373 97 220 -61 -66 22 -75
3875g5Q5k08K81Q0j43N4l16K15Nl88N03L9r0k17L61k01K36j95k79M64n6k13j19
3898a77nJ87K11k34k12K49J13j99P0j37K92l61r4K83J73K22l55k33L37P6j9m90
3920c03L74j57J76j51J2J00K4k82J02M82k56k1N6j93m5k2n7P5J08l6q0J38J33
3943A77k41j19K72L2k46J46j41J47J62k95J07L37m37j0n7K29p6l20L97q9K09l94
3965b10P1J08J00k86J26K96qj85m8q6P5J49m10K67pL02l95K1L47j61k30K99j43
3988hj61J67o3N9J28l31M3L64L6k17j50P4M82l13l47J02K79O8o6r5l9K03l16R7
4012dj74L90k72n15L16L59K48n56J8J71M08k58n26M40Rp4k08J00M35p5m11m6L87
4035A62J80p17J71M57L4l94l07K37K66r6k85K29R7J16l0m15L60Q1q6k29L7N24
$$ plain form
3875 -75 10 -198 83 163 20 74 -242 -27 -22 -410 93 132 42 -175 186 -15 221 26 -253 211 155 -58 -177
3898 -177 -182 5 216 -18 -230 19 132 -67 3 -134 158 -203 -297 -14 159 381 26 -207 130 206 187 -303
3920 -303 71 -86 90 -61 -49 51 75 -207 -105 377 121 100 156 -37 -82 -104 -161 -86 22 -14 -94 44 177
3943 177 -64 -183 89 121 -125 21 -120 27 189 -106 1 338 -99 -109 -166 63 -13 -333 64 -25 184 -210
3965 -210 -139 -31 69 -217 -91 205 197 12 -36 -122 -47 102 -308 -41 -48 254 -141 -120 227 66 -164 135 -8
3988 -8 -169 -2 -65 -6 122 -209 -166 198 234 17 -133 -59 423 110 -237 -135 144 212 146 51 12 215 -101 -4
4012 -4 -178 212 -60 -575 -259 100 348 -208 -190 -19 389 131 -395 45 54 -20 -228 -128 307 232 -179 -225 162
4035 162 342 -375 -204 253 287 -107 -414 -177 89 -7 -292 -63 34 150 120 -295 65 146 60 -169 -132 392
4057C92l31j68q4L75k35j42K33J51k37j88J88K08m8k67m2M79o3j89l2J13j90k0
4079i7J12l2j96K02M0k76N10j73l48J52L19j93J0j55K27l9j12K91l06J84k79J09
4101e0J20J31k30j01K90J53l18O4k61M92Q7n26J97J86j74j86lK95N7k98k01K09
4123f7K59r8j93P7J30Nl70J47M29%k41l41L10R9j02m07L61L46m26l7O6L96j85
4146A58o20K42N02K2l63m26M05K99k73j61M45q9j23m36K53M65k64k14J6L04L21
4167D63m06k50QK93j95k56J44L16%l64J65K99K38n25K02K4m8j33n1j38M31n42
4189c25K00K52N1j20j38L94l89M07l63j02K46l08Q9m1P3J48k23K88j08O5m04M8
4211b60L60K01l69j00M44l13K47o1r2j71L54k88J24Q5j3j99j84L66ok39K47K50
$$ plain form
4057 392 61 -107 -191 184 -51 -193 40 191 -46 -234 -46 162 114 -153 -195 284 221 32 0 113 -77 -97
4079 -97 15 -17 -213 -11 29 -247 263 90 -258 -106 213 20 30 -125 102 63 -49 242 -64 120 -159 -50
4101 -50 70 201 -29 -130 160 313 -5 59 -202 290 377 -149 48 234 60 -126 -129 166 223 -75 -276 -67
4123 -67 192 94 -99 -22 108 113 -257 -110 319 319 78 -263 47 146 44 -363 -2 344 -82 -119 -53 343 158
4146 158 -462 -220 282 304 -59 -485 -80 219 -54 -215 230 141 18 -418 -165 300 36 -178 -162 142 463
4167 463 57 -193 -185 108 -87 -343 -199 117 117 -247 -82 217 455 -70 132 156 108 -25 -76 -214 217 -325
4189 -325 -125 127 178 58 -80 314 -75 332 -31 -133 113 -195 -106 -147 -74 74 -149 139 31 96 -308 -260
4211 -260 100 301 -68 -168 276 -37 210 149 57 -114 240 -48 76 161 148 -51 -235 131 125 -114 133 383
4233C83m90j29k16O47l5l24p8K77L68l18k64J97M78l77j68n0N13m5m46j38M03
4254A88K6k34q4J29K8j12j49J19L16J32n33r4N57J30o59J50K02J97k79k01M2K59
4276A30q6j45j8L12l39K53l03L97K22n70k69J89N77n13K10j46L73p9n69L42N7
4297B5j92K09k27L45j22j32m28N92N9k5L5k93J08J7J7j20MK27K03k23j28k6J97
4320A22M8j0j24q5k02J35J72k05O9J31o9k32J09J0J84R9m57N25k73O1k37M28k03
4343dR7j14K1K09m6k47k42M97J29k45k78M20r7j17k17K37K13n0l01L4MJ35l09
4366b71o4N08j11n1m02L38O4L3j58j59J05J76k21n7M93L81p16m50N29L63l08m10
4388c88o6O63J55o25K32J24J49m36o1N36p6j09k11j9K00o6k72p7N86j40j91J38
$$ plain form
4233 383 -107 -236 -452 195 160 -164 -242 35 403 85 -179 18 496 119 -49 -99 414 369 -77 -215 188
4254 188 214 -20 -104 25 53 -59 -208 -89 227 359 -174 -268 289 419 -240 -90 112 309 30 -171 -129 130
4276 130 44 -101 -119 193 -146 107 -196 201 423 -147 -416 -227 350 -163 47 -99 274 195 -374 -32 25
4297 25 -167 42 -185 160 38 -94 -522 70 129 104 139 -154 -46 -29 -12 -132 -128 99 302 79 -49 -75 122
4320 122 170 160 36 -49 -251 -116 56 -149 -80 51 -18 -250 -141 -131 53 152 -305 220 -53 8 -229 199 -4
4343 -4 93 -21 0 209 163 -84 -326 171 300 55 -223 197 100 -17 -234 3 216 166 -135 -101 -97 38 -271
4366 -271 -335 173 62 11 -391 -53 11 44 -114 -273 -168 8 -213 -270 223 604 -112 -562 -33 330 22 -388
4388 -388 -454 209 364 -261 -29 95 244 -192 -253 283 207 98 -113 -132 68 2 -270 -347 239 99 -92 46
4410D6J36k16J92l14J08M04l35k59J68P3O2l8j48j4J77j21NR8n3j07j06K50j33
4433a25K84j03J36j51j4J4j42Q1m6k5RK16j30j98J04p1J62L32k86O7k09l02L81
4456a6K4J97m22J45K95j35N0k98N59q1l09k27L5L06o6k38J04K99n8j87m0K55R6
4479B88m15K58r2N5O8l97l1K59P8k16K92K41k22p1l13M07R2j89l42M12J67m12
4501h3j25N26l17O2j85J07J89l33k2l44M76N7J51k41k4P4M2k02J81R5o9k78J56
4524a07J53j26K34j54L7n3K45k09m6O6J2k48M7P9J93k84K73k03J24K42k97Q5q8
4547b5L9j83L50j74j20r7J62j64K98rPj77J27l26M05k51J85j7R9K2k77K36j29
4570a9N4j39K77J0j10j60J93r3K74j53k91J39N5l4k52K37J5J91k51J05Q5Q3j82
$$ plain form
4410 46 182 -34 158 -156 -48 356 21 -238 -70 3 65 27 -121 -135 42 -79 -74 24 -29 -136 -242 8 -125
4433 -125 159 56 192 41 27 41 -101 -20 -66 -91 -82 134 4 -194 -90 -161 1 333 47 114 -95 -397 -16
4456 -16 8 205 -217 -72 223 88 138 -160 399 318 9 -218 -183 123 57 -181 -77 222 164 -23 -63 192 288
4479 288 -127 131 39 94 162 -235 -266 -7 71 -145 147 388 166 95 -218 189 281 92 -250 162 329 -83
4501 -83 -208 318 1 63 -122 -15 174 -159 -181 -525 -49 8 159 -82 -106 -32 10 -192 -11 84 15 -263 -107
4524 -107 46 -80 154 0 37 -16 229 20 -26 40 52 -196 -149 -70 123 -161 112 -91 33 275 -22 63 -25
4547 -25 14 -169 181 7 -113 -210 -48 -212 86 77 84 -93 34 -292 113 -138 47 30 129 151 -126 110 -19
4570 -19 35 -104 173 183 73 -87 106 13 287 134 -157 -18 37 3 -249 -12 3 194 -57 48 133 216 34
4593C4j13J76P7l62J63j13J31k66K77l2O9J58l58j22L25O1q7j04J46o9k82K55
4615c6j4J1J05L2m19M49L7k30K77l13J29L39k75k16o7J26K4j06O7K74J43j49k16
4638b8K23k44K7j16N5K52J9j79j55R0R6k74J10m1K12K62l6k65j65J28j21J15m7
4661h2J26L6m3j89k8rK81j26j33J42j35K01l5K79k91q5r8K89K0j39r8j29L76j24
4685FmQ5j38k54M40p4n4j8m9J72k34J42L43m85%L11j86k26J8L63m33L89k85jL09
4710A37k3p6n3J02j18Q1o4O3NO6k17j0J17K6k51M02k08kJ50j94j07K74Qm27J91
4735a28K12m0l8R3p1r4j27K09J04j29o0Q3P5j84K8m9J7K27m61J63K60j76J11L1
4759E6r6J22j49l0K61j0L4j59J42R0j76O7m34Q6P6J74p6j22K23k57K89j87J15
$$ plain form
4593 34 -79 97 174 -188 -25 -138 -7 -273 4 -28 41 199 -159 -281 44 105 18 -86 60 -9 -291 -36
4615 -36 -50 -39 66 98 -321 128 165 -65 212 -101 28 367 92 -124 -191 -65 -41 -147 -80 194 337 188 -28
4638 -28 195 -49 -22 -138 -83 169 188 9 -146 -56 40 -234 -124 -165 47 309 273 8 -157 -29 -150 -35 -82
4661 -82 44 80 37 -152 -180 -189 92 -34 -167 -25 -160 41 6 285 -6 -91 -189 100 120 -19 -117 -246 130 6
4685 6 2 87 -51 -305 135 61 7 -11 -60 112 -122 20 363 -122 -122 189 3 -223 -205 158 -275 114 -171 -172 137
4710 137 114 38 -15 87 -31 50 -14 49 54 120 -97 -107 10 36 -215 187 -21 -23 127 -67 -174 100 108 -319 -128
4735 -128 84 44 6 99 28 -66 -193 16 120 -9 -69 14 89 -95 -67 -116 -99 128 -333 -170 90 -86 25 56
4759 56 -40 82 -67 -97 164 154 188 29 171 261 85 152 -282 -196 -120 54 -22 -144 79 -178 111 -76 39
4782C9k34J83M90o00j3K55l49J22J82j20q9o5J65q5K8J69k89L85j27m03K09L88
4804B41j82j47j20L55M0k41L99k76j74K65j12Q5k19L32l29N1j2j30J53n9K60l41
4826a61j11L79q3J8L9j58J55M2j10j66K70j7j06J05j5qk08q1M13Pj52o2J71l66
4850b05r8J20J53O1l2J05k10N0pJ97j76J06J00k40k21P7L90j40ko4j19R5M7Q4
4874G1m9o3J07p0O9K1J24j47k45L74j46J16l85N4J37j52K94l1k26K78k36K68k45
4897h2j1j34M32m9J12K6k24j16Q4N3j88J82j47J37j17m3K86l58m4M7J12K0k30
4920b52J47M2R4k0k5K19l75J45R9j76J67n7k0k9k0j50L01J20j12l51L98j56j94
4943b05K77J2l7Jq4rJ74j20J72j83l3J11L64m90j71Q4K17k25L34k45r4K71k8j25
$$ plain form
4782 39 -195 -12 478 -122 -135 120 -229 -107 75 -45 -134 -199 -34 -119 -91 78 -211 174 47 -356 -147 241
4804 241 59 -88 -208 147 187 -54 345 69 -105 160 48 133 -86 246 -83 -32 -44 -174 -21 -80 180 -161
4826 -161 -272 107 24 42 81 -77 78 120 10 -156 114 97 -9 96 81 73 -135 -216 197 204 52 -10 161 -205
4850 -205 -303 -183 -30 31 -1 104 -106 -56 -63 134 -42 64 164 -76 -297 -220 170 30 28 -36 -155 -60 -13 71
4874 71 22 -41 66 -4 65 86 210 63 -182 192 46 162 -223 -169 -32 -184 110 79 -147 131 -105 163 -82
4897 -82 -93 -227 205 156 268 294 70 -46 38 91 -97 85 -62 75 -42 -85 201 -157 -201 -154 -42 -22 -252
4920 -252 -105 -63 31 11 -14 205 -170 -25 74 -102 65 8 -12 -41 -61 -211 90 210 98 -253 145 -11 -205
4943 -205 72 84 47 48 -36 -45 129 9 181 -2 -35 76 440 -50 -221 -137 80 -145 189 -56 -150 121 93 -32
4967c2Q7j39J05p8J46k07J46Nj50K76j84K07k07oJ40j02J76k28l5J56j24K27j85
4990fJ65j49r3L8P7j62J71L63j93k53P4j42L66k52pK66l54K02nJ5k29M6p9J53
5014A2J62j53J52p0j02n9j14J81J70l40L02n1lk12J11j4K28l38K37N0jl08L60
5037B00m00M45J41j83j64j80K41j7j64J96M7r9m4J28n3o8j64J76J34k51q4N6K5
5060h2J31Jl29L63k06Ro0M3J94l00J44J24L1p8R8J14L6Mk16k75L0K13o8j60K07
5085c2k34J5L30m23L83j02M1L99j15j35J18m26J08K54m00L22j01k33K23j97Q1
5106a24L08k26K02k5o8k55J65L5K2k0J12P0j24l32M63m62oK90J04j43r4K92K31
5129D15n08K47L3Q5l44p9K49p3P4K03n03M28Q1j97n7J58k2j58J65k84J4m7R7L04
$$ plain form
4967 -32 55 -84 21 -57 89 -118 28 33 -117 159 -25 182 -25 -31 109 7 183 -45 -80 76 -48 179 -6
4990 -6 159 10 -83 -45 32 -130 41 404 211 -42 32 -110 256 4 -3 263 -91 111 106 121 -108 -62 -141 12
5014 12 174 21 173 103 1 -58 -172 9 179 -161 141 90 87 -125 -14 -28 200 -138 99 149 148 -160 200
5037 200 -200 245 386 203 39 -141 100 83 -81 115 162 63 19 147 94 26 -138 38 172 -79 -163 -107 -82
5060 -82 49 50 -279 84 -122 -113 -173 -130 64 -236 -92 32 63 -15 83 197 233 237 21 -254 -224 -11 -79 -239 -32
5085 -32 -266 -251 79 -344 39 -63 -22 377 262 127 245 -181 -73 181 -219 103 2 -231 -8 -205 -124
5106 -124 184 -42 160 135 67 -188 -23 12 34 14 126 196 72 -260 203 -259 -265 25 129 -14 -108 184 415
5129 415 -93 154 187 272 -72 -151 98 25 99 302 -201 227 308 111 54 212 190 32 197 -87 -73 -120 -23 281
5153B81k05J8l16L47k00j18K26J25j87J87l03L3L4K01k02L1k22M01j35J19j26
5174a1kj15K48k46O1j32L64p4K1j6p6K1j31O4l4j0R6k7K81l00p5Q1L6J85j39m0
5200C0k17K36n1J07j48J13J08j3m6j42j36L73j30j95L15j68J41j0p1k8N1ok29
5223a16J66k47K37j09J4L72n78L30K11l60Q8j0n9K32k48J12lj41J24J1j19L5L07
5246B49m31K91k02P4l6K72j43k46M02j76p8J71n9l45L80Pj16K25j29j61N5j46
5268a42l0J68m9k88L24K92k59n2J96k42K25j87Q7nk91M39M0j91P6j02K46l23J73
5291A05j65K33K7k84p6L4J82l02K56p0k06M85j25j46L07k98J0j14K85m60K53K43
5313A74n12M29j17L67q6l18M15m25P9J72l10K07ll38J74j3l8J68j71K02J59k72
$$ plain form
5153 281 76 94 -222 125 -75 -193 33 158 -29 158 -145 -112 -78 123 -79 -48 -270 131 -4 115 -11
5174 -11 -13 -128 120 -126 -65 -197 167 93 114 98 22 43 -88 -24 -58 -68 28 1 282 -18 -93 -12 24 209 70 30
5200 30 -187 49 -2 105 -43 70 178 165 119 -23 -159 214 84 -111 204 36 177 167 96 68 119 113 -116
5223 -116 50 -197 40 -69 -55 317 -261 69 280 -80 8 -2 -61 171 -77 35 32 -109 15 26 -93 -58 249
5246 249 -182 109 -93 -19 -55 217 74 -172 230 54 -24 147 88 -257 123 130 14 239 110 -51 4 -142
5268 -142 -172 -4 -53 -341 -17 275 16 -36 160 -82 143 -44 43 38 -253 186 226 35 111 9 255 -68 105
5291 105 -60 173 200 -84 -160 -126 56 -246 10 -60 -266 219 94 -52 255 -43 -33 -147 138 -322 -69 174
5313 174 -338 91 -26 341 255 -63 352 -73 6 178 -132 75 72 -266 -92 -105 -143 25 -146 56 215 -57
5335e7K19l78M51j35j56J03p0J16J72k14M9q3n3K40j02l03K42n2J29m9k30L39
5357A78l72K75q8J90j07n2j70M2Q6J9K9P2Q0o3q0l0R0p0M4j66k11K55L1k46L80
5382A16o7j20P0p1N3K61j70k16k1K98N0j97J25J1Q5j54J47k51j6K3J84j48j22
5405a30J35J7r1K15k41Q0j58j9J00O8K91l13K74j40O7o9q7o7o6O5P5j06L5J74
5429A09M0Q7l49J08J71j18k93J81N2K89j42l39M14j11j01J34q3j29J38k69J61
5450e0N4m2l6j02K53k53K28k4J6P7j89L9L40j83m6l2m49O13p8K17l08mk1n7J51
5475A14j02j44P9J42k21K96j07o0K9l1J03j22j21J02J73j12j86J23oJ47j43n5
5497a02Q4k3o9O9L61j60J7r5P8j83L14j85j77K87m43K43L0J39Jj61n9K15k18L48
$$ plain form
5335 -57 162 -216 235 100 -56 47 -23 93 265 51 100 17 -36 204 102 -201 41 -11 118 69 -161 178
5357 178 -194 81 -7 183 76 24 -146 -104 -18 1 30 102 182 119 39 9 99 29 73 -93 -304 -49 -18 -264 116
5382 116 49 -71 -1 -72 -19 242 72 -144 -165 133 183 -14 111 122 207 53 200 -51 -67 -44 140 -8 -130
5405 -130 5 22 -69 146 -95 -15 -173 -192 -92 -24 267 -46 228 88 155 86 -1 -68 -134 -69 6 -100 -65 109
5429 109 149 236 -113 -5 166 48 -245 -64 -12 277 135 -204 210 99 -2 132 49 -80 58 -211 -50
5450 -50 4 -38 -74 -176 77 -176 52 28 44 121 -68 -29 311 128 82 50 -399 214 136 353 45 41 20 -37 114
5475 114 12 -132 -53 89 -132 164 57 -3 26 -5 98 -24 -145 -43 130 18 -168 -45 -51 96 -47 -102
5497 -102 -18 -41 -110 -41 320 160 177 82 160 -23 291 106 -71 216 -227 16 46 185 186 25 -34 181 -37 311
5521C11l01k62K97K5pL2o7K64k86k7K96k47k26O05l56o8o0j76R1K59j31p2J06
5544@J25j21J3p3r1L47l38J65MrJ1K2K2K42j40j01k05J24R6J00o0j94J63j89M4
5569d3m7J81M0o7l9J18r8o7K1Q1l41Q4J57L6r1l0j21l66Q45j77j47o1j2Q8K6J99
5595A69j07J64k33J91l00k4K49j1j32L4j52J41n9M0R4K3%n5o3J20j40j64K42K52
5619B79j12l15J09J97j98q1J75k23n5Q0K61l81K38rj42O5L19K1k57j50J94j38
5641a23J22k10L31k93L93k80l9J7l9J52r4J45qJ38p4p8Nr6N5n0j70J46J18j27
5665e9q2JK07J3L9j61j84L43m8mj09J04j83P7J53j27k2k26l0M94j21J3J72k43
5689A7MJ94m04j13M66j76J26l12N1J79r9M9M0j28k3K66Jk92N8J89p6O2m4k3q3
$$ plain form
5521 311 10 -252 45 70 63 95 28 292 6 -21 275 28 -198 407 51 -17 -77 -253 -162 97 -34 -106 0
5544 0 125 4 17 -56 -147 200 -138 27 31 22 33 55 77 319 179 78 -127 -3 93 193 133 -61 102 -87 -43
5569 -43 -90 91 131 64 25 143 45 -22 -1 80 -261 -177 -20 16 -75 -105 -226 -592 253 76 -71 -132 -144 -56 -30 169
5595 169 62 226 -7 184 -116 -140 109 98 -34 0 -152 -11 -70 -30 64 87 87 32 -31 89 -51 -215 27 279
5619 279 167 -148 -39 158 -40 -121 54 -169 -224 -144 117 -264 -26 -35 -177 -112 207 228 -29 -179 15 -123
5641 -123 -1 -211 120 -173 220 -60 -99 -82 -121 31 -63 82 74 212 138 60 65 -31 24 -26 -196 -50 68 -59
5665 -59 -141 -140 67 80 119 -42 -226 117 69 65 -44 60 -123 -46 107 -20 -42 -268 -298 196 75 88 260 17
5689 17 21 215 -189 -302 164 -12 114 -198 -147 32 -67 -18 22 -106 -129 137 138 -154 -96 93 17 79 35 12 -71
5714g1J22j83M6j06J96L4l19K14qJ62j77K82k77J19j27L8J98N6k78M11m14J06
5736B4k23L46N2k85r3L86l56K6P3j33J64m3L05l57N0K25m2qj08JLj17L17K6j47
5761H6j82O8J9M2l09m3M17O3j03j50K50k73L32k72O7O9l17L60k41j2N3L07k36
5784eQ7Ok0l11N12k99j91L67j21Q0o1M01p29K53o4K45k7l8j25j6q9L4K80m40J28
5809a43L32q2l39K35R8k17Q5J87l34L54l2K1k21L34l44K09n19J65L1K13r9m7K60
5832A47J23k67n7r9M9K01k08K64l44M64m82J81J76m5J3j03k06M08k68j39L16j24
5854@J49k94K15J27l73K15j73J94j17J19J34j27Jk60J49r6Q2N7j56L24j79q4K72
5877A79r3k28K01P9J30j58j3k03K92j67Q8j97R4K49j1k94K21k30J61N6l97K37
$$ plain form
5714 -71 51 -132 -86 -192 4 38 -281 -67 -75 87 -90 192 -85 34 -93 -55 143 199 -79 332 -82 24
5736 24 -199 147 199 -86 -179 207 -149 -123 -50 -183 -19 -62 243 -114 -64 161 119 111 3 4 7 -110 207 233 86
5761 86 -96 -28 -9 33 -276 -319 98 161 58 -92 158 -115 217 -55 12 81 -236 124 -117 -129 -76 231 -5
5784 -5 82 88 68 -243 269 -30 -221 146 25 105 44 445 -284 -31 -95 150 123 85 -40 -56 -145 -111 169 -271 -143
5809 -143 189 107 -232 3 101 -116 -31 156 -178 176 144 165 -56 278 -66 143 -376 -211 -180 33 -66 -113 147
5832 147 270 3 -54 -153 -104 97 -111 153 -191 273 -209 -28 148 103 116 13 -193 215 -53 -192 124 0
5854 0 149 -145 70 197 -176 39 -134 60 -57 62 196 69 70 -190 -41 -137 -55 2 -154 170 -9 -93 179
5877 179 86 -142 59 138 268 110 97 -106 186 19 107 -90 4 253 242 -52 169 -61 100 156 -241 -4
5899dj22J38m1l1J09l2K22n32K23R9J3J44j79L48l76kJ27J49j27l11J59N5l38
5922c09K24K11oj86J40n9K3L4k54L69q1j55j1J84j24K17l89J9q2K79l74M82jQ
5946A59K6k81r5J1L06m01K86N2M0j54K27n0o3k44k7K68M54m83J3n2K03j65J77
5969B07m11J16J44k21L52j81j33J01p6K87o8m1m12J82P1L12m99R8J66N7q6J09
5991G4k33n2L16m31K51K35k90KK24k24J48j22J97m7j40j47L44l8K99k71K1k66
6013a50J65J38l1k11K74j17k40K67M1l3k09j35L87J16l34R1O7j51k0n3j28N35
6035B69k85r6l2LK82j49Q8J64k24m7R8J67l18J03L4PK15o6k51PJ93k69J76O0J08
6060B37p5k90J92j48J06k26J88M7n3J53j33K2no6j00L56j3k33j27M32m16J53o1
$$ plain form
5899 -4 -126 12 -29 -60 49 17 239 -293 -70 29 42 186 7 355 -21 -23 104 253 126 -185 -26 29 -309
5922 -309 -85 126 120 -66 74 15 38 72 -182 187 106 -49 -60 124 0 217 -172 -153 -235 44 -330 152 151 159
5946 159 185 -96 -191 -180 126 -275 11 63 103 -51 176 126 63 -181 -208 60 514 31 44 -8 195 30 207
5969 207 -204 -88 56 -165 187 6 -127 -26 -102 185 117 76 -336 -154 -83 229 -270 -172 -6 51 -35 74
5991 74 -159 -211 105 -326 -75 160 -130 -128 96 -128 20 -102 95 48 -92 -239 105 67 366 95 116 -150
6013 -150 15 153 122 -89 185 68 -172 95 136 103 -106 -241 146 262 -72 19 86 -65 -85 -138 -266 269
6035 269 -16 -112 -144 -141 141 -8 80 244 20 -27 71 238 -80 23 57 64 279 213 -38 -31 162 -107 69 129 237
6060 237 162 -128 64 -84 22 -204 -16 31 -22 131 -2 20 15 -51 -151 205 192 -41 -168 264 -152 1 -60
6083f0l1Q0K21k17K5J56K17l68k57L50l02K78l9j98J49m3j42n5N24k10k5l6L12
6106C29m87K10J3O9k11J96k00j9j1K66k34K3L8L1k3o4K65P5k94j38K13K01j38
6129A10n14R8M25k0l29J39K18K8k25j37L52m9m22K95Q8K11j82j77K0Q3L2n8n3
6152f7J63K4o8j85Q0R4N6l28J43K79r3k16J6j4K09R3k85N1Q6J03j10K71j32k53
6176h3L7J8J94k49J28j6O9k53MK14m4n1K08n52L88p8P3p7J73j53p2O8J65k09K26
6201A28j39j51Q2j2P1K56J59l84j76K42K26l49P9K3J69j55R0j5j37j02r9M7J89
6224D2O8j96O5K7R0j52P5q3J0J8m3K98j23j86K82l41o5L72l86Nj3L92k99J97j19
6249f5J33J69m42n7M05lk06J8j6q6L53k13J16j21K29p09N97Kk49Q5j99M93k44
$$ plain form
6083 -60 -91 -11 210 -7 18 174 391 23 -234 116 -186 92 53 -145 4 -39 -181 -236 288 78 53 17 329
6106 329 -158 52 65 134 -77 119 -81 -100 -111 155 -79 -56 -18 13 -10 -74 191 266 -28 -166 47 248 110
6129 110 -404 -306 119 99 -230 -91 127 155 -70 -207 145 96 -326 -31 57 268 86 -91 -71 12 44 -14 -67
6152 -67 96 120 52 -133 -53 41 97 -231 -88 191 98 -118 -102 -116 93 186 -99 -48 38 141 31 302 170 -83
6176 -83 -46 -28 166 -83 45 29 98 -155 -151 63 19 -32 176 -376 12 -66 7 -70 103 -50 -122 -54 111 -98 128
6201 128 -11 -162 -80 -92 -21 235 394 10 -166 76 302 -47 32 55 224 69 159 144 7 -95 -194 -147 42
6224 42 110 -86 -21 6 96 -56 19 -64 -54 -36 -79 219 96 -90 192 -149 -214 158 -228 -223 -236 156 -143 54 -65
6249 -65 68 237 -205 -262 143 140 -66 -48 -64 -150 203 -10 106 -15 214 -495 102 104 -145 -60 -259 234 -10
6272a0J20k64J28K32l16K45j81j01M36k09j39R0J58k56J19j23N1j66k7K90m7j92
6294a62J68j39pJ02J07J45j36q7m2n8M14k95n3P8M3J31k24J06j77K07m4j10K65
6317B32j83l66L41J38l6j06j0P0k6j56K00r1N5j10Q3J00j0j90J43j91J22n9k43
6340b93L35M8jj00l44N35j93l8j86M02j35K0k43M23l35Q1M5r1R8Q6r4ro9J4k9
6365g3J47k56R6J13m1j23L06Ml19Q5K02k59K95j09j46K13j83qJ91N6j79J45j46
6388A1r6K25o5j86L23l22k70L91l86N39M4n49K43J96P9j12k34K60j08j54M4R5
6410c2K3r5K52r9M2j82J04m7K2j24J31J74k95Q0k8r1L06j72k30M31j80pM1J00
6434A24m0L9q7k46K63J16m61L00k7J67O3j86q8L90n11J41j4J89J8k22j47M75j67
$$ plain form
6272 -10 110 -154 -26 206 -110 135 -46 -147 289 80 -59 31 189 -67 52 -71 -20 -186 -213 77 30 -162
6294 -162 6 -133 -140 -38 69 214 78 -9 -51 -109 305 10 -43 35 78 209 -15 91 -86 121 77 -33 232
6317 232 49 -317 24 162 126 20 10 80 54 -102 98 7 62 -48 35 135 125 -65 78 -113 9 -50 -293
6340 -293 42 90 89 -11 -355 180 -13 -51 -237 165 30 50 -193 230 -105 -24 21 -70 28 114 20 11 -58 -44 -73
6365 -73 74 -182 -86 27 -14 -137 169 173 -146 -61 141 -118 177 68 -78 135 -48 -56 135 191 12 157 11
6388 11 -85 140 75 -111 212 -110 -380 11 -375 164 208 -341 -98 98 177 65 -169 91 -17 -171 -127 -32
6410 -32 -9 -104 148 49 91 -91 13 -34 -12 -136 -5 169 -126 -46 -74 -165 141 -31 -261 170 -10 -17 24 124
6434 124 84 123 36 -210 53 169 -292 8 -19 148 211 25 -63 327 -184 -43 -57 132 150 -72 -219 256 89
6457H9k00j5J35k16N32l04j23M43l77j13N4L03K17m74j49L90N3l76J98M2Nj65
6479e1o4J01J08k2p4%n9J54q0L03k68J06j59J44j32%J53l25M39p4m2l44j98N31
6503A47k57K53j89j27K16j90R9l1L4m7j45L1K82m2k0J4Q1R2l14J54j82K54k2j80
6527h9K55j86k18K74J26k10n1N3J77J25m41K27j15K47l9j13J37j77rn9j2J44j91
6550a45Q9J26m1K12j94k29L6P2J28l7J10j87n0J01O0n9J40k92L79k43k2n8o3m0
6574b07K94k13J26K43l35N5k29J54J27J09l92J06L18K20m48J05n1K68j88M3k02
6595i7P6j18K23j02Q7K05j25J91k51o3j05l6j54L12j27p6K06q8P8J19j33k4N3
6618E1rR0K6r9P9j75MJ5Oj26J72J26j36R1K51r7k57j07Q3J14o3j20P6j20M08l08
$$ plain form
6457 89 -111 -126 9 -207 325 21 -102 341 -36 -149 -95 208 425 -49 -198 192 245 -131 67 109 114 -51
6479 -51 -115 -14 94 72 -2 -2 -61 93 13 316 48 154 -5 139 7 7 160 -165 274 200 158 -186 -384 147
6503 147 -110 143 -46 -173 43 -147 -48 -79 -45 -92 -237 -206 76 34 14 28 109 201 -113 41 -141 113 91 -89
6527 -89 166 -20 -238 36 162 -48 -99 -46 131 256 -185 42 -73 174 135 22 159 -18 -27 -86 -98 46 -145
6550 -145 -56 70 29 241 47 -182 -146 -74 54 17 127 -60 -110 -9 51 -8 132 -160 219 -24 -46 -104 -167 -207
6574 -207 87 -126 0 243 -92 -37 -266 -112 15 124 -268 -162 156 376 -72 33 -18 250 62 105 -97
6595 -97 -21 -139 84 -18 69 274 149 340 89 26 -79 -115 -269 43 -84 -160 46 -42 36 155 22 -2 51
6618 51 42 132 158 59 138 -37 -33 -18 -12 -138 34 160 24 115 366 269 12 -95 -12 102 39 -81 -5 -125 283 -25
6644b5Q2K3o2k6k5J45J04j83M5r8l7J29l9o5K62j79j46P9K0q3m5K39J56j15k14
6669e8J12M8j62K5k41K62J76J06l75J96k13p5q7L34P4j73K9KR6j16o1J46J01R6
6693B42m56K25j23J67r5J13k00K53j47n8L8L6o2n2K25O7j55J2k76R0j4M2J96j08
6717d0n2J98r3l05J81n6K2m0M58l02r4j3L12J41l52mkJ35l26N56k67j49P2q6J97
6742I1l41K29J5J5j33J00N9k6k37K77k73M7K72J51k33l2J25l31L46k46K52j22
6764EO0J09q7l6n2J35j81j14ML7j7J38L81k06M7k25O7J80k22k03K21k25K62k51
6788a73Q0K5L16l07J13J04J56l82J06l7j02k5o2J68J83l6q9J18j93O7j72M6J98
6811A02q2n5L49k11k28O5K69rj54R4p6K12l93K06j85p1L03m25K4L98J22k86M0
$$ plain form
6644 -25 57 80 18 -8 -33 112 216 33 78 -20 -57 72 33 -32 230 51 -95 -16 4 -79 -124 115 271 156 -58
6669 -58 54 102 -60 -35 -276 -14 162 268 -107 89 -124 -199 -286 48 122 -51 -22 -20 76 -40 -101 45 146 242
6693 242 -214 11 -112 55 -40 73 -127 126 -21 -79 -41 -5 -67 -119 106 173 18 30 -246 -156 -170 -128 68 -40
6717 -40 -92 106 13 -292 -111 -167 -145 -185 273 -29 -123 -136 176 317 -35 -39 -41 94 -232 324 57 -92 -20 -106 91
6742 91 -250 -21 -6 9 -124 -24 35 9 -228 49 -224 -177 95 246 13 -19 106 -225 121 -125 127 5
6764 5 65 174 87 51 -1 134 -47 -161 -157 -120 -137 1 382 176 223 -2 65 245 23 -180 41 -184 78 -173
6788 -173 -93 -68 248 -59 54 158 314 -68 38 1 -101 -126 -188 -20 163 127 38 156 -37 30 -142 -96 102
6811 102 20 -35 314 103 -125 -60 209 200 46 140 64 276 -117 89 -96 -167 136 -289 -265 133 255 -31 9
6834Ij57R1j60K69K12j21k58L29k0j51J61j26k06L34j32l11K21M7l3nk16J82O7
6857B6L32k40k38K05Lj13pj09L55j22j53J43j32j91J9J64q6M93n06L40j91J64
6879A56j42J8K62l65J67p0j69K30L3Ql03J72J35l91L00k45K2J16Q8j42K0J28j3
6902A5J29O8j95l3j46K20J24r6q4j18L53p6M8j06j97J46l75L50K9k52m1K05J24
6925I2j31Q6Mj21J07M0J3k83p2L10l5J55l00K7J69p7J89j45j31J02L35m95J45
6948a6r2K5n2N0L07n35L35J05k48K24k34K61m4j44oJ5j79J16K42k80L84k99J61
6971I6R5K7J8Kn09L92j20R2l3Mk28J70k21K15j98K04n1m9LK76k97J4k2KL90l23
6997e1k1j35K30J19j93P4R5k08K58k1k42Rp0J40j75J26J21j98N6M9J4L4P3K9j08
$$ plain form
6834 9 -148 -57 -217 52 264 143 -115 214 194 43 204 78 -128 206 74 -237 -16 31 -2 -7 -223 -41 26
6857 26 358 118 -120 85 88 -25 -32 -141 214 92 -61 82 -50 -241 -222 -58 -144 349 -157 183 -8 156
6879 156 14 32 294 -71 96 26 -143 87 120 128 -175 -3 132 -259 41 -204 -182 -66 22 -120 -100 28 15
6902 15 144 212 17 -16 -162 58 182 86 2 -116 237 161 209 103 -94 52 -323 27 56 -196 -237 -32 92
6925 92 -39 47 51 -70 37 77 90 -193 -265 45 10 165 -135 -108 61 -16 173 28 -103 -1 334 -161 -16
6948 -16 -108 -83 -135 -85 222 -313 22 127 -121 103 -131 130 86 -58 -64 -49 -228 -112 130 -150 234 -65 96
6971 96 191 218 236 238 -271 121 1 93 60 64 -164 6 -215 0 -198 6 -45 -94 -91 185 -112 -98 -120 -118 272 -51
6997 -51 -72 -207 23 142 -51 23 118 -90 168 147 -95 -86 -156 -16 -191 -65 56 -142 -86 -37 -23 11 84 113 5
7022EK4R7j90R6q4rL68k53m1k52J22J43P0M9j51J05P1P9l01k8K97j98q7P7l4L09
7048B84l50O5k06K04k2N1N1L1jq3L7J01m6%o9Q5j80J86k06L21k67J72k21m5N1
7073e7J41P8r7r6n6K20k85J92k1r6P9r9o1K26J45k73P4j44K57k35N01n56j27L15
7097B5P1j02O0J1k60J73j65J75jJ9M3R0k56J28L03n4l64j41J94L7N1J01n04L16
7121e0j80N24j42j57j66K7J7J66n9p4q4q7K67k02J3L00j28j9oJ37j86Q3K61j90
7145F5J8k82K60j60m9L23l70M02m5j12p5K15k30P9K4k0N5Q3j67J32j03Q0l11M45
7169B57m69Q6L1O1N6j35R4N1J75k80r3J24L2j00K75k69N6p8O1J25l89K97K67k39
7193dm4N2k51M85l00k9q6L40J18k70J64J54m57J71J23k32J78O0m21L00J62k88
$$ plain form
7022 5 29 126 -64 32 -52 -61 307 54 13 -239 -117 26 96 145 -6 99 170 249 -52 -80 217 19 -68 9 -25 284
7048 284 -66 -1 -207 -3 -25 26 77 108 107 24 61 162 116 116 47 132 -48 138 -68 253 -14 158 -63 -108 -57
7073 -57 84 162 65 -31 -87 133 -152 40 19 -77 2 -97 -158 68 213 -60 14 -130 127 -108 393 -163 -290 25
7097 25 96 -6 54 65 -195 -22 -187 -12 -13 6 49 139 -117 11 314 260 -104 -245 -51 -14 37 138 -366 -50
7121 -50 -230 294 152 -5 -171 -144 -127 39 -20 -94 -178 -265 2 -200 -187 113 -15 -34 -40 97 -89 -6 255 65
7145 65 83 -199 61 -99 -148 175 -195 207 162 50 -25 190 -40 39 63 43 98 181 14 146 43 123 -188 257
7169 257 -212 -126 -95 -34 22 -113 -19 32 207 -73 -166 -42 -10 -110 165 -104 -48 -126 -65 60 -329 -32 235 -4
7193 -4 -48 4 -247 238 -62 -91 -177 163 281 11 175 329 -128 43 166 -66 112 172 -249 51 213 -75
7215g5J20J04k35J24r4K05k33Q5q6Q4M0O2l8O3Qj21J24j24j85J57K64j29j81J41
7239H0r6l5K06j16q3J26J14k50j09J48m9RJ60K4j71M3P5p6N4r3j48J42P3m34K96
7264a10j00K58j15J77l59L95l21K81K8l08K97o0r3lo8j76K42J09K3J30l58K68
7286A37J78j71k34L8r7P0O8Qk09J28J21j19K4L4j00j20M01j87k90J07J99N1L71
7309D08l73n9q6K34J90l90L0P2P7P2o1k52K82L5l02R8j15q9j62O40j53r1n3p1
7333a19R8j90J52N3mJ71k74J6j61M07k30K46j5k45J67j28L17m93J85K85r3k50
7355a05J98kl48L86l7oJ36m4L4k06k11P9J20K13k81K39j60K52m47J29L47k85k42
7378b41J87j09K84n5j51P6k0O8q9q8j51L39j17J6K29k27p7L29k25k69M09j38N4
$$ plain form
7215 -75 45 149 -86 38 -56 149 -84 1 -85 -1 39 101 63 126 134 13 137 13 -172 -15 249 120 -61 80
7239 80 -16 -51 155 39 -44 82 196 -54 -163 -15 -64 -55 105 129 -42 1 76 0 54 -39 -187 -45 28 -406 -110
7264 -110 -210 48 -67 110 -249 146 -175 106 134 -174 123 63 -30 -33 -101 -277 -35 74 97 227 -131 137
7286 137 315 144 -90 -52 -149 -79 -11 -3 -212 -84 37 -82 -58 -24 -124 -244 157 -30 -320 -213 -14 37 408
7309 408 35 -24 -110 124 314 -76 -46 26 103 175 114 -138 144 179 -123 -25 -140 -229 -391 249 96 5 -48 -119
7333 -119 -21 -211 -59 -6 -10 161 -113 -97 -258 149 -81 165 150 -95 72 -56 261 -232 -47 238 145 -105
7355 -105 93 91 -257 129 92 86 222 178 212 6 -205 -126 -6 207 -74 165 5 257 -190 -61 286 1 -241
7378 -241 -54 -163 121 66 -85 -9 -29 39 -50 -138 -289 50 -67 -51 178 -49 -126 203 -22 -291 118 -20 34
7401C4K05J62m96J20j44P1J56p3o2L22m58pR5J85k26Q8j52J85n7P5K65J3k85k87
7425b71J73P7j63R0J28q3K96k42n9m9J14n8L37k75O4K6k59L47m4j78N7k69K55
7448A4r8K11P2k86qK61j28j52J92k04J53K47k49J10K59m35o0K49J62m06k59L22
7470c3K9M6N9J00k97J84j00nQ6p5J77Q5l72j66K47L35k38m6J36j90J63k8K02l60
7494f1k57K82j06j0K55q2J74k82J19n6p3L18L4j30j01J79j06j83L6K3j11K59j25
7517dk28Q9K08r8J14O6j8k43O7J88q7l70K93O5r9Q4o4J43l70J48L8K01k33K33
7541A23j08O0n7J2R5j65%J71o8l19L80Jm1j14J19J07j40P5j31k85N67l45R4M0
7565G1O2j42j30J99j17J80k24O9R9j56j54J63J57k38K28j27j12J55K38j95p7J79
$$ plain form
7401 34 239 401 -95 25 -119 -48 108 35 -27 295 -163 -170 -75 110 -116 -28 -180 5 -52 23 288 301 16 -271
7425 -271 -98 -21 -184 -94 34 -49 247 5 -54 -103 11 -47 290 15 79 105 -154 193 149 -29 28 -241 14
7448 14 -84 127 199 -87 -95 166 38 -114 78 -126 27 274 25 135 394 -41 -101 148 310 -96 -355 -33
7470 -33 -4 42 101 201 -96 88 -12 -17 69 -6 171 256 -116 -282 -35 300 62 16 152 -38 125 97 299 -61
7494 -61 -318 -36 -142 -152 103 21 195 -87 32 -24 -97 221 255 125 24 203 97 -86 -50 -27 -138 121 -4
7517 -4 -232 -143 65 -33 81 147 129 -114 -47 141 54 -316 -23 42 -57 27 -37 106 -264 -116 -78 123 -110 123
7541 123 15 75 18 30 125 -40 -40 131 63 -256 124 125 84 -30 89 196 56 131 0 -285 282 -63 31 71
7565 71 133 -9 -139 60 -57 123 -101 -32 67 -89 -243 -80 77 -161 67 -60 -172 -17 221 26 -51 128
7587A28J68m47J92OJ12n6l25J93j60J54Q6O8m09J86L24k59K3j70K56j31j26J79
7609hJ71k58K20j38pj55L96k86K00j37j21K43J34l72m6L77l99L37j99n6l8J10
7631c2K08Pl09O1J39l15J22O9J11p1K44j77n8j59K51J31p4j39k25K48k60J63M4
7654b1j41J58J63j30K91l43N2k22J22J88j71j93P4R0J34j90M7K47l6l32n7M43
7676A73l75K16r5K82j92q9j3l5L12j59k10J34J69j02j22l9L18j34j51K03j70J90
7698A11r6j65J3K40P0k73J24K47m5k03J55j03J11j50j52L0P7m1J52k1j50K18j51
7721bj6J18j53J93k79J0J1j28n4L30o5J06n8m2J67n5k40L32j46m6p5O3J89k97
7745a37J80J74k21j81K21j6j59K46L2j6j50n8p4K76j66M3L11k57n9K06k07N1J74
$$ plain form
7587 128 296 -151 41 47 159 103 -222 -29 -189 -35 51 119 -290 -104 220 -39 -16 -186 70 -61 -187 -8
7609 -8 163 -95 125 -13 -20 -175 221 -65 135 -2 -123 120 254 -118 -164 213 -186 151 -48 -104 -142 -32
7631 -32 176 183 -126 -65 74 -241 -119 -50 61 -10 234 57 -1 -160 91 222 148 9 -216 32 -228 -65 -21
7654 -21 -162 -4 159 29 320 -23 29 -193 -71 117 -54 -247 -173 -83 51 -139 -92 155 119 -213 -270 173
7676 173 -202 14 -81 201 9 -80 -93 -128 184 25 -185 -51 118 16 -106 -145 173 39 -112 91 -79 111
7698 111 15 -150 -137 103 173 -100 24 271 226 23 178 75 186 36 -116 -86 -9 -50 102 81 -69 149 -2
7721 -2 -18 100 -53 140 -139 -129 -118 -246 -300 30 -35 71 13 -29 138 83 -157 175 29 -17 -92 -29 160 -137
7745 -137 43 217 -4 -185 36 20 -139 107 139 123 -27 -85 -159 117 -49 -6 305 48 -11 195 -12 39 213
7768B13r0k87L80j41o2o3J74o8n9m7j68K60k10K69k41K91k74K1Q3M0j80J04p8
7791a33L11Q8l02j28J66l0m3j05J88J77m38L09K58m36m0J89l2p8N3K11J61l16
7813C0r8O7jj65RJ43J52j42m6J0j53K76k9K6l6J77k40J89m2r5J72j59r4R2j31
7838h8O6N1k5J8j26K11J36l72q4j4L35j83O3j73L63k24K19j84q6K90m36J52L61
7861B70m57J40K84j09j78Q3k91L71p0n4K67j77q4M24k52j44J44o8J32k98k1K18
7883A30K85m29r5r1KK69n6j02J20n9k91M39j24NO5k76l8J47mJ42q2J60M7k44M2
7908c8J70p6j0R0M6j23k8k26L8mrL21j60K62l83J46J2J21J63l83J67J09l7j22
7932D6O0k60o2M42n00M21j94j2Q5J11n4r7n0j46M01j46R0k56K39j9k4pj41L1J41
$$ plain form
7768 213 123 -164 216 75 13 -50 124 56 -3 -50 -218 42 -168 101 -140 151 -123 -102 -19 21 -159 -55 -133
7791 -133 178 266 -36 -164 2 -28 -71 -176 12 189 -249 60 318 -118 -158 31 -1 -79 -26 185 346 30
7813 30 -68 -1 -2 -167 -158 -15 137 -5 -51 -41 -194 82 53 79 43 220 -20 169 127 32 204 45 -49 43 -88
7838 -88 -22 29 4 22 -104 107 243 -129 -213 -227 108 -75 -12 -185 178 -46 173 -11 -97 193 -243 -91 270
7861 270 -187 -47 237 128 -50 33 -258 113 43 -11 256 79 -5 419 167 23 167 99 231 -67 -88 130
7883 130 415 -14 -109 -200 -198 71 15 -87 33 -26 -317 122 -2 3 68 -208 -246 -99 -103 39 -43 117 164 -80 -38
7908 -38 132 56 46 136 182 59 31 -195 -157 -161 -170 151 -9 253 -130 16 28 149 312 -71 96 205 168 46
7932 46 106 -154 -216 226 -274 147 -47 -59 26 137 83 -14 -64 -210 191 45 135 -121 118 99 75 68 -73 -42 99
7957I9p1K53l34K06n3j63J18k77K93m8k16J71j06K53j36K21k01Rn0J08M5l32J26
7980h5l0qj02L80l19M02o2k15p6K27j85P5O2N6j41J08k52m1J58j7P0Q9k65J45
8004b6J60k15K51j48l0Q7k34K29J78m25n3M71j03j42K64m37J1J15J04N0J01k97
8026h9o3L66kl38J10j02J99j62J66j07r5J68J22Mk01k8J02P6j30M2j94O9l2j41
8050b60N37n75L21K17o5m6j50q1R4j36J69r4L2o1R3J61K4k51nN0M37l36J09j23
8074F1n3P9o8m2K4J33j56l45L25K52o6P8l53O0O7j17J11J95q6J75k91M7o8Lj03
8099a38NL68k46k42OL32j19J22q3r5j52K75l73K68o4j8j69L76l10N02l65k7k1
8122a68K87l29m2J77J12Kj64K50j81J3K9j1J98j51l93L88k77J62J35P2l77M10
$$ plain form
7957 99 28 281 -53 153 100 -63 55 -222 71 23 -193 -22 -128 125 -11 210 9 18 -32 76 121 -211 -85
7980 -85 -115 -123 -225 155 -164 238 176 -39 -115 112 -73 2 64 120 -21 87 -165 -206 -48 -65 5 94 -171 -26
8004 -26 134 -81 170 22 -8 79 -155 74 252 -173 -226 245 142 0 264 -173 -162 -47 57 107 208 -89
8026 -89 -152 214 212 -126 -16 -118 81 -81 85 -22 -117 51 173 177 -24 -52 50 126 -4 38 -156 -87 -119 -260
8050 -260 277 -298 23 240 175 129 -21 -102 -8 -144 25 -69 -37 -98 -5 156 180 -71 -76 -26 411 75 184 61
8074 61 8 87 19 -23 1 134 -22 -367 -42 210 144 222 -131 -71 -4 -121 -10 185 99 274 -17 30 -38 -35 -138
8099 -138 -133 235 -11 -253 -247 85 -34 88 5 -90 -242 33 -340 -72 -136 -154 -323 53 -257 245 -120 -147 -168
8122 -168 119 -210 -252 -75 37 39 -125 125 -56 -43 -14 -25 173 22 -371 17 -260 -98 37 109 -268 142
8144A42p2k4m9NJ42pk36J45K06m69K08K72k74J31k29L68k48k81K61rJ44k19P8
8167a5K41k24o7R4k3q6r5r1L69j10J93k42K59k22L01k16k76J88K74k37J02k14
8189i7R3K86
$$ plain form
8144 142 70 46 -3 2 144 137 -99 46 252 -217 -9 263 -11 120 -109 259 11 -270 -9 -18 126 -93 -15
8167 -15 226 2 -65 29 6 -80 -175 -266 103 -7 186 -56 203 -19 282 66 -210 -22 252 15 117 -97
8189 -97 -4 282
8191B82
$$ Imaginary data points
##PAGE= N=2
##DATA TABLE= (X++(I..I)), XYDATA
0@%%%%%%%%%%%%%%JrJ6j6J6j6K1k9L2l7M5n2O0p0Q1r2J05j20J36j55J75j95K20
37A17k47K75l08L42l79M21m66N15n69O28o91P62q41R26j020J125j243J374j520
56g99J687j880K106k370K689l082L575m222N107o397Q458j2258K1494q3696r8858
71a68446K02959N4977j02433n6064L6656O5672L0812q4288l7691R1331K9641r0968
83b7842m110P5099o817o3575K56M7083K4935m0476n8761K6794Q5218j8998r9905
96f1099j010R2263J5601p2674l4259M3634M6504j7229m9772K014N0444Q166l9964
109a7381k311L4395L10k3134N083J9810j306j7176m543J5896J4199j5529k1045
122a2732J1695K0498p055j7295m06O197K688J092n586j1095k168J1456Q077j2035
$$ plain form
0 0 0 0 0 0 0 0 0 0 0 0 0 0 0 0 1 -8 8 -8 8 -8 13 -16 16 -21 24 -28 32 -38 43 -49 56 -64 72 -83 92 -103 117
37 117 -130 145 -163 179 -200 221 -245 270 -299 329 -362 400 -441 485 -535 590 -653 721 -799
56 -799 888 -992 1114 -1256 1433 -1649 1926 -2296 2811 -3586 4872 -7386 14108 -69588 -168446
71 -168446 34513 89490 -12943 -69007 -32351 33321 64133 -20155 -57846 33485 63126 -27842
83 -27842 -31952 43147 36330 -27245 -26989 20094 45029 4553 -54208 -27414 57804 38806 -61099
96 -61099 -62109 30154 45755 -26919 -61178 -17544 28960 11731 -38041 -36027 14417 22583 -17381
109 -17381 -19692 14703 15013 -8121 -3038 16772 15466 -1710 -6253 9643 23842 8313 -12732
122 -12732 -1037 19461 12406 -4889 -5295 902 3590 4682 -904 -11999 -14167 -2711 5366 -6669
136f669j8357M863K5002M324k7900j1381K8792K2126k2409k4936J9615L1598j0912
149A3756l1372O818L5357L37l6906n512L9249J3249l9608k2513L7512L2211l3331
162I247m3140K3478M9457j4703n6275j036N4425J2165n3888k7182M5802L6632
174C4982l8253m5412K9239N1697j7974n3229R458N5763M181n2299j4263N1796
186A5686K7487m5642l5934L9594M4995k8877m9637J7955N2535n088n2089p362
198b6377M7884J7831m3595k8333L4451L2068k8473l8348J7714L7221j0573l7911
210b6441P11L5752P241l2770j3032K9813J9783k3531k1670J8628K5160r991k4347
223a4694M850K4458K309k0158o188J8153R657j3507j0244R623R994o351r374J927
$$ plain form
136 -6669 -25026 -20163 4839 9163 -18737 -30118 -1326 20800 -1609 -26545 -6930 24668 13756
149 13756 -17616 -10798 24559 24896 -12010 -17522 21727 34976 -4632 -27145 10367 42578 9247
162 9247 -33893 -10415 39042 24339 -31936 -32972 21453 33618 -20270 -47452 -1650 34982
174 34982 -3271 -48683 -19444 32253 14279 -38950 -29492 26271 30452 -21847 -36110 15686
186 15686 43173 -2469 -38403 1191 46186 17309 -32328 -14373 38162 33074 -19015 -26377
198 -26377 21507 39338 -4257 -32590 1861 33929 5456 -32892 -15178 22043 11470 -26441
210 -26441 -25730 10022 17263 -15507 -28539 1274 21057 -2474 -24144 -5516 19644 9653 -14694
223 -14694 -9844 14614 16923 -3235 -9423 8730 18387 4880 -5364 4259 14253 7902 -1472 455
237D55O215j329o266j385K146o02k212m83q78j975J084L957k372n663K488Q374
253A554m5r643q20J2130N302j1561p702J2033J3067r269j5426Q170J9367l743
267A3414k0374k95K1818M909k1213j1034J9293J4598j8152k1201J3061K2430j0224
280G030k6226L029K6980J458k7471q665K6688J4487k3545j9677K0446K4878j4266
293E146k7069R261K9824j542k9159l543K9230J1047k5612j5731K3011K1158j8110
306G911k4060J2188K5984p116k7113k99K5529M582k5613j0681K0896J3627j8258
319b423j8065J3202J9238q606k0624L981K0148J381j8839m236J7105Q284j3353
332b807j0100J1937J2606p230j2085N050J2791o14j1713p84J0659K998q844m544
$$ plain form
237 455 6670 5341 -925 -2310 -164 -766 -2978 -3461 -4339 -6314 -5230 -1273 -3645 -9308 -6820 1554
253 1554 1509 -8134 -8954 3176 8478 -3083 -10785 1248 14315 5046 -10380 -2210 17157 13414
267 13414 -6960 -7255 14563 19472 -1741 -12775 6518 21116 2964 -18237 -5176 17254 7030
280 7030 -19196 -16167 10813 12271 -15200 -23865 2823 17310 -6235 -25912 -5466 19412 5146
293 5146 -21923 -12662 17162 15620 -13539 -17082 12148 23195 -2417 -18148 4863 26021 7911
306 7911 -16149 -3961 22023 14907 -12206 -12505 13024 17606 -8007 -18688 2208 15835 -2423
319 -2423 -20488 -7286 11952 3346 -17278 -13297 6851 8232 -10607 -14843 2262 10546 -2807
332 -2807 -12907 -970 11636 4406 -7679 -2629 10162 9548 -2165 -2949 7710 10708 1864 -2680
346b680N956M624n100n532J703M350j777m511m66J911N07j988q02M5K86N82O45
363b247r34j280J221L296n92l408Q16N475J613n245j684O223M773n279n372M825
379B201P772l788q900J609R308Q3j1054k856R632M005r848p457P662Q870o943
394B96j1586M132J2306k090j2847j215J3195L890j1807o169J1344R285q396j0491
408a0153P365J2901l495j2852J420J3975K145j3199m720J2197O919j0553r349
421g399P877J0482o345j2198K627J1952j039j2550k144J0313M079r974o383P858
435b844P729o359q432M331R171j348q744L09Q978K333o694l413O881M888m359
450B427n119L880N480j819n453N92N157j68m401j919L727J341l467k584J436K240
$$ plain form
346 -2680 3276 7900 2800 -2732 -1029 3321 1544 -2967 -3433 -1522 -1015 -3003 -3805 -3760 -3474 -2892 -2247
363 -2247 -3181 -4461 -3240 56 -536 -3944 -3128 2347 3960 -1285 -2969 3254 8027 2748 -2624 2201
379 2201 9973 6185 -2715 -1106 8202 8285 -2769 -5625 4007 8012 -1836 -9293 -1631 7239 296
394 296 -11290 -7158 5148 3058 -9789 -11004 2191 6081 -5726 -11895 -551 8734 338 -10153
408 -10153 -2788 10113 6618 -6234 -4814 9161 11306 -1893 -6613 5584 12503 1950 -7399
421 -7399 478 10960 4615 -7583 -4956 6996 5957 -6593 -8737 1576 5655 -4319 -10702 -2844
435 -2844 4885 -1474 -9906 -5575 3596 2248 -6496 -6187 2791 5124 -1570 -4983 1898 6786 2427
450 2427 -2692 1188 6668 4849 -604 -12 5145 4977 576 -1343 2384 3725 258 -2326 -890 1350
466A350j914k273K37J363n41j102j91O93J41O4L69l62J85O98J094j73q34J223
484B7K055r0j654J09K813O97k102j517K209K363k491l093J298L095j529m259j44
501b213L939M77m517k334L625K937l964l943L182M355k259m544J485N060L00m823
517c237j063N509K858m584k952M272M737k917m088J656N211n65n214o28N379J157
533E531n253k673L798K820m046m116K152L904j819m870L48M502K57m295j507L633
549a634K816l318k375K415L537j267k926Q12L920M08l319p8L061J551k087j478
565C8J718K107j360k105M50J784l96k184k55J317nj854j025N99Q69j029j199L15
583b215R46l48n47p1O88L39p8j52N70K25N36M2J92L08O37J80J04j01N27J67J7
$$ plain form
466 1350 -564 -2837 -2600 -1237 -1778 -2880 -3071 -2378 -2237 -2173 -1804 -2166 -1981 -1283 -189 -362 -1196 27
484 27 2082 1992 338 447 3260 3957 1855 338 2547 4910 2419 -674 624 3719 2190 -2069 -2213
501 -2213 1726 2203 -2314 -4648 -1023 1914 -2050 -5993 -2811 1544 -715 -5259 -3774 1286 1586 -3237
517 -3237 -4300 1209 4067 -517 -3469 803 5540 2623 -1465 191 5402 4837 -377 -1005 4374 5531
533 5531 278 -2395 1403 4223 177 -3939 -1787 2117 298 -4572 -4224 278 535 -3760 -5267 -1634
549 -1634 1182 -2136 -4511 -2096 1441 174 -2752 -1940 1980 2388 -931 -1009 2052 3603 1516 38
565 38 1756 3863 2503 398 848 2632 2236 52 -203 1114 1109 -745 -1770 -1171 -302 -1331 -2530 -2215
583 -2215 -1269 -1617 -2164 -2235 -1547 -1208 -1286 -1438 -868 -643 -107 -65 127 435 1072 1252 1356 1255 1782 1949 1966
604A966n48l58N21J30q56q51K44N68q58j537P52O09n54j352m39J580L03j245q97
623b822Q97J203m81p47L64J847J3j226K79J454R54j047n34J475P90m84j058K54
641A131J451l25j093o72J090L61j550p87M31O70r86j253L26R01j63j469j14O70
659a381O97j071l27O40R16k02p93P88J370j47n95J07R03P71l03n73M54P48m38
678A564m19K69O7J8p38k75M47P7o93o81J06K77l93n60k89L56j0m40j73L98J42
699i50k4k30J22Q76L47l68J98L71J80K68p1N43K2k55M41l2l3jl26p8j19J34l51
722F64j81k58j52k77k93j41Qr9q6j17k22l82L66P0j27J7l5P61J59j09M00M64P5
745E05J60k94N98K39n3l05L19M27k41o54o1N09r8m55m63M80L2n11p49M9N00o00
$$ plain form
604 1966 1418 1060 1581 1711 855 4 248 816 -42 -1579 -827 -218 -772 -2124 -2563 -983 -680 -1925 -2822
623 -2822 -1925 -722 -1203 -1950 -1586 261 274 -952 -673 781 1735 688 154 1629 2419 1935 877 1131
641 1131 2582 2257 1164 492 1582 1943 393 -394 37 707 -279 -1532 -1206 -305 -468 -1937 -2051 -1381
659 -1381 -684 -1755 -2082 -1442 -526 -728 -1521 -733 637 490 -105 2 905 1676 1373 800 1254 2002 1564
678 1564 1145 1414 1481 1499 761 486 933 1010 317 -364 -258 19 -374 -934 -1223 -867 -877 -1317 -1490 -1092 -950
699 -950 -974 -1204 -1082 -206 141 -227 -29 342 522 790 719 1262 1284 1029 1470 1438 1405 1404 1078 1000 881 1015 664
722 664 483 225 73 -204 -497 -638 -630 -729 -815 -932 -1154 -1536 -1170 -1100 -1227 -1210 -1245 -484 -325 -434 -34 430 505
745 505 665 371 969 1208 1155 850 1169 1596 1355 701 640 1149 1051 596 133 613 645 134 -615 -566 -66 -666
767f66q02J10N97k13k84m45P50K52m46j32M57J092l59o0K74M76N07p17L06M22
787A119L83k85m85K45M83n73l73J04K65k12n50k32J73j70m98l96Kk2p1j97p4K69
809a095Q1l98L30O01J4j51J7L07N55k7nJ84L76j28M6q1K41K32k28K54l95J6k22
832E24J50j56j63j75l5m89M3k50q1l62L2j16j17L47q0j57M05j03L01k48K13O23
854A06l40K93R8L12q9K69P7J05j01Q8j44r5M98k33j33j87Q5l29P4m99o4j28k10
877e47j53j74m0J55j59m2J62j23L32O6n04M33J32M70J81j99J65Q2J12k8O4N13
899H98j09n7j10L22j46k26nJ91k02l06j55pj87j73l53J05r3l9k26l8Q8J83j54
922g99j30J54L30L4m5K41K46o9Q1M7R2N88k19K07j00M9j1k47L28J10j51m40K57
$$ plain form
767 -666 -1468 -1358 -761 -974 -1258 -1703 -953 -701 -1147 -1279 -822 270 -89 -149 125 601 1108 391 697 1119
787 1119 1502 1217 732 977 1460 887 514 618 883 671 121 -111 62 -108 -606 -1002 -1000 -1022 -1093 -1290 -1364 -1095
809 -1095 -1014 -1412 -1082 -481 -467 -618 -601 -294 261 234 229 413 789 661 707 626 867 1099 871 1125 730 746 524
832 524 674 518 355 180 145 -344 -301 -551 -632 -994 -962 -1078 -1195 -848 -928 -1085 -680 -783 -482 -730 -517 106
854 106 -234 59 157 469 380 649 726 831 730 818 674 579 1077 844 711 524 609 280 354 -145 -209 -337 -547
877 -547 -700 -874 -914 -759 -918 -960 -798 -921 -589 -523 -1027 -594 -462 8 189 -10 155 237 349 321 385 898
899 898 789 732 622 944 798 572 567 758 556 250 95 88 -99 -272 -625 -520 -613 -652 -878 -916 -828 -645 -799
922 -799 -929 -775 -445 -411 -456 -215 31 -38 43 90 182 770 551 758 658 707 696 449 777 887 736 296 553
945E53j18k22l76n5K80l70n06K20J7k01J9j10K08K60k42k93M22K91q5k44N38J82
967A68j01o6M66J43j36o7L46J12Q6p52K05M18K66p41r6LL67p17o08P53j9k64p62
990i96K41N44j20p17P4O22m5j16l81M14Q70l36n35J95Q52l10n71L49R45j41n76
1011B62m7R88r6l48o93N36M06l85o00M3P18k53r47k18O61j17o18j94P05K16n43
1032e24n92M41O68l00l83K0P62j98j38K0M34L58q6l98N95L71l54n29L72K47L8
1053H24l37j35P8r6q4j89L02k45j57j94j06P5l09K84J64k21l20M4K8J53k01J21
1075e21Q03l46l91P5N65K08j91m45R25J20l63j71K18O16k61q46n9Q30q4n40l32
1096a90N81L08j018n31K14J004o17q78L92N07P4m45m43J086m2o15l17Q71L08m80
$$ plain form
945 553 435 213 -163 -218 62 -308 -814 -594 -577 -778 -759 -869 -661 -401 -643 -936 -514 -223 -308 -552 -14 168
967 168 67 1 467 610 474 407 753 865 951 199 404 822 1088 347 251 254 621 -96 -704 49 30 -234 -996
990 -996 -755 -211 -331 -1048 -974 -352 -397 -513 -894 -480 390 54 -481 -286 566 256 -315 34 979 838 262
1011 262 215 1203 1107 759 66 602 1008 623 23 66 784 531 -416 -634 27 -90 -708 -902 -197 19 -524
1032 -524 -1116 -675 -7 -307 -690 -670 92 -106 -244 -224 210 568 482 84 679 1050 696 167 539 786 824
1053 824 487 352 430 334 250 61 363 118 -39 -233 -339 -264 -573 -289 -125 -346 -666 -622 -594 -441 -642 -521
1075 -521 282 -64 -455 -380 185 393 202 -243 682 802 439 268 486 1102 841 -5 -64 766 682 142 -190
1096 -190 391 699 -319 -850 -636 368 -249 -1127 -735 -228 -154 -599 -1042 44 2 -613 -930 -59 249 -231
1116b31n99J015P58k73q15O3Q86J80q23k70R70K34o63q83P62N49n97o64L08L37
1136B44Nr13k13R02J23q83m76P81M39l67o13L83M76pm19j23P84j7j71JJ94M07
1158E37r5l01L8L77j40j34P5P6Q9k71q9J07j89J08k27l3Q4k58J64J8m24j49K13
1181d24k4o8k09M16J64l22J53K61J08k33J50J90R5K74m11P6K18J66l49j51O0M13
1203E53k4n79K50J42n5o25j53P52n4n75k75K49K18k32l15J75L58mm99M26L23N8
1225A14n48P0L77M29m65k56M01N46o9l81N1M29j65m55j19M84j54k95n0k16N60
1246B88j47n89K45O8J22k73k04K13K86m26k65L96J62o8j34P0L33qj41j9R3K5K74
1269C01Mj11J97Qj29J36r9r5J51j67J69j9Q6n46L03l24K19j47m51M00j35M6k94
$$ plain form
1116 -231 -830 185 943 670 -145 -82 804 984 161 -109 861 1095 432 -451 311 860 263 -401 -93 244
1136 244 249 -664 -877 25 148 -735 -1211 -430 9 -358 -971 -588 -112 -119 -538 -661 123 106 -65 -64 130 537
1158 537 442 141 179 556 416 282 357 433 522 251 162 269 80 188 -39 -72 12 -246 -82 -64 -488 -637 -424
1181 -424 -448 -516 -725 -309 -145 -467 -314 -53 55 -178 -28 162 257 531 120 196 414 580 231 80 140 553
1203 553 529 -50 200 342 287 -338 -491 261 207 -368 -643 -394 -176 -408 -723 -548 -190 -194 -693 -267 56 114
1225 114 -434 -364 13 442 -23 -279 122 668 599 218 269 698 533 78 -41 443 289 -6 -56 -272 288
1246 288 141 -448 -203 -135 -13 -286 -490 -277 9 -417 -682 -286 -124 -192 -326 -256 77 69 -72 -91 2 27 301
1269 301 305 194 391 399 270 406 307 212 363 196 365 346 432 -114 189 -135 84 -63 -514 -114 -249 -203 -497
1292d97J97j44K98k95L1K10r0L45k61J3N3N66l84k17M31J40j36K70j87m4l1M3
1314C11M2l7K36n33n5p0L05l46j02K72J7l54j72j42M53j13J15j78J08L2j55J94
1336a72K77p7K6k84J56K25r4J14J92R8j26O7k41K62k08j94M67j81k26j51L0J18
1358G8Q2l46J71m4j18mj05k27N57p54J28N30j71k11K00mL12p0k6p9J42K4J80m4
1382B01l42N40j39j36J02Q6qj17o0M62n03r2k54L05j52J03j59j07K83l33j40K98
1404a62k28K66q0j21J8J4L22r1J45j33J14L3P8J49j53L03j42k05K93n5j80p4m6
1427F5R9P7k4j48K0j9J51l95j06J06p4j44J97M4p7l9k46L56O7o7l2p4L83p1r4
1452d5l2K55N5j05J70j27Q8J43l19L6K06n7k11j8J22J07o5m06m5L20j24k00l4
$$ plain form
1292 -497 -300 -444 -146 -441 -410 -200 -290 55 -206 -193 -140 426 42 -175 256 396 260 530 343 299 268 311
1314 311 353 316 552 19 -36 -106 199 -147 -249 23 40 -314 -486 -628 -175 -288 -173 -351 -243 -211 -366 -172
1336 -172 105 28 54 -230 -74 151 57 171 363 461 335 402 161 423 215 21 488 307 81 -70 -40 78
1358 78 160 -186 -15 -59 -177 -181 -286 -513 44 -710 -582 -52 -223 -434 -234 -238 74 4 -22 -101 41 65 245 201
1382 201 -141 399 260 124 226 312 304 187 127 589 86 -6 -260 45 -107 -4 -163 -270 13 -320 -460 -162
1404 -162 -390 -124 -204 -325 -307 -293 29 -62 83 -50 64 97 175 324 171 474 332 127 420 365 185 111 65
1427 65 164 241 217 69 89 70 221 -174 -280 -174 -248 -392 -195 -151 -228 -267 -513 -157 -90 -157 -189 -263 120 49 -45
1452 -45 -77 178 233 128 298 171 259 402 83 119 325 268 57 39 161 268 203 -203 -248 72 -52 -252 -286
1475b86n5N02m69k42L65K4Q8j05J42K19k55P9k95L35P2J8k09J01K75J6l42J85
1497A63K74r0l97n6K50K9n7J57k02J35j90k27J3J50j1m82L85K16N9o26K19L71
1519H3p2J5n4r7J25l2l27L33%L57j30j89M56m2j99J6R2j96J47P6l42K43q7r0j0
1544G6p2J28l66K51K66k99j46k0O6K23n00P9K53j36j52L83rl1rk88K61L94l21
1567C1k86K03J41M44o06M2P15l98j18j84K44J61j94j87k99L80o3j82Q2O8p5j85
1589b66k16M82k1m01K2L32J71O3l58KR1L72n50K24L38K15l94k60M87m6l52J36
1611G1K81K47l73m28L85L48m15l49K09Q9oj86k02Q3K29p2l06K62J41j87K3J1K44
1634I9k57l06L01K64k29K17j49J42Q3k15K66j24K31l57j08J91J46m87L31J01Q9
$$ plain form
1475 -286 -341 161 -308 -550 -185 -161 -73 -178 -36 183 -72 7 -288 47 119 137 -72 29 304 320 -22 163
1497 163 437 347 -50 -106 144 173 116 273 71 206 16 -211 -198 -48 -59 -541 -156 60 119 -507 -288 83
1519 83 11 26 -28 -125 0 -32 -359 -26 -26 331 201 12 468 426 227 243 335 139 286 362 20 263 176 86 76
1544 76 4 132 -234 17 283 -16 -162 -182 -116 107 -393 -314 -61 -197 -349 34 25 -6 -15 -303 -42 352 31
1567 31 -255 -52 89 533 -73 -31 684 286 168 -16 228 389 195 8 -291 89 26 -156 -74 -6 -81 -266
1589 -266 -482 0 -21 -422 -400 -68 103 166 -192 -190 -99 273 -277 -53 285 500 106 -154 333 287 -65 71
1611 71 352 599 226 -202 183 531 116 -233 -24 65 59 -127 -329 -246 -17 -89 -395 -133 8 -179 -156 -145 99
1634 99 -158 -464 -163 101 -128 89 -60 82 165 -50 216 92 323 -34 -142 49 195 -292 39 140 229
1655B29k47j03J53J63o34J1J73N37m90l24L47O11k35o86K6P72k20l61j20P45K23
1676E70r25J29L05M85n00k39M3N63K7p22Q1O99j18p18l15R00J76n84m72N18Q50
1697G53q01o87L71P40q7j007K07O88K46j032k00P30O43p07o03P50P55o00o67L0
1717d78J126J13j329k3Q36J26o11m11R34J51k86l82j66P65l06n38l8Q47pq29Q4
1738d22K42L57l01l71O21O9l26m38N97r5J04j13J85J31j57n15M46K79l67J94j54
1759c4N15l11m41L66L59k24n66K3M81r3o15J82N73rm17l63N19M00l21r24J075
1780A75O37j076m34K20J264m15j140O3J250P4j250j28J053P57j045p75Q38P90
1798H58o28j249N54J429k76j845L88J555L16j530q11J570Q09j156j218P59J859
$$ plain form
1655 229 -18 -121 32 195 -439 -428 -255 282 -208 -532 -185 426 191 -495 -469 303 83 -278 -398 347 570
1676 570 -355 -226 79 564 64 -175 -132 431 458 -264 -183 516 398 -320 -635 265 441 -143 -615 -97 753
1697 753 -48 -735 -364 376 289 -718 -511 177 423 -609 -809 -79 564 -143 -746 4 759 159 -508 -478
1717 -478 648 761 -568 -591 245 371 -240 -651 283 434 148 -234 -400 365 59 -479 -517 330 323 -506 -422
1738 -422 -180 177 -124 -495 126 195 -131 -569 28 -67 37 -76 109 240 83 -432 14 293 -74 120 -34
1759 -34 481 170 -271 95 454 230 -336 -313 168 75 -540 -358 215 206 -211 -574 -55 345 24 -900 175
1780 175 812 -264 -698 -478 786 371 -769 -706 544 618 -632 -760 293 1050 5 -770 68 858
1798 858 230 -1019 -465 964 688 -1157 -769 786 1102 -428 -1239 331 1140 -16 -1234 -475 1384
1815A384r48j679M78J491jj393k34J539M45j272j044J504J258j287j487P76J567
1832A097o08j355K57J538j9j325n24J183P36j063r13Q70J008q93q57N51J132n64
1850B51r88Q1J051j9r90k04J110K77q45k90Q15N32q23n28N68M73p6o38J68M70
1870C95m28j09j51Q69l73o26O51o7J70q32N37Q37n17r04M8R51j13j001j07J009
1890B39O83j380l02Q94O86r55j041J243J158n36j837O36J444J77k001m81K232
1907H59P92k262r17J770J444j823j398J259J865q94k174O28K034R0k309p44K683
1924I03N87j893j578J928J702j275k376J301K629q20k671J77K678M64k536r20
1940a700K459J126k266j209J775J654j008k721J335K276k06k613l32K458N01k215
$$ plain form
1815 1384 436 -1243 -765 726 725 -668 -902 637 1082 -190 -1234 270 1528 241 -1246 -470 1097
1832 1097 489 -866 -609 929 910 -415 -939 244 980 -83 -996 -126 882 -11 -868 -317 815 251
1850 251 -737 -656 395 376 -614 -818 292 569 -276 -566 249 781 -42 -570 -2 471 395 -243 -75 395
1870 395 -33 -142 -293 576 203 -423 228 161 331 -501 36 873 356 -548 -500 451 338 -663 -770 239
1890 239 922 -458 -760 134 820 -135 -1176 67 1225 689 -1148 -512 932 1109 -892 -1373 859
1907 859 1651 -611 -1528 242 1686 -137 -1535 -276 1589 695 -1479 -851 1183 1273 -1036 -1780 903
1924 903 1490 -403 -1981 -53 1649 374 -2002 -701 1928 1108 -1563 -1386 1292 1756 -780 -1700
1940 -1700 759 1885 -381 -1590 185 1839 831 -1890 -555 1721 1515 -1098 -1430 1028 1529 -686
1956f86r34J720J403j436j958J240K144q87j881M35J712k9j547k09J535N86j603
1973c95o50J098Q75p06j160R72J038p14j071L24R55j97p53M4J069k31r67K13Q95
1992F39m08r45N47O58n51n12J77O94R3j092J96J183k2j081o24J363O79j045r68
2011a019J023J450r23j603M26K138m48k150P4K103L37k040p74J939J365k164j908
2028b174K117J693j083k647J284K328k9l179K8K640P47k779j070K642J846k255
2044A09k397J668K730j192k746L92L224r3l092n66K726J392k526j811K103K284
2060B205j545k604R95K818p88k787K9L067O27l121r83K381J259j555j945J439
2076e08K276j147k130M89J855J20k120m69K102O39j378p77J394R38j172j207O49
$$ plain form
1956 -686 -1620 100 1503 67 -1891 -651 1493 606 -1275 -840 872 843 -704 -913 622 1208 -395
1973 -395 -1045 53 928 222 -938 34 1072 358 -713 -389 566 369 -384 -340 729 498 -469 -256 639
1992 639 231 -714 -167 491 -60 -572 -395 299 392 -700 -504 679 657 -424 -1048 315 994 -51 -1019
2011 -1019 4 1454 531 -1072 -646 1492 1044 -1106 -1032 1071 1408 -632 -1406 533 1898 -266 -2174
2028 -2174 -57 1636 553 -2094 -810 1518 1489 -1690 -1662 978 1725 -1054 -2124 518 2364 109
2044 109 -2288 -620 2110 918 -1828 -1436 1788 1695 -1397 -1963 763 2155 -371 -2182 -79 2205
2060 2205 660 -1944 -949 1869 1081 -1706 -1677 1390 2017 -1104 -2087 294 1553 -2 -1947 -508
2076 -508 1768 621 -1509 -1020 835 955 -1165 -1634 468 1107 -271 -1048 346 1284 112 -1095 -446
2093d46J224l52j172J51J156j56r69K03O17J84p16j86O97K13o29j28M83J14n68
2112b80mO77j14m46m78Q42K2r73N3J048N96j195o52J349N62q45j236P84J488p12
2132D86k020P76K072j20k236k13K052P30j999j395K009J608j520k486J491K405
2148A640o46k502j37L024K05k321r94K187J650k217j964J672K348j183k728P74
2164a192K856Rl164j88K828P61k263j522K134J885k046k034J253K490q43k608
2180a644K96K424N54k591p79K333J434k083j633J340J920j138j880O22K136l67
2196I44k029J06J529O87j533n66J135J004q07j282K97J317m18j056J0J035K36
2213F09o87n42P03M96r34N9K45L10l47k23M73K25m97j90L06m3k33K84L47k55m45
$$ plain form
2093 -446 778 426 -746 -595 561 405 -564 -361 256 440 -276 -462 235 448 -181 -309 174 288 -280
2112 -280 -284 393 279 -167 -645 197 219 -754 -701 347 943 -252 -904 445 1007 162 -1074 -290 1198 486
2132 486 -1534 -758 1314 1194 -1042 -1255 797 1527 -472 -1867 142 1750 230 -2256 -765 1640
2148 1640 994 -1508 -1645 1379 1584 -737 -1731 456 2106 -111 -2075 -403 1945 762 -1966 -1192
2164 -1192 1664 1673 -1491 -1679 1149 1910 -353 -1875 259 2144 98 -1936 -683 1807 964 -1644
2180 -1644 -1348 1076 1630 -961 -1740 593 2027 -56 -1689 -349 1571 433 -1447 -825 1311 944
2196 944 -1085 -979 550 1237 -296 -862 273 1277 470 -812 -515 802 384 -672 -662 373 609
2213 609 -78 -620 83 579 -355 -296 -51 259 -88 -311 162 387 -110 -300 6 -37 -270 14 361 106 -339
2234c39L2P89L9o17n67J115N92j015r88Q36R75p62r34M48J351k19j625L09J280
2253G00K99j351j165J915J047j265j549Q52K114j009j875L08K104n8k022m62K138
2270G21O67j653j205J455J601j308j906J159J739j53k242L9J907P31k156q37J805
2287C64J101j463j262R66J768j010j746L34J701M34k114l50J692R21j588j275
2303a527J409J189r67j354O66J638k59j468k98J426L41j346m10J162M70o81p23
2320g32O19O45j98r47L29N59J62p10p2K69M72l40k93P2M00p0m96P4M8K14K58m01
2342a38K2j55M23K9k04l4O9L38j66n15j66O95K51q48j05Q72L24p45n13N53P30
2363G17m96p52K53R11j37j077j55Q39P76j036p02N41J258p84j046M57J088j10
$$ plain form
2234 -339 -307 482 521 -96 -663 452 1044 29 -959 -123 852 90 -844 -396 955 736 -889 -580 700
2253 700 999 -352 -1517 398 1445 180 -1369 -517 1597 588 -1287 -979 1125 1067 -955 -1417 721
2270 721 1388 -265 -1470 -15 1586 278 -1628 -469 1270 1117 -1125 -1086 821 1552 -604 -1441 364
2287 364 1465 2 -1260 -294 1474 464 -1282 -948 753 1187 -927 -1277 415 1336 -252 -1527
2303 -1527 -118 1071 104 -1250 -584 1054 795 -673 -971 455 796 -550 -960 202 672 -9 -732
2320 -732 -113 532 334 -613 -284 275 437 -273 -345 -76 396 56 -237 -165 235 165 -331 -257 -209 5 263 -138
2342 -138 -116 -271 152 181 -23 -57 12 350 184 -331 -497 198 449 -399 -504 368 692 -53 -566 -13 717
2363 717 221 -531 -278 633 496 -581 -736 103 879 -157 -859 -318 940 156 -890 -433 655 545
2381E45j093j39J418L56j519o92J262P31q01q53O58R97k36j486K59J513j68j249
2399d97m95J454N34j066p73R28N94j30j269K36J066p4j061j99J253L23j075m18
2417f69M60R17o47p37L66R57j45j085K95O06J39o88j60O34L49m70n05L66L50k28
2437A05l12J3M38J21n37k6J76J52j25l51L35j50J46k32K28j64L35Qo3k44K29j00
2459a8R6j89K08j5p3J74m10L30K84l07j91j56P24m6p68K66j2M02L2o57J75M67
2481C16L3p22J07O49Q6q05k67O06L19l90m18P88M06n67l97n0N24K09p44J41L24
2502A48R8m22j43J75L85j27n44J87P31j82o42k9O76K18n19m16P38l8l76k70K79
2523g3M02k68l01m0M67J03n15j80L82M07l06n21L13K51o6m43J96K81L04o93j6
$$ plain form
2381 545 -548 -687 731 1087 -432 -1124 138 869 68 -785 -127 870 634 -852 -593 920 752 -497
2399 -497 -992 462 996 -70 -843 85 679 549 -720 -484 582 508 -553 -752 501 824 -251 -669
2417 -669 -209 708 61 -676 -310 647 502 -583 -288 318 457 -231 -391 243 592 122 -383 -17 333 105
2437 105 -207 -194 244 365 -172 -198 -22 130 5 -346 -11 -161 -15 -247 -19 -183 152 160 97 -147 82 -18
2459 -18 78 -111 97 82 9 183 -227 103 387 80 -111 -267 457 411 -357 -91 -103 299 331 -326 -151 316
2481 316 349 -373 -266 383 469 -336 -603 3 322 -68 -486 302 708 141 -256 -306 218 427 -317 -176 148
2502 148 246 -176 -319 -144 241 114 -430 -243 488 306 -336 -365 311 529 10 -406 332 294 -82 -352 -73
2523 -73 329 61 -240 -280 187 290 -225 -405 -23 384 78 -443 -130 121 55 -388 -192 89 393 -300 -316
2544c16N85j5lm09m9K39J28k86J04Q8P9k82J35r0K67k92L04n1j76r3R4r6l3R0
2568g8R2m5j14K12j22n2n3J11k36K33JJ48p9J61O6m60K24r3QK6R6K9R8l46K16
2593D3j31K33j27k21J95J18p6n4r0j48M45j68j54J48N05m74j11p6M21m26K5J4
2615a09L77l07L58l03J12j50pJ44k15L15O8n40J47M75l00j22j00K58Q3l13J06
2636b3J29J49j23j06q9K43j21j68m4q5M14j12r0Q5K34l20j07K36J79k99J57j68
2658b9Q3K9p5j23K42M3Qj84J64O1j87j3O6J63q3J35k81j74L3J01Kj1J71m33M59
2683A67l23J73n6o9Q8J27r6n9J03RK03m41J44j32O9N5j65Q3J66L8j42r0J0l1K81
2708A12l3r9m9M16k83R5l40L00J19q8k4j01J11k82Q0J16l6l6L02j62J3p7k23O5
$$ plain form
2544 -316 269 254 251 -158 -207 32 160 -126 -22 66 145 -137 -2 -92 175 -117 187 136 -40 -133 -39 -135 -168 -78
2568 -78 14 -31 -145 67 -55 -107 -160 -49 -285 -52 -51 97 18 179 245 -215 9 -84 -76 -50 46 75 173 -173 43
2593 43 -88 145 18 -203 -8 110 34 -20 -110 -258 187 19 -135 13 518 44 -67 -143 278 -148 -123 -109
2615 -109 268 -39 319 16 128 -22 -29 115 -100 215 283 -257 -110 365 65 -57 -157 101 184 -129 -23
2636 -23 106 255 132 26 -63 180 59 -109 -153 -238 176 64 -26 59 293 -27 -134 102 281 -18 139 -29
2658 -29 54 83 8 -115 127 170 178 -6 158 219 32 19 85 248 165 300 19 -155 -122 -21 -19 -30 141 -292 167
2683 167 -156 17 -39 -108 -20 107 11 -48 55 64 267 -174 -30 -162 -93 -38 -203 -120 46 84 -58 -148 -138 -169 112
2708 112 79 -20 -69 347 64 159 -181 119 238 150 126 25 136 -146 -66 50 14 -22 280 118 131 54 -169 -104
2732a04K2J93J07q1j93J63m6p5J69m29P0M83j60J94k74k2J98j11l59M54Q5o3k31
2755a0K15j8k14J49m04K27J46k32K37m6k62L71k31K99j48j71j6J29j3K3K65j27
2777A69k77r2L7J33m5K85p7o5k01L8P0P2K8p1m4K51l63K72m3l71J37L52M8l79
2801a36k14M35j40k0M42p37N10j75ok08J01J83K6R2k24l9O5q7j3J68n9K27l65
2824a74j45J96N7k19L82M3K0j13k12M00m67L11LQ7J6k28j17K38n4J05k01K10Q2
2847B20k00O8K67k30r1o9m31K66M16l63J33o9j14K31j7J4j02K07K8j76J58l45
2869a99K13J21j82O3J57j99k05q5N58n0l89J78R3j7k21J81n0K2l5J54k59K91k9
2892A11l70J57J90l2r0R0Mn0J73j00k6J6J28l4q7j62j32J72K5j07M8K10J33n8
$$ plain form
2732 -104 -82 111 218 137 -56 107 61 -14 155 -274 -204 279 119 313 39 17 215 104 -255 199 284 221 -10
2755 -10 205 187 -27 122 -282 -55 91 -141 96 50 -212 159 -72 227 79 -92 -108 21 8 31 296 169
2777 169 -108 -200 -163 -30 -75 210 133 68 -133 -95 -25 47 75 4 -40 211 -152 120 77 -294 -157 195 243 -136
2801 -136 -350 85 -55 -75 367 -370 140 -35 -41 -249 -148 35 61 153 -71 -110 -45 -132 -145 23 -36 191 -174
2824 -174 -319 -123 -66 -285 97 140 160 47 -165 235 -232 79 82 169 185 -43 -160 78 24 129 -72 138 220
2847 220 20 88 355 125 34 -35 -466 -200 216 -147 -14 -83 -197 34 17 31 -71 136 164 -12 146 -199
2869 -199 14 135 -47 16 173 -26 -231 -316 242 192 -197 -19 74 57 -164 17 -33 -11 -46 108 -151 140 111
2892 111 -259 -102 88 56 -34 56 60 10 183 83 57 73 201 167 80 -82 -214 -42 -17 -124 -76 134 267 209
2916B09j76R0L6k06N7mR2j79%l3J00o1O7m8R2k71L62m35N15r3k07J5q3L3L97n3
2942B16k96K5R9J25J45k19J64K3j05k8j68k1p8L1L6J41M4J50l40K13k09J62k02
2965i2O5m7j18K66J8k77M28k70j36o7J92M1O0m40L65J55l44M0M6N8P4r2J20j7
2989B8N5j57J94j14p3k40M08j43J68p8k59M22j66l3j07j46J6L47l4O0l69J25L39
3012B43k15j83o6J46J94k50n5M1R2J69j00j70J61J03n0j4j39J57kJ02P9k03jk16
3036a77K14Q7j97L0p3K46k17K47l1O3l07J1m4m3L41p4k92K62p7l8j0M17l17J64
3060A85q9j27r8K22j27n5j11j09M34k84l1K66j55P8J54m05M76k24r2p1K10k43
3082a96J37K71k19n5r0J21N3J33j98K30j48p0J01m9j39K16j40K05k3l06L3J06
$$ plain form
2916 209 33 123 159 -47 10 6 98 -81 -81 -114 -14 -75 -8 -56 36 -235 127 -308 207 114 -93 -78 -161 -128 269 216
2942 216 -80 -55 44 169 314 95 259 282 177 149 -19 -40 -118 -87 -51 90 134 284 -56 157 -52 110 -92
2965 -92 -27 -74 -192 74 92 -185 243 -27 -163 -230 -38 3 63 -377 -12 143 -201 -161 -115 -57 17 -75 45 28
2989 28 83 -74 120 6 -67 -307 101 -42 126 48 -211 211 45 12 -95 -241 -225 122 88 148 -221 -96 243
3012 243 28 -155 -221 -75 119 -131 -186 -145 -53 116 16 -154 7 110 60 46 -93 64 62 164 243 40 39 -177
3036 -177 37 124 -73 -43 -116 130 -87 160 129 192 -115 -104 -148 -191 150 76 -216 46 -31 -69 -79 338 21 185
3060 185 96 -31 -129 93 -34 -89 -200 -309 125 -159 -190 76 -79 -1 153 -252 224 0 -92 -163 47 -196
3082 -196 -59 212 -7 -62 -152 -31 22 155 -43 187 39 -31 70 21 -118 98 -42 163 140 -166 -133 -27
3104b7J84k80K45k24J10R8J16l82K29J4r0k31J18K55k32J75k35j06L99k97J6J59
3126A4K97k88m3jq3K15K0k42J34L41m49m9K42j51J3M4L9j15K3n8O4J18k50K78
3150A13j4p1K70l90j2J3J97p3j57L48k90lN7J73J55k75k50M82l79J10j61l4K26
3173C5M3j42J57j7J0N3m5n8mJ27n6k65N5L72k29k4j08J75j61J26R6m0L4k46m6
3198a58k8K65n3L04k79l0K16n41L10Qq8o6M8J72R4l08J44J63J22m10j16R7J20
3221a4Q6M2K5k71O0K7j71P4K80l14M7M3PL5O1J93j42m0o5L37r7q9L5j52p2K31
3247A56k53P0K20j41J59J02j95p5j27M5L7Q7j17J1o9J79k07J59q5J06M8j36j93
3270b19j67N94j15m90O67n45K52k83L63J56k31L09l65OK21k96L10o8k8r6R3j58
$$ plain form
3104 -27 157 -123 122 -102 8 106 222 -160 69 83 -7 -238 -120 135 -97 78 -157 -263 136 -161 -145 14
3126 14 311 23 -20 -21 -104 111 131 -111 23 364 -85 -134 108 -43 -30 14 53 -62 -39 -97 -33 85 -165 113
3150 113 99 28 298 -92 -104 -91 106 33 -124 224 -66 -69 -12 161 316 41 -209 273 -106 4 -157 -191 35
3173 35 78 -64 93 76 86 139 94 36 32 159 103 -162 -107 265 36 12 -96 79 -82 44 140 100 134 -112 -158
3198 -158 -186 79 26 330 51 21 237 -304 6 14 -74 -140 -92 80 174 -134 10 173 295 -115 -231 -134 -14
3221 -14 72 114 139 -132 -72 -45 -216 -142 138 -176 -129 -86 -79 -44 17 210 68 28 -37 300 203 114 149 -3 -75 156
3247 156 -97 -27 193 52 211 313 118 43 -84 -39 -2 85 -32 -21 -90 89 -118 41 -44 62 110 -26 -219
3270 -219 -386 208 93 -397 270 -275 -23 -306 57 213 -18 291 -74 -68 153 -143 167 99 71 -25 68 -90
3292i0L45j30QOk04J44k44PJ45l2L8J69k18l8J35n8o2L5K85k85m5k2K22r6%J92
3318B07k13k65K14Q9l86L06L65m23J84l2L7j16R7k84L9M72j21n2j37J15j66ql16
3341c94M01J37m27K08J84k80L92l72K04J51l93l0J9J12n8J36K13j86K5J13j89
3362c4j0J53o1j11N5M3j00m3K7K67j21L01k07p3J61k06Q1l8k98K88j8K4p3P3j57
3387g7J03m9O8Nk1j31q9O4L05J66k76n8j8N0k07r0K74J59k55j10J75J67k63K07
3411I9r7LjM1N3j02P6j27R1N0k62K69m2k11L30p9k1k18J89o4q9L4M5n7J81l53
3437b62K97k29J28L64k73K95k40k4j50n7K11l5j56J75j09o1K4l5R7O3J91j48p3
3460gK56l41K2l1K46j19J72k6r1n3K3J50l42K23jJQJ58k71P3j31J80m4J01R7r
$$ plain form
3292 -90 255 125 133 139 -65 79 -165 -158 -13 -45 -7 162 -56 -94 41 -17 -79 -44 241 -44 -89 -111 111 15 15 207
3318 207 -6 -271 -57 32 -354 -48 317 -106 78 46 83 -33 64 -220 -181 291 170 118 -19 96 -70 -78 -394
3341 -394 7 144 -283 -75 109 -171 221 -151 53 204 -189 -219 -200 -88 -146 -10 203 17 42 155 -34
3362 -34 -44 109 48 -63 -8 35 -65 -108 -81 186 65 366 159 86 247 41 122 84 -214 74 56 80 7 80 -77
3387 -77 26 -23 45 50 29 -102 -191 -127 178 344 68 10 -8 42 -165 -255 19 178 -77 -187 -12 155 -108 99
3411 99 2 5 4 45 98 -4 72 -55 36 86 -176 93 51 -160 170 91 70 -148 41 -23 -112 -78 -33 -90 91 -262
3437 -262 35 -194 -66 298 25 320 80 56 -94 -151 60 25 -131 44 -65 -126 -102 -137 -40 23 214 66 -7
3460 -7 249 -92 -70 -101 145 26 198 172 81 28 51 201 -141 82 81 82 90 248 -23 50 -81 99 55 156 253 244
3486B44j98q4k39L10k02K65l30K26N2k33K57j92M27l96Q4K41m4m71J08K26lp8
3508c0K25j88J3j78K09k75L54k43J84O2j36j10J89l13L60o7K2J31k06L8j35J44
3530E0M3r9m0N9M4L0l6kj5K32j82O0k02J11r2J2K70k1j88N8k39K47j13J10j94
3555i7o3J95j19N6j23j60N26l71J46n2Q2j47qM69l31PJ4m3K63k68k7j9R7J95m45
3580b23L23r3j31J29R1j83k21L50k23K84l9n7J3k22J6L74r3m26J33K93j01o5K57
3603A86l9l12J33R5j13j16j85K03O2j00L1J61J31k11n1l2r8K70j7k39L5M79m25
3626a52K53J34l55M8j76L62j76K65k67M3j07L10m95K24j15K60L6l13K62Q3r1p2
3648c9J71k6m9j44O1J1m7J44j48J57J4L9q2N2j62j14M95n07J34J66m22J09M7M5
$$ plain form
3486 244 46 -38 -277 33 -169 96 -234 -8 44 -189 68 -124 303 -93 -9 232 188 -283 -175 51 48 -30
3508 -30 195 7 20 -158 51 -224 130 -113 71 133 -3 -113 76 -237 123 56 78 209 3 41 -94 50
3530 50 93 -6 -46 13 57 87 51 49 34 266 84 144 -58 53 -39 -27 243 222 34 92 -147 100 -13 97 -97
3555 -97 -160 35 -84 -28 -151 -311 215 -156 -10 -62 20 -127 -135 334 3 10 24 -19 244 -24 -51 -70 27 222 -223
3580 -223 100 7 -124 5 96 -87 -308 42 -181 103 64 7 20 -202 -186 188 95 -331 -198 95 -6 -71 186
3603 186 147 -165 -32 63 -50 -166 -351 -148 -86 -186 -155 6 137 -74 -125 -157 -255 15 -2 -241 -206 273 -152
3626 -152 101 235 -120 -72 -248 114 -62 203 -64 -21 -128 182 -313 -89 -204 56 92 -221 41 124 33 -39
3648 -39 132 106 57 -87 -26 -15 -62 82 -66 91 105 144 62 114 -48 -162 333 -174 -40 126 -296 -187 -140 -95
3672i5J23m5Q1R6k53P8J12k05J31j0J23pk27J13NJ41j11j92K59j29Q6L88m8m39
3696b5l7J01j63J84k94P5K71k23L17J28k81k26J80J03l19L42l26K18j7j59J86
3717C5J06j41j9j41K48Q0O6J6j68j41K2Qj76J47KR8n3J98lk72K58j06J12l29n4
3742b07K81l22K87k04N72r6l50O8N5k75k09L76M11m72L19k07j11K73p3j83O3K23
3764B19k69n4J82r0J19k73o5J63J77J68l11K52j86J37l35J44Q7p0p5J51j04K55
3786B22j67k67L32m4N4j22j91K36O4k72J12J66r0r9J0J48J36l13o8m8L68j27k38
3809a98J30J43j10j02Q0K10j62k39J89J00j62K6J54p4RN3k59L08k18K40j46Q3
3831E5j34L02k18O7k73K62ol0j30N8qj09M5L14j03j90J08J99m42J67R5K34k19
$$ plain form
3672 -95 28 -17 64 160 -93 -15 97 -108 23 13 136 129 -98 15 20 161 50 -142 117 -12 74 462 414 -25
3696 -25 -62 39 -124 60 -234 -159 112 -111 206 334 53 -173 7 110 -209 133 -193 25 8 -151 35
3717 35 141 0 -19 -160 88 168 234 250 82 -59 -37 -29 -205 -58 -56 42 -11 187 184 -88 170 64 176 -153 -207
3742 -207 74 -248 39 -165 407 311 -39 29 84 -191 -400 -24 387 -85 234 27 -84 189 116 -67 -4 219
3764 219 -50 -104 78 -12 107 -166 -231 -68 109 277 -34 218 32 169 -166 -22 65 -5 -80 71 -33 222
3786 222 55 -212 120 76 130 8 -183 53 117 -155 -43 123 33 -66 -56 92 228 -85 -153 -201 167 40 -198
3809 -198 -68 75 -35 -137 -57 153 -9 -248 -59 41 -121 -95 59 -15 -6 47 -212 96 -122 118 -28 55
3831 55 -79 223 5 72 -201 61 55 25 -105 -47 -55 -164 -119 195 92 -98 10 209 -233 -66 29 263 44
3854D4k18R3L44k21j36J6N8l4j21M4K4K2j64R6K01M0J6j0q0O1k76j69N97k52K16
3879A91j75R9N5j06k8j83Q8M81n83j00M16j00o5j25Q8J82j44J0MK02k41k34J18
3902a50K00j1m9m57M81K91l08q6j1J10j6j07M11k12N4j37j04M60n27J16j80Q2
3924a50K88j71k25n1N24N6k44P4K62m01l7k48N77m6q8k38J09R2M5j73k34L74o0
3947C5k16J66J30j2mr1K18o0l14O1L77l33N0q6L37j53j76%pK2J07n8qJ22k02p8
3973a73J50L50l18L2k05K41m8k46L48O9N3m91O0J59M5o9k3J63N4k45k7j25P03
3996D57m04j50j7J14O1q0Q9N9K17m73O6P8M05l76k91K69N0L8m08M50k72N28n75
4019a65J34L61m45J86k64J00J48r7l56J92L73Nj29m67O74J01l29j91J59K14k49
$$ plain form
3854 44 -174 -81 263 42 -94 -78 -20 -54 -175 -131 -107 -85 -249 -153 48 88 104 94 14 75 -201 -370 227 -25 191
3879 191 16 115 170 64 36 -147 -59 422 -161 -261 155 55 -10 -135 -47 135 -9 1 5 207 -34 -268 -150
3902 -150 50 39 -10 -467 14 305 -3 -89 -100 10 -6 -113 298 86 140 3 -101 359 -168 -52 -232 -150
3924 -150 138 -33 -258 -309 215 271 27 101 363 -38 -75 -323 254 208 120 -118 -9 83 128 -45 -279 95 35
3947 35 -181 -15 115 103 99 8 226 166 -148 -87 290 -43 7 -79 258 105 -71 -71 -78 -56 51 -7 -15 107 -95 -173
3973 -173 -23 327 9 41 -164 77 29 -217 131 200 253 -238 -178 -19 26 -43 -66 97 151 -94 -121 -246 457
3996 457 53 -97 -114 0 61 -19 70 129 346 -127 -61 17 422 46 -245 24 74 112 -296 154 -118 410 -165
4019 -165 -31 330 -115 71 -193 -93 55 -42 -398 -206 167 172 43 -424 250 351 22 -169 -10 204 -45
4040d5R0l24M74q5l01K9J56L23m26J6J44J59m92P3L24K5M4o2p9J26k89p5rM13
4064B09q2k38R2l4K34m79K49O3M42m86Q1J26r2k2k96L67K24l0q67O63k5j13jr0
4088a05J37q9K06j04J44k7m79O8N21j6m21j09M34J93m19l2J84J22k57p1J37L49
4110C66j82l60K1M29K20n27K9Q7N6m10j59P16p7j63k13p6M49j08j45j38M09N6
4132B80n24K22N4L39p01k9L70J69jo18K59M46kn39n8O12l84l32K71L57J12j86
4154A17o72O62L45n07j14Q7L19k98p2k3N18J21n96J65J3K2n1l98L78K73j58m59
4176c28K04N15m81k03J15O33l13l69J8K14K00J9n08M48J11k92l76M42j8Ql64J00
4198b25L61o8j04Q2J84j00l73P4M3N43l97q1Q6M39n19m6K97k5j48k55J00L33j82
$$ plain form
4040 -45 45 -279 195 110 -191 -162 -6 317 -109 -93 51 210 -282 -209 115 140 184 122 43 169 -120 -195 -204 209
4064 209 127 -111 -19 -53 181 -298 -49 14 456 -30 51 177 85 63 -233 134 358 328 -539 124 99 -14 -15 -105
4088 -105 32 -57 149 45 189 162 -317 -249 272 256 -165 -274 160 353 -66 -98 86 208 -49 -120 17 366
4110 366 184 -176 -155 274 494 -33 -4 83 139 -271 -430 286 209 46 -167 -243 206 98 -47 -185 224 280
4132 280 -244 -22 32 371 -330 -359 11 180 179 -439 -180 266 264 -275 -333 279 -105 -437 -166 191 303 117
4154 117 -555 107 452 -55 -169 -82 237 -61 -133 -156 362 483 -113 52 65 87 36 -362 16 289 131 -328
4176 -328 -124 391 -90 -293 -178 455 142 -227 -209 5 205 224 -284 164 275 -17 -393 49 31 39 -325 -225
4198 -225 136 68 -36 46 230 130 -243 -169 -126 417 20 -61 25 464 -55 -101 196 171 23 -232 -132 201 19
4221A9J8m2PK3o0k4K68j64k09J33K48L7n66J46J73J60l10k52K22M89j90k25N2
4244d7J16Jk98j50M27R0r8k83L29P5k64N1J34L49j18p08K90N27l57l29j26M61
4266G2R4j64k18K17L40j25o77K38L18K44k78j08J07o2j39N7M89l29m0r1K01J44
4288B90k13k69OL50n0k83J7M71m24J43k41M29J18k15l88J86j07J07p8j89J46J10
4310h4j5Q9n0R3l8J26l65N04q5r3j71k63N06j89n1K48l48Q7mj00Q4J93J8J6l40
4335b32M27p4K6p7m68O35j85m5j18Q7J89L6k54j07j34Q78n19k59J07K30l82K4
4357b15K74J25j02k92q3O35j41l66K2K15J57l18O9K0L53m31l02M08K87k06l81
4378b72j9L97M2j57l28L20K29l30k05K84K17R1m63K28O4L95n34K3K43p4l08n1
$$ plain form
4221 19 37 -5 2 25 -35 -59 209 45 -164 -31 217 254 -312 -166 7 167 -143 -395 -173 316 126 -99 -47
4244 -47 69 70 -228 -378 49 139 41 -242 87 162 -102 -51 83 432 314 -394 -104 423 66 -263 -389 72
4266 72 166 2 -216 1 341 216 -461 -223 95 339 61 -47 60 -2 -141 -84 405 76 36 -55 146 290
4288 290 77 -192 -186 164 114 -169 -152 319 -105 38 -203 226 344 129 -259 -73 -180 -73 -151 -340 -194 -84
4310 -84 -99 -10 -60 33 -5 121 -244 260 175 82 -89 -352 154 -35 -86 162 -186 -99 -103 -203 -119 74 92 108 -232
4335 -232 195 121 147 70 -398 237 52 7 -111 -24 165 201 -53 -160 -294 584 65 -194 -87 143 -239 -215
4357 -215 59 184 82 -210 -293 342 201 -165 -143 72 229 -89 -20 0 353 -78 -380 28 315 109 -272
4378 -272 -291 106 148 -9 -337 -17 212 -118 -323 -39 178 269 -194 34 98 493 -41 -18 225 151 -157 -208
4400b08J08L84m86L98l65K34j29j07O1J36P4l30L83k48mP8j79K47J12j86o1K93
4422B05k13K1J5KL39o96M67j60J20J22j74mr0J03M49o41Q6j11L56k00J96l95J80
4445b3K65j83m7P7pJK9j98J04L3N7P1o84K74M15j44k11J34R2Kp6K3p5o2J11l10
4471c32L39J30k23pK89m4N4m86L3M47o3j61k20K80j8N2k38L28K1o8l48p1M31r5
4495C0l1l55L06K12l28K3j71M50k19j87K72j3J42j64K59k15L34l91m7J51N3K38
4517C49n51K89Q4k02k54N4J80J17Q6j80K00k99K97k95K01l89N04j39j62J79m8
4538B1J12k24J07r6J59k20K41K6j50Q9J62j26K0p9q8J27k58L6R2K16j69q7K72
4561A83q0j86k0L20K0k49jM4j27R9p3J34J50j25k44K03N3j17J39j41J45N9k58
$$ plain form
4400 -208 -100 284 -202 196 -169 65 -64 -171 -110 26 100 -230 153 -95 -99 -21 -200 47 159 -27 -88 205
4422 205 -8 13 28 30 369 -327 140 -20 100 222 48 44 -46 57 506 -135 -49 -160 196 -4 192 -203 -23
4445 -23 242 59 12 89 82 83 112 -86 18 51 108 179 -505 -231 184 40 -171 -37 55 57 -19 4 -71 -133 -22 -332
4471 -332 7 137 -86 -93 196 152 206 -280 -247 200 137 -24 -244 36 18 70 -168 160 181 113 -235 -306 125 30
4495 30 -1 -356 -50 162 -166 -143 -314 136 -83 -270 2 -11 131 -33 226 11 345 -46 -93 58 111 349
4517 349 -202 87 171 -31 -285 -231 -51 66 152 -28 172 -127 170 -125 76 -313 191 52 -110 69 21
4538 21 133 -91 16 -80 79 -141 100 126 -24 65 227 101 121 42 -46 81 -177 -141 -49 167 -2 -89 183
4561 183 103 -83 -103 217 237 -12 -13 31 -96 3 -70 64 214 89 -155 48 101 -16 123 -18 127 186 -72
4584g2J6K62j05l66P1J30O8n6j32J31O4J94k53K79l97M77l19J52j8J68l25L4O1
4607F4J27J25n01J67Q4k9j57K66l07J72j6J20p3j89L37l51M92m15K63k3P3L7j1
4630B55p1k61Q6J73k38J44j12J2o2J88m44M05j0j34O1J7j7j71L24j58N9k17J71
4653@R6K80k72m8P3j25M7r9o1K63j52K5k08J79k93K30j16K41jj1k97J99qr1Q5
4678f4L2qk6L0J18J1n9j35K03pk62J41j64J58J75j33j49L76j08K5j54r2LJ43j40
4703h6k00K80L47j50k06K02m5j44N1MJ2j88J93Mq2q6K25j08k9P1K8N4l35J62m6
4728g2L27k99J78j9j59K01r0n7j64L24j91J62N3k26j19r9L17K49k46j57M3k04
4750b48N16m31M6k7j01M01m13K09k63J01K83j01J8J41j44J56k6r1L0k0l56M85
$$ plain form
4584 -72 -56 206 101 -265 -194 -64 4 -52 -184 -53 11 205 -48 231 -166 311 -8 144 126 294 -31 3 64
4607 64 191 316 -185 -18 66 37 -120 146 -161 11 -5 115 42 -147 190 -161 331 -84 179 156 229 266 255
4630 255 184 -77 9 182 -56 88 -24 -12 -74 114 -330 75 65 -69 -8 9 -8 -179 145 -13 46 -171 0
4653 0 96 376 104 56 129 4 51 -48 -109 154 2 27 -181 -2 -295 -65 -181 60 59 48 -249 -50 -58 -149 -64
4678 -64 -32 -40 -66 -36 82 93 34 -101 102 95 -167 -26 -190 -32 143 10 -139 237 129 154 0 -92 -89 54 -86
4703 -86 -286 -6 341 191 -15 187 142 -2 49 53 65 -123 70 74 -8 -94 131 23 -6 65 93 147 -188 -26 -72
4728 -72 255 -44 134 115 -44 157 67 10 -154 170 -21 141 194 -32 -151 -250 67 316 70 -87 -44 -248
4750 -248 268 -163 -117 -144 -245 156 -257 -48 -311 -210 73 -28 -10 131 -13 143 117 26 56 36 -320 165
4772A65j63K9k5j80K59J18J4k44K65k87K55l82k6K09J21l96K68J50L4k13J6n3
4794f6J61P9Lj38j4N3n2m6k23M67p7l56L79k43N4J42J59k7k78J4r2j28J87k8j79
4819b49M84k71K12N3k55Jj29J11K76n0j22k54lK30k85K61jQ4ll23L34O2J10k68
4843Ek34R2J18K12k08J47%k10k5J79k13R6o3J60j83J41n1o0N5O4J76m45K46o0
4867f1J86Jj86L55k58kr3J64L9k41j05O1K7q1L59k31K10l28p9L13J70M1k33l41
4891c13K62K15j58n1j68L59p7j08j54M1l6M36k52J67j15j32L6j2p6N3J64m41N81
4914B21l56K50O6q4m1J57j40j69K75k0j49K11k27J88j00r5P4j27K1l4J78K2l10
4937a89J89R0o1J31j67m9J24k95J69j44N38l16p4K96k59J18p1q7K4K22l00J77
$$ plain form
4772 165 2 31 6 -174 85 203 217 -27 238 -49 206 -176 -202 7 128 -268 0 150 184 -29 -13 -66
4794 -66 95 174 177 39 25 78 26 -20 -243 224 147 -209 170 -73 -19 123 282 255 -23 -9 -101 -229 -42 -70 -249
4819 -249 235 -36 176 229 -26 -25 -154 -43 233 183 61 -193 -196 34 -251 10 9 93 90 -233 101 163 273 5
4843 5 -229 -137 -19 193 -15 132 132 -78 -103 76 -137 -41 -104 56 -127 14 -37 -97 -42 22 198 -247 -1 -61
4867 -61 125 126 -60 295 37 35 -58 106 145 -96 -201 -140 -113 -194 165 -66 144 -184 -263 50 220 261 28 -313
4891 -313 -51 164 6 -45 -213 146 69 -39 -193 -152 -188 248 -4 163 48 -84 -48 -60 -136 -83 81 -360 221
4914 221 -135 115 181 97 56 213 73 -96 179 159 10 221 -6 182 82 -13 61 -66 -45 -79 99 121 -189
4937 -189 0 90 29 160 -7 -56 68 -227 -58 -202 336 20 -54 242 -17 101 30 -57 -33 189 -111 66
4959F6j56j20J23j18L44J06k13Q5j96Kl04L46j42k8J16J32J24j31j44J91k9Q8
4981A42j64K54j68k86L06j64k9j02K65j9R2l13J72k34M09j37K8M5M3L5m5j71O6
5004B5K04l19R3J37k4j47R2J81j48j94N1L28l46j0J6K34lj78P5R9k63n0n5K90
5028H8j0j56M3m3J65j15P1Q7q8j26Q0LJ38j73J54j96J48k17L03j15o4j86J50J46
5052H7k73N79m68R9j69%k3M6Q6O8j31K39j18L47k81M6q7J17p9k79p4L63n5n4K16
5077B02K1j03j31J27o0k7j55J45J09k89J38K41Ok56o4J36kq0l6m2J18J91l83M6
5101a48K04j09j09J78k6l9l5N6J14J68j02j68j6R7K95l10l04K10J43j4q0L6j58
5124a17Pk7K00j78K40k3k47J77k21q9L09O5j10J8j10K53k64J63k61L53r6j37N0
$$ plain form
4959 66 -90 -210 -87 -205 139 245 32 117 -79 -77 -381 -35 -177 -205 -89 43 167 36 -108 83 54 142
4981 142 -22 232 64 -222 84 -80 -109 -211 54 35 127 -186 -14 -248 161 24 52 97 140 175 130 -41 25
5004 25 229 -90 3 140 116 -31 61 242 94 -100 -49 279 -67 -77 -61 173 170 -8 67 166 -97 -147 -202 88
5028 88 78 -78 -35 -78 87 -28 43 130 42 -84 -4 -1 137 -36 118 -78 70 -147 156 41 -23 -209 -59 87
5052 87 -186 393 -75 24 -145 -145 -168 -122 -36 32 -99 140 22 369 88 134 47 164 85 -194 -268 95 40 -14 202
5077 202 223 120 -11 116 56 29 -126 19 128 -161 -23 218 224 -32 -96 40 38 -42 -78 -120 -2 189 -194 -148
5101 -148 56 -53 -162 16 -10 -49 -84 -28 86 254 152 -16 -32 65 360 50 -254 -44 99 85 5 41 -117
5124 -117 -110 -137 63 -115 125 102 -145 32 -189 -278 31 96 -14 4 -106 147 -117 46 -215 138 42 -95 -45
5147d5J20j77J52J58l21K24k01j68K74J22j76J5J89j64k58K21J91Jq4p1K35j63
5169G4n1k9Q3k57K16k6l07L27j19P4k16J74J08j32l8q6Q9Q1q1Q8L1L28k02l34
5193b05m0L87k29J05J91p1l80K44L76n80K62j53J81l30K31n6j28J99P1k06J22
5214iJ69j62J73k68J41j45J91k69L18J33l84J22j54k2J33P0r9J14j1l05K17K6
5236b1m6J79r3j12QJ80j93K89l41K94p8pk00J56Q8J03j75j28K5J60n4k32J72J24
5260I8J16k21j72K98l20k6O8J72p5N7k6K1l40K64r6L51n5l5N7j17L0j27K81k31
5284b8n3K11k55K4J37J62j96j91K85j95J24j5M1J71o8j54l41J01J13j02L09J9
5306I9j22n3L90k79j66J21j50J54J08j05l0j34j13L59l0j08J27j69L4Lo5R1K61
$$ plain form
5147 -45 75 -102 50 208 -113 111 -90 -258 16 138 -38 -23 166 2 -256 -35 156 157 73 2 237 74
5169 74 23 -6 77 -180 36 10 -297 30 -89 -15 -231 -57 51 -81 -119 -205 -116 -35 -116 -28 3 331 129 -205
5193 -205 -245 142 -87 18 209 138 -242 2 378 -202 60 -93 88 -242 -11 -67 -195 4 75 -131 -9
5214 -9 160 -2 171 -97 44 -101 90 -179 139 272 -112 10 -144 -166 -33 37 -62 52 41 -264 -47 -21
5236 -21 -67 112 19 -93 -85 95 -98 191 -150 144 66 59 -141 15 103 206 31 -97 -72 88 34 -198 -26 98
5260 98 214 -7 -179 119 -201 -227 -159 13 -62 -5 -31 -10 -350 -86 -182 169 114 79 136 19 49 -78 203 -28
5284 -28 -81 130 -125 -101 36 198 2 -189 96 -99 25 10 51 222 154 0 -341 -240 -127 -229 80 99
5306 99 -23 -76 314 35 -131 -10 -160 -6 102 -3 -33 -167 -280 79 49 -59 68 -101 -67 -64 -129 -38 223
5329B23r6j80J32K7k4j82m5q0q4K22J20j1k73J49N5J64j66J41r8j98M97k76QL93
5353D18l45j37k0J31k58j6L76o7m5k38K73J6j38L86l10p8N7L66j47k70J30j04
5375b0J59k85J19J82k38m3J28kJ0J71j80o2K35k30l0J24j3l21K31J26j80P0L8
5398a1M9j24j23j01M21j69J57m6j43J57M7j28j5O6J8j0n8M38k90J31k42l23L78
5421G9r2l5J3K8j46K30K83m97J23p4j2J44NJ66m20L50j80p1K78j23K62l18J56
5444A49K5J2j29O0r1k9K65k82J29k70k38L08K68j30M4p4JM6l4K2k91N05l01K04
5468A69j63K5j10L39k77K0R5o8q6K05j15p2k7K2M4K6p2P2Q2k48J67K22l23K63
5492A90j24l3M1k09J74J4n0k8K20k18K21j94M7k92M94k70J48R1j82J2jJ20k00
$$ plain form
5329 223 127 -53 79 106 82 -100 -145 -225 -309 -87 33 22 -251 -102 -47 117 -49 92 -6 -204 293 17 25 418
5353 418 73 -64 -84 47 -211 -227 149 82 37 -201 72 88 -50 336 26 -52 5 371 224 -46 84 -20
5375 -20 139 -146 -27 155 -83 -126 2 0 10 181 1 -61 174 -56 -86 38 25 -296 -65 61 -119 -49 -11
5398 -11 38 -86 -209 -310 111 -58 99 53 -90 67 114 -14 -29 37 55 45 -13 425 135 266 24 -299 79
5421 79 -13 -48 -35 -7 -153 77 360 -137 -14 -88 -100 44 49 215 -205 145 -35 -106 172 49 311 -7 149
5444 149 174 186 57 117 26 -3 262 -20 109 -161 -399 -91 177 47 91 17 18 64 30 52 -239 266 -35 169
5468 169 6 31 -79 260 -17 3 98 30 -56 149 34 -38 -65 -43 1 27 -45 27 109 -139 28 250 -73 190
5492 190 66 33 74 -135 39 53 3 -25 195 -23 198 4 51 -241 253 -17 131 222 40 52 51 171 -29
5515b9j04L44n5k07K89j01j41r7M4K40l16J30K18k07j13K50P7j4q1l7j89K55P4
5538B30n4p6r5j76L0K04P2m4k38K19J80j72kk77J39K12l29K30j68Q2L55j49m32
5561b59L18K77o89L14K66k83j82R2J62J25j11j34J2j55L32l7l87L54k22J12J87
5582I2j0Q2n46O14l4j23r0J51K54l64m69N48j75K97KJ23k04mK1k31K42j38m0r4
5606i6j2O5n5m7J66m2Q0r7JJ08j88Q3K51j33j12J3p6J21j02K02l13QK61Kj9L4
5632A03j96j9j20J96j39K30L1l61J14K15n9j80L38m0J1k17J20k28K56l4k5l13
5654c17L19K16n3k94K22q9k4l58L82J81k30J14k0L0P2k06J24p3m9P8L7j45J35
5677E2j53J82k85N3K77J10j71p8o5J51k71NJ37p5K65j71L9K70M3k44k03pK27o
$$ plain form
5515 -29 -133 211 156 -51 238 137 -4 -101 -57 183 -133 -3 215 8 -105 145 222 208 127 90 -99 156 230
5538 230 176 100 5 -171 -141 63 135 91 -147 72 252 80 78 -199 -60 152 -177 53 -115 -33 322 173 -259
5561 -259 59 336 -353 -39 227 -56 -238 -146 16 141 30 -104 -92 -247 85 48 -339 15 -207 -95 92
5582 92 82 164 -382 232 198 75 -15 136 390 26 -443 105 -70 227 229 352 148 144 165 -66 176 38 -2 -96
5606 -96 -108 -43 -98 -145 21 -21 59 -38 -37 71 -117 -34 217 84 -28 -15 -91 30 -72 130 -183 -175 86 88 69 103
5632 103 -93 -112 -232 -36 -175 55 86 -275 -161 54 -5 -185 153 113 124 -93 27 -201 55 21 -4 -317
5654 -317 2 218 165 -129 93 4 -20 -378 4 185 -45 69 49 79 151 -55 69 -4 -53 25 62 -83 52
5677 52 -101 81 -204 -151 126 236 65 -13 -78 73 -198 -193 -56 -131 134 -37 2 272 315 71 -132 -139 88 82
5701H2Kk2O0r9J98l07k46L60l29N5J31J34J30m54L84j93R9J08M7J9j30K08j98
5724C9j23J84m2r6J39j02n9qR3K1K0P0j20r1j21M1j09K87n6n2L07q4l48J67P4
5749C1m2k31J38J36j75k9l3J81K87k54N2j59j0K79P3l68k5J37N7j10K05j24J57
5772A73k68J28K63m92K25m8k8j3K95Lm23K46J85l03o4Q5j29K54j04J4l16K60j78
5795b35JJ57m2R6K05k79J40J74k45P1J41j86k8mJ28j07J28P0k55K54j32R5m8n0
5819D9l52K78K21k41j03K98j17p9J24J6K92l45j12Q1J18j76Q2L0O9j06j4J2J33
5842A58k17N9K09l90N4m5L22n2p0P3J4k10K37k58K59l12N5N5K04k38J62M5j62
5865d8J14n1K96Qm21J20q7n3K38j08l62L51R7j6k80N5k08L98Q8k60J91j24k36
$$ plain form
5701 82 84 62 122 23 221 -86 -332 28 -301 -246 -115 19 149 -305 79 -114 -15 93 140 159 29 237 39
5724 39 -84 100 58 -38 101 -1 -60 -68 25 46 66 136 16 -75 -196 -155 -264 23 -33 -85 222 138 -210 -43 31
5749 31 -11 -242 -104 32 -143 -172 -205 -24 263 9 61 -98 -108 171 244 -124 -149 -12 45 -65 140 16 173
5772 173 -95 33 296 -196 29 -19 -47 -60 235 238 -185 61 246 -57 -121 -36 -165 89 -15 -1 -317 -57 -235
5795 -235 -234 -77 -119 -23 182 -97 43 217 -28 43 184 -2 -30 -34 94 -13 115 185 -70 184 52 147 99 49
5819 49 -303 -25 196 -45 -148 150 33 -46 78 94 386 41 -71 10 128 -48 34 64 133 27 13 25 158
5842 158 -59 0 209 -181 -127 -172 150 98 28 101 115 -95 142 -116 143 -169 -114 -59 145 -93 69 114 -48
5865 -48 66 15 311 319 -102 18 -69 -122 116 8 -354 -3 94 78 -202 -147 -355 43 131 -129 62 -62 -298
5888b98M70k07J27K55l30NP2j71k52J72N6L43m74j58O23J01j57J39m08L02r4k37
5910a21L28l11J85r6n7l5K57q8m3J69j85j66N1K93j72q1k29M74L3o8j69P4K63
5933C06l56P6k1J89j54m8J42j15k63M37qj48k4J24j71k04J93J11j11J28m2J86
5955B27k81K6J51r5j29O5O5J5j29J3q1J96j61M1K27j92p6K19k05n9J43k34L31
5978G7J9k00oJ39K47j45k40J57j33K2m0k31M61J08kk57j62L04k64m3J95P6p6J6
6002B2q5K85P5l09J67n4n1l6l1n1J19J29k32L58l0j84j88J98K02k94j82L51l6
6025A43j00j38j74J52L25K6m18M0P8%k32L86N9l9Q7L9m6j45J01j47q9K20m4p3
$$ plain form
5888 -298 172 -35 92 347 17 22 94 -77 -329 -157 -101 242 -232 -390 233 334 177 316 -92 210 116 -121
5910 -121 207 -104 81 -15 -72 -107 150 62 19 188 3 -163 -112 181 9 -72 -301 173 206 138 -31 43 306
5933 306 -50 26 5 194 40 -8 134 19 -244 193 185 37 13 137 -34 -238 -45 66 -45 83 41 227
5955 227 -54 -28 123 28 -101 -36 29 44 -85 -72 -153 43 -118 -77 150 -42 -118 101 -104 -163 -20 -254 77
5978 77 96 -104 -110 29 276 131 -109 48 -85 -63 -103 -334 127 235 233 -24 -186 118 -146 -189 6 82 6 22
6002 22 -63 222 297 -12 155 101 50 14 -17 -68 51 180 -52 306 276 92 -96 102 304 10 -172 179 143
6025 143 43 -95 -269 -117 208 234 -184 -144 -66 -66 -298 88 147 108 195 234 188 43 144 -3 -92 128 84 11
$$ [...]
8191b34
##END NTUPLES=NMR FID
##END=
