##TITLE=1H_SAM_30.235.2 TFA3d
 CDCl3, 108 sc, 
 23.11.2020
##JCAMPDX= 6.0         $$ Bruker NMR JCAMP-DX V2.0
##DATA TYPE= NMR FID
##DATA CLASS= NTUPLES
##ORIGIN= UXNMR, Bruker Analytische Messtechnik GmbH
##OWNER= root
$$ XWIN-NMR		Version 3.5
$$ Mon Nov 23 13:30:14 2020 Russian Standard Time (UT+4h)  she@DPX200
##.OBSERVE FREQUENCY= 200.1315066352
##.OBSERVE NUCLEUS= ^1H
##.DELAY= (6, 6)
##.ACQUISITION MODE= SIMULTANEOUS
##.ACQUISITION SCHEME= undefined
##.AVERAGES= 108
##.DIGITISER RES= 18
##SPECTROMETER/DATA SYSTEM= spect
##.PULSE SEQUENCE= zg30
##.SOLVENT NAME= CDCl3
##.SHIFT REFERENCE= (INTERNAL, CDCl3, 0, 15.7039)
##AUDIT TRAIL= $$ (NUMBER, WHEN, WHO, WHERE, WHAT)
$$ ##TITLE= Audit trail, XWIN-NMR		Version 3.5
$$ ##JCAMPDX= 5.01
$$ ##ORIGIN= Bruker BioSpin GmbH
$$ ##OWNER= she
$$ F:/spectra/data/she/nmr/H-F/1/audita.txt
$$ ##AUDIT TRAIL=  $$ (NUMBER, WHEN, WHO, WHERE, WHAT)
(   1,<2020-11-23 13:29:06.76 +0400>,<she>,<DPX200>,
      <continue with go, POWCHK disabled, PULCHK disabled
       configuration hash MD5:
       00 E9 B6 7A A2 85 ED C7 34 08 36 98 17 FE 4E 26
       data hash MD5: 16K
       6B 9C B2 D1 D2 A1 81 8E 8B E7 E4 D3 B4 68 0F 9A>)
$$ ##END=
$$ 
$$ hash MD5
$$ FF 84 C7 A6 8F C0 8A 86 7F D1 7E 5E BF 5D 28 7F
##$RELAX= 
##$RELAX= 
##$RELAX= 
##$RELAX= 
##$RELAX= 
##$RELAX= 
$$ Bruker specific parameters
$$ --------------------------
##$DU= <F:/spectra>
##$EXPNO= 1
##$NAME= <H-F>
##$PROCNO= 1
##$TYPE= <nmr>
##$USER= <she>
##$AMP= (0..31)
100 100 100 100 100 100 100 100 100 100 100 100 100 100 100 100 100 100 
100 100 100 100 100 100 100 100 100 100 100 100 100 100 
##$AQSEQ= 0
##$AQ_mod= 1
##$AUNM= <au_zg>
##$AUTOPOS= <>
##$BF1= 200.13
##$BF2= 200.13
##$BF3= 200.13
##$BF4= 200.13
##$BF5= 200.13
##$BF6= 200.13
##$BF7= 200.13
##$BF8= 200.13
##$BYTORDA= 1
##$CFDGTYP= 0
##$CFRGTYP= 5
##$CHEMSTR= <none>
##$CNST= (0..31)
1 1 145 1 1 1 1 1 1 1 1 1 1 1 1 1 1 1 1 1 1 1 1 1 1 1 1 1 1 1 1 1 
##$CPDPRG= <>
##$CPDPRG1= <>
##$CPDPRG2= <>
##$CPDPRG3= <>
##$CPDPRG4= <mlev>
##$CPDPRG5= <mlev>
##$CPDPRG6= <mlev>
##$CPDPRG7= <mlev>
##$CPDPRG8= <mlev>
##$CPDPRGB= <>
##$CPDPRGT= <>
##$D= (0..31)
0 1.2 0 0 0 0 0 0 0 0.06 0 0.03 0 0 0 0 0.0002 0 0 0 0 0 0 0 0 0 0 0 0 
0 0 0 
##$DATE= 1606123330
##$DBL= (0..7)
120 120 120 120 120 120 120 120 
##$DBP= (0..7)
150 150 150 150 150 150 150 150 
##$DBP07= 0
##$DBPNAM0= <>
##$DBPNAM1= <>
##$DBPNAM2= <>
##$DBPNAM3= <>
##$DBPNAM4= <>
##$DBPNAM5= <>
##$DBPNAM6= <>
##$DBPNAM7= <>
##$DBPOAL= (0..7)
0.5 0.5 0.5 0.5 0.5 0.5 0.5 0.5 
##$DBPOFFS= (0..7)
0 0 0 0 0 0 0 0 
##$DE= 6
##$DECBNUC= <off>
##$DECIM= 32
##$DECNUC= <off>
##$DECSTAT= 4
##$DIGMOD= 1
##$DIGTYP= 9
##$DL= (0..7)
0 120 120 120 120 120 120 120 
##$DP= (0..7)
150 150 150 150 150 150 150 150 
##$DP07= 0
##$DPNAME0= <>
##$DPNAME1= <>
##$DPNAME2= <>
##$DPNAME3= <>
##$DPNAME4= <>
##$DPNAME5= <>
##$DPNAME6= <>
##$DPNAME7= <>
##$DPOAL= (0..7)
0.5 0.5 0.5 0.5 0.5 0.5 0.5 0.5 
##$DPOFFS= (0..7)
0 0 0 0 0 0 0 0 
##$DQDMODE= 0
##$DR= 18
##$DS= 0
$$ [...]
##$SUBNAM2= <"">
##$SUBNAM3= <"">
##$SUBNAM4= <"">
##$SUBNAM5= <"">
##$SUBNAM6= <"">
##$SUBNAM7= <"">
##$SUBNAM8= <"">
##$SUBNAM9= <"">
##$SW= 16.9725356469052
##$SWIBOX= (0..15)
0 0 2 0 0 0 0 0 0 0 0 0 0 0 0 0 
##$SW_h= 3396.73913043478
##$TD= 16384
##$TD0= 1
##$TE= 0
##$TE2= 300
##$TE3= 300
##$TEG= 300
##$TL= (0..7)
0 120 120 120 120 120 120 120 
##$TP= (0..7)
150 150 150 150 150 150 150 150 
##$TP07= 0
##$TPNAME0= <>
##$TPNAME1= <>
##$TPNAME2= <>
##$TPNAME3= <>
##$TPNAME4= <>
##$TPNAME5= <>
##$TPNAME6= <>
##$TPNAME7= <>
##$TPOAL= (0..7)
0.5 0.5 0.5 0.5 0.5 0.5 0.5 0.5 
##$TPOFFS= (0..7)
0 0 0 0 0 0 0 0 
##$TUNHIN= 0
##$TUNHOUT= 0
##$TUNXOUT= 0
##$USERA1= <user>
##$USERA2= <user>
##$USERA3= <user>
##$USERA4= <user>
##$USERA5= <user>
##$V9= 5
##$VALIST= <valist>
##$VCLIST= <CCCCCCCCCCCCCCC>
##$VD= 0
##$VDLIST= <DDDDDDDDDDDDDDD>
##$VPLIST= <PPPPPPPPPPPPPPP>
##$VTLIST= <TTTTTTTTTTTTTTT>
##$WBST= 1024
##$WBSW= 4
##$XGAIN= (0..3)
0 0 0 0 
##$XL= 0
##$YL= 0
##$YMAX_a= 1466195
##$YMIN_a= -591806
##$ZGOPTNS= <>
##$ZL1= 120
##$ZL2= 120
##$ZL3= 120
##$ZL4= 120
##$ABSF1= 10
##$ABSF2= 0
##$ABSG= 5
##$ABSL= 3
##$ALPHA= 0
##$AQORDER= 0
##$ASSFAC= 0
##$ASSFACI= 0
##$ASSFACX= 0
##$ASSWID= 0
##$AUNMP= <proc_1d>
##$AZFE= 0.1
##$AZFW= 0.1
##$BCFW= 1
##$BC_mod= 2
##$BYTORDP= 1
##$COROFFS= 0
##$CY= 11.3945322036743
##$DATMOD= 1
##$DC= 2
##$DFILT= <>
##$DTYPP= 0
##$F1P= 15.9154993809931
##$F2P= -4.1035820241983
##$FCOR= 0.5
##$FTSIZE= 0
##$FT_mod= 4
##$GAMMA= 1
##$GB= 0.15
##$INTBC= 1
##$INTSCL= 1
##$ISEN= 128
##$LB= 0.24
##$LEV0= 0
##$LPBIN= 0
##$MAXI= 10000
##$MC2= 0
##$MEAN= 0
##$ME_mod= 0
##$MI= 1.114404
##$NCOEF= 0
##$NC_proc= 0
##$NLEV= 6
##$NOISF1= 3.799351
##$NOISF2= 2.8
##$NSP= 1
##$NTH_PI= 0
##$NZP= 0
##$OFFSET= 15.70392
##$PC= 1
##$PHC0= -11050.69
##$PHC1= 15.80089
##$PH_mod= 1
##$PKNL= yes
##$PPARMOD= 0
##$PSCAL= 0
##$PSIGN= 0
##$REVERSE= no
##$SF= 200.130013532006
##$SI= 16384
##$SIGF1= 3
##$SIGF2= 2
##$SINO= 400
##$SIOLD= 16384
##$SREGLST= <1H.CDCl3>
##$SSB= 0
##$STSI= 0
##$STSR= 0
##$SW_p= 3612.71676300578
##$SYMM= 0
##$S_DEV= 0
##$TDeff= 0
##$TDoff= 0
##$TI= <>
##$TILT= no
##$TM1= 0
##$TM2= 0
##$TOPLEV= 0
##$USERP1= <user>
##$USERP2= <user>
##$USERP3= <user>
##$USERP4= <user>
##$USERP5= <user>
##$WDW= 1
##$XDIM= 8192
##$YMAX_p= 0
##$YMIN_p= 0
$$ End of Bruker specific parameters
$$ ---------------------------------
##NTUPLES= NMR FID
##VAR_NAME=  TIME,          FID/REAL,        FID/IMAG
##SYMBOL=    X,             R,               I
##VAR_TYPE=  INDEPENDENT,   DEPENDENT,       DEPENDENT
##VAR_FORM=  AFFN,          ASDF,            ASDF
##VAR_DIM=   8192,          8192,            8192
##UNITS=     SECONDS,       ARBITRARY UNITS, ARBITRARY UNITS
##FACTOR=    0.0002944,     1,               1
##FIRST=     0,             0,               0
##LAST=      2.4114304,     0,               0
##MIN=       0,             -591806,         0
##MAX=       2.4114304,     1466195,         0
$$ Real data points
##PAGE= N=1
##DATA TABLE= (X++(R..R)), XYDATA
0@%%%%%%%%%%%%%%%j07K15k16K16k16K17l25M32m62N70o60P68r66J082j197J405
$$ 0 0 0 0 0 0 0 0 0 0 0 0 0 0 0 0 -107 108 -108 108 -108 109 -216 216 -246 324 -336 432 -534 548 -649 756
31G56j621J849k124K435k754L100l484L914m385M890n442O056o731P462q258R131
$$ 756 -865 984 -1140 1295 -1459 1641 -1843 2071 -2314 2576 -2866 3190 -3541 3921 -4337 4794
47D794j0085J1123j2256J3496j4866J6380j8052J9904k1971K4291k6914K9906
$$ 4794 -5291 5832 -6424 7072 -7794 8586 -9466 10438 -11533 12758 -14156 15750
59A5750l3358L7398m2195M7995n5176O4363p6618R3913j20762J71289m98382J011161
$$ 15750 -17608 19790 -22405 25590 -29586 34777 -41841 52072 -68690 102599 -395783 615378
71F15378j170398J06468J345740j232247Q32661J24883q92485Q67992P2110o38172
$$ 615378 -555020 -448552 897188 -335059 497602 622485 -270000 597992 670102 31930
81C1930L56357m58972K11322K07533k68073J26644j04970q1840J89361O952J1676
$$ 31930 388287 -70685 140637 348170 80097 206741 101771 19931 209292 216244 227920
92B27920P0801l77316P5628K16650m71369K99977o9907m98392K89581n1859j72092
$$ 227920 298721 -78595 -2967 213683 -257686 42291 -27616 -526008 -236427 -288286 -460378
103d60378N01601m05346j77184N94988k94212K18128J05622j95015K88437k28264
$$ -460378 41223 -364123 -541307 53681 -240531 -22403 83219 -111796 176641 -51623
113e1623O7907J95343j07330N8340j73319n8918L70095k03883j526J22676l49331
$$ -51623 16284 211627 104297 162637 -10682 -69600 300495 96612 95086 217762 -131569
124a31569L03025n3079j15530K27999k09763n9165Q1547J0451P035l8627j27620
$$ -131569 171456 118377 2847 230846 21083 -38082 43465 53916 60951 22324 -105296
135a05296O6025q0546J0694J58845j63495L2188k1154l5196J33863K4136j56554
$$ -105296 -39271 -119817 -109123 49722 -113773 -81585 -102739 -137935 -4072 20064 -136490
146a36490R8671K456j56772K90294j24800j1938J27029k51906J54055J43523j46133
$$ -136490 -37819 -35363 -192135 98159 -26641 -38579 88450 -163456 -9401 134122 -12011
157a2011L6926l2295n9462J92135j60534Q2943Q4912k35713K03817j23423M1218
$$ -12011 24915 -7380 -66842 125293 -35241 47702 132614 -103099 100718 -22705 18513
168A8513J89714k61219L7484J16546j39736J39275K3894k19308K18199j27998
$$ 18513 208227 -52992 -15508 101038 -38698 100577 124471 -94837 123362 -4636
178d636o5442K15569j69747K002K4820p8056O3117P1447j06443O5763l0271p1995
$$ -4636 -70078 145491 -24256 -22254 2566 -75490 -12373 59074 -47369 18394 -11877 -83872
190h3872J51981j00596P1983l5157j20152J36971j3713n1583Q7431q1204n1623
$$ -83872 68109 -32487 39496 4339 -115813 21158 7445 -44138 43293 -37911 -89534
201h9534J49389j57418J14255M5681j84583J57768p7941J4021J14191j24803j2219
$$ -89534 59855 -97563 16692 62373 -122210 35558 -42383 -28362 85829 -38974 -51193
212e1193P1451j01084Q1151K3437j21248J43302j31876L6737J18409j19628O9221
$$ -51193 20258 -80826 325 23762 -97486 45816 -86060 -49323 69086 -50542 18679
223A8679j1431n6627O9983J1607n5411J03831j13530l88J15360j24462J10345
$$ 18679 7248 -49379 20604 32211 -23200 80631 -32899 -33287 82073 -42389 67956
234F7956m2794p2714Q0158k5085p266O7627p1589j1137P7190j21450J35252l6992
$$ 67956 25162 -47552 32606 7521 255 67882 -3707 -14844 62346 -59104 76148 39156
246C9156r1736J14595j04656M5652N7092p8577K6765K8570j00652J12638j0367
$$ 39156 -52580 62015 -42641 3011 60103 -18474 8291 36861 -63791 48847 38480
257C8480p7609J18121j37851O7492M5930q2792P4458l4249m8127O0936j4504l4073
$$ 38480 -39129 78992 -58859 8633 54563 -28229 46229 11980 -36147 24789 10285 -23788
269b3788R1178j19241M1059L6917q8313J16853p6337k3447N4872m5800J666O7442
$$ -23788 67390 -51851 -10792 26125 -62188 54665 -21672 -45119 9753 -36047 -34381 33061
281C3061p7963J3601M0386r8213J29564o4318k2723P3665r3503M9658L5763n2411
$$ 33061 -44902 -31301 9085 -89128 40436 -23882 -46605 27060 -66443 -16785 18978 -33433
293c3433K7393J7922q5139J08092m0363k0249Q8982j27302Q4525J551m8165P1705
$$ -33433 -6040 11882 -73257 34835 -5528 -25777 63205 -64097 20428 21979 -26186 45519
305D5519l6888l7800O7728l6633p889Q4198j21112P4680o930n9332J02845p1511
$$ 45519 8631 -29169 38559 1926 -5963 78235 -42877 31803 24873 -34459 68386 -3125
317c125P505L0101m3785K0057M6792p7009M9875o751o8939J14698q2677J9869
$$ -3125 4380 34481 -9304 10753 57545 -19464 30411 23660 -45279 69419 -13258 6611
329F611L3324o8401M5314M796l5456L7501j1146o1844R4886p3098K0347N1279
$$ 6611 39935 -28466 16848 21644 -13812 23689 12543 -49301 45585 -27513 -7166 44113
341D4113j03246P9030k8857k0894N3764l7353k6071N9810n8075J4852N6722r8869
$$ 44113 -59133 19897 -8960 -29854 23910 -13443 -39514 20296 -37779 -22927 33795 -65074
353f5074Q4934m6437j6865P4572o8933K5318J9401m7414K2944L9418p1165O7579
$$ -65074 19860 -26577 -43442 31130 -37803 -12485 6916 -40498 -17554 21864 -49301 18278
365A8278l1821l3319Q7069q4950N1672O096n3596M4605K424l2926N0340j9792
$$ 18278 -13543 -46862 40207 -44743 6929 13025 -40571 4034 6458 -26468 23872 4080
377D080l7537Q1261q3365N5421J3220p1845P5367m0131l877M4847l0868r742M9191
$$ 4080 -33457 47804 -35561 19860 33080 -38765 36602 -3529 -7406 37441 6573 -3169 46022
390D6022o7876M6173K0404p6041R1280o8023Q683M3430n0427K9750K563l9646
$$ 46022 -21854 24319 44723 -31318 59962 -8061 622 44052 -6375 23375 25938 -13708
402a3708L1220J2491n6221P5220n7145m023N1633o7438N3769j9884k4266L0229
$$ -13708 17512 30003 -26218 49002 -8143 -12166 39467 -27971 25798 5914 -18352 11877
414A1877j0806k7391N6059m1380k0474O5978q2393O1314j0211l8000N2799m1047
$$ 11877 1071 -26320 29739 -11641 -32115 33863 -48530 12784 2573 -35427 17372 -23675
426b3675L305L3402l4932o36M2766p5700O3765j0333m3397Q0221p8292L1040K4442
$$ -23675 -20370 13032 -21900 -22536 20230 -55470 8295 -2038 -45435 34786 -43506 -12466 11976
439A1976m2883L1075K688l6354M0519q534l0214O9254p2820L6030J5537m9629
$$ 11976 -30907 168 2856 -33498 7021 -1513 -31727 37527 -35293 737 16274 -33355
451c3355N9634k8124p841K2439p249j4247M3865m5959J7006K8928o6218O9163
$$ -33355 26279 -1845 -9686 12753 5504 -8743 35122 -10837 6169 35097 -31121 38042
463C8042l1302j0367L6257l1946K99L0025k7138L780L0792o7398P0693l2020k2558
$$ 38042 6740 -3627 32630 684 983 31008 3870 7650 38442 -28956 41737 9717 -12841
476a2841O0007o9080L7283N044l2552K7378N56l7667M8331l2902j3236O3131q4118
$$ -12841 47166 -21914 15369 20413 -12139 15239 15795 -21872 26459 -6443 -19679 43452 -40666
489d0666N5382q609l6318N2867l7060j019K3447k1649q077L6817n0439M0253o313
$$ -40666 14716 6107 -30211 22656 -14404 -15423 8024 -13625 -21702 15115 -35324 4929 -1384
502a384l9414O0769m8823K0106J2853l1563J1297K3253l2409J5207J8063m8172
$$ -1384 -40798 19971 -28852 -8746 4107 -27456 -16159 7094 -25315 -10108 7955 -40217
514d0217O0354m2715Q942L1041m8064L6820p426j8668K6924L157l8084N1196l3325
$$ -40217 20137 -22578 -13636 17405 -30659 6161 -1265 -19933 6991 10148 -27936 23260 -10065
527a0065L349L9601o5910O1120k3655j5939L8744l0261M560K7131l2872L549L6014
$$ -10065 -6716 32885 -33025 28095 4440 -11499 27245 -3016 1544 28675 -4197 -648 35366
540C5366n5310N5255k7669j9672N1947m8697K6583J114k1094J6495P411l2870
$$ 35366 -19944 35311 7642 -12030 39917 -8780 17803 18917 -2177 14318 21729 -11141
552a1141L5673j3189k5459N0714n7581L3327N151l1567K8295j4800o691J9877
$$ -11141 24532 11343 -14116 36598 -20983 12344 17495 -14072 14223 -577 -7268 12609
564A2609j1339k4948M7863m6690J8041J4429m3967N0229l3110J670J7549j9408
$$ 12609 1270 -23678 24185 -22505 -4464 9965 -34002 16227 -16883 -15213 2336 -17072
576a7072L678K2485l6723J4911K5789n2402N5931l5763j949L5346m1616K3538
$$ -17072 -13394 9091 -27632 -12721 13068 -39334 16597 -19166 -21115 14231 -27385 -3847
588c847K477j7031J3284R074l4337M8217k7471p030M1709n7636M6465j0919j8757
$$ -3847 -1370 -18401 -5117 3957 -30380 17837 -9634 -16664 25045 -32591 13874 2955 -15802
601a5802K8977j4537n624K2892j7513m027L5845n0220M0578r904k0368M3097l9927
$$ -15802 13175 -1362 -6986 15906 -1607 -5634 30211 -20009 20569 10665 -9703 33394 -6533
614f533J4915Q758j2210K869J4184k9061K3536K646l1144M4753m0176J7540R260
$$ -6533 8382 17140 4930 7799 21983 -7078 16458 19104 -12040 32713 -7463 10077 19337
627A9337k5165J8591j946j2494R841L337l1132M6533l7612O266K5441m5904L9895
$$ 19337 -5828 12763 10817 -1677 8164 11501 -19631 26902 -10710 -4444 20997 -24907 14988
640A4988j8892q404J8416j2433q959K4439k6851P839K4395n4245N2829k8439m792
$$ 14988 -3904 -12308 6108 -6325 -15284 9155 -17696 -9857 14538 -39707 13122 -15317 -20109
653b0109L2706l9892K0119L045j2345Q104R188k8455L5370j8117r885L5260m3273
$$ -20109 12597 -27295 -7176 -4131 -16476 -8372 816 -27639 7731 -10386 -20271 14989 -28284
666b8284L3444r004j1905J9304n680q236J4113k400j7741L9242l9531K3118M865
$$ -28284 5160 -3844 -15749 3555 -2125 -10361 3752 1352 -16389 22853 -16678 6440 11305
679A1305k4954L3745k3279L587J4030q892j0356K9034l0758J7413J2846m0431
$$ 11305 -13649 20096 -3183 404 14434 5542 -4814 24220 -6538 10875 23721 -16710
691a6710M8507l3914P865J7760k9507J7478M902j6798J0800N225k8863M1628l3817
$$ -16710 31797 -2117 5748 23508 -5999 11479 16381 -417 10383 15608 -13255 28373 -5444
704e444M152K5007m0572L5390j8743m763J2947n960r790J6615j5528k666K5546
$$ -5444 -1292 23715 -16857 18533 -210 -4973 7974 2014 -7776 8839 -6689 -9355 16191
717A6191m1415L4093j4490q725K1800k2504Q789N312q758n585K2647l2703K6801
$$ 16191 -25224 8869 -5621 -14346 7454 -15050 -6261 -949 -9707 -15292 7355 -25348 1453
730A453l576k5429L9217l3195J6884K766j5069J3992K610j6768J6405l14k0019
$$ 1453 -2123 -27552 11665 -21530 -4646 -1880 -16949 -2957 -347 -17115 -710 -1024 -21043
743b1043M0108m0555J9864J0383k7450L2902k0369K713R868m222q575K0908k2125
$$ -21043 19065 -21490 -1626 8757 -18693 14209 -6160 -3447 6421 2199 -6376 14532 -7593
756g593J1976J2394l1941L8890k5109M749J2247j6742R877M329r287k82J6685
$$ -7593 4383 16777 -15164 23726 -1383 3366 15613 -1129 8748 13077 3790 3508 20193
769B0193k8232L0516j9096m248K5564l2170K1950o535q114R159K305j8559K1424
$$ 20193 -8039 22477 3381 -867 24697 -7473 14477 7942 -172 8987 11292 -7267 14157
782A4157j0420j1708K9635m1035L0116o826j5719K2763j9435M586P315r950n132
$$ 14157 3737 -7971 21664 -19371 10745 3919 -11800 10963 -8472 -3886 3429 -6521 -11653
795a1653K3705l3231K1963k144k1731L4234l0021J4706O56r958O874L606j2021
$$ -11653 12052 -21179 784 -1360 -23091 11143 -18878 -4172 -3516 -13474 -6600 -2994 -15015
808a5015Q924O329k4222L4702k8619J0601J2053k2178J9464q487m34N038L749
$$ -15015 -6091 238 -23984 10718 -17901 -7300 4753 -17425 2039 -6448 -6882 -1844 1905
821A905j6802K6368j9150J769K1559l4170L3625j6466k915J6640j4021L666R285
$$ 1905 -14897 11471 -7679 -5910 15649 -18521 15104 -1362 -4277 12363 -1658 2008 11293
834A1293j0754L32K0599l3476L0885j3900p599K5436k8647J8040m492l584M714
$$ 11293 539 871 21470 -12006 18879 4979 -2620 22816 -5831 12209 7717 4133 8847
847H847K492j3894J5738o121j1873K7117l3376K1455k170j2534J3312q232K8J174
$$ 8847 11339 -2555 13183 7062 -4811 22306 -11070 10385 8215 -4319 8993 761 789 1963
861A963J481j2633K1851k4424J2673N398k4412K8926k1300N818L995o649j176
$$ 1963 3444 -9189 12662 -11762 911 6309 -18103 10823 -10477 -4659 -664 -7313 -8489
874h489R706j4750O126J2221k8686L2827k4033N887J3276k3465K0396p840l581
$$ -8489 1217 -13533 -7407 4814 -23872 8955 -15078 -9191 4085 -19380 1016 -6824 -10405
887a0405N593L156j5019K3360j5048j175J8146k7976K9732j6267M0J1550r539
$$ -10405 -4812 -1656 -16675 6685 -8363 -9538 8608 -19368 10364 -5903 -5863 5687 -3852
900c852K951N117k697p250K0537k4521K1060o043r718K1406k0382J0578O92j947
$$ -3852 -901 4216 1519 -5731 14806 -9715 11345 5302 -4416 16990 -3392 7186 7878 5931
914E931l262J1760j6508J2096L847k1229K8933k6813J5067K677j7049J6031o124
$$ 5931 2669 14429 -2079 10017 13864 -7365 21568 -5245 9822 12499 -4550 11481 5357
927E357n047N865K509j5514K3952k4211J0314P277k2833K6132k1456P345L683
$$ 5357 310 6175 8684 -6830 17122 -7089 3225 10502 -12331 13801 -7655 -310 3373
940C373p289J168M569q994R22J2411k5136K4295j4931K792Q654j5880J2626n882
$$ 3373 -3916 -2748 1821 -7173 -6251 6160 -18976 5319 -9612 -6820 1834 -14046 -1420 -7302
954g302M80j994R397j7058J7705n820j0102K2227k5104J8492o459k835Q805m617
$$ -7302 -6822 -8816 581 -16477 1228 -4592 -14694 7533 -17571 921 -5538 -8373 432 -4185
968d185l086Q278k097q729K3924k8512K0863l357j2429K2936k1492J2532N25l916
$$ -4185 -7271 1007 -1090 -9819 14105 -14407 6456 3099 -9330 13606 -7886 4646 5171 1255
982A255J097Q353j3646J0346L061j6117K4504k3328J5397j505r455R809m897n3
$$ 1255 2352 10705 -2941 7405 10466 -5651 18853 -4475 10922 9417 -38 9771 4874 4821
996D821P5O192j5671K0637j6353K995J2861k2603J8339r902o21K982j491n708
$$ 4821 4896 11088 -4583 16054 -299 2696 15557 -7046 11293 1391 770 3752 2261 -3447
1010c447R468q540k557J6371k8308K6179j2750o401J7332j7809Q438j32l870j059
$$ -3447 6021 -2519 -5076 11295 -17013 9166 -3584 -9985 7347 -10462 -2024 -2156 -6026 -7085
1024g085Q867j7461J7719q090p763J9739k4688J8965o166l247N742j679k561L762
$$ -7085 1782 -15679 2040 -6050 -13813 5926 -18762 203 -5963 -9210 -3468 -5147 -7708 -3946
1038c946L037j2645K0383j9883J3071P06j1689J5774j1063O703p65K695q361J5439
$$ -3946 -909 -13554 6829 -13054 17 723 -10966 4808 -6255 448 -317 2378 -5983 9456
1052I456j3484M493J1116k1691K4529j6883M750O492r453P244j40l314J469Q083
$$ 9456 -4028 465 11581 -10110 14419 -2464 2286 8778 -675 6569 6429 3115 4584 12667
1066A2667j8202K2635j6220K415J2271k1049J9551j0694J161K70Q57m228N493
$$ 12667 -5535 17100 880 3295 15566 -5483 14068 3374 4535 4805 5662 1434 6927
1079F927l785m640J2906j9908J7864j0514j190R501j2109O160l044K434p574J2314
$$ 6927 3142 -1498 11408 -8500 9364 -1150 -2340 7161 -4948 1212 -1832 602 -6972 5342
1093E342j4613Q895K3j2059J8695j9774J3002l537l460K859J674o589N032L461
$$ 5342 -9271 -376 -353 -12412 6283 -13491 -489 -4026 -7486 -4627 -2953 -9542 -4510 -1049
1107a049j4495K2934k2469J2340J773j2609J7806j2409M413J849p45m743J0774
$$ -1049 -15544 7390 -15079 -2739 -966 -13575 4231 -8178 -3765 -1916 -2661 -7404 3370
1120C370j0037N129Q260j9297K2312j5465P339L681p492N983p90N27l085J0269
$$ 3370 -6667 -1538 6722 -12575 9737 -5728 1611 5292 -2200 3783 2993 3520 435 10704
1134A0704j6111J6468p821l720J3667j7388J5040o112j478J708L978q626P321
$$ 10704 -5407 11061 3240 -480 13187 -4201 10839 4727 3249 4957 8935 309 7630
1147G630j360r513J9639k2355J5512m692o418J1526j1545L829J837j376n999J1250
$$ 7630 6270 -3243 16396 -5959 9553 4861 -1557 9969 -1576 2253 4090 2714 -3285 7965
1161G965j5686J1663j384j2382J8260j8285R925k137k993J884O33l630J404M858
$$ 7965 -7721 3942 2558 -9824 8436 -9849 76 -2061 -5054 -3170 -2537 -6167 -4763 95
1175I5j3100J8878j7591O980N022j2655J2038o340K347k009N801r012J0976p478
$$ 95 -13005 5873 -11718 -4738 284 -12371 -333 -6673 -4326 -6335 -534 -9546 1430 -6048
1189f048j120J2309j9613K0297j0980K388O079p340L257L811l440k341J2581j7805
$$ -6048 -7168 5141 -14472 5825 -5155 -2767 3312 -4028 -771 3040 -400 -2741 9840 -7965
1203g965J6304q020l241J3025j4540J4324o779J87J792K557p121P428j106r185
$$ -7965 8339 319 -2922 10103 -4437 9887 3108 3295 5087 7644 523 7951 6845 -2340
1217b340J6678j7383J2319m213m415Q285o463K022j149M208r325J2415j3209N719
$$ -2340 14338 -3045 9274 5061 646 8931 2468 4490 3341 7549 -1776 10639 -2570 3149
1231C149L741j3312J6179j2869M383m32j820j040M583o636L21Q085j5766J8537
$$ 3149 6890 -6422 9757 -3112 1271 839 -981 -2021 2562 -4074 -3753 4332 -11434 7103
1245G103j5725L971O936j3011J0357n487Q25j99L355q667J1329p505j596J2017
$$ 7103 -8622 -4651 2285 -10726 -369 -5856 -5031 -5230 -1875 -10542 787 -6718 -8314 3703
1259C703j7564J5366p898J848M292n155K510J489k14n124J3028j5300J3784n151
$$ 3703 -13861 1505 -6393 -4545 -253 -5408 -2898 -1409 -1623 -6747 6281 -9019 4765 -386
1273c86n370J2085j0940Q337l290J238j260O709q652N816K867j1087J6893j7432
$$ -386 -5756 6329 -4611 3726 436 1674 414 7123 -1529 4287 7154 -3933 12960 -4472
1287d472J0984N24p163P719m986J283P67L660j0463J3915j2276M882M413j3407
$$ -4472 6512 7036 -127 7592 2606 3889 4656 8316 -2147 11768 -508 4374 8787 -4620
1301d620J5889j1737L365J258k158j622L756m721j497R643j5801J5200j2109K350
$$ -4620 11269 -468 2897 4155 1997 375 4131 -590 -2087 7556 -8245 6955 -5154 -2804
1315b804O956j0751P603m491R55k610N921j0556J0799n811m660J2612j6405J3767
$$ -2804 4152 -6599 1004 -3487 -2532 -5142 779 -9777 1022 -4789 -9449 3163 -13242 525
1329E25n095j280L887l323q22M066j084o909J4235j4223J0984k753o814J3670
$$ 525 -4570 -5850 -1963 -5286 -6108 -2042 -3126 -10035 4200 -10023 961 -1792 -8606 5064
1343E064j1359O588j765J294k108O092q082N443N285j1171J3560j2797Q393N26
$$ 5064 -6295 293 -1472 -178 -2286 3806 -4276 1167 6452 -4719 8841 -3956 4437 4963
1357D963n285O050l079M13l58N184j1004J3675q447N96O549j2226J3558r221K202
$$ 4963 -322 5728 2649 3062 2704 7888 -3116 10559 2112 2708 9257 -2969 10589 1368 3570
1372C570J674j120k285M625m717j886J0490j5441J3422q738p04O577q640M918
$$ 3570 5244 4124 1839 6464 1747 -139 10351 -5090 8332 -406 -1110 5467 -3173 1745
1386A745k474J167l187N365j0118R228l694n044J2222j4944J0050m499j096L410
$$ 1745 -729 438 -2749 2616 -7502 1726 -1968 -7012 5210 -9734 316 -4183 -5279 -1869
1400a869j743j486N89L454q816J3883j4751P891M35o927J1783r224M517j927K428
$$ -1869 -3612 -5098 -4509 -1055 -9871 4012 -10739 -2848 -2413 -9340 2443 -6781 -2264 -4191 -1763
1415a763k811O341p123L162N914j1972J3970j0070M422J730m657M516k50k6q36
$$ -1763 -4574 1767 -5356 -2194 3720 -8252 5718 -4352 70 1800 -2857 1659 1409 1383 547
1430E47N755r723J2306p816n61Q440j1448J1514o880L92J871J330l977L082j075
$$ 547 6302 -3421 8885 1069 508 8948 -2500 9014 2134 2526 4397 5727 1750 4832 3757
1445C757m006J0373j4323J2716o834j609P158p486L186k27P53m718P476j0784
$$ 3757 -249 10124 -4199 8517 1683 74 7232 -254 2932 2705 3458 -1260 6216 -4568
1459d568Q184j726p679J3026j4056Q749k745l391L440l30l425J869K720r139J2075
$$ -4568 3616 1890 -5789 7237 -6819 1930 -815 -4206 -766 -1096 -4521 -2652 68 -9071 3004
1474C004j2769P247R06p372R763p864M062j270K075m536O269n259J394N943j1461
$$ 3004 -9765 -2518 -1612 -8984 779 -7085 -3023 -4293 -2218 -6754 -485 -5744 -4350 1593 -9868
1489i868J2682p957K005K716k665J821J520r1k575P604j0074J0384o185r08R461
$$ -9868 2814 -5143 -3138 -422 -3087 -1266 254 163 -2412 5192 -4882 5502 -683 -1591 7870
1504G870j0757P729l911J257Q77L205n582M325q31m981J0724j2480J0681m036
$$ 7870 -2887 4842 931 2188 3065 6270 688 5013 4182 -799 9925 -2555 8126 4090
1518D090l377O686o883M319j620J183m879Q350q721M154K066q435R916j0271O034
$$ 4090 713 7399 516 4835 3215 4398 -481 7869 -852 3302 5368 -3067 6849 -3422 2612
1533B612j951j929J360J347k941j332N313q468R661q602K564L407p921P047l941
$$ 2612 661 -1268 92 1439 -1502 -2834 2479 -5989 3672 -4930 -2366 1041 -6880 167 -3774
1548c774L1o17M301q181R266n591j594Q902j3533J1684o224J694L017m124K315
$$ -3774 -3743 -4360 -59 -8240 1026 -4565 -6159 2743 -10790 894 -5330 -3636 -619 -4743 -2428
1563b428l46Q9k084Q521j0313Q781l786j490P062q212P009l921J996l60K728m625
$$ -2428 -2774 -2685 -4769 3752 -6561 2220 -1566 -3056 4006 -4206 2803 -1118 878 518 3246 -1379
1579a379M121K120p146J0893j0825P201j445k465M309l842K354Q8J419n728R444
$$ -1379 2742 4862 -2284 8609 -2216 4985 3540 1075 5384 1542 3896 3984 5403 -325 9119
1594I119r105M523K817j0361J0894p964L621q14j445P02J023j784k30L964j0599
$$ 9119 14 4537 7354 -3007 7887 -77 3544 2730 1285 1987 3010 1226 996 4960 -5639
1609e639J2060j0565M015K749p001O897m605Q14k072M378p155N651k859j090N217
$$ -5639 6421 -4144 -129 2620 -4381 2516 -2089 -1275 -3347 1031 -6124 -473 -3332 -4422 795
1624G95r355R537o524K040J081j340M01p85K489n257Q781j0154P864j374m399
$$ 795 -8560 977 -5547 -3507 -2426 -3766 -3365 -4150 -1661 -6918 1863 -8291 -427 -1801 -6200
1639f200Q850o981K988P2O45k159N022n086L577J599p145J2798j1368O302q91
$$ -6200 2650 -4331 -1343 -1271 -626 -2785 2237 -2849 728 2327 -4818 7980 -3388 2914 2023
1654B023k608M122k501K641j726L041o188P964o844L084M254q275Q865p480L681
$$ 2023 -585 3537 1036 3677 1951 4992 -1196 6768 -76 3008 7262 -1013 7852 372 4053
1669D053r12P07j496J720j323k417P601j1273R728o144O17K889m777L433k791
$$ 4053 3141 3848 2352 4072 2749 332 7933 -3340 6388 244 861 3750 -1027 2406 -385
1684c85P26j587M629q500O874j382n761P880r678Q324l875r42K127j433j81J48
$$ -385 341 -1246 3383 -5117 1757 375 -5386 2494 -7184 1140 -2735 -3677 -1550 -2983 -3164 -3016
1700c016J416n315P690q331Q381l429m264Q478p817M914j998J692j723K379k213
$$ -3016 -1600 -6915 775 -7556 825 -2604 -6868 1610 -6207 -1293 -3291 -1599 -3322 -943 -3156
1715c156N03L585o759J0034r210N317O09l061L418j376J535j865N077p851Q590
$$ -3156 -2653 932 -5827 4207 -5003 314 923 -2138 1280 -96 1439 -426 4651 -3200 5390
1730E390n757R04O146r027J0217p124K020M62P55k622M172k064k906P357j0562
$$ 5390 -367 537 6683 -2344 7873 749 2769 3231 3986 1364 5536 3472 566 7923 -2639
1745b639J0270n382q79M205o251N747l760J505j476L008o905N531j002l995P144
$$ -2639 7631 2249 1370 5575 -676 5071 1311 2816 1340 4348 -2557 2974 1972 -2023 5121
1760E121j0566O739l462P86J87M71j218r3K845p734Q765p204K819R46n614P274
$$ 5121 -5445 1294 -2168 -1382 -1195 -724 -1942 -2035 810 -6924 1841 -5363 -2544 -1598 -7212 62
1776F2m503K565j406M98l310N294l830J205M599p665R105p920L711J412l067K616
$$ 62 -4441 -1876 -3282 -2784 -6094 -800 -4630 -3425 1174 -6491 2614 -5306 -1595 -183 -3250 -634
1792f34n56M29j261M300p033R149o050J332M703q191Q910n076K052j164J821j583
$$ -634 -1190 -761 -2022 2278 -4755 4394 -1656 -324 4379 -3812 5098 22 2074 910 2731 1148
1808A148J814m09l235Q477r404P818l169j670L740l758L080k310J882n035O614
$$ 1148 2962 2553 -682 7795 -1609 6209 3040 1370 5110 1352 4432 2122 4004 -1031 5583
1823E583o059K657J336n232Q083r436P004j772k137J199L33k389Q74J798p115
$$ 5583 -476 2181 3517 -1715 6368 -3068 3936 2164 27 1226 1559 -830 44 1842 -5273
1838e273R350r076M648M8m452O180m831K280k191J713l147M388l418j172N756
$$ -5273 4077 -4999 -351 -303 -4755 1425 -3406 -1126 -3317 -1604 -4751 -363 -3781 -4953 803
1853H03p510P172n828L122M20j500J763j694J947l411O106p411O651j674j940
$$ 803 -6707 465 -5363 -2241 -1821 -3321 -1558 -3252 -1305 -4716 1390 -6021 630 -1044 -2984
1868b984O131p098N495k477Q11j513M029l819L082R18m857R320r778P632k689
$$ -2984 3147 -3951 1544 -933 -122 -1635 2394 -1425 1657 2575 -2282 7038 -2740 4892 2203
1883B203k312M902m709L397j549K660m796O165o036K637K162n965O976p055N520
$$ 2203 -109 4793 84 3481 1932 4592 -204 5961 -75 2562 4724 -1241 5735 -1320 4200
1898D200k379O51J28p29J18k401M091o469P765o804K319J622m706M204l811L029
$$ 4200 1821 2472 2600 1871 1989 -412 3679 -2790 4975 -1829 490 2112 -2594 1610 -2201 828
1914H28l012L712n371M332l127p07N740r447P296n702K669R96k141J155m86J496
$$ 828 -2184 1528 -3843 489 -2638 -3345 2395 -7052 244 -5458 -2789 -1793 -3934 -2779 -3265 -1769
1930a769l199O048p960P359l534j054M912o254O345l500J498r47K763l106J648
$$ -1769 -4968 1080 -6880 479 -3055 -4109 803 -5451 894 -2606 -1108 -2055 708 -2398 -750
1945g50J513l395P402p545O160l408l21L033l562K808j313L803n509O087m335
$$ -750 763 -2632 4770 -2775 3385 -23 -344 2689 -873 1935 622 4425 -1084 5003 668
1960F68J656K699o981P477m496K994k433N15JJ870j693j887M167o563Q817o937
$$ 668 2324 5023 -1958 5519 1023 4017 1584 2099 2100 3970 2277 390 4557 -2006 6811 -126
1976a26K275J076m167N964m991J910k560L668n895M291k457j749N763q040O945
$$ -126 2149 3225 -942 5022 31 1941 -619 3049 -2846 1445 -1012 -2761 3002 -5038 1907
1991A907n475K655j77j682J127j047R52l375N323o444N302j167l429N557m816
$$ 1907 -3568 -913 -1090 -2772 -1645 -2692 -1740 -5115 208 -6236 -934 -2101 -5530 27 -4789
2006d789M217k858J826j697K705k774J037K701m912P468p651N605j410k132L874
$$ -4789 -572 -3430 -1604 -3301 -596 -3370 -2333 368 -4544 2924 -4727 878 -532 -2664 1210
2021A210k586K627j576L025m732O384n222K283J640n340P908n520L657k838J703
$$ 1210 -1376 1251 -325 2700 -2032 4352 -870 1413 3053 -2287 5621 101 3758 920 2623
2036B623j043J268j71j668M428o970P235n642J669L624n239K905k387K026k105
$$ 2623 1580 2848 2677 1009 5437 -1533 5702 60 1729 5353 114 3019 632 2658 553
2051E53M258o615M545j625k875O789q601O692l628M50K19p11K34m19M59l823O215
$$ 553 4811 -1804 2741 1116 -1759 5030 -3571 3121 -507 -57 162 -549 -315 -734 -275 -4098 2117
2068B117o791M796j486m130N646n227M685k935J864k049K451k529m32M391o274
$$ 2117 -4674 122 -1364 -5494 152 -5075 -390 -3325 -1461 -3510 -1059 -3588 -4020 371 -5903
2083e903P938p896N423j595JJ985j320J171j445L800o739P219n436J715L551o098
$$ -5903 2035 -5861 -438 -2033 -2032 -47 -1367 -196 -1641 2159 -4580 2639 -2797 -1082 2469 -3629
2099c629P767n313K977k206K713k253K439k22k822O054o826O611m741J146K857
$$ -3629 4138 -1175 1802 -404 2309 56 2495 2273 -549 5505 -1321 5290 549 1695 4552
2114D552l812L331k619L114l692L503m783M612j083l336O645q426M962k345N23
$$ 4552 740 4071 1452 4566 874 4377 -406 4206 3123 -213 6432 -1994 2968 623 1146
2129A146o38J078j343n40K874n810O351o097K342q97k312O075n887L196j859K853
$$ 1146 508 1586 243 -297 2577 -3233 3118 -2979 -637 -1534 -3846 2229 -3658 -462 -2321 532
2145E32m164L889l532L21L899o181P534p025L596K22k701L228k742J595k465N138
$$ 532 -3632 257 -3275 -2954 945 -5236 2298 -4727 -1131 -909 -3610 -382 -3124 -1529 -3994 1144
2161A144n785N635l242m0L176m701N961m542K716j183K781j979O26O49l838P733
$$ 1144 -4641 994 -2248 -2288 888 -3813 2148 -2394 322 -861 1920 -59 567 1216 -2622 5111
2177E111q124O765k993o5K410l182L079j781K044l256N045m227K673N40m675O832
$$ 5111 -3013 3752 759 694 3104 -78 3001 1220 3264 8 5053 826 3499 4039 -636 6196
2193F196p580M856k308J495J98j250N97j152K607o580P391n448K508K60k829K921
$$ 6196 -1384 3472 1164 2659 2857 1607 2204 1052 3659 -2921 4470 -978 1530 1790 -1039 1882
2209A882l882L669l076K242m074L931l333o52M741o234N800n707K992m56p00J147
$$ 1882 -2000 1669 -1407 835 -3239 692 -2641 -3293 1448 -4786 1014 -4693 -1701 -2157 -2857 -1710
2225a710q33O73k817N941o827N516k976q01M776m911M571l411J802j147K054k179
$$ -1710 -2543 -1870 -4687 1254 -5573 -57 -3033 -3834 942 -3969 602 -2809 -1007 -2154 -100 -2279
2241b279N88J869l022O049p188N666j289m85J466j967K239j695L139m528M882
$$ -2279 -1691 178 -2844 3205 -3983 1683 394 -91 1375 -592 1647 -48 3091 -1437 3445
2256C445l003J394J112l071M088m774M801k484N22N45j23l80q80L235n727P138
$$ 3445 442 1836 2948 -123 3965 -809 3992 1508 2030 2575 2452 2072 1192 4427 -1300 5838
2272E838n155J306J672l968L067k899K185k829K475k562K604k270p12M251o816
$$ 5838 683 1989 3661 -307 2760 -139 2046 -783 1692 -870 1734 -536 -1248 3003 -3813
2287c813N925m519K241j294j407R28K21K97j474M652p237N695k983l16L032m728
$$ -3813 2112 -2407 -166 -1460 -2867 -1939 -1718 -1421 -2895 1757 -5480 215 -2768 -3084 -52 -4780
2303d780M436l904L375l068L126k221J399J793n047O701n182M526k946L89K712
$$ -4780 -344 -4248 -873 -3941 -815 -3036 -1637 156 -4891 1810 -3372 1154 -1792 -1403 1309
2318A309l156K591k163K286l220N597n351K524K337l324M865n451L614j920J787
$$ 1309 -1847 744 -1419 867 -2353 3244 -2107 417 2754 -570 4295 -1156 2458 538 2325
2333B325r86Q32r6q25L718o016N243l515J656Q15l787M547m380L349k477L407
$$ 2325 1339 2171 2075 1250 4968 -1048 4195 680 2336 3151 -636 3911 -469 2880 403 3810
2349C810m276L112j447j618M015o068N028l747J875l92o79k53k19J799l575M890
$$ 3810 -466 2646 1199 -419 3596 -2472 2556 -1191 684 292 -387 -640 -859 940 -2635 2255
2365B255o352L594l11l022M523m627M164l300J462j246L317k940j88K233m887
$$ 2255 -4097 -503 -814 -3836 687 -3940 224 -3076 -1614 -2860 457 -2483 -2671 -438 -5325
2380e325O165n487M797k756l55K435j766J418k416M508m672M248k918J430K608
$$ -5325 840 -4647 150 -2606 -2961 -526 -2292 -874 -3290 1218 -3454 794 -2124 -694 1914
2395A914m331N210n014M025j709N18j78J46R28k014M860n979O183m090J585Q94
$$ 1914 -2417 2793 -2221 1804 95 613 435 581 1509 -505 4355 -1624 4559 469 2054 2948
2411B948j995K834l382K700k685L942l815K263r03j913M654n919M878k910k37
$$ 2948 953 3787 405 3105 420 4362 547 2810 1907 -6 4648 -1271 3607 697 460
2426D60K252j152j30j850K421l962N353o500M428j459j807L040l899M222l569
$$ 460 2712 1560 1430 -420 2001 -1961 3392 -3108 1320 -139 -1946 1094 -2805 1417 -2152
2441b152K418k378K456k751r96L925n020N701n027K081K2j182J203j129J360j925
$$ -2152 266 -2112 344 -2407 -3403 522 -4498 1203 -3824 -1743 -1721 -2903 -1700 -2829 -1469 -3394
2457c394M104m399M108l082N79K843m300N090l772K265j88J46m65J578n80j410
$$ -3394 710 -3689 419 -2663 -2084 759 -3541 1549 -2223 42 -146 0 -465 1113 533 -877
2473h77L595m622M630m009K252L6j075L071j977J331j040J243l016K634P04l088
$$ -877 2718 -1904 2726 -1283 969 1005 -70 3001 1024 2355 1315 2558 -458 2176 2880 -208
2489b08L440l282L562k763K131j158j92R84k108K906m370M699l786J645J30k900
$$ -208 3232 -50 3512 749 2880 1722 1530 2514 406 3312 -1058 3641 -145 1500 1630 -1270
2505a270K782l053L554k266P61j927K469k721j65L474n730O667n948K123q10j20
$$ -1270 1512 -1541 2013 -253 508 -1419 1050 -1671 -1836 1638 -4092 2575 -3373 -1250 -2060 -2180
2521b180K232k489K171l252L971m092K315j584J52K165k887K561j715J670j490
$$ -2180 52 -2437 -266 -3518 453 -3639 -1324 -2908 -2756 -591 -3478 -917 -2632 -962 -2452
2536b452M17k27K028M01k804M776m836L695k007L41J663j304J771j860K875l478
$$ -2452 -2035 -2262 -234 167 -2637 2139 -2697 998 -1009 -668 995 -309 1462 -398 2477 -1001
2552a001L558k361J730L16l248N702n147M392k228K53o69J146n05j133L570m502
$$ -1001 2557 196 1926 2242 -1006 4696 -451 3941 1713 1966 1297 2443 1938 805 4375 -127
2568a27M481n200K174P98k758L684k953J286j357J622k218K636j959j719M203
$$ -127 4354 -846 1328 2126 -632 3052 99 1385 28 1650 -568 2068 109 -1610 2593
2583B593n207M224l395J568l24n47O63j093J314k646L576m855M235k152j377L607
$$ 2593 -2614 1610 -1785 -217 -541 -1088 -425 -1518 -204 -2850 726 -4129 106 -2046 -3423 184
2599A84k681J745j015M11j125J968j858M22J387l078N224m787L362j244m35K006
$$ 184 -2497 -752 -1767 -1356 -2481 -513 -2371 -1949 -562 -3640 1584 -3203 159 -1085 -1520 486
2615D86k819K197q24K570l303K565k985K308J593l098L804k757L044k447J088
$$ 486 -2333 -136 -960 1610 -1693 872 -2113 195 1788 -1310 2494 -263 2781 334 1422
2630A422o88J378r25m86K634m573M577k156R04J487l129K670j844K103l241K467
$$ 1422 734 2112 1187 701 3335 -1238 3339 1183 2087 3574 445 3115 1271 3374 133 2600
2646B600l127K784p26j623L182n001N246l623J871j106o01N7p88J595k574K988
$$ 2600 -527 2257 1531 -92 3090 -1911 3335 -288 1583 477 -124 -67 -855 740 -1834 1154
2662A154m880N055l106J76L115n042L128k618K898l430K057j342R26J698l660
$$ 1154 -3726 1329 -1777 -1601 1514 -3528 -400 -3018 -120 -3550 -1493 -2835 -1909 -211 -3871
2677c871M092l919L254j907n86K722k128K030j983K165k874M057l328J800J005
$$ -3871 221 -3698 -444 -2351 -2937 -215 -2343 -313 -2296 -131 -3005 1052 -2276 -476 529
2692E29k580L960l936K672m86P9j592J740N03j417L104k925L499k524M72P09j756
$$ 529 -2051 1909 -2027 645 159 238 -1354 386 889 -528 2576 -349 3150 626 1098 1807 51
2709E1K957k370J671j524J909k498K088M29k104K682l171L541l355J589n36l35
$$ 51 3008 638 2309 785 2694 196 2284 2713 609 3291 120 3661 306 1895 1359 1024
2725A024m44o85K329l344L941n015K706o48j746K543k916L320k912J585j974K730
$$ 1024 580 -105 2224 -1120 2821 -2194 512 -136 -1882 661 -2255 1065 -1847 -262 -2236 494
2741D94k746J895m01k471N597o061M012k286N50P70j491J061j842L136l224L798
$$ 494 -2252 -357 -758 -3229 2368 -3693 319 -1967 -1417 -647 -2138 -1077 -2919 217 -3007 791
2757G91k512J0J776l995M678k573K352j537J180j091J375j86j648L253l776K936
$$ 791 -1721 -1711 65 -3930 748 -1825 527 -1010 170 -921 454 268 -1380 1873 -1903 1033
2773A033j738J804K47j532K216k029K393k288K704k568K683r49k296L881m569
$$ 1033 -705 1099 1346 -186 2030 1 2394 106 2810 242 2925 1976 -320 3561 -1008
2788a008M986l602R83o48P7R86j377K267k914K963k905K336j497k53J400k645
$$ -1008 3978 376 1359 711 788 1774 397 2664 -250 2713 -192 2144 647 394 1794 -851
2804h51K036j946K85p94K040j123j38J837l573L854m104K775j985j55J069j222
$$ -851 1185 -761 -476 -1270 770 -353 -491 1346 -2227 1627 -2477 298 -1687 -1842 -773 -1995
2820a995J051j820L470m218K786j177n10J930l187L100j703J173q72J337o92j79
$$ -1995 -944 -2764 706 -3512 -726 -1903 -2413 -483 -3670 -570 -2273 -1100 -1972 -635 -1327 -1506
2836a506J272j637L564m117L212j824N03J758k215K557k012J555k555L319k467
$$ -1506 -234 -1871 1693 -2424 788 -1036 -533 1225 -990 1567 -445 1110 -1445 1874 -593
2851e93L164o33l205L910l227M560l752J910p48Q99q24o28Q54k320L690l314J964
$$ -593 2571 1938 -1267 2643 -584 3976 224 2134 1386 2285 1461 833 1687 -633 3057 -257 1707
2868A707J51j697K128k097J837j867J710k237J749j042l67K208m052M221m220
$$ 1707 1858 161 2289 192 2029 162 1872 -365 1384 342 -25 2183 -1869 2352 -1868
2883a868L057k251K30M72j522K082k064K969m451L511j423j31J116l166L472k259
$$ -1868 1189 -1062 -832 -360 -1882 200 -1864 1105 -3346 165 -1258 -1389 -273 -3439 33 -2226
2899b226J777k550K928j643P98k8j583M420m840L205j883N08J390j780K395k402
$$ -2226 -449 -2999 -71 -1714 -916 -944 -2527 1893 -2947 258 -1625 -1117 273 -1507 888 -1514
2915a514K827l147K944j948J583l03j708L642l910M322k396R24p03K85m8K34J236
$$ -1514 1313 -1834 1110 -838 745 442 -1266 2376 -1534 2788 392 1316 613 898 850 1084 2320
2932B320k581M042m060K181M12j643K468k944L592l285J630j440J725j765q82
$$ 2320 -261 3781 -279 1902 2314 671 3139 195 3787 502 2132 692 2417 652 -230
2947b30K573m176L856k731K289j476o4L54j282J862k193L112l739K506j135Q5
$$ -230 2343 -1833 2023 -708 1581 105 41 395 -887 975 -1218 1894 -1845 661 -474 -389
2963c89M33k584K681k791K372k004O56J21P34n41r02K930m623M889l002M74P40
$$ -389 44 -2540 141 -2650 -278 -2282 -1626 -1505 -771 -1312 -2214 716 -3907 982 -2020 -1546 -806
2980h06j022J312j828K982l277K663j917J488N56j547K972k695J976k342K580
$$ -806 -1828 -516 -2344 638 -2639 24 -1893 -405 151 -1396 1576 -1119 857 -1485 1095
2995A095j692J495k25j433L695m217L948k302k05J123j318K050j815J622r21R80
$$ 1095 -597 898 673 -760 2935 -1282 2666 364 159 1282 -36 2014 199 1821 900 1880
3011A880j041P69n50K54J649k586K375l686J772o14k85J225r05J089k050K635
$$ 1880 839 1608 1058 1312 2961 375 2750 -936 836 222 -63 1162 257 1346 -704 1931
3027A931k410J626j688L8Q72k312L493l302K133j761O60j174P78R35k505L498
$$ 1931 -479 1147 -541 -503 369 -1943 1550 -1752 381 -1380 -720 -1894 -1116 -181 -2686 812
3043H12l368J941L45r58N0j271J071q66J792k286K648k653J558J173k430K448
$$ 812 -2556 -615 -270 -1228 -1178 -2449 -1378 -2244 -452 -2738 -90 -2743 -1185 -12 -2442 6
3059Fk785M143j812P53q79K39J73n27J871k198K709k525J852L12j546K775k307
$$ 6 -2779 1364 -448 305 -574 -335 -162 -689 1182 -1016 1693 -832 1020 1332 -214 2561 254
3076B54J530j857K515k195J039l07j72J992l709L367j366Q08n24q5O94j484K372
$$ 254 1784 -73 2442 247 1286 979 807 2799 -910 2457 1091 1899 1375 1290 1984 500 2872
3093B872k868K297k781K428j308n51J335k397K990k840J116j265K443k576l54
$$ 2872 4 2301 -480 1948 640 89 1424 -973 2017 -823 293 -972 1471 -1105 -1459
3108a459K993k909K582l606K773k623Q66M72j895K874k853K616k280J564j930
$$ -1459 1534 -1375 1207 -2399 374 -2249 -1383 -911 -2806 68 -2785 -169 -2449 -885 -2815
3123b815L038K54k273J951k611J652j307J320p31k18J501j289J864k832L864k975
$$ -2815 223 477 -1796 155 -2456 -804 -2111 -791 -1522 -1740 -239 -1528 336 -2496 1368 -1607
3139a607R93O61r46J626j514J508j780L314l548K757m28q45K567k933K558j341
$$ -1607 -614 47 -899 727 -787 721 -1059 2255 -1293 1464 1036 191 2758 -175 2383 1042
3155A042J197n22j005P49r52J245k483L714l206K349j700K54J885k805L340l622
$$ 1042 2239 1717 712 1461 509 1754 -729 2985 -221 2128 428 682 2567 -238 3102 -520
3171e20R59r06K271k226N16J257k611L846l972J716j209M46L94j525J446j050
$$ -520 439 -467 1804 -422 94 1351 -1260 2586 -1386 330 -879 -433 -39 -1564 -118 -1168
3187a168J660l214L428k671P67R14k196K244j538K327k875K072j278n33J334j045
$$ -1168 492 -2722 706 -1965 -1198 -284 -2480 -236 -1774 553 -2322 -250 -1528 -2061 -727 -1772
3203a772K247k766K034k297J243J353r94M43j841K605j738K341k108J268R8j018
$$ -1772 475 -2291 -257 -2554 -1311 42 -952 -509 -2350 255 -1483 858 -1250 18 116 -902
3219i02L308l817K880j877J996j424J324J55j822J646k323L742k281Q99lj120
$$ -902 2406 -1411 1469 -408 1588 164 1488 1643 -179 1467 -856 2886 605 1504 1501 381
3235C81J207j218J117j343J705j345J265n21j248K643l123L368l694K412j511
$$ 381 1588 370 1487 144 1849 504 1769 1248 0 2643 -480 2888 -806 1606 95
3250I5J026l19p12J226k401K304k325K027k346J409R44k518K393k677K788k767
$$ 95 1121 802 90 1316 -1085 1219 -1106 921 -1425 -16 928 -1590 803 -1874 914 -1853
3266a853J514j012R26l28k513K920k169L352k410L96J393k153J546j796J463j121
$$ -1853 -339 -1351 -425 -753 -3266 -346 -2515 837 -1573 -1177 216 -1937 -391 -2187 -724 -1845
3282a845J714k365K607q0k545M156l741L406k297J165p76Q79p55Q06J040k751
$$ -1845 -131 -2496 111 31 -2514 1642 -2099 1307 -990 175 -601 278 -477 329 1369 -1382
3298a382M059k957J423m66j53O39j472J769j330J258j234J115n03o39K215k355
$$ -1382 2677 -280 1143 677 524 1163 -309 1460 130 1388 154 1269 766 127 2342 -13
3314a3K890k707R40O7l42j97O2J050k042K886l484K205j266o12J364j673J187
$$ -13 2877 170 1110 1177 835 638 700 1750 -292 2594 -890 1315 49 -563 801 -872 315
3331C15k331K370j401R21j491P93N83j730K405l464L641k308J080J28j762J377
$$ 315 -2016 354 -1047 -126 -1617 -824 -241 -1971 434 -3030 611 -1697 -617 -489 -2251 -874
3347h74j695K487j779J161j731J811L5j743L426l171K643k040J359p91M43M44
$$ -874 -2569 -82 -1861 -700 -2431 -620 -585 -2328 1098 -2073 570 -1470 -111 -902 -459 -15
3363a5l34J723l082M420k991R38k83P9O79j618K091k469K042j181R57j001k3K106
$$ -15 -349 1374 -1708 2712 -279 659 376 455 1134 -484 1607 -862 1180 -1 956 -45 -68 2038
3381B038k849L178j753O93L24j014Q70o07J044k458L429k994K140j826o6J258
$$ 2038 -811 2367 614 1307 1631 617 1487 880 1924 -534 2895 -99 2041 215 149 1407
3397A407k497K111r40J338j372R62k178Q64P10k243L807l851L300j249j432J014
$$ 1407 -1090 1021 81 1419 47 1009 -1169 -305 405 -1838 1969 -1882 1418 169 -1263 -249
3413b49r50O44j558K855k648K501l520J323P08j329L447m075K085o81K324k514
$$ -249 -1199 -555 -2113 742 -1906 595 -2925 -1602 -894 -2223 1224 -2851 -766 -1447 877 -1637
3429a637J540p51j125K053j471K542k260N97j36n18J299j127K087k387K129j783
$$ -1637 -97 -848 -1973 80 -1391 1151 -1109 -512 -648 -1166 133 -994 1093 -1294 835 -948
3445i48J679l87K25J468k657J695j361J871p25j85L44J86Q29k310K501k329J332
$$ -948 731 344 569 2037 -620 1075 -286 1585 860 675 1019 1205 2034 -276 2225 -104 1228
3462A228j50p52K230k952K221o67P78j846M73k39k49J928l160K814k835K034n31
$$ 1228 1078 326 2556 -396 1825 1158 1936 90 563 324 75 2003 -1157 1657 -1178 856 325
3479C25n61P43j322J351j919K179k576J843o30%L33j990K039j883K043j487J231
$$ 325 -236 507 -815 536 -1383 796 -1780 63 -567 -567 -234 -2224 -185 -2068 -25 -1512 -281
3496b81j156L33J08o21K005j739J631j870Q73q96R60P78k275J972j546K136j585
$$ -281 -1437 -1104 -996 -1617 388 -1351 280 -1590 -717 -1613 -653 125 -2150 -178 -1724 412 -1173
3513a173J341j231N30J326k765L184j448N89m5j47Q67j699K209k614K231k12R07
$$ -1173 168 -1063 -533 793 -1972 1212 -236 353 308 161 1028 -671 1538 -1076 1155 943 1850
3530A850j693J6J773k423J418j152J515q71P36n22m95O31j064K116k574K021j011
$$ 1850 157 173 1946 -477 941 -211 1304 433 1169 647 152 783 -281 1835 -739 1282 271
3547B71p81J678j758J575q42O22j286J180j707J84J783k368K169k812K174j003
$$ 271 -510 1168 -590 985 143 765 -521 659 -1048 -864 919 -1449 720 -2092 82 -921
3563i21J71r07J10Q23j317K077j775J869j267m42K33r91J629p83J900k016J233
$$ -921 -750 -1657 -1547 -724 -2041 36 -1739 130 -1137 -1579 -1346 -2337 -708 -1491 409 -1607 -374
3580c74j096J094m85o43J292n73P13j034J131l89N77o22N51N38j403J841k180
$$ -374 -1470 -376 -861 -1504 -212 -785 -72 -1106 25 -364 213 -409 142 680 -723 1118 -1062
3597a062K802j057q47J937j882J778j244J018j177J789j094k17O56j872K417k176
$$ -1062 1740 683 -164 1773 -109 1669 425 1443 266 2055 961 744 1400 -472 1945 -231
3613b31K549j820O26Q2r37L39K89J11k124K689j987L05N91j285K236k145K065
$$ -231 2318 498 1124 1206 269 608 897 1008 -1116 1573 -414 -109 482 -803 1433 -712 1353
3630A353k382J137q17J218j137l30J523j632J398j624R12M18j859J707l91J42
$$ 1353 -1029 108 -709 509 -628 -958 565 -1067 331 -1293 -381 37 -1822 -115 -506 -364
3646c64j313K288j668o8P28k403L795k230J132j804J880r21R13n71m13J281j358
$$ -364 -1677 611 -1057 -1125 -397 -2800 995 -1235 -103 -1907 -27 -948 -35 -606 -1019 262 -1096
3663a096K293k539J835j057j52J002n64J175j728K576k471R85K24J164N33k741
$$ -1096 1197 -1342 493 -564 -716 286 -278 897 -831 1745 -726 259 483 1647 2180 -561
3679e61L669k611J096J30p01k00Q9M07q71J487j754J042r06O32Q88k359K239k132
$$ -561 3108 497 1593 1723 1022 822 911 1318 447 1934 180 1222 316 948 1836 -523 1716 -416
3697d16J422j585P50j77Q09j216m58K434k245N15l68RJ097p54L89j879J965j077
$$ -416 1006 -579 171 -6 803 -413 -871 1563 -682 -167 -535 -526 571 -183 206 -1673 292 -785
3715g85J104k000J028j60q33J876k350K330k070Q72L49j16K11q26O94j879L016
$$ -785 319 -1681 -653 -813 -1646 230 -2120 210 -1860 -988 -639 -755 -544 -1370 -676 -2555 461
3732D61j003m44K09l27J694p51K53j256R92l02J774j525l49K432j952J622j758
$$ 461 -542 -986 -777 -1104 590 -161 92 -1164 -172 -474 1300 -225 -574 1858 -94 1528 -230
3749b30J008J47m02K89p35J780j932J835j173P84j228P02N4r31J672k152K251
$$ -230 778 925 523 812 77 1857 -75 1760 587 1371 143 845 899 -32 1640 -512 1739
3766A739r87k04l31j52M36r77J990k227J081j64J13P52j768P45j92O14j526K302
$$ 1739 752 548 217 65 501 -476 1514 -713 368 204 317 1069 -699 46 -146 468 -1058 1244
3784A244k219M75M31j463J668j383J310j515O77q54P80M11q13J868k524J582j475
$$ 1244 -975 -500 -69 -1532 136 -1247 63 -1452 -775 -1629 -849 -438 -1251 617 -1907 -325 -1800
3801a800J056k88J08O86j480K057j259P31j356J247P39j824J600j413J743l5L60
$$ -1800 -744 -1032 -924 -238 -1718 339 -920 -189 -1545 -298 441 -1383 217 -1196 547 512 872
3818H72j213M37Ko22K196k115L065k933K663p36r83Q70j389P13o73J361o12J214
$$ 872 -341 96 98 -524 1672 -443 2622 -311 2352 1616 633 1503 114 827 154 1515 903 2117
3836B117j266m80L02j421K757k025J467o18o62P65r37L59j173J490j677J450p72
$$ 2117 851 371 673 -748 2009 -16 1451 833 171 936 -1 358 -815 675 -1002 448 -324
3853c24m21J212j282J271j261Q53j781Q24J36n02n2Q02R53k447K310j172o2K32
$$ -324 -745 467 -815 456 -805 48 -1733 -909 -773 -1275 -1327 -525 428 -2019 291 -881 -943 -711
3871g11l26J279j793J189j176J871j747O87J378j620J428k259K518k057J371m00
$$ -711 -1037 242 -1551 -362 -1538 333 -1414 -727 651 -969 459 -1800 718 -1339 32 -368
3887c68K58R8n60L95l37J177j952K987j911P79J441k619J425p85J252k280L079
$$ -368 -110 -12 -572 -177 -514 663 -1289 1698 -213 566 2007 -612 813 28 1280 -1000 2079
3904B079r08n16P98j810K178k364K364j331m59J530o21K63j369J135r03J724r90
$$ 2079 1171 655 1453 -357 1821 -543 1821 490 31 1561 940 1203 -166 969 66 1790 800
3921H00qk83p92J227j757J782j190N49r52J89M23j192K085k003J207j633M40M65
$$ 800 792 509 -283 944 -813 969 -221 328 -624 -435 -12 -1204 881 -1122 85 -1548 -1108 -643
3939f43P6J57p32P04j851L321k265n05L38L62J325j172L42p1J619k399J08J834
$$ -643 -567 -410 -1142 -438 -2289 1032 -1233 -1738 -1400 -1038 287 -885 -543 -614 1005 -1394 -1286 548
3957E48j558J593j815K210j370R22K51r02P17o19J745l109J624l28M99p51P32
$$ 548 -1010 583 -1232 978 -392 530 781 -121 596 -23 1722 -1387 237 -91 408 -343 389
3974C89J446k029J467j342J180o90N22J17n90R73k215K435k106L105k217j53J566
$$ 389 1835 -194 1273 -69 1111 421 943 1060 470 1443 -772 1663 -443 2662 445 292 1858
3991A858k660K106j500J555j579J443j449K31J184k050K230j609J617j706Q7K72
$$ 1858 -802 1304 -196 1359 -220 1223 -226 5 1189 -861 1369 -240 1377 -329 -242 30
4007C0j415K763k511J499j412R27j913J625j040m19J386j541J431j819K074q53
$$ 30 -1385 1378 -1133 366 -1046 -119 -2032 -407 -1447 -1866 -480 -2021 -590 -2409 -335 -1188
4023a188O36M37q69J187k763L605k415J089o6n39N46j047K066p76J043j562Q68
$$ -1188 -552 -115 -984 203 -2560 1045 -1370 -281 -347 -886 -340 -1387 679 -97 946 -616 252
4040B52L75p34R08r52J375j273J047o55M37j40Q44j69j776J799j046J573j203
$$ 252 627 -107 801 -151 1224 -49 998 343 780 640 1484 1315 -461 1338 292 1865 662
4057F62n21M23n87J884j443L74K60m13m55l5N16p51J978k403J534p06R19j86j541
$$ 662 141 564 -23 1861 418 792 1052 639 184 149 665 -86 1892 -511 1023 317 1236 1050 -491
4076d91K113k407J349j057J655j722M00N43j693K204k309J714q06J933j304j147
$$ -491 1622 -785 564 -493 1162 -560 -160 383 -1310 894 -1415 299 -507 1426 122 -1025
4092a025Q30p12Q19k527K255k048J709J66n37J56r93J664n66N41j89Q1J34j12
$$ -1025 -195 -907 -88 -2615 -360 -2408 -699 -533 -1070 -914 -1907 -243 -809 -268 -457 -376 -242 -354
4110c54J314j666K081k751K299r52j78J145j354J216p17J470j668J607j344l6
$$ -354 960 -706 1375 -1376 923 -29 -207 938 -416 800 83 1553 -115 1492 148 112
4126A12J219j528R25q07J593k85j095K07l99O71m48J046q55J008k142K099p70
$$ 112 1331 -197 728 -79 1514 1229 134 341 -58 613 165 1211 356 1364 -778 1321 551
4143E51M7L16j649J986j170M7l94M67L42j262J626j786R86k41P38j008k10O76
$$ 551 598 914 -735 1251 81 128 -266 201 543 -719 907 -879 107 -134 604 -404 -614 62
4161F2o92R76j247R88k254J223J06k95j16N6J314o16m03n94J479j66j136J44o33
$$ 62 -630 346 -901 87 -2167 -944 -838 -1133 -1249 -1193 121 -495 -898 -1492 -13 -179 -1315 -1171 -1804
4180a804K031j151m92JP36J125j009J171j389J537k491K921j110n76J349j600
$$ -1804 227 -924 -1416 -1415 -679 446 -563 608 -781 756 -1735 1186 76 -500 849 -751
4196g51J481j193J285l19M41o87J74M83j093J423j679J840m86l38M4n29J419j973
$$ -751 730 -463 822 503 944 257 431 914 -179 1244 -435 1405 919 581 625 96 1515 -458
4214d58K620k680J917j232L6J390j822J794k487K479k617K015r96P4M52j186J289
$$ -458 2162 -518 1399 167 203 1593 -229 1565 -922 1557 -1060 955 -41 33 485 -701 588
4231E88k043K186p07p5j31p03O24m83M05p77P96j474J712j302j75J018j024J335
$$ 588 -1455 731 24 -51 -182 -885 -261 -744 -339 -1116 -320 -1794 -82 -1384 -1559 -541 -1565 -230
4249b30m20O70o28m86O92j138J454j443K271j685J514j18n07k77r26J656j17Q66
$$ -230 -650 20 -608 -1094 -402 -1540 -86 -1529 742 -943 571 453 -54 -331 -1257 399 282 1148
4267A148k043K240q73m73J458k369J928j642J697J10j01j14M1R61j316P56j258
$$ 1148 -895 1345 472 -1 1457 -912 1016 -626 1071 1181 1080 966 1007 1968 652 1408 150
4284A50J476j399O87j27j376K680k363J525r76R05j468J020N1j403R19j614J855
$$ 150 1626 227 914 787 -589 2091 -272 1253 277 1182 -286 734 785 -618 301 -1313 542
4301E42j124R93n02J12j78p45R16n08M61j377n1M39L04J130j877J444j463J094
$$ 542 -582 411 -91 21 -157 -902 14 -494 -33 -1410 -1461 -1022 -718 412 -1465 -21 -1484 -390
4319c90N54q34l50O63k77j368J984j552J484J4m91P14j032P50j645J638K4J66
$$ -390 164 -670 -1020 -357 -634 -2002 -18 -1570 -86 -72 -563 151 -881 -131 -1776 -138 -114 52
4337E2mn50J372j726J533j554K184j484N88K91p54J410j067J686k859K608p53
$$ 52 48 -502 870 -856 677 -877 1307 -177 411 702 -52 1358 291 1977 -882 1726 973
4354I73L80J16j770J957j506J085n39K78L22j534J892k610K584j945Q66l07N05
$$ 973 1353 1469 -301 1656 150 1235 696 974 1296 -238 1654 -956 1628 -317 549 242 747
4371G47j265M46K33k12P78j621J022j218M78O83o82M22j234K046j681O13k27J173
$$ 747 -518 -72 161 -51 727 -894 128 -1090 -612 71 -611 -189 -1423 623 -1058 -445 -672 501
4389E01r01m57P72j079J264j392J163k92L24o26J49M95r29Q39j054K56m07J076
$$ 501 -400 -857 -85 -1164 100 -1292 -129 -421 -97 -723 -574 -79 -1008 -169 -1223 -967 -1374 -298
4407b98m24n63J381j376J834q47R97Oo44O70m63P11k399J737M07m08J441k033
$$ -298 -722 -1285 96 -1280 554 -293 704 710 66 736 273 984 -1415 322 729 321 1762 -271
4425b71J416o71J020j982J812j597K10J732j831J371n37j98j34J75j17P35r0n35
$$ -271 1145 474 1494 -488 1324 -273 -63 1669 -162 1209 672 474 340 515 398 1133 1043 508
4443E08M89j742K196j571Q28l93j359J966j999J401j202J576j237N20k88N31m39
$$ 508 997 -745 1451 -120 708 315 -1044 922 -1077 324 -878 698 -539 -19 -307 224 -215
4460b15r94J934k386J095K27p76L76p22K147j751P79q98J644j784R34L32n57O43
$$ -215 -1209 725 -1661 -566 -339 -1115 -739 -1461 686 -1065 -286 -1184 460 -1324 -390 -58 -615 28
4478B8j479J666J08o89N46j229R51n8R86o94NN88q16N88j564J512q52J334r42
$$ 28 -1451 215 323 -366 180 -1049 -98 -156 830 136 141 729 -87 501 -1063 449 -403 931 -11
4497a1N14P9n93J264p31K68j311K254j143O11o68j076J263r25J126j132K644k369
$$ -11 503 582 -11 1253 522 790 -521 1733 590 1201 533 -543 720 -205 921 -211 2433 64
4515F4l63L55o05O36o16J865j404Q63j072n41J455r58J375j291N07p54L29k87
$$ 64 -299 56 -549 87 -529 1336 -68 795 -277 -818 637 -321 1054 -237 270 -484 -155 -442
4533d42j045R79M24O27j583J45n82R10o6N8J405j889J041j093J513q2j440M27
$$ -442 -1487 -508 -84 543 -1040 -895 -1477 -567 -633 -575 830 -1059 -18 -1111 402 320 -1120 -693
4551f93l27J484j298J089j971J763J12p19R19n50J042j319J520j804Q09M31m03
$$ -693 -1020 464 -834 255 -1716 47 159 -560 359 -191 851 -468 1052 -752 57 488 85
4568H5O28j393K276q94p50l19R95q39J464j062N72J008j767J653j339l67J895
$$ 85 713 -680 1596 702 -48 -367 628 -211 1253 191 763 1771 4 1657 318 -49 1846
4585A846k564K061j186J187p45N56j286J286j92m48M00j427J664j424K63O3j41
$$ 1846 -718 1343 157 1344 599 1155 -131 1155 963 515 915 -512 1152 -272 -9 54 -87
4602h7K29p91L04J58N43k010J720o66k65R84j734J335k89L00j463O15Q1q11J446
$$ -87 142 -649 -345 -187 356 -1654 66 -600 -865 119 -1615 -280 -569 -269 -1732 -1117 -1036 -1847 -401
4621d01j29K55p94O59j03j49J09j022J227q45J206j074R42K6n60R77j146J526
$$ -401 -530 -275 -1069 -410 -513 -662 -553 -1575 -348 -1193 13 -1061 -119 -93 -653 324 -822 704
4639G04j611J411l67P70k19n48J318j407J064k219K788p70L74j094O99m02j608
$$ 704 -907 504 137 907 688 140 1458 51 1115 -1104 1684 914 1288 194 893 491 -1117
4656a117J836n71R62j199OO94m99J233j659J636j125M57o22m76R62L46n3j697
$$ -1117 719 148 1110 -89 -83 611 112 1345 -314 1322 197 654 32 -444 518 864 811 -886
4674h86J343l26l15R4r0K94j338J366p84O75r34O08K78j344K034j865J678j244
$$ -886 457 131 -184 -90 -180 114 -1224 142 -642 33 -901 -293 -15 -1359 675 -1190 488 -756
4692g56N28m7j406K360j621P84j129O25O17k79O46j698R74o34J204q31Q86r06
$$ -756 -228 -275 -1681 679 -942 -158 -1287 -662 -45 -324 322 -1376 -402 -1036 168 -663 223 -683
4710f83Q91k8q50J254j015J018m58J235j213k02J85j2J066q83J26n53O38L89J11
$$ -683 208 180 -670 584 -431 587 129 1364 151 -51 134 122 1188 305 431 -122 516 905 1016
4729A016K4o38O4j031J754j181N30K03j961K163j048N17p60J374r24j16N69j055
$$ 1016 1040 402 466 -565 1189 8 538 741 -1220 943 -105 412 -348 1026 102 -14 555 -500
4747e00J118j841J960j789J659r90P12j03q06P48r68J088j587Q63P06k45p16J76
$$ -500 618 -1223 737 -1052 607 -383 329 226 -580 168 -800 288 -1299 -436 270 25 -691 -515
4765e15P99j104k6J74o65R03o52J305j197R50q62M87J068k211J022O2J60r63J131
$$ -515 284 -820 -846 -672 -1337 -434 -1086 219 -978 -28 -890 -403 665 -1546 -524 -462 -302 -1265 -134
4784a34m73N23p20Q49J27m83J385j002M41j93j16J7N90o78l0Q51m90l28n02J337
$$ -134 -607 -84 -804 45 172 -311 1074 72 513 320 204 221 811 133 103 954 464 136 -366 971
4804I71k76j105J724j285J368j620J234j015N84R4p06Q78j321M25j26K60K70k99
$$ 971 695 -410 1314 29 1397 -223 1011 -4 580 674 -32 846 -475 -50 -176 84 354 55
4822E5K92r94J465j243O48q50M41m39p73J337j17j37r93P19k89m24M16J079n48
$$ 55 347 -647 818 -425 223 -627 -186 -625 -1398 -61 -178 -315 -1308 -589 -878 -1302 -886 193 -355
4841c55j414K421j429L75l07O99j007N85M18n68P6o28J94O26j085J529n77J357
$$ -355 -1769 652 -777 -402 -709 -10 -1017 -432 -14 -582 -506 -1134 -940 -314 -1399 130 -447 910
4859I10k492J429j06J740r52l06M94q86K43m07L73O45j3J59m17j19m23J553p69
$$ 910 -1582 -153 -259 1481 529 223 717 -169 74 -333 40 685 672 831 414 295 -128 1425 656
4878F56o07O10M1K49r50K62n07R26N1M71r19N3N19j005J165j282J940j394L81
$$ 656 49 659 700 949 -1 261 -246 680 731 1202 283 336 855 -150 1015 -267 1673 279 660
4897F60n12M19L29j586J681j531Q91j555J98M23J92Pq8P7p24O73N77n05j16k38
$$ 660 148 567 896 -690 991 -540 351 -1204 -1006 -583 -391 -384 -472 -395 -1119 -446 131 -374 -490 -728
4917g28R81j625J359j55k71rJ19J95R5L18o74L07L20K11p18q7R12q12J524k205
$$ -728 253 -1372 -13 -168 -439 -448 -329 -134 -39 279 -395 -88 232 443 -275 -362 550 -262 1262 -943
4937i43K38J260o37j95k53J447j597J974j881J312j094M86J009j580K447j424
$$ -943 -705 555 -82 -277 -530 917 -680 1294 -587 725 -369 117 1126 -454 1993 569
4953E69M06r10O08q00R79m48k64J380p43k78P28n68j15O1p30r78K204j246R47
$$ 569 975 65 673 -127 852 404 140 1520 777 499 1227 659 544 605 -125 -1103 1101 -145 802
4972H02q09R2J4j52Q50k018J581q78J752j576k63J92J86M76o01Q0l41K24M76p8
$$ 802 -7 85 99 -53 797 -1221 360 -518 1234 -342 -605 -413 -227 249 -352 -272 -613 -389 87 9
4992Io40k37J162j320J392j563Q66o84r25J609o52J235r67J264q49P98J291k440
$$ 9 -631 -868 294 -1026 366 -1197 -331 -1015 -1940 -331 -983 252 -715 549 -300 498 1789 -651
5010f51N52r00J012q6J48m12K49K91K6O58p03J948j596N68j615J595q28k12Q09
$$ -651 -99 -999 13 -73 75 -337 -88 203 229 887 184 2132 536 1104 -511 1084 256 44 853
5029H53j280J447r03N92j8R06l56j605O06l49O42o78K5J091j347J722j274J188
$$ 853 -427 1020 117 709 691 1597 1241 -364 242 -107 535 -143 -118 973 -374 1348 74 1262
5047A262k121J091r47J428j306J92j83K1J703j617k7K9J07L57p11J053o79L9p35
$$ 1262 -859 232 -715 713 -593 -401 -584 -563 1140 -477 -504 -475 -368 -11 -722 331 -348 -309 -1044
5066a044M08j7o3R02o40O36j175J025q91R81m67O1J259j337M71j354J403j184
$$ -1044 -636 -653 -716 186 -454 182 -993 32 -859 122 -345 -284 975 -362 109 -1245 158 -1026
5084a026K95Q30j249J528j244J261r51R30r19O45R26j608J322j227J595j748Q89
$$ -1026 -731 99 -1150 378 -866 395 -556 374 -545 100 1026 -582 740 -487 1108 -640 249
5101B49l41M63k10N01K32j661J863k56j055J265j051J053j080n8j13J059m15j076
$$ 249 -92 371 161 662 894 -767 1096 840 -215 1050 -1 1052 -28 -86 -199 860 445 -631
5119f31O39K29J75p85O34o48O10K23j317P5M31N67o16O08q35L35p93J080N64r21
$$ -631 8 237 412 -373 261 -387 223 446 -871 -796 -365 202 -414 194 -641 -306 -1099 -19 545 -376
5139c76K95j255Q03o69M63K6k82M96n18Q01l01J360q21n70M69J34l47q84J220
$$ -376 -81 -1336 -533 -1202 -739 -713 -995 -499 -1017 -216 -517 843 22 -548 -79 55 -292 -1176 44
5158D4o67M1L57K58L92k88L06j041Q81J74j157J215p85k2O82j77k05J437q49q42
$$ 44 -623 -582 -225 33 425 137 443 -598 283 457 -700 515 -270 -292 390 213 8 1445 596 -246
5178b46N84N72K60j690J740j570Q18n52L64P12j200J380k318J899o71K7M36j070
$$ -246 338 910 1170 -520 1220 -350 468 -84 280 992 -208 1172 -1146 753 82 109 545 -525
5196e25K14l18M02L56M00j801K32N08M64J884j312n99n08P47q98K0R62r74R47
$$ -525 -311 -629 -227 129 529 -1272 -1040 -532 -68 1816 504 -95 -603 144 -754 -734 228 -746 201
5215B01j628J751j488K367j674p42R11r22J349q76J88M89j56q93K29J214n41N75
$$ 201 -1427 324 -1164 1203 -471 -1213 -302 -1224 125 -751 -563 -74 -230 -1123 -894 320 -221 354
5233C54n77L95r10J616q71r4O73r74J070j558R25p97P51P24l42L19j149N77j10
$$ 354 -223 172 -738 878 7 -87 586 -388 682 -876 49 -748 3 727 385 704 -445 132 22
5252B2J288j314k47P9P12k03q21J762j607K037j393r81K303j528K37k36M12n61
$$ 22 1310 -4 -251 -172 540 337 -484 1278 -329 1708 315 -666 1637 109 346 110 522 -39
5270c9K94o52k70J169r15J113j386L50p80J490K5j386J636j936J019l68P59j30
$$ -39 255 -397 -667 502 -413 700 -686 -336 -1116 374 399 -987 649 -1287 -268 -636 123 -7
5288gj232Q46r66R17j46M08p42J058j670Q73L09r48J548j388N81l73J014J02m10
$$ -7 -1239 -393 -1359 -442 -588 -180 -922 136 -1534 -661 -352 -1300 248 -1140 -559 -932 82 184 -226
5307b26J033j586Q99j222K038j258R54J041k178O59j162J603m91M08n71O97L18
$$ -226 807 -779 120 -1102 936 -322 632 1673 -505 154 -1008 595 104 512 -59 638 956
5324I56r64J549j566M77p68L24N43k50K92j226J888j737J85oQ46Po27J044q95
$$ 956 -8 1541 -25 452 -316 8 551 301 593 -633 1255 -482 -297 -303 543 550 -77 967 72
5343G2R52n82J40n34k1L43l59J109j943O26l85J134k95j377J153j242J298o22
$$ 72 1024 442 582 48 27 370 11 1120 -823 -197 -582 552 257 -1120 33 -1209 89 -533
5361e33N58m46m89L44R81l68n10J015q52N19j611R75O97m02m91j128J664r95M03
$$ -533 25 -421 -910 -566 415 47 -463 552 -300 219 -1392 -417 280 -122 -613 -1741 -77 -1072 -669
5380f69L53M04j33j60K68l24O04o39P07p58J00P78q28R58p08Q82n14q1n31M96
$$ -669 -316 88 -45 -205 63 -261 343 -296 411 -347 -247 531 -297 661 -47 835 321 240 -291 205
5400B05N9l51M26K82P62p96m3m28L0J538k380P23L07K29J48m31P2m16J260r92
$$ 205 264 -87 339 621 1383 587 544 116 146 1684 -696 27 334 563 711 280 352 -64 1196 204
5420B04K65j980K305m21k68k27J7L44j751J425L18R8j03r05J594k044R33j03P8
$$ 204 469 -1511 794 373 105 -122 -105 239 -1512 -87 231 329 226 -679 915 -1129 -196 -299 -221
5439b21l92k65J272j159R43r53R81j865O07O18o29R64k63J126j671Q20j356J756
$$ -221 -613 -878 394 -765 178 -775 206 -1659 -1052 -434 -1063 -99 -362 764 -907 -87 -1443 313
5457C13m90j99M40p11J208j408J389n49n10R84l24m28p7Q72j006J559o61k6J48
$$ 313 -177 -376 64 -647 561 -847 542 -7 -517 467 143 -285 -362 510 -496 1063 402 376 524
5476E24p27R75r21J60L59k7K81o09Q21k30P87q63n00N93m43N42j083L09O40l9
$$ 524 -203 772 -149 11 370 343 624 15 836 606 1393 530 30 623 180 722 -361 -52 588 549
5496E49o47k74K95O47o30l75J117o34l00q4J53J87m07J32l08R38o18j36n7j36
$$ 549 -98 -372 -77 570 -60 -435 682 48 -252 -336 -183 4 -403 -271 -579 359 -259 -395 -452 -588
5516e88L61O43n84q04R0L76K73r70J344j18O7l25n60J115j483J343o36k34m26
$$ -588 -227 416 -168 -972 -882 -506 -233 -1203 141 23 90 -235 -795 320 -1163 180 -456 -690 -1116
5535a116J408L85j085R94q95j33l8L48R21o08K64j168Q66n36Q66K92O75j051m72
$$ -1116 292 677 -408 586 -309 -442 -480 -132 789 181 445 -723 143 -393 473 765 1440 389 -83
5554h3J079j34M23j264K56N51q02O66j21k04Q4J58K7r05m91R15l79l63J738j381
$$ -83 996 862 1285 21 277 828 26 692 571 367 451 609 636 -269 -760 155 -224 -587 1151 -230
5574b30M91o76K9O57j025P35j08l02n68J804q89r01K54L57Q09j91K74j222J436
$$ -230 261 -415 -386 271 -754 -19 -127 -429 -997 807 -82 -983 -729 -372 437 246 520 -702 734
5593G34q44N18r18n2J198j465P79p77j13P80j97l13n15J431p67K52j76J548o11
$$ 734 -110 408 -510 -562 636 -829 -50 -827 -940 -160 -357 -670 -1185 246 -521 -269 -445 1103 492
5612D92j626J714j094J533j295N01n0p90J156n62Q68j185K80Q22m66m56M09J0
$$ 492 -1134 580 -514 1019 -276 225 175 -615 541 -21 847 -338 -58 764 298 -158 251 261
5630B61m00k08J014l3m56N31o30j25J733j925J180mr15m36O50q23o54J441o02
$$ 261 -139 -347 667 634 178 709 79 -46 1687 -238 942 938 23 -413 237 -586 -1240 201 -401
5649d01Q31j289J762j277J06J58n17J450j677J175n99M32n82o2L0m55L37k4K77
$$ -401 430 -859 903 -374 -268 -110 -627 823 -854 321 -278 154 -428 -490 -460 -915 -578 -602 -325
5668c25l79Q66j157O37k75p53J041j85M63r51K124j001o35O79j288R30K40m4n06
$$ -325 -704 162 -995 -358 -633 -1386 -345 -530 -67 -1018 1106 105 -530 149 -1139 -209 31 -13 -519
5687e19M36K93n91J364j993J196q78L52p2Q08q3o34R36j02M71j030K53J368j158
$$ -519 -83 210 -381 983 -1010 186 -692 -340 -412 396 313 -321 615 513 984 -46 207 1575 417
5706D17K05j158J135l64M99p24P40l8j417J464n34Q17k60q62O52j067J161j127
$$ 417 622 -536 599 235 734 10 750 712 -705 759 225 1042 782 -80 572 -495 666 -461
5724d61J976k558J023M33l81L33j183K085k181R68k69p9q8O18j13n36K22l84Q36
$$ -461 1515 -1043 -20 413 32 365 -818 1267 -914 54 -215 -294 -382 236 123 -413 -191 -575 261
5743B61l02O36j224K26L50j691J825j264P30m50K24O81m42J136j374P61j99O15
$$ 261 -41 595 -629 -403 -53 -1744 81 -1183 -453 -903 -679 2 -440 696 -678 83 -116 499
5761D99o12N76Q5m60N06l27K58r91M39K39L73r4k83J400j163J11j063L75J184
$$ 499 -113 463 548 88 594 267 525 -466 -27 212 585 491 208 1608 445 556 -507 -132 1052
5780A052m36N8k60R16k100R02q17N19Q99p05O03l22k63k00N82N39p67J59l59m8
$$ 1052 616 674 414 1330 -770 132 -685 -166 733 28 631 309 46 -154 428 967 200 359 0 -48
5800d8q25N89n95J380q26Q22q85M62N52j927J457r54N87r8O2m13J150m09n7K04
$$ -48 -873 -284 -879 501 -325 497 -388 74 626 -1301 156 -798 -211 -309 -247 -660 490 81 24 228
5820B28n32K42l59N0j37j07J107j750J189N91j065Q93r99J161K40O03j890R42
$$ 228 -304 -62 -421 -371 -508 -615 492 -1258 -69 522 -543 350 -649 512 752 1355 -535 407
5838D07k73k14P04n79P58m63j71K84l4p9p11J440r49K05j309J856j600O69j72
$$ 407 134 -80 624 45 803 340 169 453 419 340 -371 1069 120 325 -984 872 -728 -59 -231
5857b31l70J236r74P60j051J754o79l89n70M56J38J62R51q06p17N86j66K52j147
$$ -231 -601 635 -339 421 -630 1124 445 56 -514 -58 80 242 1193 387 -330 256 90 342 -805
5876h05J343k25J11o53n8J5L20L71j347L79J87n03K212j274j525N89O72o72Q70
$$ -805 538 313 424 -229 -287 -272 48 419 -928 -549 -362 -865 1347 73 -1452 -863 -191 -863 7
5895Gj008Q74K6q31O03R64j028l04J767j657Q07R1J76o63m07J824j193N84j169
$$ 7 -1001 -127 -101 -932 -329 635 -393 -697 1070 -587 220 311 487 -176 -583 1241 48 632 -537
5914e37j21Q71J65J90n70J185q17P33p07Q33q99j104J538j439J459q52P77r04
$$ -537 -658 213 378 568 -2 1183 366 1099 392 1225 326 -778 760 -679 780 -72 705 -199
5932a99Q57n20l51Q4K74M80j362J683n13P59m90r4q0J71m95O7K70j293J83j5L45
$$ -199 658 138 -213 -129 145 625 -737 946 433 1192 702 608 528 699 204 271 541 -752 -569 -584 -239
5953b39R94q64J31p42K45m72l4j00M54O88n36N61k20P3L32j61K62k051J455p70
$$ -239 755 -109 22 -720 -475 -947 -981 -1081 -627 61 -475 86 -134 -61 271 110 372 -1679 -224 -994
5973i94R23o68R48n00m31O74n76J78n9J107n93j007O66N08m09m37L49Q85j004
$$ -994 -71 -739 209 -291 -722 -48 -624 -446 -505 602 9 -998 -332 176 -233 -670 -321 564 -440
5992d40J042o66O48o13r82K27J593l57J17l87Q49q09j376J657K49m11J58M82n29
$$ -440 602 -64 584 -29 -1011 -784 809 452 569 182 1031 222 -1154 503 752 341 499 981 452
6011D52k18j34k68J014j10q05q87Q29R09j669P88l04M94r44K14Q77j178M27N65
$$ 452 234 100 -168 846 736 -69 -956 -127 782 -887 -99 -403 91 -853 -639 238 -940 -513 52
6030E2J7J41n5J70l58j016J698l10q87J221j497R0mJ120o98J40n49j96J440l58
$$ 52 69 210 155 325 -33 -1049 649 339 -548 673 -824 -734 -738 382 -316 -176 -725 -921 519 161
6050A61J26J85j019Q87j332J337j228Q40j39J6J408q86j62j10L56LJj6l3q58r5
$$ 161 287 472 -547 340 -992 345 -883 -43 -182 -166 1242 356 194 84 440 443 444 428 395 -463 -558
6071e58J94j08M30l46J064j55j072Q82k05M87j160P13o12Q27L63L47j0j888J810
$$ -558 -364 -472 -42 -388 676 521 -551 331 126 613 -547 166 -446 381 744 1091 1081 -807 1003
6090A003n58J16Mo28q6m62N90q60J613j518M76J76r7Q2L24m90m44J428j260M49
$$ 1003 445 561 565 -63 -149 -611 -21 -881 732 -786 -310 -134 -231 -149 175 -315 -759 669 -591 -142
6110a42n07L68K36n06O98j510R14J58J94m38J43Q30j462O19m06R52p34J187o10
$$ -142 -649 -281 -45 -551 147 -1363 -449 -291 -97 -535 -392 438 -1024 -405 -811 141 -593 594 -16
6129a6m80J155p31N09r86k63J050p17l42M30J138j186Q74j117M49J31R46j53p31
$$ -16 -496 659 -72 437 -549 -812 238 -479 -821 -391 747 -439 435 -682 -233 -102 844 691 -40
6148d0J552j541N79r03N41j29R39l25o37O93j524J069O09l14m06r97J282j47l91
$$ -40 1512 -29 550 -353 188 59 998 673 36 729 -795 274 883 569 163 -834 448 301 -90
6167i0k6J346j143k00N35L28r34j195J164L52J81n22Q4p1r02J62M44M96j100K54
$$ -90 -116 1230 87 -113 422 750 -184 -1379 -215 137 318 -204 -120 -191 -1093 -931 -487 9 -1091 -837
6187h37L5Q20o76k21Q22j051K74R37m35j56N67l77j38m73j6M80K69J60N30r30
$$ -837 -802 18 -658 -879 -57 -1108 -834 103 -332 -488 79 -298 -436 -909 -925 -445 -176 -16 514 -416
6207d16J497j751Q25r88J331j247J078m38k79R43k005K096j311R91l78Q6M69n53
$$ -416 1081 -670 155 -833 498 -749 329 -109 -388 555 -1450 646 -665 326 -52 34 503 -50
6225e0R35j189K45M3M88o76j4j24J139N33q98j95m43M63l38m51J365p10O46j544
$$ -50 885 -304 -59 -16 472 -204 -218 -342 797 1330 432 237 -206 257 -81 -532 833 123 769 -775
6245g75P47m29m8J178j075N34J64j40o45M65o65N44q6K71m87r0P4P8J92o54J276
$$ -775 -28 -457 -505 673 -402 132 296 156 -489 -24 -689 -145 -231 40 -447 -537 -463 -385 -193 -847 429
6266D29r20L34L41m42Q76r98L81m44J132j410P18M45l70o73P54m95M02q21J222
$$ 429 -491 -157 184 -258 618 -380 1 -443 689 -721 -3 442 72 -601 153 -342 60 -761 461
6285D61p42l3N79o5O4j87J953j917p94J170r11M94q00P83j70J133j222J143q82
$$ 461 -281 -314 265 200 264 77 2030 113 -681 489 -422 72 -728 55 -115 1018 -204 939 57
6304E7P77m34M0k55q15L53l51O76l56R94j472N77J428j678R53r94J001j429J413
$$ 57 834 400 440 185 -630 -277 -628 48 -308 686 -786 -209 1219 -459 494 -500 501 -928 485
6323D85k58j503J511o17Q30j226J123m73J52k7l81J33N70p64K0l93J308k211J986
$$ 485 227 -1276 235 -382 448 -778 345 -128 24 -3 -384 -251 319 -445 -425 -818 490 -1721 265
6342B65k49o82K17L23m56K15J58q54J416p95Q33M89n79n66l12M43j63J17M98r3
$$ 265 16 -666 -449 -126 -582 -367 -209 -1063 353 -442 391 880 301 -265 -577 -134 -297 -180 318 225
6362B25m66O04j101O93O0K12P5j104P45j47M16q46k13J521k21q0o56P18K52p86
$$ 225 -241 363 -738 -45 15 227 302 -802 -57 -204 212 -634 -847 674 453 373 -283 435 687 -99
6382i9Q88p59R59j555P43m12J049j211Q69N0o35K49l75M95j207J70N33k30L15
$$ -99 789 30 989 -566 177 -235 814 -397 472 522 -113 136 -239 256 -951 -781 -248 -478 -163
6401a63q85J119p67J561j959J315l44J21L66q45K58K58K75%m55r94J157m5n15
$$ -163 -1048 71 -696 865 -1094 221 -123 -2 364 -481 -223 35 310 310 -145 -1139 18 -27 -542
6420e42L26o88J267j763J207N31K94p3j064K30K09j070J454L17L45k60q24J15
$$ -542 -216 -904 363 -1400 -193 338 632 559 -505 -275 -66 -1136 318 635 980 720 -104 11
6438A1l53N38K1r26P95K97m44O87j311J023L34M77j725J126P3J07p52N85J080
$$ 11 -342 196 217 -709 86 383 -61 626 -685 338 672 1149 -576 550 623 730 -22 563 1643
6457A643q96L0o34r34O97J59J022m92n87J25M16q63J00m87N56Q51j354L59L46
$$ 1643 747 777 143 -791 -94 65 1087 595 8 133 549 -314 -214 -701 -145 706 -648 -289 57
6476E7J052P08k878O32j9M88l85K073j830n45P19o37O11l15p1l3J200j901M98
$$ 57 1109 1817 -1061 -429 -448 40 -345 1728 -102 -647 72 -565 46 -269 -340 -373 827 -1074 -576
6495e76Q11k60K73k41P04k216J565M07q30M49l37Q34j620J619j056n7P22q31O04
$$ -576 235 -25 248 7 711 -1505 60 467 -363 86 -251 583 -1037 582 -474 -531 191 -640 -36
6514c6P70n02K86p96m59M75L51m2j02L62j43p93Q36P42n55l84m19J233p22J77
$$ -36 734 232 518 -278 -737 -262 89 47 -55 307 164 -629 207 949 394 10 -409 824 102 279
6534B79J72K75q95Q2o4M89N19j403j18J130p39J344j350M78n24J231r26p53N43
$$ 279 451 726 -169 -87 -151 338 857 -546 -664 466 -273 1071 -279 199 -325 906 -20 -773 -230
6553b30k75k80n08J600RJ313j895M35j05m47J39J02o77r0J362j035P46n28N6l20
$$ -230 -505 -785 -1293 307 316 1629 -266 169 64 -383 -244 -142 -819 -909 453 -582 164 -364 -308 -628
6573f28N55l5l97k71M62k37J033p85P42j677Q6J160q42K97L48j36J84Q78j034
$$ -628 -73 -108 -505 -776 -314 -551 482 -303 439 -1238 -1152 8 -834 -537 -189 -325 -141 737 -297
6592b97J030l58J40r9q37Q49j994K117m33J20P2j13j99q04J345l89j02m6j30J136
$$ -297 733 375 515 416 -421 428 -1566 551 118 238 310 197 -2 -806 539 150 48 2 -128 1008
6612A008j790J606p21J80l13q4l42M75M30k7m06n6O62m21k53M04J96k80r74J696
$$ 1008 -782 824 103 283 -30 -114 -456 19 449 422 16 -40 622 201 -52 352 548 268 -706 990
6632I90j363M73k40k28K30m33N61p11Q71l53J63q46N88k89J65J231j935J827j74
$$ 990 -373 100 -140 -368 -138 -571 -10 -721 150 -203 -40 -886 -298 -587 -422 809 -1126 701 527
6651E27k44m99j050K211j321J162q16N37j387J202N6n83L71j17K73j386J218L4
$$ 527 283 -216 -1266 945 -376 786 -30 507 -880 322 378 -205 166 49 322 -1064 154 188
6669A88KM17k29n96q71J281p34J882k20j341K92R0N66m02L3l46K47K55j11l08
$$ 188 190 607 378 -218 -1089 192 -542 1340 1120 -221 71 161 727 325 358 12 259 514 403 95
6689I5J97k36J20J327j936K55k15Q61n62M42k48j120K337j920Q95j281J97k88
$$ 95 292 56 176 1503 -433 -178 -393 468 -94 348 100 -1020 1317 -603 292 -989 -792 -1080
6707a080J237Q46j370J38j11O82p41M41L88p41p7N83J66l81j016O82k06l86R25
$$ -1080 157 1003 -367 -229 -340 342 -399 42 430 -311 -388 195 361 -20 -1036 -354 -560 -946 -21
6726b1Q93p09l88J09J234j496K73J060j406k7j52N53J41K98r2p76O96K8P45p28
$$ -21 872 163 -225 -116 1118 -378 -105 955 -451 -478 -630 -77 64 362 270 -506 190 218 963 235
6746B35j30K47k40Q6r09J231J55j86q97L95k47R60j99j613J568p0l4m18K86O78
$$ 235 105 352 112 198 -711 520 675 489 -408 -13 -260 700 501 -1112 456 386 352 -66 220 898
6766H98q51k38P41n16q48J102j79k76J90m94O75l16J91q1q38J6j71R91o36O23
$$ 898 47 -191 550 34 -814 288 109 -167 23 -471 204 -112 79 -2 -840 -824 -995 -4 -640 -17
6786a7p00K95O1K62J9n57j4P1O07n24j63O03l83M44J51k3P4o9j434J747m81L26
$$ -17 -717 -422 -361 -99 -80 -637 -651 -580 27 -497 -660 -57 -440 4 155 132 206 137 -1297 450 -31 295
6808B95Q5j92L49n43M36o22J96l76R4M38rQ24r97m96J87J036q76O64l68m28J74
$$ 295 380 188 537 -6 430 -192 4 -372 -278 160 151 975 -22 -518 -331 705 -171 493 125 -303 -129
6829a29J18N16j143J035j69j03k36K75p50N08Q20j365J163N6m65J6r75O49K4j014
$$ -129 -11 505 -638 397 228 125 -111 164 -586 -78 742 -623 540 596 131 147 -828 -179 -155 -1169
6849a169J449N2n05N57k12k29p39K27P12m01J40j7n34P71p71L29O5K62N15o98
$$ -1169 280 332 -173 384 172 -57 -796 -569 143 -258 -118 -135 -669 102 -669 -340 -275 -13 502 -196
6869a96J77p84J62P65j68m23J135m19j054J228n69K56m69R89q29L02J64r76J141
$$ -196 -19 -803 -641 124 -44 -467 668 249 -805 423 -146 110 -359 630 -199 103 267 -709 432
6888D32n22p9K36L86m20l84K36j06O97j25m97L80k48K79m29Q03j008Q71l6o97
$$ 432 -90 -169 67 453 33 -351 -115 -221 476 351 -146 234 -14 265 -164 639 -369 502 466 -231
6908b31Q09p12P89q40k80j20M90J48n66m24K65J144m78m64n8P01m77O84J4q61
$$ -231 578 -134 655 -185 -465 -585 -95 53 -513 -937 -672 472 -6 -470 -528 173 -304 380 394 -467
6928d67k40R28j76Km07Q95q15P07j189Q9q8J567j353O01M96r62O06o37l13Q98
$$ -467 -707 221 45 47 -360 535 -280 427 -762 -673 -761 806 -547 54 550 -412 194 -443 -756 142
6948A42N06j372Q67K96j292J219j064R92n17n41J218n57J18m54k83J094q6m08
$$ 142 648 -724 143 439 -853 366 -698 294 -223 -764 454 -103 15 -439 -722 372 286 -122
6966a22p57J613j26j054j03M30J08M1J6N55l72O34o25j231K229j343J55M60j73
$$ -122 -879 734 608 -446 -549 -119 -11 30 46 601 229 863 238 -993 1236 -107 48 508 335
6985C35P82j015M78j433J122n42K97J89J23l24l92M13o70R14q08Q54j079J337
$$ 335 1117 102 580 -853 269 -273 24 213 336 12 -380 33 -637 277 -531 323 -756 581
7003E81m43q68J425j415O18n96p15Q58M80K14j197J710j045r6m98m9K495k105
$$ 581 138 -730 695 -720 -102 -698 -1413 -555 -75 139 -1058 652 -393 -489 -987 -1036 1459 -646
7021f46M05k59L05o1J76J36r94N63q9J212r94k78n0J047r65L51l13M87L45J07
$$ -646 -241 -500 -195 -256 -80 56 -938 -375 -464 748 -246 -524 -574 473 -492 -141 -454 33 378 485
7041D85J249j193l5k87J73n65N49k92n35J228j457J757j515j5J344k235J622M52
$$ 485 1734 541 506 219 392 -173 376 84 -451 777 -680 1077 -438 -453 891 -1344 278 730
7059G30M2p78P3j35J96J021j030l4p83M47P95n90L9o74N92O27m55j16J50k04o52
$$ 730 772 -6 67 -68 128 1149 119 85 -698 -251 544 -46 -7 -681 -89 538 83 -33 117 -87 -739
7080g39N54l41P14j101J557n63k81j78L44L13N5M1j556R51l97J272r2n79j52J5
$$ -739 -185 -526 188 -913 644 81 -200 -378 -34 279 334 375 -1181 -230 -627 645 553 -26 -178 -163
7100a63p6R07n98k53P99j253m49M58M14J57K31k82l97J082k8n9k51l84P91k80
$$ -163 -239 668 70 -183 616 -637 -1086 -628 -214 -57 174 -108 -505 577 549 490 239 -145 646 366
7120C66n54N98m12O93k83R46n82N0l64m40r3l11R79o79O01M04N65o36j192K45
$$ 366 -188 410 -2 691 408 1354 772 822 458 18 -75 -386 593 -86 515 919 1484 848 -344 -99
7140i9r86O93J57Q71q75p73M55K44Q11j427J097k5j004N31L03l41N55P39j305
$$ -99 -1085 -392 -235 636 -239 -1012 -557 -313 498 -929 168 143 -861 -330 -27 -368 187 926 -379
7159c79J040n71J9N19j158q61J022M47j33N20j713J316j93O7j94o13J844j008
$$ -379 661 90 109 628 -530 -1391 -369 78 -55 465 -1248 68 -125 -58 -252 -865 979 -29
7177b9Q13j473L41M32M65j231N62lJ29J70J37l2k32L73r02K02k29K41Q58m36J90
$$ -29 784 -689 -348 84 549 -682 -120 -123 6 176 313 281 49 422 -480 -278 -507 -266 592 156 346
7198C46q36J263N37j981J009j87K1M10k88j02l39J237j101O39m22O87r93p89J27
$$ 346 -490 773 1310 -671 338 151 172 582 294 192 -147 1090 -11 628 206 893 -100 -889 -762
7217g62M14N51r66J150k35j02q7j24J366j159q79J096p7j256R60N73q87J108o37
$$ -762 -348 203 -763 387 152 50 -37 -161 1205 46 -833 263 186 -1070 -110 463 -424 684 47
7236D7m51j006J331o53m22J566p12O66q09O10n25J41j2M89j07N0l93O87N38r30
$$ 47 -404 -1410 -79 -732 -1154 412 -300 366 -443 167 -358 -217 -229 260 153 203 -190 497 1035 105
7256A05r54J084p49N83K57N23j469J092J62l99p19J300l50p0r42K06n09J191l2
$$ 105 -849 235 -514 69 326 849 -620 472 634 235 -484 816 466 396 -546 -340 -849 342 310
7275C10q8j02K37l23N85l31j90RN05p87l31J106M93o88m57K70r44J845j313J28
$$ 310 222 120 357 34 619 288 98 107 612 -175 -506 600 1093 405 -52 218 -726 1119 -194 -66
7295f6P44k195J510p73P22O8M10n6o97M98m29l8l47R34M14j214O13k94L2m53P51
$$ -66 678 -1517 -7 -780 -58 10 420 364 -333 165 -264 -302 -649 285 699 -515 98 -196 -164 -617 134
7316A34N9m18P23j638P09P8p73R15q6j66p04Q40J48L6p08O93N51n65N76o69K88
$$ 134 193 -225 498 -1140 -431 -353 -1126 -211 -297 -463 -1167 -327 -179 -143 -851 -158 393 -172 404 -265 23
7337B3k38K21n86O34L24j189J099m32k4Q3M09j52k8Q55j022N09m63o58M79j47
$$ 23 -215 6 -580 54 378 -811 288 -144 -168 -85 324 172 144 999 -23 486 23 -635 -156 -303
7357c03J98l73L53j49R79j38J79p60K60N5l14j2p64O54O9L18k64m71L82K41M81
$$ -303 -105 -478 -125 -274 705 567 746 -14 246 301 -13 -25 -789 -135 -66 252 -12 -483 -101 140 621
7378F21o82n36J87J1n0Q67n02K40m06N6l71N16N34j317k11J60Q11J389j388L30
$$ 621 -61 -597 -410 -399 -449 418 -84 156 -250 -194 -565 -49 485 -832 -1043 -883 -72 1317 -71 259
7398B59l87m57M99K3L47q77P19j33L27p00L15j35k14O3p55J018L03P44k52q21
$$ 259 -128 -585 -86 -63 284 -593 126 -7 320 -380 -65 -200 -414 -351 -1106 -88 215 959 707 -114
7418a14L43K52j04p93P42k61N23j038K04P5l75J529n80P75o46j19k84K58n16k21
$$ -114 229 481 377 -416 326 65 588 -450 -246 -171 -546 983 403 1178 532 413 129 387 -129 -350
7438c50P16k06J03j451J397QO34n6o74L1o26J598p50o60j08m26P94j62M33n6M08
$$ -350 366 160 263 -1188 209 217 851 795 121 152 -474 1124 374 -286 -394 -820 -26 -188 245 189 597
7459E97n29n99J36J61n03M12q4O5K9L35l38O20p34j70L09O75r14j80O09JP79n25
$$ 597 68 -531 -395 -234 -737 -325 -409 -344 -315 20 -318 302 -432 -602 -293 382 -532 -712 -103 -102 677 152
7481A52m7k2Q2O68j597L92N6J75m71J334m78K26M82j264J123j191J458j174J47
$$ 152 105 83 165 833 -764 -372 -316 -141 -612 722 244 470 952 -312 811 -380 1078 -96 51
7500E1K6K74l20L42K89j302R78l43N37j040J13Q16p64M52o19R96j32l9m86L06
$$ 51 77 351 31 373 662 -640 338 -5 532 -508 -395 421 -343 109 -510 486 354 315 -171 135
7520A35l92R36n94n63N70M25j001N03O46L13j794L40Q93k76M87j259P66Lk36o60
$$ 135 -257 679 85 -478 92 517 -484 19 665 978 -816 -476 417 141 628 -631 135 138 -98 -758
7540g58L06M65o7J02l25j1N49q6m35L23l92K75j45p24J432l99J91j2J60j236N00
$$ -758 -452 13 -54 48 -277 -288 261 175 -260 63 -329 -54 -199 -923 509 110 301 289 449 -787 -287
7561b87L33q6K55L95m24K26k5j327J478J85m62Q83j402J18N33j506K03M76J123
$$ -287 46 -40 215 610 186 412 387 -940 538 723 261 1144 -258 -140 393 -1113 -910 -434 689
7580F89l11J028j141k16q8J056k320J778j71N04n35k11N46j090Q45o94J865j155
$$ 689 378 1406 265 49 -39 1017 -1303 475 304 808 273 62 608 -482 363 -331 1534 379
7598C79j058O96p50J091o93j0j03L84j88J47l3m21R22j362P01L23L31l64L1m94
$$ 379 -679 17 -733 358 -335 -345 -448 -64 -252 -105 -138 -559 363 -999 -298 25 356 -8 23 -471
7618d71K83j00m87M23O48n32k42j73K45M14k98O09l34R29j057k44Q22K28l81J65
$$ -471 -188 -288 -775 -352 296 -236 -478 -651 -406 8 -290 319 -15 914 -143 -387 435 663 282 447
7638D47j076O08n78K86J12J25J46k9j89Q5m37Q99r89J004q07J054k51l61M6j90
$$ 447 -629 -21 -599 -313 -201 -76 70 41 -148 -63 -500 399 -590 414 -393 661 410 49 95 -95
7658i5l6O25j950J203L09L6o14L33O87P4J63r37O87p24m98O35L94o88P25m58n19
$$ -95 -131 494 -1456 -253 56 92 -522 -189 498 572 735 -202 485 -239 -737 -102 292 -396 329 -129 -648
7679f48J84j61N03M57k77l43m17O21K85K79k78k35j47J33o5K89n84Q27K2m07L84
$$ -648 -464 -625 -122 335 58 -285 -702 -81 204 483 205 -30 -177 -44 -109 180 -404 423 445 38 422
7700D22n46o6k62Q29n4k85o80L62R51j029P6n41J065K57j319J725o64M94j642
$$ 422 -124 -190 -452 377 323 38 -642 -280 671 -358 -282 -823 242 499 -820 905 241 735 -907
7719i07J156k43L65m44M08n37L53m41J241q19p78N71J236p66J18n60J65q34J144
$$ -907 249 6 371 -73 335 -202 151 -290 951 132 -646 -75 1161 395 513 -47 118 -716 428
7738D28j266N01L78j18o1k61M44l23l92Q4o5k61P64j67J602j095m89o78O95k77
$$ 428 -838 -337 41 -77 -138 -399 45 -278 -670 -586 -651 -912 -148 -315 1287 192 -297 -975 -280 -557
7758e57K74k04J8m13nO31K59n43O78q10N5L28M55j0N67j351O60k36n60K62P6n94
$$ -557 -283 -487 -469 -882 -887 -256 3 -540 138 -672 -617 -289 166 156 723 -628 32 -204 -764 -502 -426 -1020
7780a020P57m84J438R2n85J050j846P33n35M00k63L67R1L47L65p03Q03q18Q11
$$ -1020 -263 -747 691 783 198 1248 -598 135 -400 0 -263 104 195 542 907 204 1007 189 1000
7799A000j111n87M67l07R27p03M7K49J56K55m48N36l8l83R36Q7j824N19L34r9
$$ 1000 -111 -698 -231 -538 389 -314 -267 -18 138 393 -55 481 443 60 996 1083 -741 -222 112 13
7819A3J065j624J184p92n3m67OJ908j800Q99p70N22k78L14J31j02k23K04j06l21
$$ 13 1078 -546 638 -154 -207 -674 -668 1240 -560 339 -431 91 -187 127 258 156 -67 137 31 -290
7839b90N7N19J86k35l44M12n8k77n11L77M38K77Qp43R10j66j017O79k85j64J087
$$ -290 -233 286 472 237 -107 305 247 -30 -541 -164 274 551 559 -184 726 560 -457 222 -63 -227 860
7860H60j054L99m0j112J156n89Q93n37l40J307j632R13L02J94k70l97j06M50l42
$$ 860 -194 205 165 -947 209 -380 513 -24 -364 943 -689 224 526 720 450 53 -53 397 55
7879E5O50r58K90O43p4m80m6N2p7J71K80n84R41r54j42J74j92O19J005j555J27
$$ 55 705 -253 37 680 606 126 80 132 55 226 506 -78 863 -91 -233 -59 -251 368 1373 -182 -55
7900e5K92q75J750o95q7M64j792M47K46N49N02q55J19K02l74k47K23r29R33J367
$$ -55 237 -638 1112 417 330 794 -998 -551 -305 244 746 -109 10 212 -162 -409 -186 -1115 -182 1185
7920A185j385l88l56J324L36j379J56l6K40m68P88r03J110M1j23N63j765O91P50
$$ 1185 -200 -588 -944 380 716 -663 -507 -543 -303 -771 17 -886 224 265 142 705 -1060 -369 381
7939C81j028O94M31q88J96ML27K12j50j13J22J18L33n80q59J715o86p19P15j12
$$ 381 -647 47 478 -410 -214 -210 117 329 179 66 188 306 639 59 -800 915 229 -490 225 113
7959A13k75P38l28l70j369J823j69k15j090N46J188j010j6l83J036p95J314N65
$$ 113 -162 576 248 -122 -1491 332 163 -52 -1142 -596 592 -418 -434 -817 219 -576 738 1303
7977A303k205N68Q2l20K97P04q66J237J0l18j758J312r50n46Q05k09M6l32M96
$$ 1303 -902 -334 -252 -572 -275 429 -437 800 810 492 -1266 46 -904 -1450 -645 -854 -808 -1140 -644
7996f44k7Q19k3j198J950j001Q26q02n09J184k28m35N54o98l9n5j91m06J374q27
$$ -644 -671 148 125 -1073 877 -124 702 -100 -609 575 347 -88 466 -232 -271 -326 -517 -923 451 -376
8016c76Q68m15K09L10j87%m72N52m99o65L24O45q92J064q44Q2M21p46O38o3N74
$$ -376 492 77 286 596 409 409 -63 489 -10 -675 -351 294 -598 466 -378 -296 125 -621 17 -46 528
8037E28p06R69o49k56o06N18J114j599K89k11N58Q22j121P07J00N06q16j660R59
$$ 528 -178 791 142 -114 -720 -202 912 -687 -398 -609 -51 771 -350 357 457 963 147 -1513 -554
8056e54K72m52P46r5l58K68J9r51J348k43k92j081J917l42j3lo65j46J065K19
$$ -554 -282 -734 12 -83 -441 -173 -154 -1105 243 0 -292 -1373 544 202 189 186 -479 -625 440 659
8076F59j043J104l23l40l8K40k94m2O96Oq0J99r79O43J3K04r61N40p27O16l39
$$ 659 -384 720 397 57 19 259 -35 -77 619 625 545 744 -235 408 421 625 -336 204 -523 93 -246
8097b46R62J46n52r54J81M6K86K98n17N64l48M07o43O71o2j23k0P36L08p47n31
$$ -246 716 862 310 -644 -463 -417 -131 167 -350 214 -134 273 -370 301 239 116 96 832 1140 393 -138
8118a38J374j104L35l82j041J400j230P02o57N96K62o78J018q34R72l0m58N61
$$ -138 1236 132 467 85 -956 444 -786 -84 -741 -145 117 -561 457 -377 595 565 107 668
8136F68q25J05m93J007j269J27J21O94o97J028k34j17N73j175M21J38J230r06
$$ 668 -157 -52 -545 462 -807 -680 -559 135 -562 466 232 115 688 -487 -66 72 1302 396
8154C96m63L65l31K08J77n74M39Q07j400Q69m93n23L81M42j95m36J36L62r4m81
$$ 396 -67 298 -33 175 352 -222 217 1024 -376 493 0 -523 -142 300 105 -331 -195 167 73 -408
8174d08N99J64k34k78j35J36J424j073l50k2O06n98P28p54L20k02k43
$$ -408 191 355 121 -157 -292 -156 1268 195 -155 -177 429 -169 559 -195 125 -77 -320
8191c20
$$ Imaginary data points
##PAGE= N=2
##DATA TABLE= (X++(I..I)), XYDATA
0@%%%%%%%%%%%%jJ09k16K16k16L20m28M32n40O48p56R01j009J188j404J620j864
$$ 0 0 0 0 0 0 0 0 0 0 0 0 0 -1 108 -108 108 -108 212 -216 216 -324 324 -432 469 -540 648 -756 864 -1000
29a000K188k498K822l240L673m138M674n271N913o597P351q184R094j0099J1189
$$ -1000 1188 -1310 1512 -1728 1945 -2193 2481 -2790 3123 -3474 3877 -4307 4787 -5312 5877
44E877j2375J3672j5080J6622j8313K0169k2219K4476k6970K9749l2859L6356
$$ 5877 -6498 7174 -7906 8716 -9597 10572 -11647 12829 -14141 15608 -17251 19105
56A9105m0324M4865n0125N6304o3685P2678q3904R8372j17808J45426j87925K62197
$$ 19105 -21219 23646 -26479 29825 -33860 38818 -45086 53286 -64522 80904 -107021 155176
68A55176m28331J444547K8406j606926J873323j065753P9287O16105j270056J70588
$$ 155176 -273155 1171392 1199798 -407128 1466195 400442 479729 1095834 -174222 -3634
78c634N69641q64324M73717j05304k94188K60191l02873J76866K30728k05939
$$ -3634 566007 -298317 175400 70096 -224092 36099 -266774 -89908 140820 -65119
88f5119K2908j23520n7063J66445q9132j76394K12863m82794J19893M35142l62703
$$ -65119 -42211 -165731 -222794 -56349 -145481 -321875 -109012 -591806 -471913 -36771 -399474
99c99474J97539J47334l44669M53167R9823l34646N79554k47810k67508M04863
$$ -399474 -201935 -54601 -399270 53897 153720 -180926 398628 150818 -116690 288173
109B88173k00487K52953j33377k84831K15762p8294O5997J4749k03905J77909
$$ 288173 87686 340639 207262 -77569 138193 59899 125896 140645 -63260 114649
119A14649j08627j73111L71270k31488K1508P7896l32256L04420m377j30500O8848
$$ 114649 6022 -167089 204181 -27307 -5799 72097 -260159 44261 39884 -90616 -21768
130b1768r1746m5629P0128K0120N7867l0485j58662J74717k9046L0581R9089j38054
$$ -21768 -113514 -159143 -89015 -68895 -11028 -41513 -200175 -25458 -54504 -23923 75166 -62888
142f2888L2334M6616l9663J00396J24399k59111J11863M5854j33554K63134j96877
$$ -62888 -30554 16062 -23601 76795 201194 -57917 53946 99800 -33754 229380 32503
153C2503n4486J63730j61215L5595J27121j14397N5212j00717q4287K67827j95119
$$ 32503 -21983 141747 -19468 16127 143248 28851 84063 -16654 -100941 166886 -28233
164b8233O5997j212j83200K58115j31802l8980J75266j88012l2698J51158j66288
$$ -28233 37764 36552 -146648 111467 -20335 -59315 115951 -72061 -104759 46399 -119889
175a19889J48527L3574k66900K17778n7543m1399J40119j01571l0018O3683m5289
$$ -119889 28638 62212 -204688 13090 -44453 -85852 54267 -47304 -77322 -13639 -58928
186e8928M3496R1221j51697Q1218m4186j4525J20557j34324P5274l676j09605
$$ -58928 -15432 75789 -75908 5310 -38876 -53401 67156 -67168 8106 4430 -105175
197a05175R9297M8305r0169J10046r9583m6457K03789j72168R7470Q471j39637
$$ -105175 -5878 42427 -47742 62304 -37279 -83736 120053 -52115 45355 53826 -85811
208h5811J37097n4840k2627J06507q9139m4377J08197j05757J22590q333j26080
$$ -85811 51286 -3554 -26181 80326 -8813 -53190 55007 -50750 71840 63507 -62573
219f2573J52896j13571L8195Q4658q6999J1800J0550o6562Q4214P881j08404J26480
$$ -62573 90323 -23248 14947 99605 12606 24406 34956 -31606 52608 60489 -47915 78565
231G8565j21777K3934R4010j04631P6172k6746o1337O0680Q250m9805Q5849j08591
$$ 78565 -43212 -19278 74732 -29899 46273 19527 -41810 18870 27120 -22685 63164 -45427
243d5427R662R4135j34560J32786m9305o6929Q7730o4575J8847P2802r1675P045
$$ -45427 -35765 58370 -76190 56596 7291 -59638 28092 -36483 -17636 55166 -36509 -29464
255b9464O9642j20456J29961l9297o1713J00990j22497N9929L8872o1208L0273
$$ -29464 40178 -80278 49683 10386 -51327 49663 -72834 -12905 25967 -35241 -4968
266d968J107o7756Q9120k1388m8099J00775j32128O7611K3928o6307Q9983m6009
$$ -4968 -3861 -71617 17503 -3885 -51984 48791 -83337 -15726 8202 -58105 31878 -14131
278a4131l9059O2890j2824k8787Q9273j04743M2951L6696q9382J27496o5894k1263
$$ -14131 -53190 9700 -3124 -31911 57362 -47381 -4430 32266 -57116 70380 4486 -16777
290a6777N7994n1734J3377O1219p3963K5626L2888r5922J26396p0672q176O8393
$$ -16777 41217 -10517 2860 64079 -9884 15742 48630 -47292 79104 8432 256 68649
302F8649j08564O6567J1770m7709M4856q170o8809R4407n5818q223P8924j25315
$$ 68649 -39915 26652 38422 -9287 35569 27399 -41410 52997 -2821 -11044 67880 -57435
314e7435Q2249j4269l6515O8950m8652j8974M4110m0362K216O6305j05493P0627
$$ -57435 24814 10545 -25970 42980 -5672 -24646 19464 -20898 -18682 47623 -57870 12757
326A2757j4871n4186R9196p3094J2076K1878m5584K3221L5914o5920N4825r394
$$ 12757 -2114 -56300 42896 -30198 -18122 3756 -41828 -18607 17307 -48613 6212 -3182
338c182o6239J10728q5626L1625L0257p5061O0258o594k9108M9677j7658n3139
$$ -3182 -69421 41307 -44319 -12694 17563 -57498 2760 -3834 -32942 16735 -923 -54062
350e4062R0319p1126L0155M1512r1920Q7860m4802p447N5804m2639r060M8685
$$ -54062 36257 -34869 -4714 36798 -55122 32738 -12064 -19511 36293 -6346 -15406 33279
362C3279n1703K1072M6909q5633Q3177m9240j4711P2717p0787L2265J5056m3438
$$ 33279 -18424 2648 49557 -36076 47101 -2139 -16850 55867 -14920 17345 32401 -11037
374a1037K4233L1072o2341O6264l8488l0136Q2457r0831N8806L356n5364M9214
$$ -11037 13196 44268 -18073 48191 9703 -20433 62024 -28807 29999 33355 -22009 27205
386B7205j4323k4803M8602l2857k6908O9202q7360O2103N425o5855P3751n4968
$$ 27205 12882 -11921 36681 3824 -23084 46118 -41242 20861 26286 -39569 34182 -20786
398b0786Q319K9563l6050L282L1100n9548M2347J5978o5210Q0121o3709J2293
$$ -20786 -12467 17096 -18954 -15672 15428 -44120 -1773 14205 -51005 29116 -34593 -22300
410b2300L2012m3967L3846l221l2516K9922J1428n6099P8333n3222o380N6998
$$ -22300 9712 -34255 -409 -3630 -36146 -6224 5204 -50895 27438 -25784 -32164 24834
422B4834p1524N9982j2784k7184L5785j5933j7317N4096m4309j540N3461q4088
$$ 24834 -46690 13292 508 -26676 9109 -6824 -24141 29955 -14354 -15894 37567 -46521
434d6521P9764k7374l0506O5012n9628K0922K5089l0867J4406K2416n6085N8111
$$ -46521 33243 5869 -24637 40375 -19253 1669 26758 -4109 10297 32713 -23372 34739
446C4739k0679k6993O6506p5112M0094O401l2311L1881n104k2937K4626o563k8049
$$ 34739 14060 -12933 53573 -21539 18555 24956 -7355 24526 19422 -3515 21111 14548 -13501
459a3501O1768o6148K7197J8558n3504N4959k4679j7227K3396r684k2435M7905
$$ -13501 48267 -17881 9316 27874 -25630 29329 4650 -12577 10819 1135 -21300 26605
471B6605m8152J7379K9996p4238P5436m0098p935M1459n1838J8083J8302l3156
$$ 26605 -21547 -4168 25828 -48410 27026 -13072 -21007 20452 -31386 -13303 4999 -28157
483b8157K1673J1257n4663P2810m7890l902N5306p3288N0897j1190k0728L4031
$$ -28157 -6484 4773 -49890 22920 -24970 -28872 26434 -46854 4043 -7147 -27875 6156
495F156j0971k0981L3761k2400m189M4175o3323N1156j3037k2114M6583l5979
$$ 6156 -4815 -25796 7965 -14435 -18624 25551 -37772 13384 347 -21767 24816 -11163
507a1163P118K0703j7274j3161M2922m5898K9036O090m1215O0032m6496J8495
$$ -11163 -4045 16658 -616 -13777 29145 -16753 12283 18373 -22842 37190 -9306 9189
519I189J6972l2409J7801J5128l4229K5331R470m6420O0821n2653J9611K9241
$$ 9189 26161 -6248 11553 26681 -7548 17783 27253 -19167 41654 -10999 8612 37853
531C7853n8734M6692j8672j2782L0275j5593k2601M4805m1226J0713K7485o1548
$$ 37853 -20881 25811 7139 -5643 24632 9039 -13562 31243 -9983 730 28215 -33333
543c3333O1306l2786r903L0336l1149J3158R113k5592Q514K4410m8433M7116k6385
$$ -33333 27973 -4813 -14716 15620 -15529 -2371 6742 -18850 -10336 14074 -34359 12757 -13628
556a3628j5037M7086n1681K8559R38j7855J6156L360k8837L6108q221k8398M9769
$$ -13628 -28665 18421 -33260 -4701 -3763 -21618 -5462 -2102 -30939 5169 -3052 -31450 18319
569A8319n1757L3993J858k9136L4994j9112j147K0247j3976j5062M7611m8896
$$ 18319 -33438 555 2413 -26723 8271 -10841 -11988 8259 -5717 -20779 26832 -22064
581b2064K3725J6245m4554N7691l7488K234K3460k2084O415J6006k8300J7751
$$ -22064 1661 17906 -26648 31043 -6445 -4211 19249 -2835 3580 19586 -8714 9037
593I037J5777m4348N7120m1707N627L1592m7338L4217m758j5569J5255l77k4333
$$ 9037 24814 -19534 37586 -4121 1506 33098 -14240 19977 15219 -350 14905 14528 -9805
606i805L9609k9683l812L3728n1280M5125j9420j2261K5385j9233P46J0961j2916
$$ -9805 29804 121 -3691 30037 -21243 23882 4462 -7799 17586 -1647 -901 10060 -2856
619b856m386K8996m6351L1905o943k0748L7052l7364J3849O546j2672L388J3377
$$ -2856 -7242 21754 -24597 7308 365 -20383 16669 -20695 -6846 -300 -12972 -9584 3793
632C793k9309K3925K049l5538N2289m4361J5945J4441l0879K8344o966j0847J4583
$$ 3793 -25516 -1591 458 -35080 17209 -27152 -11207 3234 -27645 699 -6267 -17114 -2531
645b531k860j8297M2890m4905K0296J9970m5294N1964l2389J880K2128j8000J779
$$ -2531 -5391 -23688 19202 -25703 -5407 14563 -30731 21233 -11156 -9276 12852 -5148 -3369
658c369J4480j8989J1168J6185l8275M3192k6546L492K2286l3535K4755l810q644
$$ -3369 11111 -7878 3290 19475 -18800 24392 -2154 1338 23624 -9911 14844 11034 2390
671B390N587J1146k5398K7366j1803j4974L7426m1280K6695m612j6366K0750o104
$$ 2390 7977 19123 -6275 21091 9288 -5686 31740 -9540 17155 12543 -3823 16927 10823
684A0823j3338J7474p506j7886L8804m6840K7606K900l0714L9734l3154R048J1970
$$ 10823 -2515 14959 7453 -10433 28371 -18469 9137 12037 -18677 21057 -12097 -3049 8921
697H921j6983R62J6240k8048K2229L92l3144M7710m0629J5080J0004k5588K2040
$$ 8921 -8062 -7100 9140 -18908 3321 3713 -29431 18279 -22350 -7270 2734 -22854 -814
710h14o270o941N672N324j9643L2709k9553O246K2239l5004L2012j5330k594J2841
$$ -814 -7084 -14025 -8353 -3029 -22672 10037 -19516 -13270 8969 -26035 5977 -9353 -11947 894
724H94n067q038J8602j2599l586K8095m1173L6424j1462j1918K6762k5127J3736
$$ 894 -4173 -12211 6391 -6208 -9794 18301 -22872 13552 2090 -9828 16934 -8193 5543
737E543N688j2329J927J8183k9489K9280r666j8466M0291l9986K3567j295j4306
$$ 5543 11231 -1098 829 19012 -10477 18803 9137 -9329 30962 -9024 14543 13248 -1058
750a058J7311n800r984J2934j729j7725L2934l6946K0999K696k2971K8864k2493
$$ -1058 16253 10453 469 13403 11674 -6051 26883 -10063 10936 13632 -9339 19525 -2968
763b968N055N154n286q296J8044j8610N818J1043l1740L8967k8581L430J4007
$$ -2968 2087 7241 1955 -6341 11703 -6907 -1089 9954 -21786 17181 -11400 -7970 6037
776F037k1445J2720J502j2164M805J1578k8012L2754k1732k770K6692l6319K7709
$$ 6037 -15408 -2688 -1186 -13350 -8545 3033 -24979 7775 -13957 -16727 9965 -26354 1355
789A355r415o611J3881o438q794J9808j3379n105K7360l8002L1877q959j0558
$$ 1355 -8060 -14671 -790 -7228 -16022 3786 -9593 -14698 12662 -25340 6537 -2422 -12980
802a2980K1840j9329J0812K158m231k042J8906k5485J9044k92j9375L3922k8908
$$ -12980 8860 -10469 343 2501 -1730 -3772 15134 -10351 8693 8401 -10974 22948 -5960
815e960J4554J951r729P277L511j0228P742P143k4584L3274k8456J0405J3410
$$ -5960 8594 10545 816 8093 11604 1376 9118 16261 -8323 24951 -3505 6900 20310
828B0310k8169K4771j3255m60P276k715j1907K2190k0803K844J6595l2908L2731
$$ 20310 -7859 16912 3657 3197 10473 7758 -4149 18041 -2762 82 16677 -16231 16500
841A6500k0482N40J2621j6714P799J261o012j566J2494k4749K5815j5705m862
$$ 16500 -3982 -3442 9179 -7535 264 1525 -4487 -6053 6441 -18308 7507 -8198 -13060
854a3060K2412k9388J9554o592k138J607M421j0393J0709j195j3549K6807l0319
$$ -13060 9352 -20036 -482 -7074 -9212 -7605 -3184 -13577 -2868 -4063 -17612 9195 -21124
867b1124K0293j316j3636J8875j0485J127M874k329q275K3637k5354J6189M680
$$ -21124 -831 -2147 -15783 3092 -7393 -6266 -1392 -3721 -11996 11641 -13713 2476 7156
880G156k3105L2150k6210J2651M939j1148R068K178r301P754O957k2952L0852
$$ 7156 -15949 16201 -10009 2642 7581 -3567 5501 7679 -1622 6132 13089 -9863 20989
893B0989k5361J1145R819k2926K3278j3595K593K971N62j0293J5822j1727k069
$$ 20989 -4372 6773 16592 -6334 16944 3349 5942 8913 9475 -818 15004 3277 1208
906A208J7090k8379K6190j3740l833J1779q464j594M491l097q224J8868k6342
$$ 1208 18298 -10081 16109 2369 -1464 10315 1851 257 4748 1651 -6573 12295 -14047
919a4047K0603o951j1288K4466k7873J4595o3o861K984N314j4159J3008j627j7602
$$ -14047 6556 -395 -11683 12783 -15090 -495 -558 -7419 -4435 879 -13280 -272 -1899 -19501
933a9501K9311k9368J8058l212j1317J8224j3088M547K397q88r291K0113j9440
$$ -19501 9810 -19558 -1500 -4712 -16029 2195 -10893 -6346 -3949 -4837 -14128 5985 -13455
946a3455Q494Q048j7774K2503j7714Q249K019m100J135N807n732q99J6275k5159
$$ -13455 -4961 3087 -14687 7816 -9898 -1649 370 -3730 -2595 3212 -2520 -3419 12856 -12303
960a2303K5967j3748n30J3337j7490J4047l426l073J866P527j5126J7660j0803
$$ -12303 13664 -84 -614 12723 -4767 9280 5854 2781 4647 12174 -2952 14708 3905
973C905n889K2320k7551K3415j1304l253J1348j0806J871M672n272m481J5302
$$ 3905 -1984 20336 -7215 16200 4896 1643 12991 2185 4056 8728 3456 -1025 14277
986A4277k3737J9645n658r685J8066k0408J3103n114j589j816N528j0408O172
$$ 14277 -9460 10185 4527 -5158 12908 -7500 5603 489 -1100 -2916 2612 -7796 -1624
999a624M844j9098K5381k1371Q320L991j2152R371k803k685J758L919j4127K1169
$$ -1624 3220 -15878 9503 -11868 -3548 443 -11709 -2338 -5141 -7826 -6068 -2149 -16276 4893
1013D893j8959O316J3724k6559K5766j3378M05O271m369J20O618o172L03J2637
$$ 4893 -14066 -7750 5974 -20585 5181 -8197 -7792 -1521 -5890 -5770 848 -5324 -5021 7616
1027G616k2905K5859j6173J833J2242j5941J3562n059R15j993R446j2888J2376
$$ 7616 -15289 10570 -5603 -3770 8472 -7469 6093 1034 1949 -44 9402 -3486 8890
1040H890k287r501J8015k0228J7337o575j830L900j718j800L475K210j4559K2890
$$ 8890 6603 -2898 15117 -5111 12226 5651 3821 7721 6003 4203 7678 9888 -4671 18219
1054A8219k1644J1062L000j5330J7769j5136O724R0k120l909R934j2506O446L855
$$ 18219 -3425 7637 10637 -4693 13076 -2060 4664 4754 2634 -1275 8659 -3847 2599 6454
1068F454j8357K4322k2262R059L824j2436J0957o111J639k927M883j1410J4608
$$ 6454 -11903 12419 -9843 -784 3040 -9396 1561 -4550 -2911 -5838 -955 -12365 2243
1081B243j2729M298Q317j7676J8326j2880M154m08K336l530M925j759o790J7290
$$ 2243 -10486 -6188 2129 -15547 2779 -10101 -5947 -6355 -4019 -7549 -2624 -4383 -11173 6117
1095F117k1252J8359o690m310J1480j2828Q430l46n99k792J1747j5879J3998q44
$$ 6117 -15135 3224 -3466 -7776 3704 -9124 -694 -1040 -1639 -4431 7316 -8563 5435 4591
1109D591j2346K2847k2673J5567m036n731R516l612j113L859K18r158J8119j8942
$$ 4591 -7755 15092 -7581 7986 3950 -1781 7735 4123 3010 6869 7087 -2071 16048 -2894
1123b894J0476K268j2521J6605j4451P294j141N81n174O907p722J500Q921j8379
$$ -2894 7582 9850 -2671 13934 -517 6777 5636 6217 1043 7950 228 1728 10649 -7730
1137g730K0284j6595M649O316j0779O490j196k187l608J0701j6896J6681j0545
$$ -7730 12554 -4041 608 6924 -3855 2635 1439 -748 -4356 6345 -10551 6130 -4415
1150d415l637J3566j9742J8008r017k616N612j929m729P161n079l396J5464k1843
$$ -4415 -8052 5514 -14228 3780 -5237 -7853 -2241 -4170 -8899 -1738 -6817 -10213 5251 -16592
1164a6592J8252p447l744J1977j2551Q235l466J827m188J0437j1217R283R50j2466
$$ -16592 1660 -5787 -9531 2446 -10105 -1870 -5336 -3509 -7697 2740 -8477 806 1756 -10710
1178a0710J9700j6670R378p9k832K991p6j452J795N308j2758J8300j5125O083
$$ -10710 8990 -7680 1698 1619 -1213 1778 1702 250 2045 7353 -5405 12895 -2230 3853
1192C853P150j4969J5146r579K731K641M4p693J2529j0565J894R567j8637J8850
$$ 3853 11003 -3966 11180 1601 4332 6973 7017 -676 11853 1288 3182 12749 -5888 12962
1206A2962j2774L585M966r551O945k335k680k225Q732j4650J4284q082l773J2212
$$ 12962 188 3773 8739 -812 6133 3798 1118 -1107 7625 -7025 7259 -823 -4596 7616
1220G616j6679J3468o817o80k49K927p186N891m71q112J5272j8566J4179l410
$$ 7616 -9063 4405 -2412 -3092 -3341 -414 -7600 -1709 -2180 -10292 4980 -13586 593 -2817
1234b817p046R315p372L148R39J150q473J3263j1168P454J314j2421J8603j4236
$$ -2817 -9863 -548 -7920 -4772 -3833 -2683 -11156 2107 -9061 -1607 -293 -12714 5889 -8347
1248h347O493J034l262K739K429n191K615O420j3402J7633j3651N629M956j0393
$$ -8347 -1854 -820 -4082 -1343 1086 -4105 -1490 4930 -8472 9161 -4490 1139 6095 -4298
$$ [...]
8191D00
##END NTUPLES=NMR FID
##END=
