##TITLE=1H_SAM-11.111
 CDCl3, 108 sc, 
 11.3.2019
##JCAMPDX= 6.0         $$ Bruker NMR JCAMP-DX V2.0
##DATA TYPE= NMR FID
##DATA CLASS= NTUPLES
##ORIGIN= UXNMR, Bruker Analytische Messtechnik GmbH
##OWNER= root
$$ XWIN-NMR		Version 3.5
$$ Mon Mar 11 17:04:13 2019 Russian Standard Time (UT+4h)  she@DPX200
##.OBSERVE FREQUENCY= 200.1316
##.OBSERVE NUCLEUS= ^1H
##.DELAY= (6, 6)
##.ACQUISITION MODE= SIMULTANEOUS
##.ACQUISITION SCHEME= undefined
##.AVERAGES= 108
##.DIGITISER RES= 18
##SPECTROMETER/DATA SYSTEM= spect
##.PULSE SEQUENCE= zg30
##.SOLVENT NAME= CDCl3
##.SHIFT REFERENCE= (INTERNAL, CDCl3, 0, 15.7039)
##AUDIT TRAIL= $$ (NUMBER, WHEN, WHO, WHERE, WHAT)
$$ ##TITLE= Audit trail, XWIN-NMR		Version 3.5
$$ ##JCAMPDX= 5.01
$$ ##ORIGIN= Bruker BioSpin GmbH
$$ ##OWNER= she
$$ F:/spectra/data/she/nmr/H-F/1/audita.txt
$$ ##AUDIT TRAIL=  $$ (NUMBER, WHEN, WHO, WHERE, WHAT)
(   1,<2019-03-11 17:02:57.04 +0400>,<she>,<DPX200>,
      <created by zg, POWCHK disabled, PULCHK disabled
       configuration hash MD5:
       00 E9 B6 7A A2 85 ED C7 34 08 36 98 17 FE 4E 26
       data hash MD5: 16K
       58 85 47 23 CD AA BA 03 F5 A0 D8 E6 61 E0 46 98>)
$$ ##END=
$$ 
$$ hash MD5
$$ 2F FA 4E 78 5E 1C E9 3B AE E1 74 BF 51 E7 77 F0
##$RELAX= 
##$RELAX= 
##$RELAX= 
##$RELAX= 
##$RELAX= 
##$RELAX= 
$$ Bruker specific parameters
$$ --------------------------
##$DU= <F:/spectra>
##$EXPNO= 1
##$NAME= <H-F>
##$PROCNO= 1
##$TYPE= <nmr>
##$USER= <she>
##$AMP= (0..31)
100 100 100 100 100 100 100 100 100 100 100 100 100 100 100 100 100 100 
100 100 100 100 100 100 100 100 100 100 100 100 100 100 
##$AQSEQ= 0
##$AQ_mod= 1
##$AUNM= <au_zg>
##$AUTOPOS= <>
##$BF1= 200.13
##$BF2= 200.13
##$BF3= 200.13
##$BF4= 200.13
##$BF5= 200.13
##$BF6= 200.13
##$BF7= 200.13
##$BF8= 200.13
##$BYTORDA= 1
##$CFDGTYP= 0
##$CFRGTYP= 5
##$CHEMSTR= <none>
##$CNST= (0..31)
1 1 145 1 1 1 1 1 1 1 1 1 1 1 1 1 1 1 1 1 1 1 1 1 1 1 1 1 1 1 1 1 
##$CPDPRG= <>
##$CPDPRG1= <>
##$CPDPRG2= <>
##$CPDPRG3= <>
##$CPDPRG4= <mlev>
##$CPDPRG5= <mlev>
##$CPDPRG6= <mlev>
##$CPDPRG7= <mlev>
##$CPDPRG8= <mlev>
##$CPDPRGB= <>
##$CPDPRGT= <>
##$D= (0..31)
0 1.2 0 0 0 0 0 0 0 0 0 0.03 0 0 0 0 0 0 0 0 0 0 0 0 0 0 0 0 0 0 0 0 
##$DATE= 1552309376
##$DBL= (0..7)
120 120 120 120 120 120 120 120 
##$DBP= (0..7)
150 150 150 150 150 150 150 150 
##$DBP07= 0
##$DBPNAM0= <>
##$DBPNAM1= <>
##$DBPNAM2= <>
##$DBPNAM3= <>
##$DBPNAM4= <>
##$DBPNAM5= <>
##$DBPNAM6= <>
##$DBPNAM7= <>
##$DBPOAL= (0..7)
0.5 0.5 0.5 0.5 0.5 0.5 0.5 0.5 
##$DBPOFFS= (0..7)
0 0 0 0 0 0 0 0 
##$DE= 6
##$DECBNUC= <off>
##$DECIM= 24
##$DECNUC= <off>
##$DECSTAT= 4
##$DIGMOD= 1
##$DIGTYP= 9
##$DL= (0..7)
0 120 120 120 120 120 120 120 
##$DP= (0..7)
150 150 150 150 150 150 150 150 
##$DP07= 0
##$DPNAME0= <>
##$DPNAME1= <>
##$DPNAME2= <>
##$DPNAME3= <>
##$DPNAME4= <>
##$DPNAME5= <>
##$DPNAME6= <>
##$DPNAME7= <>
##$DPOAL= (0..7)
0.5 0.5 0.5 0.5 0.5 0.5 0.5 0.5 
##$DPOFFS= (0..7)
0 0 0 0 0 0 0 0 
##$DQDMODE= 0
##$DR= 18
##$DS= 0
##$DSLIST= <SSSSSSSSSSSSSSS>
$$ [...]
##$SUBNAM2= <"">
##$SUBNAM3= <"">
##$SUBNAM4= <"">
##$SUBNAM5= <"">
##$SUBNAM6= <"">
##$SUBNAM7= <"">
##$SUBNAM8= <"">
##$SUBNAM9= <"">
##$SW= 24.9336934301222
##$SWIBOX= (0..15)
0 0 2 0 0 0 0 0 0 0 0 0 0 0 0 0 
##$SW_h= 4990.01996007984
##$TD= 16384
##$TD0= 1
##$TE= 0
##$TE2= 300
##$TE3= 300
##$TEG= 300
##$TL= (0..7)
0 120 120 120 120 120 120 120 
##$TP= (0..7)
150 150 150 150 150 150 150 150 
##$TP07= 0
##$TPNAME0= <>
##$TPNAME1= <>
##$TPNAME2= <>
##$TPNAME3= <>
##$TPNAME4= <>
##$TPNAME5= <>
##$TPNAME6= <>
##$TPNAME7= <>
##$TPOAL= (0..7)
0.5 0.5 0.5 0.5 0.5 0.5 0.5 0.5 
##$TPOFFS= (0..7)
0 0 0 0 0 0 0 0 
##$TUNHIN= 0
##$TUNHOUT= 0
##$TUNXOUT= 0
##$USERA1= <user>
##$USERA2= <user>
##$USERA3= <user>
##$USERA4= <user>
##$USERA5= <user>
##$V9= 5
##$VALIST= <valist>
##$VCLIST= <CCCCCCCCCCCCCCC>
##$VD= 0
##$VDLIST= <DDDDDDDDDDDDDDD>
##$VPLIST= <PPPPPPPPPPPPPPP>
##$VTLIST= <TTTTTTTTTTTTTTT>
##$WBST= 1024
##$WBSW= 4
##$XGAIN= (0..3)
0 0 0 0 
##$XL= 0
##$YL= 0
##$YMAX_a= 532750
##$YMIN_a= -959260
##$ZGOPTNS= <>
##$ZL1= 120
##$ZL2= 120
##$ZL3= 120
##$ZL4= 120
##$ABSF1= 10
##$ABSF2= 0
##$ABSG= 5
##$ABSL= 3
##$ALPHA= 0
##$AQORDER= 0
##$ASSFAC= 0
##$ASSFACI= 0
##$ASSFACX= 0
##$ASSWID= 0
##$AUNMP= <proc_1d>
##$AZFE= 0.1
##$AZFW= 0.1
##$BCFW= 1
##$BC_mod= 2
##$BYTORDP= 1
##$COROFFS= 0
##$CY= 11.3945322036743
##$DATMOD= 1
##$DC= 2
##$DFILT= <>
##$DTYPP= 0
##$F1P= 18.9103706918063
##$F2P= -1.10871071338519
##$FCOR= 0.5
##$FTSIZE= 0
##$FT_mod= 4
##$GAMMA= 1
##$GB= 0.15
##$INTBC= 1
##$INTSCL= 1
##$ISEN= 128
##$LB= 0.24
##$LEV0= 0
##$LPBIN= 0
##$MAXI= 10000
##$MC2= 0
##$MEAN= 0
##$ME_mod= 0
##$MI= 1.114404
##$NCOEF= 0
##$NC_proc= 0
##$NLEV= 6
##$NOISF1= 3.799351
##$NOISF2= 2.8
##$NSP= 1
##$NTH_PI= 0
##$NZP= 0
##$OFFSET= 15.70392
##$PC= 1
##$PHC0= -8892.3
##$PHC1= 71.80014
##$PH_mod= 1
##$PKNL= yes
##$PPARMOD= 0
##$PSCAL= 0
##$PSIGN= 0
##$REVERSE= no
##$SF= 200.130013532006
##$SI= 16384
##$SIGF1= 3
##$SIGF2= 2
##$SINO= 400
##$SIOLD= 16384
##$SREGLST= <1H.CDCl3>
##$SSB= 0
##$STSI= 0
##$STSR= 0
##$SW_p= 3612.71676300578
##$SYMM= 0
##$S_DEV= 0
##$TDeff= 0
##$TDoff= 0
##$TI= <>
##$TILT= no
##$TM1= 0
##$TM2= 0
##$TOPLEV= 0
##$USERP1= <user>
##$USERP2= <user>
##$USERP3= <user>
##$USERP4= <user>
##$USERP5= <user>
##$WDW= 1
##$XDIM= 8192
##$YMAX_p= 0
##$YMIN_p= 0
$$ End of Bruker specific parameters
$$ ---------------------------------
##NTUPLES= NMR FID
##VAR_NAME=  TIME,          FID/REAL,        FID/IMAG
##SYMBOL=    X,             R,               I
##VAR_TYPE=  INDEPENDENT,   DEPENDENT,       DEPENDENT
##VAR_FORM=  AFFN,          ASDF,            ASDF
##VAR_DIM=   8192,          8192,            8192
##UNITS=     SECONDS,       ARBITRARY UNITS, ARBITRARY UNITS
##FACTOR=    0.0002004,     1,               1
##FIRST=     0,             0,               0
##LAST=      1.6414764,     0,               0
##MIN=       0,             -959260,         0
##MAX=       1.6414764,     532750,          0
$$ Real data points
##PAGE= N=1
##DATA TABLE= (X++(R..R)), XYDATA
0 0 0 0 0 0 0 0 0 0 0 0 108 -108 108 -108 108 -216 216 -217 324 -325 432 -477 542 -648 753 -860 970
27 970 -1101 1257 -1417 1592 -1794 2011 -2249 2503 -2798 3113 -3455 3831 -4250 4708 -5215 5772
43 5772 -6396 7076 -7860 8725 -9717 10853 -12179 13728 -15584 17867 -20730 24465
55 24465 -29539 36880 -48549 69990 -122570 532750 284764 -789083 -103206 360027 21067
66 21067 -329467 56575 148966 -79867 -153032 24393 -15883 -115 108255 70180 -185479
77 -185479 -198801 -9231 84124 -18448 -59278 -31954 18834 39043 40462 -17936 -24019 55496
89 55496 111549 26815 -43231 27878 103630 5951 -115205 -45124 98043 64730 -52626 -12468
101 -12468 107553 69790 -67459 -88293 -5179 20242 -25000 -55087 -38287 673 26468 -20341
113 -20341 -93323 -65734 41249 62183 -6739 -14779 24427 -10006 -45439 20181 50663 -47057
125 -47057 -58156 86681 103789 -62930 -75485 120990 147903 -51111 -101535 58303 100094
136 100094 -36675 -78815 7572 31583 -12007 -8010 6756 -32358 -47304 -6629 1216 -25200
148 -25200 -9 36175 -11822 -75867 -53479 122 -7315 -14590 31945 46112 -7803 -22238
160 -22238 36775 44795 -12058 -7662 51879 31508 -37088 -6957 72541 44916 -38800 -32766 29338
173 29338 28140 -12821 -8660 16382 7317 -19096 -34625 -35377 -14390 9102 -14752 -48732 -20782
186 -20782 27714 4538 -37373 -4050 36144 -9511 -49010 6038 41111 -9210 -26546 41353
198 41353 54078 -17062 -28652 40352 46307 -14820 -6074 55240 38813 -22189 -19227 11684 -4611
211 -4611 -23899 -4766 6307 -12573 -8638 8160 -13129 -34993 -10279 12679 -23034 -44636
223 -44636 -561 28261 -15729 -35893 11466 30381 -17150 -26613 26325 37904 -3332 -5684
235 -5684 32090 24875 -11193 621 29830 12289 -12742 4435 26197 12493 -3114 4942 2877
248 2877 -9661 -10865 -8746 -17068 -9623 6830 -7727 -30388 -13201 9581 -11611 -37257 -6732
261 -6732 22557 -512 -25012 3689 23598 -6462 -19252 12011 21739 -3991 1146 28794 21031
274 21031 -3178 6903 26101 6474 -13578 9832 21205 -1989 -9171 10908 7500 -18587
286 -18587 -13482 7628 -6775 -26095 -4693 14125 -12255 -30678 -2819 11861 -19607 -30986
298 -30986 4424 17096 -13545 -15069 16045 18765 -7765 -4529 17666 11077 -3942 10409 23587
311 23587 9031 -1261 14537 13902 -2349 -2577 11750 4683 -7345 2446 6692 -6477 -12823 -2361
325 -2361 -3207 -17754 -13796 4883 -2540 -18057 -10137 6362 -7719 -19697 -3582 7508 -6702
338 -6702 -9638 11340 12979 -5090 86 16029 8555 -5295 8685 22433 6648 -3895 15402
351 15402 19624 -4633 -7760 13559 8399 -12323 -5612 13396 1740 -18772 -7315 7024 -10804
364 -10804 -24022 -4728 6700 -13007 -18198 3193 4151 -15078 -15414 6823 4576 -10511 -1592
377 -1592 14700 5557 -4660 10172 17001 1835 -1899 12963 14432 567 2983 16190 8599
390 8599 -6629 714 8751 -3865 -10626 1828 5492 -10082 -11525 1562 -3829 -17485 -11038 401
404 401 -7895 -16508 -3904 4309 -8564 -11896 3245 4857 -9944 -2340 13553 7481 -3850 6443
418 6443 19257 2948 -3462 12073 18143 -750 -1840 18225 13303 -6294 -2597 10335 428
431 428 -15665 -4477 9681 -5925 -17474 -1126 4405 -15347 -19395 202 332 -17137 -11889
444 -11889 7806 798 -13416 -2602 11083 -638 -7427 7108 13695 295 1238 16768 13844
457 13844 -2151 4267 15729 6463 -3342 7413 15072 -623 -5503 6171 5011 -8791 -10160
470 -10160 2694 -2377 -15184 -7512 3033 -6444 -16220 -6338 915 -9818 -12881 860 2077 -6841
484 -6841 -2285 8995 806 -5744 6497 13173 1056 -1221 16286 14813 -1104 1488 15461 11419
498 11419 -6153 -143 13656 4007 -8510 1986 9447 -6050 -15232 -86 3704 -13272 -13226 1216
512 1216 -640 -14629 -11624 994 -4288 -13465 -4971 4885 -1806 -4874 6867 8871 -2106 2522
526 2522 14103 5549 -4633 8134 20981 4975 -5399 10349 17199 -634 -8094 8937 10182
539 10182 -6807 -8102 5599 1229 -12101 -8113 -865 -8248 -14585 -3568 717 -9607 -9387 -382
553 -382 -2807 -9034 -3378 2486 -2291 -3156 7916 8955 -3439 659 16422 10906 -5466 3140 22432
568 22432 10914 -6769 1811 18083 7287 -9178 -1362 9855 13 -8555 -385 3733 -7633
581 -7633 -10945 -1137 -5128 -14010 -8139 -454 -6813 -11994 -2488 1113 -7503 -4504 4924 1240 -5944
596 -5944 4452 13690 2517 -5901 10573 19173 146 -7428 12044 20606 -393 -8969 11179
609 11179 13536 -2493 -7850 4065 3841 -5781 -5566 -3448 -5997 -6964 -790 -5994 -11750 -7097 -811
624 -811 -7356 -9349 -1997 3251 -5591 -5377 6924 4799 -7540 -644 16499 7138 -6698 3326
638 3326 20806 9989 -8219 683 17643 8635 -6762 -107 10453 4650 -4342 -2585 -104 -2856
652 -2856 -2415 -1111 -8348 -9591 -2303 -1909 -10705 -10104 1581 -631 -11410 -4607 6198 -1192 -8931
667 -8931 3754 11382 -1740 -7302 10356 16942 -2667 -6106 11688 17480 -561 -5432 8151
680 8151 13402 311 -3833 1239 4744 1395 -3417 -5331 -4101 -1518 -173 -8556 -11387 -836 2249
695 2249 -8448 -11263 -496 3256 -7424 -10117 5037 5071 -6293 -2714 10496 6013 -4888 676
709 676 15785 10236 -5149 -886 13528 8259 -3265 257 8334 4904 -1253 -562 -2059 489 1423
724 1423 -1469 -9068 -6374 2330 -2240 -13022 -8882 3734 -2589 -13085 -5291 5958 -571 -11046
738 -11046 -730 8468 -176 -5704 4302 10157 -1263 -3240 7336 11315 2495 -1353 7084 8635
752 8635 2175 748 1326 3151 1620 -189 -3108 -4196 1045 1063 -7726 -10373 -240 4064 -8596
767 -8596 -11181 -51 2769 -7025 -10670 2152 5977 -4347 -6075 4961 5289 -2369 -342 7920
781 7920 6601 146 2646 7857 5845 1605 3208 5463 2692 2113 3176 1164 -936 2232 368
796 368 -5919 -3550 2855 114 -12669 -7441 4398 -1096 -13446 -5920 5346 158 -11738 -4467
810 -4467 4720 -184 -6015 420 5702 1681 -1844 4586 5855 1570 1003 5611 5635 2988 3839 5001
826 5001 1028 2316 3633 -277 -2634 695 2938 -4097 -7785 -314 3164 -6055 -9434 -2264 2985
841 2985 -6053 -10573 -1415 4003 -4662 -7713 1001 3673 -1061 -2411 3238 3442 1162 3543 4269 2490
857 2490 1971 5374 4413 779 2844 5488 1756 -1367 3758 3872 -3674 -2891 4128 -94 -7996 -5445
873 -5445 2961 -1221 -10226 -6102 2012 -1552 -9147 -5043 2218 -919 -4096 -1859 2542 -557 -468 1943
889 1943 1945 2325 4204 4368 2279 1187 6769 5077 1414 1998 5874 2923 -2123 -793 5046 -492 -6455
906 -6455 -1482 2893 -4721 -9045 -2140 1424 -5798 -8443 -1710 1250 -5542 -6485 -463 1895 -4191
921 -4191 -2139 2821 401 -488 3218 3530 -966 1688 6516 4202 408 4895 8234 2747 121 4209
937 4209 5308 -173 -2297 4097 2013 -5701 -4458 2198 -895 -7372 -5499 1006 -2911 -6722 -2791
952 -2791 950 -3052 -4736 -1696 509 -1129 -754 1686 904 1107 3484 5174 1103 508 5748 6615
968 6615 713 1932 7049 5176 743 1411 5936 519 -3167 60 4059 -2258 -6265 -1792 273
983 273 -5512 -7822 -1535 -1849 -6160 -4044 -664 -3698 -3871 500 1745 -1290 -1881 3333 2378 -987
999 -987 2090 6412 2969 -177 4059 5548 1894 -1348 3695 5923 949 -1125 4606 1323 -3771
1014 -3771 -982 2071 -1622 -5849 -2662 -612 -4264 -7262 -2229 -713 -5002 -4725 -1564 -1581 -3522 -1774
1030 -1774 2016 -441 -1987 2405 5148 950 721 5200 6436 -166 2818 5273 4220 -508 2311
1045 2311 4356 1160 -2392 1142 3184 -1677 -3851 509 -768 -6126 -4621 -615 -3302 -7404 -2469
1060 -2469 -443 -3628 -4734 -995 -357 -3378 -1695 1388 1748 -507 324 4598 2582 -1319 4110 5773
1076 5773 1802 1356 6085 5919 685 2611 2981 1720 -1191 1241 2019 -1687 -4289 -1158 -1264 -3754
1092 -3754 -5601 -2380 -1430 -6001 -4239 -669 -2298 -4941 -1192 1538 -1902 -2009 2808 3336 382 138
1108 138 4449 4153 -88 2900 6301 4606 360 3075 6276 1754 -909 2320 3015 -1040 -1713 773
1124 773 120 -4621 -2481 -564 -2414 -6070 -2301 -690 -3870 -4986 -1206 -742 -4385 -1093 1901 217
1140 217 -1624 1452 4336 591 475 3294 4548 1656 1748 4549 3733 757 415 4321 3153 -635
1156 -635 1086 1188 -879 -2745 815 -1313 -3906 -3674 -1011 -1920 -4719 -3236 -824 -2627 -4487 -792
1172 -792 628 -2439 -1923 1481 1180 -1611 -770 3851 2828 -816 2895 5533 3363 740 2928 4897
1188 4897 1189 -171 2814 2188 -17 44 2139 -1017 -3206 -620 -90 -3961 -4517 -189 -1004 -4911
1204 -4911 -2954 82 -292 -4770 -3196 2023 -998 -3362 923 2810 347 -1493 2598 3527 462
1219 462 903 4436 3912 655 1255 3336 2245 1692 1579 1013 -337 -584 693 -799 -2880 -1558 192
1236 192 -2697 -3625 -937 -45 -3260 -4890 586 -83 -2738 -2979 2421 1589 -2058 -235 3183 2577 464
1253 464 1162 3337 3721 593 3100 4428 1391 339 1156 2085 264 1012 1295 -864 -908 899 -265
1270 -265 -4205 -2195 1457 -1577 -4371 -3475 -544 -1389 -4014 -3060 842 -884 -2670 978 1351 -521
1286 -521 -1778 2275 2133 1346 245 2715 3116 2080 1292 2586 2699 1333 766 1595 200 1743 1366
1303 1366 -724 -1870 94 -427 -2704 -3027 -383 196 -3831 -3761 578 805 -3724 -3047 -842 271 -2114
1320 -2114 -932 1604 1383 186 1159 3632 2757 677 2979 2983 3340 2458 2482 1942 1994 724 458 44 -581
1339 -581 2875 700 -4013 -1728 1159 -2222 -3810 -2057 1359 -2110 -4584 -2517 -397 -1340 -2489
1354 -2489 -1046 886 -351 -885 599 2160 -590 1466 1834 802 1669 2281 2012 1531 1993 2177 1069
1371 1069 451 974 1294 910 -1057 2397 1341 -2650 -3081 -13 -320 -3749 -4678 -601 372 -2608 -2692
1388 -2692 -1153 544 -2777 -1356 -462 -535 -20 -395 899 1142 419 2737 2199 972 2787 3205 1368
1405 1368 -90 2144 2527 -617 717 2326 1801 -2516 -669 1811 -604 -3459 -1503 -145 -1526
1420 -1526 -4237 -2151 -559 -1240 -4025 -1123 -375 -366 -1154 -1451 -453 225 469 1046 499 861 2604 1848
1438 1848 1923 2098 3049 1828 -136 1591 2101 380 -1105 675 2221 -2025 -2231 478 596 -3386 -3199
1455 -3199 407 748 -2862 -3476 -868 -1154 -2049 -2038 -1075 -1266 1008 566 72 922 1999 2959 -441 967
1473 967 3232 3639 1 132 3588 3235 -224 362 3687 2134 -1243 -614 1324 139 -2277 -1138
1489 -1138 507 -1215 -4027 -1787 -1682 -1531 -2797 -1761 -1635 -1554 -1375 23 -220 124 217 621 -840 688
1507 688 1615 1593 -1 2521 4608 2308 -993 1477 2532 -115 -662 2338 2264 -89 -933 304 1070
1524 1070 -1732 -3465 40 -561 -2898 -2920 -1191 -2273 -2855 -1761 -1129 -1059 -398 -800 -639 -791 1028 2162
1542 2162 -103 1194 2035 3635 525 504 2818 2597 -275 334 2561 1319 283 -22 886 994 -1174
1559 -1174 -72 495 -651 -1533 -529 -596 -2930 -2504 -1224 -784 -782 -782 -595 -980 206 -993 297 -921
1577 -921 385 1735 1070 -207 911 3468 1515 1021 2810 3750 512 -903 902 1812 -299 -858
1593 -858 1095 1037 -1555 -1760 1216 -1220 -2252 -2363 -1575 -3025 -1832 -1140 -1605 -2580 -1372 750 -1663
1610 -1663 -423 328 1116 287 -803 2376 882 739 132 3313 2111 -68 1615 1858 2012 -184 521
1627 521 1080 -782 -508 -931 43 -658 -1041 -941 -1336 -1359 -2015 -519 -1147 -2459 -904 26 -1662 -1290 177
1646 177 -327 296 138 1408 1350 -287 728 2392 344 203 1286 2271 43 985 1963 974 -18 -72
1664 -72 357 -284 16 302 1275 -1124 -2189 -235 -1123 -1842 -2401 -510 -1859 -2110 -1681 223 -946 -1135
1682 -1135 1201 174 -644 -1255 2130 1940 -192 526 1650 2412 342 1197 2250 1221 -79 1252
1698 1252 2171 313 701 784 -554 -866 -1040 -1149 -2166 -2552 -440 -494 -1390 -1713 -1815 -901 -1230 -930 768
1717 768 1656 -520 -62 961 124 -473 1101 1971 933 931 1939 1833 913 95 1227 2160 -775 330
1735 330 1273 -51 686 -1039 -233 -851 -898 214 -1369 -1140 -441 -305 -1214 -2355 -1049 -927 -1267 -2174
1753 -2174 -315 -1197 -1531 -936 -159 618 -414 2219 1585 2346 1531 1607 1243 1103 493 962 1487 1416 1359 821
1773 821 63 -701 -78 298 -181 -177 -1068 -324 -1719 -1707 -681 -541 -1779 -442 75 258 -628 -90 8 691
1793 691 -251 -232 426 -237 952 1691 1104 1121 1127 989 735 125 1666 480 1403 -355 -281 -8 35 -584 41
1814 41 1333 -1097 -1541 373 -1376 -981 -2523 -279 -1712 -1344 -1596 97 97 -1394 73 -788 -51 158
1832 158 1088 1322 217 1420 1458 821 315 545 1821 759 1583 1376 588 436 132 1899 -687 -586
1850 -586 -72 -8 -916 -2765 474 -627 -2002 -897 -1496 -1025 -668 -182 -332 -1396 -1481 -272 722 -850
1868 -850 576 806 1679 522 944 2286 695 676 881 1563 924 239 950 250 425 557 785 -129 -405
1887 -405 -761 -628 -752 -1847 -794 -86 -351 -1458 -865 950 -867 20 938 859 -1012 -552 -31 473
1905 473 736 318 801 501 199 1893 1878 709 512 2259 -217 -88 740 861 -247 -648 -506 -606 282
1924 282 -1330 614 973 -2304 -1456 -834 -1203 -2285 -2072 -635 -121 -1172 -115 -208 192 630 113 -50
1942 -50 1290 412 136 -269 556 3011 1065 -583 344 983 -495 44 949 798 531 -794 179 656
1960 656 -304 -2224 151 -1408 -544 -1103 -1727 -900 -547 -358 -788 -1094 -1989 -1121 739 946 395 713 110
1979 110 1254 995 1488 1900 -193 1113 928 343 310 981 419 4 -198 -719 -275 -1354 -440 490 -947
1998 -947 -1163 -586 -219 -1254 -1853 -1700 -1010 -1024 -1179 69 -898 -82 528 739 480 1227 1273 310 537 1507
2018 1507 1111 1169 358 972 1531 734 182 627 766 -1177 -122 -636 1250 -1062 -1514 -914 -120 -512 -994
2037 -994 -982 115 -41 -575 -689 -1708 -889 -741 -265 -616 174 1636 -1386 -750 1908 1468 411 1555
2055 1555 429 1212 807 951 794 683 645 -634 365 -155 -779 -195 -1203 -428 -349 -466 561 -1284 -501
2074 -501 -337 -1561 348 -796 -460 -1918 -194 -1012 785 604 -182 817 2016 773 234 1965 1190
2091 1190 623 1913 2022 1329 379 1010 1126 422 -573 20 1738 -740 -913 -817 -470 -1170 -752 -1331 -602
2110 -602 -784 -992 473 -652 29 -412 -563 -886 -260 119 -292 -151 370 212 240 244 685 759 585 184 1002
2131 1002 1899 650 1387 861 1010 -1219 -218 31 648 -1286 -817 -984 -863 -136 -585 -1683 -559 -1335
2149 -1335 -1081 -879 -1216 894 680 -755 -172 375 116 -168 474 1120 862 1113 1538 749 539 -555 1335
2168 1335 705 1458 -287 745 1386 362 -1074 -121 -786 -1002 359 184 -1278 -2174 -909 -94 -1303
2185 -1303 -267 946 -640 -910 -815 -171 -306 -168 -123 838 -160 861 1454 1132 841 661 1184 437 -658
2204 -658 566 1151 636 612 -877 -433 -920 378 -380 -554 -1066 -522 -50 -450 -1198 -1232 -511 -859 296
2223 296 -86 -1114 -167 70 430 -834 849 -926 1174 1141 205 791 1689 238 351 745 546 -193
2241 -193 -238 406 -74 1198 9 -414 -492 -571 -318 -985 -1186 -1172 -1492 -201 -423 -551 297 -1112 -726 -55
2261 -55 -349 1016 -44 -217 1056 300 -513 1074 309 255 183 1249 1727 -90 882 -203 -817 -252 437
2280 437 -49 -366 -40 1052 -1486 -47 -1555 717 -166 -1316 -734 -640 134 -679 280 -571 -1187 -467
2298 -467 -554 -711 -494 178 1094 906 867 1178 1222 349 677 553 1508 -247 747 -258 810 -255 719 -114
2318 -114 -343 -194 -144 308 -511 -18 -796 -749 550 -1184 968 -23 -1090 -1399 -128 -1425 -745 478
2336 478 554 828 926 294 568 106 1329 1246 1004 -49 1391 664 2028 758 1065 190 -620 -1027 220
2355 220 -104 -394 -409 268 -229 -1031 401 -242 -1444 -607 -1120 -358 -1726 180 816 -2218 -457 191
2373 191 1026 208 95 409 381 572 -439 518 1219 954 -125 1860 3 303 722 -288 -230 324 -41
2392 -41 274 -81 5 -1449 -1408 -1030 -1097 142 83 -1356 -390 633 -863 -2130 -921 -206 291 -54 -6 129
2412 129 1467 1132 408 -776 1118 895 398 340 728 119 351 82 -516 301 -310 -58 892 166 116 295
2432 295 -322 -219 141 -711 -379 -560 -846 -877 240 -699 -151 -599 513 -437 195 -67 -98 1236 237 495
2452 495 -969 737 1329 168 516 798 -865 942 -216 280 -499 -909 -384 -138 -54 -37 -222 -25 -886
2471 -886 53 -599 -1569 -1058 726 -137 872 -945 -312 -152 -226 75 418 -214 143 -727 1243 1025 113
2490 113 -447 -844 248 -403 78 5 459 -91 -632 200 440 97 -1262 607 -70 -399 -1243 -719 -34
2509 -34 -13 -1255 -538 302 -1024 -833 401 -159 -709 270 -828 598 672 -691 472 966 870 2049 362
2528 362 225 879 0 69 270 295 -215 -43 -757 449 291 -68 -252 -643 -1160 -843 -846 -1138 -791 -335 -505
2549 -505 -721 452 -893 -476 162 229 697 1519 572 826 2026 1040 -119 758 1260 859 -217 685 1057
2568 1057 -138 -302 908 828 74 -662 555 -409 81 -1062 -708 -175 -684 91 -337 -685 -66 -497 179
2587 179 -126 -208 240 542 -1084 -305 -283 -308 -96 -750 1495 10 48 175 682 1002 816 1574 -329 1188
2607 1188 -75 632 -642 -506 -58 -148 -58 1176 -402 -386 -676 -97 -621 -401 -117 -1148 -839 -682 -719
2626 -719 -448 -462 -491 374 912 10 -102 259 352 451 1135 110 739 987 691 452 726 -550 -704 -701 698
2647 698 -741 537 -153 -1014 -1005 -440 -464 -753 -638 90 -655 -605 -1702 -885 -817 -328 763 801 596 -165 -228
2668 -228 1094 -935 -169 1901 932 -27 -698 -619 512 283 293 -40 -839 -277 -333 -132 -472 -2501 -158
2687 -158 153 -724 -426 -10 -1201 -1318 -92 -518 -370 -311 -1282 201 555 -996 1332 760 897 114 -282
2706 -282 -21 -529 60 366 -93 2 129 -77 952 576 -408 -783 448 -984 73 54 -961 375 -806
2725 -806 -1221 -307 -376 60 -988 -71 -561 -156 -1486 321 497 371 410 32 346 163 -397 1158 864
2744 864 -330 550 -284 649 1532 601 -233 191 599 153 745 -1954 -197 -422 -402 65 -1195 677 -224
2763 -224 -526 -264 -1200 -565 375 306 -534 488 -320 295 719 -399 897 1030 -104 124 929 341 375
2782 375 104 227 -435 220 194 409 -303 532 574 -686 -195 -1946 -671 -830 -214 1035 1242 -42 -941
2801 -941 -222 -114 95 148 883 -160 5 586 -1666 -379 -185 498 674 1541 169 -17 371 918 1632
2820 1632 925 442 -397 -352 623 870 -409 193 203 -315 -464 369 325 -895 -506 -82 -440 198 -512 3
2840 3 294 -457 519 -391 -693 334 279 467 764 521 791 309 -65 1175 299 228 465 1390 616 476 807
2861 807 596 -119 -705 -833 -1721 -669 -296 193 -55 -1255 -1110 -188 -77 -229 -17 -1274 -838 82 -319
2880 -319 215 637 428 802 302 378 38 236 1295 813 479 680 764 -255 -500 404 -642 154 472 416
2900 416 -2116 -941 574 550 -1208 -1258 -404 -556 107 -807 -787 295 -881 997 -136 324 541 -432
2918 -432 -661 -24 1429 381 1094 -942 182 1362 1315 854 -885 1141 -313 -161 160 -510 -347 -528
2936 -528 -856 -782 -203 1149 456 48 -860 118 -612 230 -341 -789 125 -210 -82 24 769 -147 -375 819
2956 819 1025 530 1087 1294 286 1419 931 907 474 -168 1262 930 -99 41 739 -774 700 159
2974 159 1259 -242 340 297 -301 -417 -1043 -458 -1295 334 -899 65 -1208 335 581 1098 624 -239
2992 -239 998 8 418 172 -63 1521 996 630 1386 178 859 -379 -149 1163 472 -1321 -266 -43
3010 -43 -684 -437 -739 -553 -237 -1146 -210 -330 676 -571 666 89 362 338 -849 -1009 -328 -336 -326 -84
3030 -84 1532 452 263 924 -116 1231 179 500 156 -635 687 721 609 -329 112 39 -848 -268 431
3049 431 57 -1578 -767 -678 -861 -1443 -385 -1159 -1233 474 -712 -170 401 -208 436 -576 373 -123 337
3068 337 968 1212 639 -619 25 1193 592 731 395 -23 -325 -187 228 -36 354 220 -25 -205 -169 649
3088 649 -884 -1115 -907 -737 -688 -480 510 -1046 987 -563 932 668 351 21 -358 394 279 1191 186
3107 186 1380 1160 260 1423 912 -356 48 1293 254 -534 549 -189 -384 -1189 -933 -1724 -686 -610
3125 -610 -953 -17 450 -1030 -455 -76 -363 -436 464 -40 323 658 -81 45 139 -212 -4 -399 -1024 1946
3145 1946 386 1102 644 949 8 808 438 -292 -48 -1300 784 278 -917 -980 -1235 673 -473 -554
3163 -554 -244 -693 578 -19 -342 49 -736 -470 1003 145 98 272 374 1133 158 -104 319 29 509 297
3183 297 435 1412 281 272 -1139 -579 -126 -115 -227 -173 1155 -483 -961 -326 160 -1540 -371 -78 482
3202 482 185 -913 -445 -303 -82 539 -662 -606 -288 287 961 874 130 145 297 542 92 -207 1134 372
3222 372 97 398 -1689 2 608 -501 -699 -594 -62 -640 -642 -375 433 -841 -407 351 -74 408 -1126
3241 -1126 -701 372 -1095 -1028 -412 1427 43 264 728 -48 834 -269 -421 1146 -14 -729 -133 519
3259 519 -708 569 66 -207 799 -1291 523 -373 -188 -560 -629 -457 -189 -309 52 904 341 159 52
3278 52 -648 408 -656 521 51 385 -148 -130 1049 1145 -29 349 894 311 116 -27 908 -591 -559
3297 -559 387 389 -635 371 239 -375 -667 -228 639 947 -263 -835 -118 254 -1885 -1088 303 111 -230
3316 -230 1036 120 922 412 786 -140 862 250 274 542 411 -150 -1169 -197 1433 470 381 16 101 782
3336 782 146 -209 -18 53 -483 575 -1897 -288 -174 -977 -133 584 684 435 176 -157 -497 4 447
3355 447 -42 168 678 507 -324 -981 179 594 -416 -449 -244 399 -338 134 32 482 405 313 895 -360
3375 -360 289 273 62 409 -428 1046 409 -96 -1436 -115 -136 -660 528 273 220 537 -68 142 767 1233
3395 1233 -710 125 -414 -166 282 1296 173 608 -276 225 397 109 27 446 -788 -385 -234 241 -123
3414 -123 280 -169 -1293 -32 65 -447 -369 321 -337 -387 238 -45 110 -576 134 656 1004 1124 1046 322 -640
3435 -640 933 -17 -308 599 27 -362 -620 -368 -183 -117 987 -319 -503 -345 -1480 106 420 -1191
3453 -1191 -364 -344 790 -1128 -219 86 115 253 -32 -440 -710 -407 50 -386 336 854 836 279 -91 899
3473 899 -198 -1139 -252 566 -169 387 1287 -932 -1120 -264 -1182 -1188 277 -784 -870 -131 -315 -1769 961
3492 961 -7 -782 7 940 416 581 -77 366 -39 316 1117 -447 -747 2 -22 1518 571 457 481 -19
3512 -19 115 -365 -175 125 -667 -674 1633 89 -554 -628 -578 -1737 -19 -345 -1330 80 9 -1710 369 367
3532 367 -90 803 552 27 -351 -579 -14 855 431 458 863 -767 -97 1086 -488 -123 182 -1035 249
3551 249 -81 -590 -961 -485 -106 -856 -1336 -155 -631 -35 -1227 482 1013 131 -443 -673 -804 -515 -245
3570 -245 -617 177 375 -182 285 539 232 234 211 1048 141 274 -285 -331 871 125 857 -661 958 774
3590 774 -321 -163 -13 -32 -812 65 821 386 -678 -491 -1213 -121 28 -421 173 -853 165 745 73
3609 73 -380 382 974 333 566 99 1157 298 -534 -22 820 1268 127 255 -1285 -595 763 -96 318
3628 318 18 -1554 -409 -24 -230 295 -434 188 139 -794 560 58 -232 568 629 510 -38 940 179 371
3648 371 550 837 1752 472 -594 472 199 211 101 -208 -792 395 -177 -636 -176 -32 315 -779 -894
3667 -894 -271 1248 321 -405 972 -753 -1128 -771 724 -463 -1126 -450 228 256 72 850 592 307 556
3686 556 239 321 1396 1189 118 -346 724 -20 917 252 257 30 722 323 1221 -690 -805 -810 996 -687
3706 -687 737 -677 -828 -272 199 91 -577 -289 1042 -58 749 829 210 938 568 970 633 -234 192
3725 192 -459 -476 -189 105 -206 393 221 1273 548 -88 116 -838 -1033 -728 55 -840 7 -1165 39
3744 39 -152 -50 87 428 -391 -556 -98 -1419 -170 -892 -721 750 -141 332 1044 1770 252 519 375
3763 375 92 119 -118 -254 546 472 239 394 -1960 -516 -710 579 -99 -843 -592 895 603 -690 231
3782 231 -801 -259 440 -413 -63 226 -524 51 -88 642 86 781 -373 -1215 611 -96 168 912 377
3801 377 28 -367 498 -321 -199 210 -710 -655 -355 -274 -1209 -588 -970 453 -157 -411 909 -684 -121 -482
3821 -482 -503 -419 35 -722 1185 457 -462 -164 30 554 285 -260 495 967 -238 253 96 -516 -32 781
3841 781 -331 -52 -262 -47 861 -8 -691 -8 617 1450 660 769 -545 -342 -654 -496 102 -118 -1015
3860 -1015 524 229 -741 -89 -130 -538 588 -169 823 69 -141 -56 2 -978 -832 -466 -212 1204 -936
3879 -936 19 164 -397 -388 -826 -78 -1077 469 15 -389 111 -764 -235 310 -99 -1172 138 721 738 -541
3899 -541 700 694 427 -441 481 -1116 -85 1036 -915 467 164 332 570 157 -410 1146 347 743
3917 743 -368 369 -564 -586 -113 -791 -1098 414 548 -1016 201 617 -193 257 262 -150 -647 -39 -680 -278
3937 -278 65 230 206 -486 633 -25 -75 430 290 912 -1009 -510 -56 -1457 -165 -108 852 -354 120
3956 120 -214 -1204 493 6 -1122 -518 -26 -115 299 -626 -724 197 330 627 736 -91 -316 -188 142 1734
3976 1734 545 599 -1025 -178 406 -707 -608 823 -647 -198 -237 -1060 -331 -277 99 -1463 -222 131 -872
3995 -872 280 -197 -694 -1077 -202 207 341 -1422 -80 14 1265 -279 165 -70 -1023 -109 32 140 50
4014 50 -640 -342 97 -141 876 1588 1208 -27 484 -184 -67 -133 104 -493 178 -246 -533 -94 799 809
4034 809 623 -684 140 -921 620 -108 24 505 379 897 -520 194 981 -67 -875 298 -302 680
4052 680 1113 607 96 1904 -679 614 -238 1313 447 -818 -1255 -586 -620 374 215 -227 379 -240 -377
4071 -377 14 -708 -85 -695 582 -342 139 1272 -338 -286 248 -244 567 -529 -402 -618 1132 -104
4089 -104 -571 229 355 -155 811 752 -13 136 -67 43 -1218 -725 -18 369 -219 -138 157 -324 -608 -529 920
4110 920 -550 1304 -710 -604 -588 1733 284 -143 543 -56 -15 -547 121 1117 -272 -263 151 -171 135
4129 135 636 382 -338 -112 242 -722 -816 -51 -1143 -1274 -250 -17 -555 481 -126 -1128 49 -651 -759
4148 -759 -146 236 619 890 -37 618 -156 68 -692 601 -86 1381 749 1175 -26 1363 346 -382
4166 -382 -46 64 -473 -1754 -360 -653 741 -727 -1326 -846 1009 153 -397 -828 -935 558 -255 -974
4184 -974 187 240 433 -555 -151 497 -141 272 215 1210 867 567 99 127 1071 229 -1104 273 191 133 20
4205 20 -24 360 -315 632 498 -801 -299 -213 788 -866 -413 -877 -378 -1529 -62 620 -1063 90 175
4224 175 82 -265 781 318 -243 119 155 -944 -164 -86 31 485 296 636 290 311 -596 662 -199 180
4244 180 716 61 411 -455 587 255 54 -496 -920 287 -187 -892 -475 -65 -1243 -132 76 1077
4262 1077 -1085 -670 907 1272 -91 639 276 463 201 -668 -520 330 287 -897 150 -355 427 -223
4280 -223 5 -86 -171 -244 -2027 69 1147 -291 -572 776 547 284 507 1014 47 -314 899 -749 -935
4299 -935 339 195 283 459 -251 2028 1147 19 24 1135 158 405 -516 -841 -4 1061 138 191 39 -1001
4319 -1001 263 196 -251 211 196 -1613 -510 -140 -589 -292 266 -4 -631 299 -313 1106 -350 448 -444
4338 -444 -687 1184 377 522 112 -246 -511 95 -1298 -1379 -461 -1075 416 -104 -571 464 -6 -760 -426
4357 -426 -589 -3 -187 -17 -205 1611 1157 -231 -82 -461 1008 709 508 -391 -717 -610 -39 -354 1124
4376 1124 966 61 -326 406 -77 470 -529 1474 -407 -189 21 -223 1146 -4 -801 274 -368 360
4394 360 -5 256 -233 507 644 407 489 -349 266 -359 -62 -336 -573 -536 532 587 517 690 848 -206 514
4415 514 -40 697 5 304 -22 1313 810 -364 109 -468 571 -524 180 126 -1147 -1320 -79 -560
4433 -560 -823 17 -865 52 -333 88 1162 377 -340 -48 -288 -275 454 572 136 1196 1234 251 91 -5
4453 -5 978 -189 22 -277 -662 -661 -955 -616 -122 -575 14 -252 -806 544 91 87 344 -275 -277 -535 456 -78
4475 -78 -434 -406 406 -306 883 147 302 551 771 128 -460 -1659 962 327 -219 237 902 287 1215 -807
4495 -807 169 -25 218 -1241 113 -442 -658 351 -425 -136 129 194 209 1197 668 58 -580 -311 -502 -163
4515 -163 904 506 -604 813 -570 293 -331 1139 287 673 2027 -109 438 -98 753 -609 231
4532 231 298 -77 -270 -2 -194 -806 -326 312 89 283 -71 -889 -362 826 901 -427 -6 -299 788 220
4552 220 256 -32 258 828 559 297 682 -483 184 -184 450 329 1108 884 514 47 -260 -1546 -1548 1086
4572 1086 -1116 531 -792 444 81 228 -12 63 -389 153 -99 -104 1189 1084 -156 -275 -456 274 -48
4591 -48 -245 190 -13 75 1103 -87 643 618 -166 -765 -440 1025 360 -365 -9 -903 921 -407 -412 47
4611 47 -776 -41 535 112 30 -320 -224 -64 448 -1237 -172 11 12 -379 597 729 -300 180 353 421 100
4632 100 1084 157 -708 1613 -948 898 -506 -151 -574 -824 -339 282 879 821 -977 -347 -240 -1647
4650 -1647 -183 543 -134 -927 298 48 -443 -40 1304 599 501 -1154 871 65 -205 1014 860 792
4668 792 96 523 298 502 -889 -290 277 242 406 -476 -323 -87 -471 -469 -309 59 -684 -413 -635 -1242 -765
4689 -765 -373 349 141 -394 -528 -580 494 151 225 -552 434 180 786 -414 -1 1066 -26 -653 163
4708 163 163 277 347 244 -530 596 366 -182 -1084 687 920 -525 874 -361 -292 -316 926 -384 -836
4727 -836 -21 -1130 16 245 818 -169 751 449 344 103 -179 233 485 -839 1438 614 -113 -1015 437
4746 437 -423 734 241 1101 -287 -515 -963 167 1293 -29 -1460 -1160 -534 -187 525 309 16 1531
4764 1531 599 284 133 890 531 -220 -338 -1484 74 -589 661 114 -530 -47 -353 124 385 350 162
4783 162 8 645 380 -497 -4 203 1455 -855 677 161 -185 22 -422 -1103 248 522 -536 77
4801 77 698 915 790 1340 259 594 -25 -5 34 -138 682 315 870 650 -104 -729 97 -336 192 -266 -1171
4822 -1171 -385 -774 -894 303 -178 145 -1415 -438 -1016 -883 645 -146 -16 -757 414 883 -161 -93
4840 -93 -444 1032 1250 -481 -13 -188 163 -1377 382 -188 43 -372 69 -44 223 -980 -265 874
4858 874 610 -369 -2 -221 130 -270 -279 1143 -529 132 -341 183 76 -1134 -131 -60 -131 -1244 -555 66
4878 66 834 1016 -585 -185 -684 -21 -438 669 -383 217 -307 -198 -1161 -49 24 -434 -101 542 689
4897 689 -67 -345 -592 -509 -341 -746 191 -426 173 -227 -538 -359 24 670 -351 -174 101 -449 -578 -260
4917 -260 416 63 402 148 -545 -1656 522 -344 450 -64 586 690 -697 -924 -496 -871 -1364 -440 -185
4936 -185 846 -924 -294 -361 361 -41 -526 -383 1116 1160 -636 -35 -354 1328 391 473 -420 704 40
4955 40 547 1330 0 -988 -924 -290 -11 -524 81 37 185 209 626 90 55 -34 943 374 217 106 -269 146
4977 146 66 41 251 -1102 37 532 21 -253 452 -86 -140 224 -29 925 692 -326 653 103 -242 1440
4997 1440 1153 33 -138 469 -299 1281 317 140 -706 -429 373 -262 566 156 1128 33 -472 -1033 -829
5016 -829 -165 -748 -526 188 -233 -575 98 -1400 -1089 -555 901 351 722 -266 161 -424 1085 -386 325
5035 325 -379 -349 66 -156 -1005 -115 631 -411 -673 67 1437 -202 -288 99 93 80 788 -418 504 1764
5055 1764 -709 756 605 194 391 66 -399 1044 857 -348 -1204 303 768 -1412 172 -912 -203
5072 -203 -865 357 284 144 391 77 325 -620 -464 -1065 -363 504 -731 890 -515 312 -493 413 211
5091 211 426 -377 410 431 -12 1045 461 -236 309 -139 -508 -100 -271 -287 -659 126 -656 117 645 -860
5111 -860 793 -315 -336 -194 -733 -29 116 -770 -460 -287 -1675 264 -19 42 -688 107 -21 130 890
5130 890 -744 -285 -121 296 509 -660 -257 344 -34 1024 -111 -480 211 88 -28 34 224 1701 -993
5149 -993 -387 -1421 -1118 447 277 168 1007 245 -1497 -252 800 -1171 -382 -136 -616 -607 668 -564
5167 -564 6 831 191 -783 231 -180 -502 80 655 393 -165 704 277 325 523 -245 137 597 -670 -568
5187 -568 -1322 81 291 26 760 -431 166 365 -398 219 -776 101 -119 -788 730 -324 -486 -661 1098
5206 1098 -242 -42 -116 293 -259 -34 182 353 356 600 1613 -298 -117 -302 151 143 -287 377 -726 -436
5226 -436 -1585 162 -258 1254 -827 -909 -155 -1117 -35 -97 465 701 -345 -874 -137 -283 270 665 -528
5245 -528 -150 -514 102 611 -801 402 819 401 435 1092 -272 -829 384 -71 -205 -574 12 764 -136
5264 -136 24 96 -464 -1062 -479 -1172 -1340 562 19 522 480 552 693 -120 176 280 -379 480 208 271 279 104
5286 104 124 -1018 -555 64 245 -51 -611 830 -508 -557 -143 39 -961 197 -715 -913 531 -531
5304 -531 947 43 -675 287 -205 -859 -312 -395 546 261 34 -276 304 -98 -135 801 -345 -393 636 3
5324 3 1624 -444 202 -177 835 609 98 85 -181 -852 441 -1 948 155 234 -482 590 851 755 500
5344 500 -210 -322 -105 561 -658 67 -62 491 -88 -553 771 186 555 -772 15 505 84 1592 -978
5363 -978 -479 -826 -554 -903 614 96 -206 -783 195 -869 -953 302 -72 252 391 272 233 94 24 -366
5383 -366 166 649 -6 -93 1015 65 -84 -183 158 167 -1299 563 -350 243 -183 -266 177 -618 -1461 -401
5403 -401 989 433 -474 108 222 485 -291 -1390 297 -467 -1273 833 346 -102 22 -600 568 27
5421 27 501 -280 -59 938 349 341 -165 -25 129 1210 -1155 424 9 427 -847 27 -120 65 -885 68
5441 68 306 405 -826 -194 -608 32 -1150 850 568 184 227 869 -632 -335 -195 618 -161 249 857 -148
5461 -148 272 7 341 125 18 83 267 -205 1257 366 -570 -621 450 282 1099 -231 -328 222 -1249 1244
5481 1244 -189 -864 -56 -137 410 521 332 -498 661 319 -156 646 594 -206 542 -47 246 -934 275
5500 275 779 -484 -32 632 -434 675 1074 214 878 -110 1008 46 -384 -13 250 -342 -625 -188 96
5519 96 -308 -635 32 -550 -175 546 151 -469 279 125 722 -36 -857 821 -38 -256 -80 -508 -274 334
5539 334 395 118 489 -763 1373 -369 -362 -295 349 61 666 -645 -95 492 844 -243 77 -232 283 829
5559 829 238 299 791 -19 -343 722 -1418 1704 -695 47 516 -54 713 -748 -70 860 -957 -1091
5577 -1091 -145 148 667 409 29 -562 1749 116 -379 -4 195 570 -486 -6 -1065 81 -1322 325
5595 325 -22 512 1343 -286 3 295 -182 -146 1189 118 -382 -593 -809 451 249 438 -212 -285 -374 59
5615 59 -487 -540 789 -653 625 -496 718 -291 -146 462 -1121 -274 -608 110 -344 -358 -530 -162 -438
5634 -438 1343 -315 -720 405 -126 222 -297 -557 491 -281 488 83 324 162 859 124 982 228 -229
5653 -229 -1431 226 -273 -849 602 339 -84 -757 417 -430 -939 100 -358 -576 -222 -414 -106 22
5671 22 271 -986 -644 51 -516 -671 -320 -31 -191 786 1666 50 202 104 -257 -31 -246 -949 -361 -2
5691 -2 139 296 -460 1218 90 -153 -884 -1042 -865 5 743 515 -582 166 -819 -797 417 -202 -532 -537
5711 -537 220 -1015 -255 -5 -353 269 943 -348 -118 783 904 1046 824 9 -632 840 602 460 -472
5730 -472 -752 476 -742 321 220 -781 316 66 129 -239 950 -301 -439 764 432 -922 495
5747 495 588 -826 -83 -403 859 873 61 620 -32 312 -497 126 -236 168 237 372 680 -164 387 1243
5767 1243 -314 103 295 901 319 -1271 -17 -657 365 -1050 -1561 537 893 -1007 -219 -128 323 1234
5785 1234 -198 -1350 149 458 312 -528 177 -154 -308 473 729 -320 -129 -702 179 850 -1342 -2
5803 -2 -357 -257 871 -170 302 -571 -441 -208 -251 -949 382 -647 -143 540 104 79 -360 -28 -562 7
5823 7 844 167 686 705 630 1154 -209 166 84 67 879 -411 723 -1114 593 327 -607 -1351 -632 1315
5843 1315 740 -93 -158 486 -239 -390 372 674 318 278 116 -223 607 -1030 142 -98 -958 -163 -957 670
5863 670 -210 -269 1482 -259 -530 -1044 -194 467 -467 -961 280 -98 -616 -1541 263 513 -517 -348 -174
5882 -174 331 -78 -889 -123 282 -1206 -262 -50 412 -483 666 353 -473 742 360 948 661 -350 450
5901 450 -306 -12 189 -258 -313 -365 -15 -340 -713 -291 -143 1063 -523 285 -244 340 706 -505 624
5920 624 -422 -214 -651 -1142 -1213 -385 1770 468 690 749 -402 -147 -326 -660 354 393 -144 -260 207
5939 207 -882 -576 -310 -1128 -221 301 549 271 270 192 100 -177 -395 -286 -341 -778 987 -187 -653 -582 -640
5960 -640 280 -184 744 491 65 1105 1569 168 856 372 -260 -278 19 -89 626 275 1218 -471 -327
5979 -327 -254 -473 -170 1298 679 -844 -1226 77 -31 649 215 -290 128 -250 -276 -488 236 -219 -385 -379
5999 -379 -982 -1073 -91 -982 -342 -149 -606 -124 794 -141 295 -774 -37 -299 208 1093 426 634 629 -284 -517
6020 -517 355 -1226 824 921 1317 358 -366 -84 -552 276 276 13 842 402 -238 458 118 -148 62 582
6040 582 151 -235 299 -641 216 160 612 -549 -641 -254 -16 -360 354 397 262 -28 -972 -1221 51 113 -401
6061 -401 -374 261 -432 510 -842 199 149 177 -275 521 -609 -467 -900 -249 -90 773 -1216 1212 1283 -1111
6081 -1111 41 374 39 -247 654 -313 -734 703 -176 62 426 -730 690 -205 -254 1170 -390 -343
6099 -343 -295 372 -188 -960 -1062 -191 -633 245 -578 -335 -757 356 264 -221 307 -714 -174 184 52 -414
6119 -414 249 152 960 -213 75 561 -240 -1324 -509 491 -818 -703 -1057 20 293 -15 -782 -402 -300
6138 -300 260 -1034 940 1063 694 -132 -21 94 -538 -391 -310 -317 341 899 936 461 119 -4 848 568 414
6159 414 -662 -171 -1165 164 -624 82 773 -936 63 403 -206 -662 131 -349 185 -48 -256 139 -164
6178 -164 677 570 -179 1338 75 321 -467 367 -862 -974 267 -524 666 485 727 29 -937 239
6196 239 -671 -393 -272 -931 1179 336 223 335 254 -211 -76 -988 485 -306 463 84 -536 589 307
6215 307 -494 110 805 -1054 311 -643 171 276 -31 -75 806 870 616 -472 -426 1284 -587 1061 1039
6234 1039 43 263 -718 -219 1026 448 -56 1182 -958 -260 -696 -485 -232 1043 406 -374 535 -318
6252 -318 -240 824 -225 -1250 -28 -133 -194 657 -320 1205 -325 632 -577 576 133 -397 754 -579
6270 -579 449 309 -554 639 -573 -486 1200 -415 -829 -716 -340 1051 -1189 -123 588 -239 -441 -104
6288 -104 -407 44 523 663 -261 -741 327 -12 -1109 175 -30 874 -508 -45 68 1178 -1055 -674
6306 -674 -191 -750 109 -683 13 -420 -636 -2 782 627 -399 591 -65 -564 371 327 406 -1063 -454 -57
6326 -57 677 -101 169 462 -45 8 772 -310 444 -315 212 838 52 128 -338 173 -881 -17 -689 -310
6346 -310 591 -401 -28 -76 -934 412 835 -162 -657 -714 439 729 646 343 93 290 -91 -324 -649 236
6366 236 -255 -311 -1772 119 -1031 -275 -75 -2204 -577 -741 -900 13 306 483 -1023 901 348 -474
6384 -474 -620 344 475 98 -1139 89 684 748 440 404 837 -625 154 -217 1084 -1057 -1369 170 -625
6403 -625 881 501 -461 -599 201 -26 -32 -800 366 187 -510 48 717 1675 9 1072 -143 -1051 -552
6422 -552 -212 169 216 38 -388 617 -234 87 -366 -503 -708 333 291 -456 22 12 307 55 351 -200
6442 -200 726 358 -882 -200 -564 243 275 -213 750 967 -1195 -58 -47 -284 -651 -160 656 203 -297 -789
6462 -789 -272 53 -208 210 -163 -491 -310 -173 975 519 982 -146 520 -946 -411 -415 -759 399 420 884
6482 884 -408 1321 13 76 418 -438 126 -142 533 519 327 173 147 294 -732 363 -283 -965 407
6501 407 -1643 -248 75 -544 189 -225 521 341 918 484 -122 -1054 -494 206 -923 1298 712 -34 393
6520 393 699 798 -506 -358 227 -749 -728 647 1364 -1784 -854 -335 -742 -231 -507 396 -785 -2 145
6539 145 668 145 -175 -439 -73 390 -300 89 88 -204 300 -295 756 -5 1860 -90 -610 387 -66 -248
6559 -248 443 -1128 779 847 -1417 -432 476 567 -417 -800 -782 -395 659 689 292 -88 -206 -754 276 132
6579 132 422 425 19 -133 -21 -72 -60 345 85 403 -190 263 -208 -503 -856 155 105 -100 181 -31 -135
6600 -135 -300 -412 686 -28 1010 380 -514 257 -164 458 9 186 54 -918 -19 69 -348 -925 527
6619 527 -968 -55 -230 83 -130 252 -698 -316 -153 -387 -600 -617 649 -288 1038 -619 31 -773 -502
6638 -502 168 178 -272 -1152 1031 350 -14 -127 1485 639 -1760 -111 212 291 -713 -185 -158 99 -630
6657 -630 -578 -452 104 183 -267 -417 211 605 141 487 392 -297 944 122 -967 -175 -472 935 -471 197
6677 197 44 685 -483 210 -956 278 -1268 223 1033 581 -610 -960 172 -747 -331 96 710 -761
6695 -761 95 3 -1809 -444 -401 -563 -1439 -582 385 524 386 -451 -807 -40 -240 -648 -355 -1231 265 377
6715 377 -613 -28 -6 54 -10 -904 -924 39 0 -220 857 159 698 -39 -694 431 1221 -233 -348 -508 156
6736 156 742 -1158 -646 -43 808 328 343 373 203 -776 448 1086 -1193 299 384 20 -357 681 -576
6755 -576 -55 632 -418 30 -271 147 846 -243 -779 -173 211 -912 -703 435 -741 -669 71 -36 -914
6774 -914 305 648 986 -695 648 1367 -736 525 639 -347 -28 -520 -455 287 -540 -46 448 646 399
6793 399 995 187 642 906 930 206 -322 -1080 652 599 81 -882 314 -736 520 350 -274 178 993
6812 993 979 -402 -273 295 -356 168 664 -190 204 -182 1218 180 -452 -311 114 -903 540 51 414
6831 414 16 477 -417 -1470 -828 617 -408 503 -427 614 315 923 -895 -363 1058 -445 132 515
6849 515 -779 -444 72 -396 -746 -792 -580 591 949 116 -187 -995 697 173 335 -84 874 43 439
6868 439 995 -755 -134 -545 -151 -634 -42 -726 474 278 -345 171 1226 786 424 156 143 -718 -272
6887 -272 259 -1049 81 -698 -518 -77 -404 -727 565 251 117 139 419 -787 -232 85 -141 -61 -557
6906 -557 -498 -19 -679 -946 -653 -3 -164 -235 -344 -646 -517 0 657 -739 606 -271 86 25 -349 -857
6926 -857 594 -443 288 -86 159 563 -731 47 -159 -661 -262 -1472 -79 105 -246 245 -478 795
6944 795 -342 -49 861 679 812 253 450 -360 -328 -394 -535 189 -871 637 747 -173 105 -316 84 455
6964 455 527 -453 -414 -478 -572 -160 128 -756 -480 -626 -697 -51 -265 -705 178 -619 885 1012 -357 -115 461
6985 461 1407 -127 87 255 372 45 250 451 213 -695 -241 1002 552 -1127 304 -279 -910 171
7003 171 400 -1156 705 -186 -1060 1214 727 -599 -246 -124 257 403 -116 -40 1020 187 982 -48
7021 -48 636 -333 337 -36 234 173 965 161 70 850 -312 184 738 -78 1050 1047 152 569 791 495 276
7042 276 1423 897 54 826 -110 -15 -954 -470 270 437 1543 974 -311 -122 -963 -354 1247 1462 236
7061 236 857 1543 334 570 224 254 904 -149 -192 886 334 468 -981 286 -519 250 136 79 906
7080 906 66 251 392 -576 573 350 -373 179 244 -534 1574 550 393 511 -521 970 453 -60 99
7099 99 278 203 -441 -752 -83 346 22 -426 356 765 691 -872 -1378 -926 480 183 471 421 121 562 -1117
7120 -1117 304 689 -498 91 -1009 -1575 54 653 -1029 -1195 1149 -677 -376 346 264 210 193 -1069
7138 -1069 221 601 589 -552 405 -304 30 -210 -103 676 248 -36 -26 510 293 -117 1124 -380 -643
7157 -643 987 -272 -295 672 -696 152 33 -519 366 1236 935 -392 376 334 -44 28 -187 142 538 -87
7177 -87 -10 145 743 -510 578 642 103 -566 -186 -763 -773 -42 315 57 -511 -226 231 699 -273 -188 -275
7198 -275 430 -534 509 1054 824 284 158 -55 728 163 140 441 -292 -379 595 264 -133 -437 203 -600
7218 -600 -678 207 -408 -233 388 442 -421 1328 121 -439 -400 -754 -1154 811 710 442 238 -217 590 -457
7238 -457 -168 -271 -317 19 1098 -691 9 948 -407 -675 -210 -57 -657 52 -7 -276 -542 0 643 31
7258 31 -736 -176 -783 -1659 -382 -310 -602 833 214 -837 -567 264 -1182 -324 877 1162 1313 -201 562
7277 562 628 97 -353 -511 597 368 1334 -1044 -931 -428 -1076 521 1393 -207 279 1002 432 -363 452
7296 452 -326 168 685 -1561 1059 -648 813 -168 1062 -317 103 279 -126 -587 -965 -9 -85 -597
7314 -597 823 192 -467 -49 592 -140 -343 884 39 575 -521 -856 -702 -786 -1737 -38 -211 70 -1096
7333 -1096 -55 715 -521 129 -319 67 820 911 545 -73 -874 -49 1057 341 1037 -624 1121 97
7351 97 211 503 721 -400 -237 60 -592 84 -10 -1442 -409 374 -576 476 -587 338 -481 -216 -308
7370 -308 896 -799 -274 935 -434 -207 -371 -150 -186 -444 -365 -69 -64 -156 -445 503 -384 -375 -21 729 95
7391 95 543 147 -291 -158 -242 910 471 496 -399 -143 -73 -370 -347 95 301 106 -52 -778 -71 -598 693
7412 693 635 822 1139 -1724 -37 1416 6 190 -432 204 -522 111 -221 775 -121 -93 292 420 -902
7431 -902 -1312 824 181 -727 104 -437 -315 1317 159 417 -758 -67 570 -446 -87 146 -568 -193
7449 -193 -107 -130 -35 523 -30 -172 290 364 103 702 -355 -154 687 -178 -372 154 -297 626 -863 843
7469 843 151 -99 396 -216 294 494 433 111 -1844 175 -339 -584 -88 726 -918 -850 903 34 149
7488 149 -201 849 -813 -498 -754 586 478 -278 -626 142 -747 241 517 236 -494 -139 1350 570 236
7507 236 -802 -535 482 329 -297 -4 1248 -111 758 74 1387 264 559 -1462 -468 -262 -332 -1687
7525 -1687 -128 1412 -122 -914 -718 -990 -465 239 357 1105 -462 -632 122 -88 368 797 299 -343
7543 -343 366 357 374 -412 -302 -777 223 587 -66 128 -1475 776 159 623 485 559 341 -696 436 69
7563 69 -265 66 -489 -450 62 -27 157 44 -65 -206 -452 -1151 1249 552 -348 1193 -616 -56 643 776
7583 776 -364 -200 1223 -1967 396 1085 -240 -876 -944 -484 75 324 617 -1203 -17 284 126 607
7601 607 -56 -771 -647 -113 -1148 -889 494 243 354 383 -494 -177 394 -279 -382 -465 18 -454 47 728
7621 728 203 328 -627 -918 -241 4 243 -1085 -68 543 -443 831 381 -99 195 -299 771 75 -454
7640 -454 -293 41 295 112 120 282 437 261 -96 -504 -206 539 -330 481 258 -824 -303 -313 831 -430
7660 -430 -867 -191 5 -327 -782 737 711 271 400 -1278 -151 -51 36 -526 -49 -488 -223 391 -594 -709
7680 -709 873 -30 106 -915 -451 -613 495 117 -214 921 192 -807 298 897 262 133 155 124 94
7699 94 317 232 515 -206 -622 168 -624 504 520 -534 -350 -794 -122 -275 151 192 515 289 404 1244 796
7720 796 -550 498 448 252 -50 377 1044 -592 1058 -593 -140 -900 133 181 919 -274 -262 -868 785
7739 785 648 63 -115 -78 410 -473 17 -1014 -313 -2 -333 -407 858 915 -357 717 -372 -1126 -223
7758 -223 -1311 -497 -956 -158 39 -284 701 574 153 223 553 -335 -381 -113 -474 -235 1218 151 -59 -926
7778 -926 720 -963 -248 396 186 -1250 151 -299 -417 -52 489 517 1210 111 14 -156 -229 -418 -924
7797 -924 59 -306 -133 -673 510 -381 1505 -874 830 130 626 -254 -728 697 -57 203 -389 70
7815 70 16 -64 67 -6 919 318 53 -264 1339 103 352 505 -941 655 -59 280 136 688 79 249
7835 249 -477 188 1096 -194 1189 583 1100 805 -1213 338 -1232 641 -999 105 771 68 -141
7852 -141 -1094 -277 943 191 -5 550 -69 -183 52 -462 -52 266 -354 -74 -211 -379 1146 1165 -650
7871 -650 176 710 273 757 117 743 -320 369 191 103 -53 33 -58 214 -214 1101 323 -888 658 -222
7891 -222 -539 44 914 681 -213 45 -687 -519 -244 170 614 -281 23 1501 -532 1324 897 -273 23
7910 23 77 197 -374 -719 1307 -437 992 -458 1961 264 -540 -211 -55 -451 -502 1434 -181 689
7928 689 -269 11 786 -215 -513 806 228 -3 361 -681 -482 1584 296 177 -120 745 -1568 -1216
7946 -1216 -132 -156 114 -228 -72 -385 -904 119 -312 -379 24 565 599 305 537 -21 151 365 -110 838
7966 838 434 -47 -348 -425 -557 -746 -288 -143 -386 -220 -357 -941 13 -215 476 1146 -513 -772 967 383
7986 383 -169 -91 226 703 38 -43 80 -133 -628 1361 241 -224 -340 352 -145 -942 203 269 -799 -232
8006 -232 822 401 -147 -92 -974 -642 813 -528 332 -726 535 77 -185 -422 315 -1220 -441 -732
8024 -732 -268 507 578 40 -911 -143 -226 -267 132 -443 377 888 -188 -309 -584 14 -119 -285 -1517 305
8044 305 -26 -50 1174 -1046 -175 -67 368 -424 578 465 -280 -946 293 -925 -776 533 -766 -329
8062 -329 -1414 1530 -274 -5 -253 -1287 300 -370 -987 362 -85 -510 136 -656 92 -370 795 -472
8080 -472 41 -52 43 6 -164 351 7 1015 -277 475 -30 -725 -967 724 -181 -402 338 -752 19 -356
8100 -356 800 254 -509 -29 174 -64 -58 912 1185 -681 101 381 91 1003 -309 744 -474 -954 842
8119 842 -289 189 419 -129 -278 -420 409 -908 -431 45 447 840 -250 -792 385 -282 -154 237 -482
8138 -482 167 -31 -219 -731 -138 103 603 -13 -1210 -592 -557 -426 420 219 648 -755 -253 675 -220 1314
8158 1314 224 47 -308 37 -536 1505 214 622 -235 654 344 641 256 414 451 -181 496 719 -226
8177 -226 944 362 -841 247 1281 608 26 -454 426 85 540 812 -351 648
8191F48
$$ Imaginary data points
##PAGE= N=2
##DATA TABLE= (X++(I..I)), XYDATA
0 0 0 0 0 0 0 0 0 0 0 0 0 0 0 0 0 16 -78 108 -108 108 -108 108 -132 176 -212 218 -246 284 -323 366 -406 463
32 463 -510 573 -638 709 -785 870 -963 1068 -1184 1313 -1454 1607 -1787 1987 -2211 2463
48 2463 -2766 3115 -3536 4057 -4701 5542 -6669 8274 -10728 14930 -23474 47487 -217293
61 -217293 -959260 -153636 517911 104810 -306511 -12729 111023 -154020 -196988 15205
71 15205 49680 56999 140994 51219 -174691 -143409 66601 97404 -26733 -38194 37786 84674
83 84674 105316 86697 -341 -42080 30258 62426 -39162 -90129 20655 97427 -9647 -111464
95 -111464 -24117 87297 14630 -100776 -44171 68299 28237 -83635 -77093 6256 20461
106 20461 -33886 -63781 -39108 18712 54348 12718 -43132 3964 97394 70962 -34845 -43716
118 -43716 18307 5202 -17349 54064 81325 -20293 -46668 74191 74158 -88605 -83462 113103
130 113103 123868 -83656 -121523 45035 66483 -87330 -117855 -817 36066 -8930 -3710
141 -3710 14012 -24594 -37678 3364 4350 -27925 553 38586 -1215 -45992 1207 56673 31709
154 31709 3432 32877 37327 -14369 -12665 52404 54037 -12246 -18744 28703 -1826 -64301 -24465
167 -24465 52685 23850 -51048 -30930 28701 11022 -40538 -39216 -14400 -14865 -24745 -20353 -8649
180 -8649 13503 26815 -2901 -41312 -9066 43281 22231 -19573 15859 57890 8111 -37415
192 -37415 12272 47089 -8250 -27398 44707 59666 -15176 -29786 38509 33011 -41044 -36813
204 -36813 25240 8106 -50833 -33597 13200 -2146 -30250 -10353 35 -23264 -20032 7167
216 7167 -3130 -20625 8685 29205 -9025 -34361 10168 38548 -3751 -19790 32753 52001
228 52001 -927 -15831 32404 34639 -16093 -18968 23540 20027 -15535 -3431 23095 -534 -31162
241 -31162 -14245 7849 -8118 -21401 -6919 -2449 -16269 -15148 -10133 -18691 -13584 5086 -1845
254 -1845 -20243 1909 30668 7699 -21658 4309 33493 4005 -20286 11960 35065 8034
266 8034 -9455 21033 29241 -7468 -10896 19125 12859 -15900 -2026 18330 -2589 -25356 -5817
279 -5817 5984 -20012 -26817 -104 3796 -19143 -13803 8844 -4720 -27954 -5837 15690 -6983
292 -6983 -23278 10760 28301 -2897 -16006 17783 27968 -4446 -9726 22926 27610 -1937 -540
305 -540 21149 12459 -10299 -433 13171 -2721 -12943 3605 8478 -11970 -12647 24 -4898 -21116
319 -21116 -11338 422 -11311 -14086 1243 2592 -14398 -11449 7502 694 -13615 -1824 19266
332 19266 8566 -8528 7747 20426 3906 -3656 13718 18113 -395 2915 19612 11240 -7209
345 -7209 2069 13883 -4417 -16508 3479 10024 -10473 -18653 3394 1524 -22826 -17184 4391
358 4391 -3273 -21548 -7799 11834 -4494 -18745 908 12641 -5344 -12199 10585 16824 -2986
371 -2986 -2401 19322 14015 -3565 1291 18357 7652 -4992 9517 18064 797 -6647 6123
384 6123 5948 -10874 -10776 4217 -1195 -14402 -7786 3609 -9301 -17836 -5777 1118 -12242 -13608
398 -13608 1509 2623 -10724 -3168 8710 92 -9683 3956 13612 2766 -1298 13308 15377
411 15377 -555 630 15626 9723 -6009 5356 17541 3157 -7628 5788 10319 -10268 -14478
424 -14478 3648 3479 -15400 -11341 4242 -5239 -20136 -10319 5013 -9242 -20042 -2956 9116
437 9116 -7296 -11821 8443 10288 -8917 -4263 14859 11104 -3659 6811 20885 9005 -1054
450 -1054 10045 15179 696 -3172 10838 9856 -7609 -4169 9823 -1713 -13781 -4698 3989 -9478
464 -9478 -16489 -2428 1520 -13714 -12992 -1242 -3672 -14649 -6407 6298 361 -9388 2607 12684
478 12684 -104 -4635 9120 11786 972 3631 14586 9614 924 8795 15157 72 -4994 10071
492 10071 9920 -7881 -6607 9285 2682 -14915 -10017 3366 -4836 -19019 -7936 3313 -9529
505 -9529 -15839 -1214 5481 -10265 -13003 2114 5419 -9182 -3870 11727 7703 -4100 3729 13655
519 13655 6897 405 9747 13171 1978 2905 14075 7053 -7794 1900 12791 -2207 -13570 1101
533 1101 10083 -8695 -17233 -1050 1816 -15782 -16257 417 -753 -13476 -8269 3638 -3359 -10744
547 -10744 -454 6416 -1981 -5479 7816 8617 -96 5708 11598 4672 1808 10070 11483 200
561 200 1822 14621 9643 -9816 -4052 12667 2577 -16367 -6947 9662 -1405 -17850 -8042
574 -8042 4481 -5904 -16083 -6333 155 -7199 -9651 564 -119 -7462 -2234 6793 1789 -3876
588 -3876 4501 11305 2875 4321 12082 8273 -5 7102 14041 1430 -5476 7766 16304 -3718
602 -3718 -12765 5564 13061 -9269 -17458 1461 6944 -11405 -14823 94 308 -9265 -10166 -3956
616 -3956 -4133 -4963 -128 -1511 -3404 -551 7198 1802 -3111 6975 10603 1388 1096 12956 12843 -1934
632 -1934 3352 16095 7251 -9375 -1136 15409 4599 -14497 -4949 10910 1670 -14679 -9013
645 -9013 4840 -2351 -12273 -7389 -1231 -5537 -5933 -4080 -6772 -7226 -382 1029 -4157 -3005 7962
660 7962 7892 -3355 1480 12452 5146 -2488 6981 15897 1223 -5390 9637 14598 -4014 -10132
674 -10132 9077 12731 -6931 -13786 1158 5767 -8079 -13867 -5133 190 -5675 -8049 -7147 -5400
688 -5400 -690 58 -6651 -7288 1807 6763 -2365 -6483 6360 10552 -1179 -1758 10608 11345 -33
703 -33 485 11467 8690 -4267 -616 13974 5637 -8858 -4867 8011 2627 -9411 -6580 2448
717 2448 -2284 -9395 -7352 -3953 -4469 -3782 -4203 -7009 -6298 2909 -405 -9240 -3412 8984 3232 -7915
733 -7915 137 13934 6017 -5766 3751 13284 2590 -4375 6504 12898 439 -4349 6975 9018
747 9018 -1379 -6932 1261 2953 -3152 -6354 -3165 -1909 -3076 -4170 -5589 -6520 -917 148 -8054
762 -8054 -8982 1462 6054 -4111 -7164 4545 8587 -1659 -5135 7597 12004 1304 -2265 9509
776 9509 10131 -844 -733 7028 6470 -1507 -199 6383 1818 -3347 -2639 293 -1646 -3810 -2240 -2965
792 -2965 -5472 -2706 -2854 -8943 -6201 2516 -101 -10937 -5982 7460 2370 -8529 -2048 11225
806 11225 3871 -6304 796 11551 5703 -2072 3555 8649 4088 -723 3558 5527 -78 -360 3374
821 3374 847 -1914 -830 -1088 -2454 -4650 -2538 -4331 -6319 -2725 -128 -5190 -7287 -1287 4000
836 4000 -3812 -9544 3216 6821 -2737 -6794 4711 9665 485 -3217 6379 9178 1910 1144 6280
851 6280 5996 1331 2674 5197 1281 22 2324 450 -3240 -2260 516 -3232 -6639 -2056 -1272 -6605
867 -6605 -5517 506 -585 -8747 -5830 4306 807 -8084 -2580 6428 1316 -5187 -625 7139 4440
882 4440 -363 3563 5536 3683 2080 4506 3770 1445 2583 5093 831 42 2030 811 -2968 -3436
898 -3436 751 -1198 -5720 -4615 281 -2695 -8300 -2996 989 -4926 -7067 -1555 4649 -3587 -6487
913 -6487 1787 5537 -452 -2064 5779 7565 1462 2610 4926 4101 1904 4834 5457 1638 2118 5293
929 5293 2811 -3102 -301 3321 -1817 -5279 -657 1018 -4897 -6067 671 -1242 -7614 -6077 941
944 941 -510 -5639 -2473 2483 -719 -4287 -651 4715 2091 74 3190 4846 1979 3303 4604
959 4604 4021 1980 5179 5657 1103 -437 3579 3803 -2938 -3821 2131 1238 -5764 -4176 591 -2476
975 -2476 -7599 -2678 -277 -4371 -5846 -1285 1784 -3716 -4710 1406 2343 -2045 -597 4199 3145 -324
991 -324 2363 4831 2679 2330 5757 4433 976 1251 5841 2808 -1542 1862 4201 -1328 -4209 -925
1007 -925 2276 -5261 -4773 -2051 -1861 -6090 -5204 -449 -2720 -6772 -3293 -463 -2406 -2989 676 2678
1023 2678 -842 -1160 4132 3323 1237 2170 5546 3976 1335 4660 5138 1838 -34 4007 4387 -2997
1039 -2997 -1986 1496 781 -3724 -2171 1337 -2478 -6839 -3170 -438 -4921 -5761 -1241 -840 -5018 -3275
1055 -3275 1376 -1457 -2356 -471 4256 437 -1221 4216 4645 1251 1817 5723 4799 592 2032 4964
1071 4964 3022 -741 1899 3226 -344 -3825 1170 1278 -4428 -3151 308 -1510 -6083 -4130 -1699
1086 -1699 -3454 -5002 -3222 -730 -3327 -2970 1296 412 -2854 -938 3126 2188 339 2466 5038 2506
1102 2506 1719 5838 6161 172 2092 4979 4190 -482 545 3359 1490 -3084 -1566 801 -2260 -5450
1118 -5450 -1955 -1330 -5176 -3787 -1845 -915 -4198 -3454 -828 -1692 -4094 1750 2323 -452 -1675 4598
1134 4598 3220 -61 764 5015 2895 22 4018 5020 1621 45 3117 4803 505 -1944 1808
1149 1808 1761 -2665 -1251 465 -1133 -4550 -2244 -1160 -3710 -6045 -992 -475 -3577 -2577 -702 -419
1165 -419 -3479 -1026 2722 1448 -842 2582 5730 2552 923 4332 3891 1103 2109 4481 3301
1180 3301 -1658 1929 3879 1558 -1216 450 762 -1344 -4104 -2411 -504 -3906 -4052 -786 -3558
1195 -3558 -3711 -2209 -261 -2441 -4023 31 488 -1292 -668 2943 1460 -596 2687 5250 2874 -442
1211 -442 2450 5618 1498 -736 3451 5148 36 -200 1993 2832 -2324 -2003 909 -47 -2460 -3219
1227 -3219 -840 -1387 -2735 -649 -1922 -2402 -1583 -16 -2418 -3073 -534 1020 -785 -1706 2072 4298
1243 4298 666 75 3850 3437 11 1599 4156 1636 91 1212 3574 2229 -422 917 407 -267
1259 -267 -2470 -855 -446 -1611 -2742 -1540 -4065 -2082 -698 -439 -3847 -1621 1389 -488 -2773 -1312
1275 -1312 3054 1263 -2128 -117 2896 1642 -551 1554 4040 1535 147 3266 2520 1177 58
1290 58 2560 1930 228 -508 831 -709 -877 -843 -1544 -3001 -1832 -557 -3291 -3757 -1283 -1417 -3300
1307 -3300 -4395 -258 1517 -1450 -2592 1524 3411 -347 -717 2428 2805 617 699 3510 2883 1311
1323 1311 2544 2315 1001 -204 1638 1390 -475 -16 171 -444 -1697 -882 -1457 -2765 -1854 -1713 -1149
1340 -1149 -3971 -3197 -77 -1460 -3172 -859 1888 1139 -2438 437 3107 781 -447 1186 3313
1355 3313 2489 1784 2025 2813 2879 -230 2336 1449 118 744 241 -242 -2600 430 -1081 -2069 -1567 86
1373 86 -1884 -3705 -798 -44 -2966 -1787 -131 417 -3064 -4045 1366 2438 -535 -2638 1774 3537
1389 3537 1368 277 2296 2417 2302 2182 2760 1660 842 1605 1284 -391 1232 2710 -864 -1861 -294
1406 -294 726 -2518 -4127 -193 -544 -3930 -2456 -191 -2620 -4256 -1953 1485 -2109 -2701 -842 1753
1422 1753 641 -1316 371 3461 1570 520 1048 2477 1185 2306 1358 1723 1860 1792 137 -211 280
1439 280 868 -504 -1706 -119 -13 -994 -2217 -1948 -136 -2265 -3419 -910 1213 -2805 -4408 259
1455 259 1529 -1202 -2992 1075 2250 1605 -661 3082 2866 1674 1410 2595 1298 2491 3436 1141
1471 1141 338 1704 2053 -401 -860 2011 739 -2968 -2763 167 -853 -2879 -1676 273 -1316 -4006
1487 -4006 -2237 -986 -1183 -4154 -687 1054 713 -957 453 1678 987 813 -81 1942 2530 2066 1314
1504 1314 767 1555 3059 740 -503 377 658 -103 -1999 -59 -201 -2620 -3114 -427 410 -2380 -3373
1521 -3373 -1498 -118 -3147 -3332 -1524 -733 -2309 339 253 969 -766 -51 1952 1309 908 1765 1405
1538 1405 1097 2724 2513 1220 309 1737 3523 52 186 2030 2207 -1698 -2604 1040 -98 -2004
1554 -2004 -2059 -1803 -1249 -3319 -1936 -186 -1752 -3558 -1049 -582 -826 -1447 731 1494 -586 866 1865
1571 1865 2061 1993 2710 2761 1288 -320 1882 2836 -570 1120 2672 -274 -911 267 474 -310 -1656
1588 -1656 -1409 619 -1536 -2135 -1723 -1575 -1842 -1847 -102 -1687 -1799 679 222 -201 -14 -268 658 384 1214
1607 1214 4262 1084 1347 2402 2058 793 237 2486 2441 611 130 1981 746 -781 -1349 609 -87
1624 -87 -1957 -1965 503 -988 -2024 -1783 -500 -1844 -2050 -917 -195 -1214 -1120 -995 -165 46 605 2146
1642 2146 794 965 2304 2424 -520 854 2677 1771 114 968 2781 1215 -803 676 -149 -928
1658 -928 -754 -480 679 -1606 -1184 -179 -1777 -1838 -1385 -1472 -1707 -1262 -488 -964 -762 -587 -297 578 -542
1677 -542 854 1529 369 406 1056 2677 1410 580 1475 1084 1149 222 323 1098 -1061 -414 190 -534 30
1696 30 -1187 -750 -2147 -1400 -849 -739 -3055 -2092 -554 -694 -267 -1597 41 -408 -1025 488 1460 10
1714 10 190 561 1980 968 1321 3430 1787 1792 965 1906 1353 1127 949 615 1117 -1380 -1017 -413 -2039
1733 -2039 -568 564 -2034 -2036 -1215 35 -1809 -1537 -1353 -531 -2175 -586 63 -1216 -795 -72 1767
1750 1767 32 1154 1847 1704 620 218 1649 1812 700 885 1920 827 -1234 446 920 -462
1766 -462 -372 -114 -767 -991 -1156 -345 -1264 -1034 -1412 393 -659 -2094 -176 -787 -715 -2560 76 624 173
1785 173 450 1192 999 448 501 2251 2077 2044 364 1697 -1037 979 851 837 967 -4 -639 98 -611
1804 -611 -1 -743 -152 -863 -919 -955 -2803 -939 -1271 -1009 -1970 -892 -578 -46 -902 479 1107 -46 -811
1823 -811 1288 1455 1044 10 1264 545 24 -220 1503 -28 930 -1190 1818 -87 -262 -156 -607
1840 -607 546 -957 824 -509 -1551 -1694 -818 -1397 -1445 -1727 -224 -1438 -1477 -902 607 855 -1576 -495
1858 -495 1805 575 274 1834 1479 1028 571 1546 623 562 1353 1088 1505 1100 564 -33 -397 -1089 298
1877 298 -992 -1811 -915 -240 -1367 -1783 -1396 -972 -985 -2023 -493 -417 -2599 -751 -162 -129 -454 -48 889
1896 889 207 325 1171 625 388 420 1093 474 -398 582 948 422 344 266 694 -100 -584 -373 -386 -562 88
1917 88 -1542 -1006 -1313 -1146 781 150 -955 151 657 439 -70 144 1819 -452 676 856 102 135
1935 135 1191 929 -318 -327 1836 1532 865 2046 1435 -81 -243 -772 -468 -575 -520 458 -753 -1233 -1856
1954 -1856 170 -1579 -2575 -381 -632 -535 315 178 -1357 -13 -1176 -99 -162 799 675 288 651 630
1972 630 697 608 1731 1042 1951 2086 -671 551 1619 865 -240 72 -666 -1101 -689 389 -39 -2167
1990 -2167 -1295 -158 -831 -2106 -1736 -634 -164 -1617 -1168 1139 1 227 453 -500 -790 584 -202
2007 -202 1208 1885 551 -932 486 -445 700 2350 -166 -669 -442 109 70 -62 792 565 -1068 -581
2025 -581 345 -315 -521 -1689 -130 -1251 -1573 -1567 -82 -1713 -946 -629 782 838 250 524 575 1421 393
2044 393 1601 -438 1582 821 938 449 1184 1670 1853 77 -1205 1154 -237 -2040 -233 363 -876
2061 -876 -1953 243 -873 130 -1370 -1313 -437 -1533 -1403 859 -1274 -1264 -426 369 -380 705 1284 -581
2079 -581 227 2077 721 -178 1084 968 2127 894 975 488 825 499 249 347 411 -198 -810 -144 -803
2098 -803 -1806 -836 -851 -457 -1218 -1191 49 -1652 -972 1081 -910 -1749 6 988 917 372 878 386 683
2117 683 369 1658 552 476 875 1240 1232 -40 1718 -182 -831 -421 290 174 -635 -421 0 -1320 -402
2136 -402 -1441 -208 -1797 -2001 -487 538 -569 -1614 -861 284 -363 -534 321 363 795 254 1104 1025
2154 1025 -1 1606 -276 861 308 894 553 -641 154 995 -235 -1355 77 -221 -836 -741 -790 -280
2172 -280 -1509 -1069 -716 -513 -1588 -371 71 -1408 -425 758 335 -1 -11 778 280 559 337 1239 1099
2191 1099 733 1378 2174 729 1100 664 61 974 11 -365 509 -437 -1152 1058 786 -827 -1175 -1343 -1510
2210 -1510 27 -141 -667 -799 -393 -355 128 534 265 672 615 -87 1071 1043 816 172 969 713 -108 459
2230 459 488 791 -732 296 623 -135 869 -164 -605 -267 108 -183 -587 -405 -1495 -146 -489 -455 -75
2249 -75 -1034 -552 -359 1207 443 -71 155 509 810 373 154 267 483 1125 599 196 371 -513 768 951
2269 951 54 1129 1029 779 -759 -683 -101 -642 -124 -332 -30 -3 -1412 -747 -215 -347 -617 -1361 -1110 -494
2289 -494 98 -413 852 308 -107 721 -972 582 508 671 412 181 -65 1381 512 497 618 880 714
2308 714 1108 1492 238 -342 -34 -560 -249 -1507 -444 -466 -1475 823 65 -786 -928 -248 10 86 -616
2327 -616 1254 -74 132 -449 266 144 310 873 1914 253 1048 1865 1373 1088 -414 763 314 543
2345 543 405 920 -619 -133 -841 1056 -248 -1940 -640 -965 -924 -1037 -566 -1061 -963 -765 165 209 120 663
2365 663 1125 -27 305 935 903 96 470 743 977 115 123 1451 145 -6 -75 1684 -966 330 -277
2384 -277 80 -485 -1029 -258 -623 -796 -576 -147 -58 22 -835 -93 -660 -76 731 -344 35 197 125 218 -306
2405 -306 210 255 -27 -70 411 931 570 249 410 1198 1484 76 578 -588 -112 -120 -1122 -115 -953 -1043
2425 -1043 -841 130 -914 -412 -338 180 126 659 -1733 -387 275 -413 178 -138 856 192 677 1345 1167
2444 1167 1236 343 858 852 354 497 352 836 479 -707 453 -349 -690 36 -1005 -838 -1329 477 -963
2463 -963 -1528 -810 -753 439 -523 512 114 -1356 180 349 679 51 838 80 209 552 861 -308 843
2482 843 1112 581 240 907 1399 1140 -248 284 -665 -118 985 -470 46 -593 -563 -795 -1250 788 231
2501 231 -1637 -253 -1197 -518 -1256 -1084 109 -393 249 -980 1021 -643 35 -348 179 163 -639 889
2519 889 738 618 -469 837 -732 482 776 413 -80 -884 837 51 -292 -1471 -517 -976 -731 -1030
2537 -1030 -1740 -87 413 -1534 -1344 -1488 -373 -758 674 -401 642 698 215 -904 -214 494 275 770
2555 770 1329 368 521 1181 9 384 -10 -17 -69 -350 -321 -539 -1261 121 -856 866 -1006 -286 -1020 -1025 -830
2576 -830 -131 -166 -242 -601 -828 -1004 -652 -351 774 945 139 1272 774 1146 15 106 655 77 -137 522
2596 522 -249 457 286 -982 653 -341 -580 -1130 -277 -1150 -567 614 -567 77 -945 -1016 -1518 -136
2614 -136 -741 -1328 489 -279 -284 -743 385 483 750 550 435 1436 -11 -683 968 -571 1181 369 964
2633 964 -123 -756 422 911 -1475 -421 174 -1770 430 -1067 -398 -1440 -1152 -504 -39 491 -742
2650 -742 -306 -303 -606 1457 68 594 136 278 1326 263 219 -40 1002 1646 -176 372 815 1830 1007
2669 1007 723 1166 456 -272 -888 -306 750 -201 -1274 -323 -246 175 -765 -806 -320 -589 -934 -1958 534
2688 534 -429 262 -83 214 522 -277 388 458 60 969 288 1385 1860 -263 -371 248 853 309 -434 -325
2708 -325 -646 718 110 209 -292 251 196 -727 -843 -1063 -161 -190 -615 -726 -169 -505 -160 278 -390 -414 295
2729 295 -162 909 932 359 1200 1415 1910 396 -185 554 -476 290 1323 73 -339 -1146 638 -356
2747 -356 -365 -592 -1230 148 -319 122 -63 -309 -1069 248 -817 -863 155 553 -276 -115 411 729 49 169
2767 169 217 239 -71 821 1062 1021 986 -451 17 396 141 -61 205 -39 -384 18 57 1183 -642 -124 -987
2788 -987 -601 -451 -1281 -834 -1956 286 167 -361 -606 28 -661 907 -935 15 454 415 1525 1327 588
2807 588 34 463 599 234 -346 373 1171 648 -723 603 563 -1038 -343 33 -1144 244 -224 -1265
2825 -1265 -1554 -652 -453 616 134 -411 195 -496 -145 414 -3 -290 616 16 845 62 -124 1332 754
2844 754 461 1506 1597 1083 -373 -2 -269 -506 -686 1283 -1369 477 -299 -678 -1105 -214 -373 -394 -366
2863 -366 -1494 46 162 -319 -1653 727 171 -1692 147 -27 591 -292 -159 1235 914 405 1092 405
2881 405 615 497 434 612 953 582 1294 372 -1351 429 795 240 -30 240 -653 24 620 -674 -612 -1049
2901 -1049 -434 -969 -1105 -305 336 835 -77 209 -1007 237 63 765 -83 213 -384 829 460 301 -155
2920 -155 712 -320 -1075 -503 889 -241 -394 -145 613 -193 -392 -488 1084 -642 -628 -525 436 -2193 611
2939 611 47 59 -307 265 -212 175 -235 87 -94 207 721 44 -888 234 798 163 408 784 348 -719
2959 -719 -239 -228 543 -889 -952 -647 -417 -903 -278 180 -550 215 -582 -1313 -274 -240 -480 -420 -574 -323 759
2980 759 857 -58 144 -305 683 999 674 -252 -390 1429 958 438 420 471 193 292 218 503 316 397 333 306
3002 306 175 -1430 -696 -1205 -917 -291 -681 -122 -314 672 10 136 241 -539 -896 562 781 734 -1105
3021 -1105 746 1025 582 241 -299 750 673 434 -545 1230 524 -112 192 -24 631 -299 289 -1100 -836
3040 -836 -296 -1093 -142 219 -164 -114 92 282 55 -280 -773 -736 -293 -311 -125 238 212 -81 953 -85 -88
3061 -88 -545 -499 292 1167 706 231 281 576 1329 374 -1536 -686 -417 -424 -770 -960 -222 202 -266 271 23
3082 23 -52 224 198 -656 -1093 -1359 -217 766 589 345 1097 -815 -368 63 611 665 -416 334 70 712
3102 712 519 866 508 -124 499 -830 252 -911 -1139 -58 455 -1082 -1022 -712 -560 -1221 -500 332 382
3121 382 600 514 1175 -802 599 -95 -225 -69 361 146 210 855 1051 226 -290 -300 1546 -996 284
3140 284 297 259 450 -187 108 -639 -305 477 -1208 731 -1211 650 -262 -793 -1309 1469 -833 -273 -149
3159 -149 -943 -46 -997 -659 -527 401 241 589 28 920 -279 199 872 1424 -285 482 1152 168 -838
3178 -838 -507 -507 -73 -119 -949 -175 -817 600 -938 -577 620 -562 -1665 -900 -803 -872 -413 -411 92 396 -784
3199 -784 545 221 -777 236 430 -197 526 864 883 445 -15 1056 1132 1620 759 428 202 259 39 -437
3219 -437 -933 -1455 7 -1632 -790 964 -138 -1003 -399 -592 -789 63 29 107 705 -812 -364 -3 -167
3238 -167 -182 860 188 765 633 -407 382 1429 5 230 -653 638 90 -890 160 -576 -764 -417
3256 -417 -81 6 -194 -502 185 -269 -62 -68 -1321 -797 -757 -190 500 -167 422 170 476 164 1744 -338
3276 -338 311 292 1303 462 -29 -365 -220 1258 -189 450 1035 218 15 -399 389 -75 -1301 -1106 -794
3295 -794 -413 -46 -779 -740 88 -24 864 341 902 124 522 -912 176 51 1088 -313 -431 765 -247
3314 -247 13 595 788 1165 1818 1091 303 -105 -66 -65 1099 -404 1245 1079 519 -46 61 -119 -301 -12
3334 -12 -1045 589 551 -1 -1321 -171 -199 -554 430 516 -3 1184 -573 -128 7 -148 68 866 687
3353 687 331 -203 1164 183 -240 455 -524 -155 -623 170 -123 -528 -493 -413 -470 -75 -449 -683 41 -1074
3373 -1074 178 587 615 -70 -608 610 823 481 -926 -66 -930 -340 279 -61 339 1045 181 178 1118 328
3393 328 -99 -28 120 -1331 298 -292 -695 -96 -441 -825 -1281 393 295 -122 -731 -198 -1127 -166 1031
3412 1031 -482 -533 891 623 -548 918 -255 -187 -9 475 -574 581 -237 152 177 -79 724 587
3430 587 -1349 497 -102 473 -205 -1075 -384 727 116 549 -1034 -1304 -204 528 455 1110 -5 350
3448 350 -1141 -286 121 582 343 729 456 320 572 846 350 402 1032 -235 929 432 -125 109 -462
3467 -462 -692 -782 -675 -430 -469 -906 626 -1344 -190 -622 -323 -1121 -854 176 1156 269 49 -850 -485
3486 -485 32 -444 -91 -636 -807 -352 1132 103 81 877 276 979 657 3 -101 -62 886 -655 1014
3505 1014 467 -370 0 -180 -98 -389 -88 -576 -175 -537 -80 1009 176 -476 1287 113 -445 609 -364
3524 -364 -302 253 -3 1013 498 704 -372 -389 1509 214 1176 -263 493 -522 2 339 -1147 -606
3542 -606 -381 -444 686 -145 -373 1125 -836 588 61 -167 -671 -1756 -330 -1245 363 38 -56 -269
3560 -269 281 -1200 973 653 -166 -430 1060 1199 -1398 581 1130 150 -95 535 -693 334 175 878
3578 878 46 430 -781 -1383 -526 270 877 -224 -388 -1336 -390 -253 -527 -436 108 11 -390 348 298 142
3598 142 93 604 46 -694 445 494 663 -92 -9 -35 442 24 54 -169 849 -118 -108 -281 827 -101 178
3619 178 -576 1173 -1123 -1202 -844 -148 309 -144 -609 -951 100 -49 -423 114 284 412 -938 6 -1451
3638 -1451 554 -25 1202 668 369 785 -250 -318 -143 214 6 -629 123 -577 60 154 -302 144 63 -268
3658 -268 -1405 -408 130 79 81 -771 -846 -358 -759 -65 102 -474 -453 738 454 120 1999 323 561 343
3678 343 976 835 981 910 59 -72 378 177 -1336 -32 171 -486 700 -290 -590 -410 455 -191 -880
3697 -880 716 281 -84 24 -618 -1128 -786 766 180 -716 -3 -406 690 1457 -100 283 -308 -54 55
3716 55 -486 146 1111 -474 -352 -1027 267 64 -806 -591 895 -598 1000 -471 -67 -212 -1099 316
3734 316 -1276 -917 -969 82 544 335 144 287 -332 -438 1692 526 1216 10 430 953 -603 -401
3752 -401 94 1286 1100 7 246 -180 811 -838 -828 350 133 492 298 -1036 -354 -72 -64 -235 51
3771 51 -611 -477 -154 -155 22 -18 462 -1055 1532 162 -130 -431 253 -74 -598 159 388 -200 370 1149
3791 1149 -647 771 -179 -831 -220 -588 799 699 -824 603 -474 -834 189 -600 -423 -892 -679
3808 -679 -1458 -660 -125 148 2 -520 260 937 167 312 -492 162 915 476 757 -439 255 -242 935
3827 935 -14 271 -259 -324 720 217 -188 160 -113 -1183 1665 -1696 -342 427 -66 437 -934 -1426
3845 -1426 -441 202 -925 607 -865 -225 175 893 -17 853 34 2 1134 334 1603 87 726 65
3863 65 1077 -565 247 512 -781 18 -158 20 -655 -72 -179 952 -662 419 42 -266 -1454 -1323
3881 -1323 245 -650 -271 -410 -822 608 -764 -900 405 466 530 158 825 736 718 -503 -707 1723 -109
3900 -109 28 740 436 92 139 -347 -852 -1832 -1260 -150 544 -1183 780 -165 -411 -1111 -494 252 290 -189
3920 -189 -813 -435 717 565 650 1135 -674 -79 -490 1357 -376 525 985 -5 61 817 185 -549 1394
3939 1394 687 -243 691 1059 394 132 -438 -1025 238 53 -440 -123 299 560 -1153 -1346 -672 -299 -305 -949
3959 -949 -966 -82 -126 224 495 159 -185 -166 -410 1269 304 -271 229 239 -142 440 879 509 412 -662 -399
3980 -399 -408 923 -1075 18 63 427 408 -1013 51 273 -914 -1482 373 -1172 -446 274 1006 -73
3998 -73 125 -22 499 383 435 262 -518 704 198 -177 -319 506 -443 56 268 1092 317 -687 -796 -29
4018 -29 -430 -258 326 94 -895 -235 470 -620 10 -97 -807 356 -512 -526 540 518 -18 550 -239 229
4038 229 888 1145 234 230 487 419 188 224 604 -303 285 -264 -623 233 -431 38 -424 400 684 -1412 -76
4059 -76 196 730 278 -957 376 -369 -271 -696 69 195 443 672 735 386 -197 -335 549 -182 315 742
4079 742 -463 0 424 45 566 -223 -176 -2381 -641 -167 -812 28 -458 -575 213 318 428 -684 207
4098 207 344 257 -1024 -48 -889 740 32 -153 148 -620 1405 -193 859 707 -303 620 -819 -594
4116 -594 -5 -579 887 1482 246 712 306 833 1326 -106 213 -816 51 -620 149 184 -297 -516 -954
4135 -954 -47 69 -230 46 -255 -461 -139 93 91 252 26 619 -21 299 -146 -177 142 585 1218 111 -107
4156 -107 -74 -671 -563 22 -26 700 962 -68 461 -127 679 501 81 269 206 259 1125 419 897 492 736
4177 736 -398 -654 -682 75 -168 486 591 -368 -319 900 626 1576 359 -151 482 -408 614 67 -985
4196 -985 -880 410 -891 245 174 424 366 -389 718 -691 -829 -1096 -719 -936 -461 -772 -250 624 -124
4215 -124 1870 20 387 -39 366 316 276 243 900 -133 -165 1164 74 -407 -52 205 -232 -797 824
4234 824 -362 -1857 -402 -608 333 947 310 145 278 124 -451 -809 262 -619 -1158 -19 965 -678
4252 -678 -73 406 780 630 1288 82 261 339 1240 -659 470 -343 51 -683 -759 -571 -579 -957 438 -661
4272 -661 -352 -57 508 244 577 72 -968 -648 -1364 807 -1343 473 -187 1461 21 591 241 305
4290 305 252 -141 938 511 1498 926 633 392 16 1425 -248 -6 -180 -487 69 276 1012 -630 -883
4309 -883 351 -212 -1073 1134 -511 -636 436 -35 -26 373 323 176 694 630 -319 338 726 11 352 -358
4329 -358 744 -799 196 1161 402 -61 -1368 -1200 -2 212 -29 -834 -94 898 975 -495 214 74 562
4348 562 694 126 -326 -153 -383 -170 19 -626 -640 -442 187 -187 193 376 517 -759 -10 1349 44
4367 44 1034 -566 479 162 121 709 -237 118 -655 499 -145 288 -176 -101 -594 -139 257 -987 476
4386 476 -437 455 428 -674 403 -226 541 342 324 -539 -381 -347 388 1480 -107 293 636 -1028 -964 237
4406 237 -1207 481 -250 233 103 428 719 -331 -429 143 721 326 514 -1207 78 -1010 -2354 -885
4424 -885 988 -81 458 -711 -154 -552 -620 1501 77 157 -99 116 178 -110 433 779 -284 634 243
4443 243 -391 75 745 702 -809 -805 -731 397 353 361 533 22 276 94 -1311 -94 -1129 -17 -111 54 -847
4464 -847 845 369 480 551 157 -472 -975 -59 965 864 -135 -826 346 -343 -744 688 618 -754 392
4483 392 -188 821 212 668 94 -1245 -194 175 -1352 -658 -1023 -312 228 -17 -721 59 -840 -228 51
4502 51 284 163 1178 355 118 352 118 -159 361 -535 278 -590 -61 -1072 210 668 1041 684 1493
4521 1493 595 374 1118 -421 -558 -568 -795 -589 86 12 -50 -627 -121 -1212 637 958 809 -850 1126
4540 1126 -552 822 909 -69 918 94 617 847 682 172 672 -451 -812 -284 -885 -53 1030 146 -124
4559 -124 10 61 -1027 206 -150 -763 261 -1667 -341 -219 -454 356 -618 126 -1200 -745 -44 -9 1047
4578 1047 -1052 97 695 518 1111 -28 384 -367 705 -1400 41 -502 -347 -829 -165 546 -6 1837
4596 1837 593 178 434 960 -378 -914 -336 -244 -1127 378 -632 113 1595 776 -225 318 691 -335
4614 -335 982 365 647 1860 -475 -868 -155 -890 244 228 279 385 458 912 -521 -547 -275 291 279 41
4634 41 807 -571 158 -397 -227 599 -258 7 -365 117 -302 259 55 -679 564 -466 732 683 679 -211
4654 -211 65 170 624 615 258 99 486 796 -292 -409 -1581 -765 236 -76 -338 14 388 -37 251 -99
4674 -99 165 568 -373 -661 145 709 -1071 207 2490 -215 1311 -135 -145 1489 731 -624 -587 -346
4692 -346 740 -273 271 625 316 543 -261 -988 423 192 -605 -240 -756 -286 -242 -251 745 -663 -1 33
4712 33 -89 -1454 -670 888 -204 -189 -1093 -26 -699 -380 172 1000 -490 -46 1542 731 537 -1096
4730 -1096 -125 868 147 -427 -270 1028 -593 -293 -656 -636 1094 -643 463 -679 -115 -267 -557 -276
4748 -276 -745 -1161 27 212 483 -1227 -90 528 -1118 869 -1149 103 -948 456 413 626 1
4765 1 -265 800 390 -863 599 122 -223 -842 92 -746 768 35 368 -1091 -849 -1118 122 -135 -819
4784 -819 -634 -1708 95 -1328 -261 -240 -748 -930 725 1125 -118 -736 669 575 770 -408 596 111
4802 111 1604 -369 -962 -808 135 466 761 -366 -566 307 -449 -124 -881 -339 888 40 -32 -75 -388
4821 -388 -239 -813 -143 319 640 620 -489 -1803 771 625 -382 1085 -19 -564 -262 73 242 76
4839 76 -193 614 667 101 16 -677 960 -662 359 79 -477 -1100 188 -542 132 1000 -316 583 -115
4858 -115 -372 630 -345 -263 253 93 827 -902 -627 1086 -162 -884 473 -401 -605 -34 320 982 1074
4877 1074 634 -102 -505 455 -441 -312 -486 -785 -1216 -592 944 853 97 546 -360 -208 -131 -868 601 -273
4897 -273 -313 320 -1001 111 -397 547 274 49 -317 -586 204 57 815 785 -201 271 421 34 316 646
4917 646 -222 -458 875 -658 -599 -749 20 -163 -521 322 839 -333 -267 -42 -102 743 819 -658 604 -221
4937 -221 -251 -492 1004 85 149 -618 -1063 451 -1324 1317 83 -59 -1271 -11 -133 -1222 -29 454
4955 454 1031 -857 -300 -326 -72 23 -788 245 -26 217 871 -90 -774 -77 -671 457 -1872 -1135 -818
4974 -818 454 117 -1086 352 930 538 796 -587 1335 1238 -352 235 -752 -135 -1433 -501 557 51
4992 51 534 -444 -1529 1 -287 -526 1293 -227 -639 -417 -670 97 129 588 1691 172 -257 727 -689
5011 -689 797 391 169 330 -139 1065 753 946 -52 -280 24 -64 -227 285 155 51 -289 -723 635
5030 635 -226 -769 -336 -451 -693 -205 478 -174 1420 -102 -259 -270 944 185 300 657 861 -674 925
5049 925 556 1396 1220 -680 248 821 288 609 -242 -16 839 139 422 191 -362 -472 302 597 -593
5068 -593 -959 754 -1689 -294 92 -207 381 225 503 485 151 640 408 600 515 -88 26 1011 175 -1175
5088 -1175 243 282 592 -643 -262 -739 129 34 -215 -1409 -110 -562 -161 458 -371 -23 -27 -1679 -341
5107 -341 291 -1052 -388 1180 153 -546 706 -532 810 -406 1374 104 299 272 -67 358 -356
5124 -356 164 1464 -186 950 1226 194 -494 822 -401 691 -790 101 -49 -572 -541 87 -334 -695
5142 -695 -269 300 -140 -304 -81 -872 -1312 601 -266 445 1168 249 361 -457 -778 -459 -536 -217 -1026 39
5162 39 -50 564 318 -628 572 7 -734 -425 -1038 573 -65 270 -806 -288 568 985 62 71 248 -988
5182 -988 410 -209 769 -182 -1146 -719 407 427 -639 -1465 27 367 -587 -338 -373 -913 262 -317 714
5201 714 -13 421 201 1054 490 -107 1123 -592 -261 -862 -444 676 335 -857 -922 1185 -534 65
5219 65 214 -9 -667 -269 -955 -632 -158 -231 675 425 -176 635 598 -232 39 -322 1113 900 -90 -51 794
5240 794 -1287 -80 776 482 913 561 112 386 -463 91 60 183 -103 -368 -877 176 -223 -74 -479
5259 -479 -280 1030 -454 64 -530 -139 1318 799 654 -102 -289 523 -731 103 490 697 716 681 -451
5278 -451 -646 116 -483 321 407 598 1234 729 -393 -602 -1074 455 494 -589 250 -536 -307 -33 -583 445
5298 445 636 -720 -201 285 -439 -127 -671 -237 -500 283 13 439 536 860 362 676 -1093 -147 -324 -522
5318 -522 -1441 791 394 252 -256 905 -905 -274 -748 -483 -4 -291 1487 -169 532 405 807 -120
5336 -120 -23 -622 28 611 740 244 -1655 211 -51 -80 112 1148 133 737 506 921 -599 -614 508
5355 508 -564 -216 110 371 -964 60 599 283 -1222 139 -749 -33 -86 -329 -87 -270 -425 -432 261
5374 261 -638 182 -552 278 950 320 373 2 1096 667 198 175 862 -275 -781 1427 391 358 619 -677
5394 -677 61 -22 359 -382 -51 -811 -277 131 -277 -576 -9 -800 -181 472 285 169 -1199 -505 766 963
5414 963 -326 -320 128 717 1058 416 176 -179 -69 -391 -365 117 807 -925 168 327 388 843 -328 627
5434 627 -354 -113 308 19 -365 -486 -228 590 319 476 1446 -170 -270 -145 619 80 277 37 -320 -22
5454 -22 -1110 711 -325 298 540 -289 495 -694 433 -756 -377 -715 -218 -73 -320 182 492 -200
5472 -200 -1618 99 393 162 621 -202 -1040 577 -863 -90 -473 -486 -443 -5 91 1026 255 -178 -439 -269
5492 -269 -1025 1204 1465 -221 66 -172 -535 -154 546 -548 -575 -183 140 -668 117 702 -219 -144 243 -138
5512 -138 478 -245 -848 386 176 -1055 -645 962 -636 -640 773 -11 579 30 443 338 -696 559
5530 559 -195 1714 -491 334 318 -158 -1221 -486 -76 563 -55 -57 -550 -641 213 -609 -912 519 -226 382
5550 382 -193 314 -38 258 -1346 466 334 21 517 583 -571 -508 -900 -139 526 -178 -1020 147 111 1386
5570 1386 -1043 34 366 137 39 2 -427 223 58 -97 -222 -998 536 627 854 335 447 -470 310 481
5590 481 740 -495 -87 -291 116 288 338 -127 68 510 340 -289 1388 801 -97 1464 355 154 -254
5609 -254 395 963 1063 -218 -932 85 -589 441 -916 -402 33 454 -130 133 -309 1477 -453 162
5627 162 140 -232 772 -460 -1814 -179 -64 -436 446 110 330 -969 220 -1412 -853 -657 745 -281
5645 -281 -1185 171 20 679 -600 -14 -379 -140 -1294 -701 -288 -23 -993 178 396 282 415 483 95
5664 95 -481 -559 98 1123 1090 216 1053 -253 -800 1022 -60 475 760 167 -314 -295 -347 1555 -427 -721
5684 -721 -289 -693 -767 458 535 325 225 942 438 -51 -907 1182 952 30 380 700 506 -647 993
5703 993 124 456 216 587 1284 703 -53 -117 -105 75 -1374 -1019 -138 182 682 280 -79 -240 283 -173
5723 -173 43 276 702 -324 14 237 -571 -341 234 -8 -249 -859 737 160 78 787 160 227 -310 539
5743 539 -22 -44 -203 -712 1251 186 -195 1131 893 384 120 8 -551 -556 593 -209 616 1019 -26
5762 -26 -723 -1426 285 47 -21 -238 211 466 -1099 -389 -872 -1184 -151 -962 -406 -390 500 -728 -299 124
5782 124 476 -537 340 -556 62 214 380 1040 683 349 -466 -273 -532 -745 208 -447 -571 359 -689
5801 -689 -449 272 -221 -561 -379 -751 537 960 -413 -1373 306 -522 -949 770 927 -403 -1510 -157
5819 -157 1086 874 -331 -27 167 -243 -107 281 -9 1669 99 241 -34 -1155 -617 -480 -276 899
5837 899 -465 -19 262 353 -431 -184 -89 401 -990 -609 887 -215 602 1058 206 1406 -320 153 -745
5856 -745 858 180 698 141 -18 552 -802 -103 -222 312 123 -760 -1150 -628 416 -1201 -428 -1176 558
5875 558 -486 -170 -119 -378 1327 359 -627 -95 1288 857 -487 549 1107 1505 1409 -208 638 421 -49
5894 -49 174 -680 -946 -1282 733 -411 -60 -78 421 188 -369 340 53 -352 3 -100 -254 355 -284 -607
5914 -607 69 825 491 237 -471 -336 555 953 668 -1025 544 -308 -584 258 260 160 855 -126 -333 -260
5934 -260 -25 935 -305 -757 1096 -350 -279 -568 -538 -282 310 1105 -162 -210 -352 192 -1178 -520 -311
5953 -311 -322 -292 -422 -39 -413 1548 589 1299 425 97 -175 -173 -451 -1022 -495 -625 -428 -297 -1152 19 263
5974 263 -709 625 554 13 -1386 -299 424 107 -433 -274 308 -907 -137 283 -388 720 83 -506 612
5993 612 689 -450 -205 3 -27 558 537 169 498 477 -786 526 95 -174 -312 -1514 -238 -679 -86 -780
6013 -780 -453 296 311 -338 -1149 345 -112 404 -700 -1781 -171 496 13 -412 396 -139 -295 -287 343 534
6033 534 654 -315 -821 426 666 447 1030 735 775 309 453 724 -862 -155 -88 37 -607 763 357 305
6053 305 -273 -1015 158 -605 256 -588 -74 383 322 -629 713 704 -873 326 25 1320 26 -236 -1587
6072 -1587 976 401 -332 -273 94 -550 -843 160 582 -453 175 94 -1004 -372 53 208 908 -149 -50
6091 -50 -135 -507 144 -581 1214 -227 316 710 258 18 1040 -753 -712 -687 866 -40 -385 -543 -85 -382
6111 -382 -654 167 -768 153 156 935 419 -301 653 423 -1040 -116 -3 -545 -282 80 -610 -27 -261 -297 -258
6132 -258 -79 -411 499 -556 956 -499 415 814 -60 -536 208 -8 -231 -334 186 770 596 -981 511
6151 511 21 271 120 502 1054 -548 280 -166 675 826 -467 -37 -352 16 744 -183 -295 -1099 154
6170 154 7 522 240 791 549 -262 -435 84 -1481 481 484 79 925 -17 -158 -326 676 233 44 1002
6190 1002 -167 32 -136 -392 -411 465 -200 1027 253 465 -330 822 -815 242 951 86 594 -278
6208 -278 88 458 -773 -723 -154 -636 145 294 -784 -118 769 -310 17 241 89 -356 -305 142 -557 -506
6228 -506 -140 -467 379 -1123 708 167 -608 -299 -387 753 -47 853 -416 198 -338 -731 131 205 -195
6247 -195 -1060 64 337 297 96 352 3 217 490 366 -1856 397 337 -118 200 -240 365 -1038 -121
6266 -121 -403 -888 258 143 -918 348 -79 -869 -845 531 516 965 958 -1645 -915 6 -612 573 50
6285 50 336 -250 -871 -516 -542 402 -578 120 -947 898 -542 838 -7 -233 694 -294 56 -136 105
6304 105 -791 33 511 605 -737 77 331 244 196 -52 339 705 -190 64 136 1007 -97 -866 -180 138 245
6325 245 641 -520 1112 -68 -295 1307 -234 -325 -121 416 -48 -464 686 1289 -511 229 -318 -590
6343 -590 302 225 -88 -972 -482 -154 62 -50 -780 83 -427 -778 -318 231 990 -409 41 -347 921 -8
6363 -8 600 975 -318 -710 -439 -312 991 -429 1085 -750 -765 -535 -609 1124 -367 707 -483 -1751
6381 -1751 -910 398 706 -462 -590 -976 324 -407 345 151 143 755 219 578 609 -729 342 528 -322
6400 -322 536 661 139 -135 -142 -620 -361 266 184 -430 10 -574 -554 -450 -362 -413 -365 -570 1064 -85 -192 725
6422 725 291 -31 -86 -853 897 211 281 175 183 246 520 813 561 -40 -463 -953 387 -178 521 909 -1145
6443 -1145 884 1110 -364 -893 810 19 -237 426 350 14 1177 332 -159 521 834 -639 353 1771
6461 1771 731 328 354 -125 658 718 -8 -697 177 -85 -1107 8 43 436 1413 -213 719 -62 1133
6480 1133 -591 -1334 -46 -1493 -642 456 982 822 -425 -58 186 5 154 -674 -639 -197 631 -1027
6498 -1027 -211 559 464 -816 -704 544 1354 310 233 1133 571 17 -174 -134 -359 419 -169 -99 438 373
6518 373 -356 327 -270 -991 949 303 -1075 -526 19 -707 -139 -42 355 -9 612 -165 171 128 -509 1045
6538 1045 -711 -1082 160 -827 -38 -237 -730 484 347 651 73 228 1147 2 211 439 -170 -429
6556 -429 -537 -258 -571 238 -167 264 433 1205 228 477 -53 171 -228 953 371 582 358 -192 96 498
6576 498 -865 -755 719 -908 -60 -352 328 676 210 594 165 62 -563 894 108 -33 -773 -777 -648
6595 -648 -280 -485 514 -283 77 762 -362 -157 -869 -523 47 -712 -1 71 459 677 254 288 -905 -78
6615 -78 -44 565 99 -177 1313 146 588 -365 -167 -729 -511 -360 216 242 -93 -12 -610 548 269 340 112
6636 112 -503 623 343 -678 582 -968 -832 335 552 -799 12 -86 328 535 -324 -35 -341 303
6654 303 377 -601 -232 879 945 1044 85 -32 -454 300 -499 -608 693 586 -846 398 -306 -766 270
6673 270 693 -973 276 419 -253 410 543 -312 435 -61 -714 -480 29 -114 -176 -493 -197 -1677 91
6692 91 172 369 551 671 -769 138 693 -348 305 391 464 -600 319 499 882 -1 -165 -195 -32 -125 48
6713 48 -396 145 169 1125 236 521 1268 737 557 -447 -246 -769 -87 -1134 698 1437 -1016 936 893
6732 893 -1222 182 1008 1039 -1083 208 1181 158 588 -807 499 658 -225 29 -440 211 853 41
6750 41 -426 -53 771 636 -288 673 -536 -730 -278 431 -497 790 9 602 297 368 864 -260 318 -208
6770 -208 -1005 252 -582 -1 -740 -891 216 -77 -965 -304 -35 -438 230 -126 -678 -360 363 439 312 1443
6790 1443 644 -814 -786 -25 746 587 574 -702 -672 915 155 -842 796 -453 788 219 -281 -945 -659
6809 -659 12 88 475 -295 1483 -54 -899 -82 769 -58 -828 -784 275 207 -216 294 265 -488 -376 21
6829 21 -265 96 -823 619 892 125 62 535 -494 75 -1079 1349 167 26 156 -379 300 -243 1119
6848 1119 653 686 742 1011 -382 -253 1273 538 -600 -276 -1410 -902 1007 145 189 -683 -899 412 -1189
6867 -1189 -244 670 -45 -502 217 -297 -448 -7 -584 1156 567 395 -802 104 -352 1238 405 -393 -63
6886 -63 169 467 834 -932 -997 -488 370 1087 -469 963 -386 -96 -660 -301 -37 -902 -546 -338 -23
6905 -23 780 -464 -799 -213 796 -557 -142 624 -147 -308 315 301 -897 264 331 -197 298 349 859 157
6925 157 250 438 -922 -467 -691 -526 -761 578 -653 131 -491 -942 235 -105 608 472 425 -220 -170 22
6945 22 -263 995 177 156 738 -971 796 859 -150 695 -219 -147 -635 -404 67 -283 -258 -142 193 -850
6965 -850 -107 -1163 -605 545 -57 -339 -262 73 -717 -254 1126 -139 -688 278 25 1055 311 31 -117
6984 -117 -578 410 -109 226 854 -127 -107 -207 -175 1368 -774 73 -72 84 1116 -1072 -282 715 -502
7003 -502 106 127 8 -666 81 331 -29 1048 -94 -1321 -639 -100 -447 323 200 258 -373 -72 -363 -83
7023 -83 -413 -640 1228 -611 -264 -1042 -300 -119 813 -720 -512 424 380 -242 -115 55 -542 158 -1368
7042 -1368 -785 448 90 -1216 -184 -1006 -112 783 -218 -372 -465 146 515 -484 -98 715 269 -807
7060 -807 467 380 -933 -261 -1358 398 252 769 -518 1207 -643 -478 -38 -674 -335 577 246 -1089
7078 -1089 -20 6 -349 529 -211 125 1443 998 62 352 -553 369 510 92 -822 -345 590 85 825
7097 825 698 -521 -506 -623 96 -315 -943 235 554 -1668 466 71 268 60 -1014 -152 38 389 596
7116 596 -538 29 -666 -219 1409 -124 -929 -357 1179 504 85 7 -878 -718 515 157 220 -412 -807
7135 -807 365 1048 -56 -446 -971 -563 -430 3 -367 -657 -732 -468 -524 1016 -207 -298 -71 89 -415 309
7155 309 -286 274 -355 190 -266 -355 488 272 -173 -755 -164 740 -145 -784 186 -642 371 898 -592 -1008
7175 -1008 -591 -446 1272 206 207 991 693 491 402 -206 -273 -560 -239 803 -318 1235 631 313 1889
7194 1889 -844 -1330 735 -788 852 -230 945 471 -805 669 -400 -590 331 468 613 744 -447
7211 -447 421 407 -543 446 1147 388 -890 -214 1593 250 -454 702 -349 -129 -235 -891 -56 691 602
7230 602 1037 1267 -690 -114 -160 256 1669 -46 479 951 -71 -134 -790 -617 -29 1067 -1414 517
7248 517 -116 -967 196 386 -240 -1866 -163 368 20 -521 90 -114 7 14 423 1125 -52 470 -503
7267 -503 956 -376 -374 922 404 220 -399 571 -321 396 -463 -87 -1562 356 -611 644 -147 -483 -246
7286 -246 -435 498 944 -40 339 1049 -320 -774 -795 -773 -65 1154 636 -471 93 -646 -67 -74 -968 -909 -242
7307 -242 -696 -459 794 -170 1611 -462 -26 -9 -213 291 -434 235 -411 -543 184 -434 -956 425 -397
7326 -397 -171 -676 -909 -540 16 181 -1246 113 423 960 -45 -669 375 1886 -382 1099 376 225
7344 225 566 645 -788 797 1177 -829 -317 -612 -841 1031 245 -516 52 1172 492 532 -385 708 605
7363 605 1251 225 135 -625 -1316 -124 -1215 -230 325 -112 -530 509 256 -918 807 62 1041 992 -55
7382 -55 281 789 329 276 415 -69 -690 113 -194 -674 -929 38 599 -834 -976 -716 -343 -322 428 -29 -792
7403 -792 43 226 727 985 -56 -239 -657 946 -216 531 -22 -367 232 -43 -61 -977 -458 724 272
7422 272 261 -16 -184 197 70 606 157 -185 -567 -95 -667 1000 883 -884 -32 1073 488 -788 199
7441 199 674 414 -729 -270 -1042 1563 -267 -171 -802 674 -755 -118 2 -142 107 -288 428 -177 345
7460 345 -468 -13 -746 -164 -455 185 603 -404 133 461 -359 -125 687 585 -119 166 -916 -439 -350 278
7480 278 -745 -292 263 -76 99 -199 -322 -886 -181 -591 40 -159 329 -394 -1453 -286 -515 178 -548
7499 -548 186 -752 1014 334 -1028 138 -212 -895 -70 115 792 315 550 283 281 -392 -545 -251 1451
7518 1451 347 -1029 700 157 -11 -692 -82 336 -217 163 459 713 -299 331 487 -225 -1239 -1053
7536 -1053 1089 -750 677 -900 493 476 -721 27 -1494 -111 -47 -342 -225 158 -260 184 -982
7553 -982 -868 -1044 850 71 305 493 67 -846 -129 734 616 -694 -408 25 -173 -431 -425 217 442 -223
7573 -223 -621 306 -528 -1789 942 404 21 502 472 -304 -196 -98 1276 285 1164 149 104 519 -147 361
7593 361 161 -432 -289 759 293 -502 -770 -84 -56 -38 -1107 485 -700 -741 -492 144 433 247 -426 -139
7613 -139 -1125 -285 175 -420 224 154 389 984 303 -438 -346 426 -173 1164 151 -2220 17 -88 109
7632 109 200 -217 736 59 826 -14 -233 -97 -209 -21 -797 237 132 -629 492 651 477 -145 60 754
7652 754 520 -360 -199 -362 228 1560 -674 30 -533 447 -629 -853 684 -845 52 -138 765 479
7670 479 1238 156 376 -361 -66 1753 -202 -569 1182 226 207 151 -49 464 -1020 8 -1083 597
7688 597 -284 450 735 -62 68 -1650 224 562 -313 -139 183 75 22 1073 -7 316 554 923 235
7707 235 -274 60 -234 -119 857 -345 -752 426 -538 566 -239 104 549 232 -822 -191 806 200 439
7726 439 -898 682 698 693 13 -721 215 342 1115 -219 350 1031 774 945 -1367 350 -45 189 542
7745 542 1091 -440 458 467 806 309 287 -533 -820 292 524 -305 73 -457 197 373 -512 -125 60 -904
7765 -904 73 -626 221 -372 -803 -250 -172 -345 100 1284 -686 506 969 273 240 -153 -518 761 414
7784 414 166 -510 58 -1041 -362 -94 737 164 -185 -1291 -597 -691 -1012 -423 296 270 -18 799 -734 -100
7804 -100 242 287 -1052 -328 223 454 -58 -1004 587 492 -779 -49 240 787 1315 150 -26 166 -1380
7823 -1380 13 1207 44 18 -501 -262 -667 -642 -92 -958 -1029 -325 -128 796 -110 -207 -1015 521 615 146
7843 146 -643 -410 331 -358 -364 -124 325 -6 806 -222 -597 -754 210 -657 -379 343 -265 -280 361 -84 -97
7864 -97 198 -512 115 412 -723 -294 -69 784 -832 -13 -112 706 680 633 -635 668 608 -118 -419 -990
7884 -990 989 -384 587 506 299 1023 -1076 289 477 -1136 401 24 -686 -714 -240 323 -319 -665 -275
7903 -275 -992 -240 -267 -162 444 137 -783 793 -131 11 1159 -1199 846 1201 -449 -100 551 -107 -998
7922 -998 -201 -110 -934 908 396 338 -230 321 108 -648 389 -573 342 -834 -659 2 -16 135 102 443
7942 443 330 649 -344 -486 43 -583 208 -164 -257 541 453 93 168 159 -312 -934 1350 460 37 -284 878
7963 878 314 -708 504 -530 175 61 282 995 1000 -576 -308 673 562 502 -203 192 -178 21 -780 430
7983 430 -482 -778 -196 819 -681 808 -1211 228 1147 300 1124 -394 223 -948 255 -462 -427 647
8001 647 553 593 616 1152 -792 890 -127 -1132 576 -774 791 253 -222 297 -787 255 -291 -556
8019 -556 -80 -579 -176 -418 583 12 -75 445 -292 -380 -522 -258 -532 259 146 455 -53 -1171 -26 -784
8039 -784 -1141 -1286 -127 -19 343 86 -349 -229 287 481 -245 -675 -642 -231 -167 803 756 863 999 353 394
8060 394 159 121 660 512 101 -332 224 -99 260 750 -275 207 39 678 -1894 446 33 568 -182
8079 -182 221 356 -585 928 107 -174 -351 -299 917 337 156 105 -969 -682 148 308 -542 138 -105 192
8099 192 -342 218 -612 -219 -1025 -71 493 331 814 -22 223 -565 -627 -434 -821 -914 -297 591 -999 -167
8119 -167 125 946 -203 585 -996 -353 58 -915 79 -498 -73 -294 775 110 16 -146 -1000 10 68
8138 68 1175 130 208 -437 281 174 -1100 15 -776 -206 9 -241 351 708 -590 72 -122 178 928
8157 928 -808 -236 1001 -995 -517 209 459 -83 -106 -1066 849 426 220 -314 836 -509 465 -730
8175 -730 473 -216 -382 921 1014 -517 742 552 570 -475 -1020 794 -346 709 453 114
8191A14
##END NTUPLES=NMR FID
##END=
