##TITLE=1H_SAM-11-Br
 CDCl3, 108 sc, 
 22.7.2019
##JCAMPDX= 6.0         $$ Bruker NMR JCAMP-DX V2.0
##DATA TYPE= NMR FID
##DATA CLASS= NTUPLES
##ORIGIN= UXNMR, Bruker Analytische Messtechnik GmbH
##OWNER= root
$$ XWIN-NMR		Version 3.5
$$ Mon Jul 22 15:27:57 2019 Russian Standard Time (UT+4h)  she@DPX200
##.OBSERVE FREQUENCY= 200.13003
##.OBSERVE NUCLEUS= ^1H
##.DELAY= (6, 6)
##.ACQUISITION MODE= SIMULTANEOUS
##.ACQUISITION SCHEME= undefined
##.AVERAGES= 108
##.DIGITISER RES= 18
##SPECTROMETER/DATA SYSTEM= spect
##.PULSE SEQUENCE= zg30
##.SOLVENT NAME= CDCl3
##.SHIFT REFERENCE= (INTERNAL, CDCl3, 0, 15.7039)
##AUDIT TRAIL= $$ (NUMBER, WHEN, WHO, WHERE, WHAT)
$$ ##TITLE= Audit trail, XWIN-NMR		Version 3.5
$$ ##JCAMPDX= 5.01
$$ ##ORIGIN= Bruker BioSpin GmbH
$$ ##OWNER= she
$$ F:/spectra/data/she/nmr/H-F/1/audita.txt
$$ ##AUDIT TRAIL=  $$ (NUMBER, WHEN, WHO, WHERE, WHAT)
(   1,<2019-07-22 15:26:52.78 +0400>,<she>,<DPX200>,
      <continue with go, POWCHK disabled, PULCHK disabled
       configuration hash MD5:
       00 E9 B6 7A A2 85 ED C7 34 08 36 98 17 FE 4E 26
       data hash MD5: 16K
       50 04 E5 B7 20 62 C9 4B 6F EC 8F 19 39 AB B0 43>)
$$ ##END=
$$ 
$$ hash MD5
$$ D1 B5 82 8D 03 97 30 30 75 FB 99 4A 9B 43 DA E8
##$RELAX= 
##$RELAX= 
##$RELAX= 
##$RELAX= 
##$RELAX= 
##$RELAX= 
$$ Bruker specific parameters
$$ --------------------------
##$DU= <F:/spectra>
##$EXPNO= 1
##$NAME= <H-F>
##$PROCNO= 1
##$TYPE= <nmr>
##$USER= <she>
##$AMP= (0..31)
100 100 100 100 100 100 100 100 100 100 100 100 100 100 100 100 100 100 
100 100 100 100 100 100 100 100 100 100 100 100 100 100 
##$AQSEQ= 0
##$AQ_mod= 1
##$AUNM= <au_zg>
##$AUTOPOS= <>
##$BF1= 200.13
##$BF2= 200.13
##$BF3= 200.13
##$BF4= 200.13
##$BF5= 200.13
##$BF6= 200.13
##$BF7= 200.13
##$BF8= 200.13
##$BYTORDA= 1
##$CFDGTYP= 0
##$CFRGTYP= 5
##$CHEMSTR= <none>
##$CNST= (0..31)
1 1 145 1 1 1 1 1 1 1 1 1 1 1 1 1 1 1 1 1 1 1 1 1 1 1 1 1 1 1 1 1 
##$CPDPRG= <>
##$CPDPRG1= <>
##$CPDPRG2= <>
##$CPDPRG3= <>
##$CPDPRG4= <mlev>
##$CPDPRG5= <mlev>
##$CPDPRG6= <mlev>
##$CPDPRG7= <mlev>
##$CPDPRG8= <mlev>
##$CPDPRGB= <>
##$CPDPRGT= <>
##$D= (0..31)
0 1.2 0 0 0 0 0 0 0 0 0 0.03 0 0 0 0 0 0 0 0 0 0 0 0 0 0 0 0 0 0 0 0 
##$DATE= 1563794526
##$DBL= (0..7)
120 120 120 120 120 120 120 120 
##$DBP= (0..7)
150 150 150 150 150 150 150 150 
##$DBP07= 0
##$DBPNAM0= <>
##$DBPNAM1= <>
##$DBPNAM2= <>
##$DBPNAM3= <>
##$DBPNAM4= <>
##$DBPNAM5= <>
##$DBPNAM6= <>
##$DBPNAM7= <>
##$DBPOAL= (0..7)
0.5 0.5 0.5 0.5 0.5 0.5 0.5 0.5 
##$DBPOFFS= (0..7)
0 0 0 0 0 0 0 0 
##$DE= 6
##$DECBNUC= <off>
##$DECIM= 16
##$DECNUC= <off>
##$DECSTAT= 4
##$DIGMOD= 1
##$DIGTYP= 9
##$DL= (0..7)
0 120 120 120 120 120 120 120 
##$DP= (0..7)
150 150 150 150 150 150 150 150 
##$DP07= 0
##$DPNAME0= <>
##$DPNAME1= <>
##$DPNAME2= <>
##$DPNAME3= <>
##$DPNAME4= <>
##$DPNAME5= <>
##$DPNAME6= <>
##$DPNAME7= <>
##$DPOAL= (0..7)
0.5 0.5 0.5 0.5 0.5 0.5 0.5 0.5 
##$DPOFFS= (0..7)
0 0 0 0 0 0 0 0 
##$DQDMODE= 0
##$DR= 18
##$DS= 0
##$DSLIST= <SSSSSSSSSSSSSSS>
$$ [...]
##$SUBNAM2= <"">
##$SUBNAM3= <"">
##$SUBNAM4= <"">
##$SUBNAM5= <"">
##$SUBNAM6= <"">
##$SUBNAM7= <"">
##$SUBNAM8= <"">
##$SUBNAM9= <"">
##$SW= 41.9190550511907
##$SWIBOX= (0..15)
0 0 2 0 0 0 0 0 0 0 0 0 0 0 0 0 
##$SW_h= 8389.26174496644
##$TD= 16384
##$TD0= 1
##$TE= 0
##$TE2= 300
##$TE3= 300
##$TEG= 300
##$TL= (0..7)
0 120 120 120 120 120 120 120 
##$TP= (0..7)
150 150 150 150 150 150 150 150 
##$TP07= 0
##$TPNAME0= <>
##$TPNAME1= <>
##$TPNAME2= <>
##$TPNAME3= <>
##$TPNAME4= <>
##$TPNAME5= <>
##$TPNAME6= <>
##$TPNAME7= <>
##$TPOAL= (0..7)
0.5 0.5 0.5 0.5 0.5 0.5 0.5 0.5 
##$TPOFFS= (0..7)
0 0 0 0 0 0 0 0 
##$TUNHIN= 0
##$TUNHOUT= 0
##$TUNXOUT= 0
##$USERA1= <user>
##$USERA2= <user>
##$USERA3= <user>
##$USERA4= <user>
##$USERA5= <user>
##$V9= 5
##$VALIST= <valist>
##$VCLIST= <CCCCCCCCCCCCCCC>
##$VD= 0
##$VDLIST= <DDDDDDDDDDDDDDD>
##$VPLIST= <PPPPPPPPPPPPPPP>
##$VTLIST= <TTTTTTTTTTTTTTT>
##$WBST= 1024
##$WBSW= 4
##$XGAIN= (0..3)
0 0 0 0 
##$XL= 0
##$YL= 0
##$YMAX_a= 78523
##$YMIN_a= -35379
##$ZGOPTNS= <>
##$ZL1= 120
##$ZL2= 120
##$ZL3= 120
##$ZL4= 120
##$ABSF1= 10
##$ABSF2= 0
##$ABSG= 5
##$ABSL= 3
##$ALPHA= 0
##$AQORDER= 0
##$ASSFAC= 0
##$ASSFACI= 0
##$ASSFACX= 0
##$ASSWID= 0
##$AUNMP= <proc_1d>
##$AZFE= 0.1
##$AZFW= 0.1
##$BCFW= 1
##$BC_mod= 2
##$BYTORDP= 1
##$COROFFS= 0
##$CY= 11.3945322036743
##$DATMOD= 1
##$DC= 2
##$DFILT= <>
##$DTYPP= 0
##$F1P= 18.9103706918063
##$F2P= -1.10871071338519
##$FCOR= 0.5
##$FTSIZE= 0
##$FT_mod= 4
##$GAMMA= 1
##$GB= 0.15
##$INTBC= 1
##$INTSCL= 1
##$ISEN= 128
##$LB= 0.24
##$LEV0= 0
##$LPBIN= 0
##$MAXI= 10000
##$MC2= 0
##$MEAN= 0
##$ME_mod= 0
##$MI= 1.114404
##$NCOEF= 0
##$NC_proc= 0
##$NLEV= 6
##$NOISF1= 3.799351
##$NOISF2= 2.8
##$NSP= 1
##$NTH_PI= 0
##$NZP= 0
##$OFFSET= 15.70392
##$PC= 1
##$PHC0= -8866.819
##$PHC1= 27.60096
##$PH_mod= 1
##$PKNL= yes
##$PPARMOD= 0
##$PSCAL= 0
##$PSIGN= 0
##$REVERSE= no
##$SF= 200.130013532006
##$SI= 16384
##$SIGF1= 3
##$SIGF2= 2
##$SINO= 400
##$SIOLD= 16384
##$SREGLST= <1H.CDCl3>
##$SSB= 0
##$STSI= 0
##$STSR= 0
##$SW_p= 3612.71676300578
##$SYMM= 0
##$S_DEV= 0
##$TDeff= 0
##$TDoff= 0
##$TI= <>
##$TILT= no
##$TM1= 0
##$TM2= 0
##$TOPLEV= 0
##$USERP1= <user>
##$USERP2= <user>
##$USERP3= <user>
##$USERP4= <user>
##$USERP5= <user>
##$WDW= 1
##$XDIM= 8192
##$YMAX_p= 0
##$YMIN_p= 0
$$ End of Bruker specific parameters
$$ ---------------------------------
##NTUPLES= NMR FID
##VAR_NAME=  TIME,          FID/REAL,        FID/IMAG
##SYMBOL=    X,             R,               I
##VAR_TYPE=  INDEPENDENT,   DEPENDENT,       DEPENDENT
##VAR_FORM=  AFFN,          ASDF,            ASDF
##VAR_DIM=   8192,          8192,            8192
##UNITS=     SECONDS,       ARBITRARY UNITS, ARBITRARY UNITS
##FACTOR=    0.0001192,     1,               1
##FIRST=     0,             0,               0
##LAST=      0.9763672,     0,               0
##MIN=       0,             -35379,          0
##MAX=       0.9763672,     78523,           0
$$ Real data points
##PAGE= N=1
##DATA TABLE= (X++(R..R)), XYDATA
0@%%%%%%%%%%%%%%%%%%%%%%%%%%%%%%%%%jKkKkKjjOj0J2j9K7l4L8m0M4n0N8o8
53c7P4p9Q7r6J13j24J33j53J72j97K27k57L05l79M87o42J5560j8073j1004j461
73a5344l464n466p645l460K445P158N617K138j534O18M820Q387O942K904N0J040
89E206M443N806K670k659n480l174Q75L411J168k886m488j491J915K793j068n290
105A751o496l403L64J763j032l998l799M32M650N451K052r04m62L562O868O091
121A2890J038k756l029jJ987m36m780p409n868q84K416J741j612k698m50M130
137e721O197L946l48k255k10M143N241J862k493m357j754J344J283k072o305o749
153h248k905J432K166n01l307k390J215M904M338M54k469j556J980N241M805Q86
$$ y = [0, 0, 0, 0, 0, 0, 0, 0, 0, 0, 0, 0, 0, 0, 0, 0, 0, 0, 0, 0, 0, 0, 0, 0, 0, 0, 0, 0, 0, 0, 0, 0, 0, 0, -1, 1, -1, 1, -1, 1, 0, -1, 5, -5, 7, -12, 15, -19, 19, -21, 23, -27, 31, -37, 37, -42, 45, -51, 62, -62, 71, -82, 90, -107, 120, -137, 168, -211, 276, -366, 15194, -2879, -13883, -15344, -18808, -24274, -31919, -35379, -32934, -25776, -20159, -18021, -19555, -18937, -14117, -5730, 1212, 4116, 4166, 5206, 9649, 15455, 18125, 15466, 9986, 6812, 7687, 11098, 12266, 9380, 4892, 3401, 5316, 8109, 7041, 1751, -4745, -8148, -7784, -6021, -7053, -11051, -14850, -14418, -9768, -4317, -2265, -3169, -3631, -69, 6799, 12890, 13928, 11172, 8143, 8142, 10129, 9693, 4913, -2496, -8364, -9248, -6832, -5091, -6703, -9401, -9851, -5721, 476, 4422, 4074, 1819, 1609, 5752, 10993, 12855, 10362, 6005, 4251, 5595, 6878, 4806, -1499, -8248, -11153, -9721, -7555, -8056, -11363, -13753, -12538, -7634, -3296, -2842, -5311, -6867, -4887, 354, 5159, 6045]
169F045j716k6L681N786L649p90l361j812J148K704k52m412o621m676j310K5k416
186d354n974o273k844J510L426J136j900j671J890N606O139L175k09j85L218O287
202H977N377J432k160k713J81K388Q13l069n767m753q73J740P98k771n160l114
218h674R12K642J123k311l805r99L196M860K642q39k171L32L673M537J396k485
234D029l157k20L015L128k2l503l546o21K582K563j030l987l248M92L167K484
250B126p86l369k049J528L963K761j032l009j764J687L123J263k513m286k870
265e227Q65K579M10k823l833j110K415M008J159j608k282O04M186M881J522j055
281D691j645J042M228L549K13l102l219n65K248J162k491n302m239j047J608O55
$$ y = [6045, 4329, 4303, 7984, 13770, 17419, 16629, 13268, 11456, 12604, 15308, 15056, 10644, 4023, -653, -1963, -1938, -4354, -10328, -16601, -19445, -17935, -14509, -13373, -15273, -16944, -15054, -9448, -3309, -134, -343, -528, 2690, 8977, 14354, 15786, 13626, 10913, 11094, 13482, 14295, 11226, 5459, 706, -167, 1573, 2371, -400, -5560, -8674, -7762, -5120, -3997, -6308, -10113, -11112, -7916, -3056, -414, -1253, -3424, -3092, 581, 5118, 6514, 4029, 872, 652, 3667, 6795, 6773, 3270, -276, -897, 1685, 4248, 3218, -769, -4017, -3525, -358, 2126, 1340, -2029, -4078, -2550, 1413, 4174, 3142, 133, -1631, 56, 3179, 4442, 1929, -2357, -5227, -4362, -1783, -1373, -4196, -8029, -9139, -6724, -2716, -1557, -3165, -5447, -4843, -657, 4224, 5746, 4691, 3046, 4088, 8316, 11865, 12078, 8976, 5757, 5192, 7440, 8602, 6111, 809, -3430, -4477, -2869, -2214]
297b214k507m682k879Q73L318J844j405k963l52L330M721L190k25j523O82L773
313B981M916K289j496k584l18K693K921m08l731m352j669J387J021j665m688m094
329f797p25K046J821r88l275k222J180L999L011L5k165m83K406M331K556o96k881
346A153j298J759L467J354j866l201j369K043K837O43k733l657j172J754K650
361B364K69k911l024m26K646K744Rl067k759M5K825K639o95l039k457N89L006
378a242K156j220l271j944J203L269K239n96k676q05K153L855K216j133k529m86
394A189K363L617J160k085l246j475J692K066n70l784l808j534J514J672q11l159
410e199l253k33K359K836M8k422j543J495L869L311N34j895r67K115L952K660
$$ y = [-2214, -4721, -9403, -12282, -11409, -8091, -6247, -7652, -10615, -10967, -7637, -2916, 274, 49, -1474, -792, 2981, 7897, 10186, 8690, 6106, 5788, 8481, 11402, 10994, 7263, 2911, 1242, 2629, 3650, 1985, -2703, -6797, -7522, -5476, -3655, -4643, -7918, -10140, -8960, -4961, -1950, -1915, -4080, -4563, -2157, 2174, 4730, 4034, 1153, -145, 1614, 5081, 6435, 4569, 1368, -1, 2042, 4879, 5522, 2789, -868, -2040, -286, 2364, 2633, -278, -3302, -3728, -1082, 1662, 1671, -1396, -4155, -4110, -1285, 1354, 659, -2380, -4837, -4248, -1242, 914, -306, -3577, -5521, -4318, -1049, 1190, 594, -2082, -2887, -734, 3121, 5337, 4204, 1675, 1189, 3552, 7169, 8329, 6244, 2998, 1523, 3215, 5281, 4711, 927, -2881, -4415, -2901, -1229, -2040, -5199, -8452, -8685, -6326, -3490, -3442, -5864, -7407, -5912, -2043, 1268, 1802, -93, -1060, 1055, 5007, 7667]
426G667o04k460j472J694K916J078k152l659k160Q63J903k51l259l988j900J252
442d532K154j58k508l024l83K999L215Q94j861j621R06L426L409K72j946j693
458d51J200L127K416m23k753k247O23K857J637j543l404k051P75K496J058k025
474A292l401j621J080K737R11k205k765j202K104K664O49j843k833j46K417K908
490G46N97j893k243K59K822K883J01k430j950P25L064K555k87k618j750P55K943
507D279J392j157l151k027P97K168J087k129l362j977Q84K059N99k154l191j180
523g063J903L108Q70j525k195K77K962L092R86j166j765O50L065K880N74k369
539D284k131J45K535J931p68l231k553OJ769J350j754l765k548L83K322R59j515
$$ y = [7667, 7063, 4603, 3131, 4825, 7741, 8819, 6667, 3008, 848, 1711, 3614, 3363, 104, -3884, -5784, -4532, -2378, -2536, -5044, -8068, -8451, -5452, -2237, -1343, -3204, -4825, -3919, -493, 2916, 3188, 1242, -451, 749, 3876, 6292, 5869, 3116, 869, 1492, 4349, 5986, 4443, 1039, -1012, -237, 2259, 3317, 1292, -2109, -3730, -2650, 87, 998, -1207, -3972, -5174, -3070, -406, 243, -1600, -4433, -4579, -2162, 746, 1343, -550, -2793, -2534, 288, 3171, 3272, 842, -1108, -383, 2681, 5236, 4949, 2331, 581, 1336, 4279, 5671, 4514, 1363, -664, 133, 2301, 3388, 1259, -2103, -4080, -3196, -1137, -538, -2692, -5883, -7063, -5160, -2052, -1182, -2707, -4902, -4625, -1663, 1429, 2415, 1249, -516, 134, 3199, 6079, 6653, 4284, 2153, 2298, 4833, 6764, 5996, 2765, 212, 218, 1987, 3337, 1583, -2182, -4730, -4347, -2025, -1066, -2581]
556b581l088j458J545K974J622j025k298k46K509L409J681j175k073j24K621L012
572E305O03k065k229l17K137K099m43k751k777l29J881J606j083k946k475L00
588c484K083J621j145k563j900J052K843J465r61k147j152J661L130J336j198
603F41k197m09J701L005J255j317k069n33J978K585M46k098k528o92J998K146
619C912l93k550k586l43J969J575p00k883k403J39K290J689r22k438j710P06K972
636a676J570p42k003j067J893L128J894p73j956n49J718L131J070j681k257p72
652I28J717K215J73k322k838q77J279J696n08k808k665m33J705J670n85k457k073
669f183P25K541J924j35j823r93J460K791K331m14j992p50J637K857J431j158
$$ y = [-2581, -5669, -7127, -5582, -2608, -986, -2011, -4309, -4555, -2046, 1363, 3044, 1869, -204, -328, 2293, 5305, 5908, 3843, 1614, 1297, 3434, 5533, 5090, 2339, -438, -767, 1114, 2720, 1637, -1309, -3784, -3484, -1401, 220, -925, -3488, -5388, -4336, -1493, -28, -989, -3136, -4288, -2627, 503, 1839, 641, -1556, -1965, -264, 2741, 3996, 2679, 610, 77, 2055, 4640, 5086, 2988, 460, -232, 1766, 3912, 3519, 969, -1617, -1960, 9, 1584, 884, -1999, -4402, -4263, -1973, -284, -1206, -3644, -5354, -4648, -1676, -106, -848, -2851, -3918, -2025, 1103, 2997, 2224, 268, -281, 1437, 4568, 5638, 3957, 1700, 928, 2645, 4860, 5033, 2711, -127, -1004, 275, 1971, 1463, -1345, -4010, -4443, -2738, -1068, -1653, -4110, -6183, -5458, -2917, -993, -1128, -2951, -3944, -2484, 307, 2638, 2224, 232, -518, 1119, 3976, 5407, 4249]
685D249k233j097J235K393L47j925k807j343J245J845R8k433k746j096J526J974
701g68k01j967k240K89K332K100K8j794j624P12K698K298j67j892j152R58K587
718B197K087o86k218j435J037K437J311j288k805j142Q27K220N24k096k712j376
734c118J466J951K33j959k357o96J790K060Q3j799k031R8K197K389J22j459j557
751b587P55K651K098J2j839j424J238K408J604n32k351j630Q64J889J085j722
767B519k722j511O55J997N09j975k772j290J391J913M34j666k220l96K094K339
783g01P55j468j588L43K575K542N89j694j355N41K301K144l88k146j813K82K028
800B947J355j019k520k199O26J666Q16j380k870j601R65K049Q01j411k178j007
$$ y = [4249, 2016, 919, 2154, 4547, 4894, 2969, 162, -1181, 64, 1909, 2007, -426, -3172, -4268, -2742, -768, -969, -2936, -5176, -4887, -2555, -455, -427, -2221, -3845, -3133, -435, 1863, 1696, -196, -1348, -390, 2197, 4284, 3598, 1380, -55, 982, 3419, 4730, 3442, 637, -505, 322, 2542, 3066, 970, -1742, -3118, -1652, 299, 532, -1427, -3784, -4480, -2690, -630, -547, -2346, -4377, -4279, -2082, 307, 429, -1030, -2587, -1832, 819, 2917, 2929, 1090, -334, 904, 3312, 4916, 4384, 2033, 403, 1267, 3156, 4241, 2519, -203, -1714, -1059, 938, 1447, -528, -3300, -4590, -3199, -1286, -852, -2518, -4738, -5134, -3040, -701, 54, -1414, -3002, -2659, -84, 2458, 3047, 1353, -2, 539, 2840, 4984, 4596, 2450, 637, 919, 2947, 4302, 3283, 763, -1436, -810, 856, 1672, 292, -2578, -4179, -3214, -1165, -364, -1775, -3953, -4960]
816d960J663K644Q55j204j842LK169K548P92j345j892J65K183J971Q9j697j750
833C92K44J861J658m95k284k038J03J806J110o89k639j847N29J667J292j171k523
850c024j430J050K249J051j002k011n95J727K401J149j232j718k64K062K361R02
866C676j357j685j90J921K239K2k287j845m91K020J519o87k564k189oJ790J098
883I84j183k378j635M95J919J369j002k176j127J266K613J291n97j640m23J978
899b46K772J142j104j835l87J788K050M84j719k172l19J325J560l83k148k097
915a289n02J419J521m47k258k110K09J848J270n35j840j473O77K367J779m27j677
932a468r50J315K630J391r00j798n93J611K217Q21j465j923r33J224J880L06j822
$$ y = [-4960, -3297, -653, 202, -1002, -2844, -2841, -672, 1876, 2668, 1323, -569, -404, 1779, 3750, 3839, 2142, 392, 636, 2497, 4155, 3660, 1376, -662, -559, 1247, 2357, 1668, -971, -2818, -2289, -622, 670, -501, -3024, -4454, -3404, -1155, -104, -1106, -3117, -3712, -1985, 416, 1565, 333, -1385, -1649, 413, 2774, 3676, 2319, 634, 444, 2365, 4604, 4626, 2339, 494, 3, 2023, 3542, 2855, 291, -1898, -1904, -114, 984, -199, -2577, -4212, -3717, -1798, -429, -1431, -3607, -4734, -3468, -855, 436, -161, -1801, -2224, -246, 2526, 3668, 2564, 729, 342, 2130, 4180, 4664, 2945, 773, 454, 1779, 3339, 2956, 808, -1289, -1791, -372, 1149, 702, -1556, -3666, -3457, -1609, -339, -874, -2714, -4187, -3510, -1143, 636, 209, -1468, -2418, -1103, 1527, 2918, 2018, 220, -373, 1238, 3455, 4276, 2811, 888, -45, 1179, 3059, 3365, 1543]
949A543k279o37J423J504Q7k355k083k24J701J556l33k114j634K94J941J771l65
966b04k083j096Q35K612J441k81j714r41J514K283J457q62j887p50J364K211M09
983D308j362k268q20Q81J472N2j862k453o33J260J523o6j793k095j93J800J643
1000f06o8j627j580M58K208J963J0j530j191J190K292J748k24j621j114J221J914
1017C443J162j164k323j316N99J755M89j645k530j135J074J495M30j783k109m57
1033d015J665K015J91j504j536K2K118J858K85j696j272O24K213J622q2j662j211
1050c65M36K354J386p14k028j217O38J708R63j200k200j518Q09J508N14j559k178
1067b663q98J110J853L65j390j888k38J722J923N48j334j629K07J963J960M1j351
$$ y = [1543, -736, -1373, 50, 1554, 1641, -714, -2797, -3021, -1320, 236, -97, -2211, -3845, -3551, -1610, 161, -204, -2287, -3383, -2548, 64, 1505, 1224, -490, -1431, 83, 2366, 3823, 2961, 1074, 324, 1688, 3899, 4308, 2946, 678, -142, 739, 2211, 2263, 401, -2052, -2685, -1425, 98, 32, -1761, -3856, -4049, -2249, -606, -674, -2301, -3881, -3423, -1215, 748, 758, -772, -1963, -773, 1519, 3267, 3043, 1422, 308, 1529, 3443, 4605, 3441, 1118, -198, 401, 2156, 2645, 1000, -1530, -2665, -1591, -96, 334, -1449, -3558, -4015, -2350, -335, -144, -1648, -3184, -3162, -1044, 814, 1099, -597, -1869, -1245, 968, 2590, 2508, 846, -365, 71, 2425, 3811, 3097, 1069, -148, 490, 2198, 3161, 1961, -239, -1757, -948, 560, 1074, -485, -2663, -3561, -2451, -598, -233, -1623, -3511, -3749, -2027, -104, 444, -890, -2519, -2312, -349, 1611, 1652, 301]
1084C01j466N41J871K055j80j548j343N72J831J148o15k234j469M48J502O75j363
1101G26k522j351P37J659M85j312j978o09J247J961Q98j164j556j72J783K116
1117I48P22j090j428J07J787K293L12j838j391q7J815J416m09k032j442rJ567
1134A241J050j095k182j601K56J751Q75j170j852j114R39J967R43p77j708n13
1150b990J510K126R53q34j506j98J777J894M56j425j711j17J467J697j11j841
1166A147j692j08J694J249n40j844j779K87J660R98q15j893j657O66J529J233
1182A35j017j722j016J043K299J014q24j496n04J547J996J157j048j664k06J304
1198I98K093L24j268j771l83J510J490J29j924j863l30J376J110l72k172j617
$$ y = [301, -1165, -624, 1247, 3302, 3122, 1574, 231, 803, 2634, 3782, 3167, 933, -536, -88, 1414, 2089, 726, -1796, -3147, -2410, -751, -266, -1578, -3556, -4165, -2918, -957, -59, -1223, -2779, -2951, -1168, 948, 1670, 580, -848, -741, 1046, 3339, 3651, 1813, 422, 335, 2150, 3566, 3157, 1125, -317, -326, 1241, 2291, 1196, -986, -2587, -2331, -580, 295, -875, -2727, -3841, -2902, -935, 8, -769, -2477, -2990, -1480, 646, 1599, 765, -741, -939, 838, 2732, 3188, 1763, 52, -65, 1402, 3099, 2988, 1147, -545, -653, 1041, 2290, 1750, -94, -1873, -1586, 74, 1072, 257, -1636, -3293, -2627, -1098, 135, -882, -2604, -3620, -2577, -278, 736, -88, -1584, -2088, -541, 1455, 2612, 1564, -100, -306, 998, 3091, 3415, 2147, 376, -7, 1503, 2993, 3122, 1198, -665, -995, 381, 1491, 1119, -1053, -2670]
1214b670j81J675J272o13j803j350N91J788J275m75j609p01J343K276J182n54
1230A446j423n11J277K072P90j016j770m91J147J711m1j352k199m72P89J599l22
1247A234j734k054j71J477J380k13j582j472L02J583J698k68j635j090Q88K136
1263D79J357m27j411r13R77K045J239r47j657o56R45J563N63j411j874q06R02
1280c2J586M19j784k006m67J174J513P0j682j561j22J434J562K5j572j259L51
1297b351J845J422qj547j108Q88K158J133k90j688r20J150J820R07p97j797o68
1314A49O56J647M56j402j994q95Q86J395K03j621j997m23J197J532J61j546j521
1331c117j08J738J847R5j230j236N61J715J625l2j293j142P20J771J622n67j579
$$ y = [-2670, -2851, -1176, 96, -517, -2320, -3670, -3079, -1291, -16, -491, -2100, -2801, -1458, 818, 2000, 1446, 23, -488, 789, 2861, 3651, 2635, 865, 374, 1521, 3232, 3191, 1839, -360, -832, -43, 1556, 1234, -500, -2554, -2725, -1248, 132, -81, -1663, -3135, -2833, -1250, 448, 180, -1455, -2545, -1657, 479, 1836, 1409, -2, -915, 62, 2107, 3346, 2399, 742, 86, 1031, 2594, 3157, 1746, -128, -934, -32, 1554, 1973, 189, -1817, -2284, -1110, 403, 473, -1209, -2770, -2892, -1458, 104, 129, -1443, -2702, -2351, -506, 916, 908, -639, -1747, -859, 1299, 2432, 2142, 454, -466, 684, 2504, 3411, 2614, 817, 149, 805, 2452, 2908, 1506, -488, -1383, -497, 898, 1101, -520, -2517, -2940, -1743, -211, -50, -1596, -3117, -3225, -1487, 360, 455, -775, -2011, -1450, 265, 1890, 1858, 565, -577, 143, 1914, 3536, 2969, 1390]
1348A390j152N02J385J051j251k090j022O26J397M22j369j979p68J062J313N80
1364I7j182j782j42J486J821O88j498j227q3J851J596M11j364j302L18J832J399
1381B919k69j518j190J74J667J008o89j854j179L66J213P15q47k114r66Q07J649
1398a08N27j243j659o49J073J889N00r76j608j52J427J887N57j204j130j55J548
1415E24J730K87j189j440J11J679J380k36j586j522O7J500J030o05k052j419N24
1432a217J309P52j108j756j178O96J616Q51p75j587n57J226J929P17r79j372j61
1449a594J473J827O65j164j454l5J567J361K49j545j411N7J112J266l23j730j630
1466a309J94J022R56m45k116j144K57J598J038o03j633q27J131J681R29m27j743
$$ y = [1390, 238, 740, 2125, 3176, 1925, -165, -1187, -561, 836, 1258, -111, -2090, -2858, -1796, -483, 97, -1085, -2867, -3009, -1523, 298, 986, -512, -1739, -1822, 29, 1625, 2036, 672, -630, -312, 1520, 2919, 2650, 1132, -58, 116, 1783, 2791, 2102, 248, -931, -565, 648, 1363, 516, -1598, -2564, -1757, -108, 419, -824, -2483, -3132, -2059, -170, 330, -646, -2254, -2406, -979, 908, 1465, 261, -869, -1024, 524, 2254, 2541, 1352, -88, 23, 1702, 3082, 2846, 1260, -262, -195, 1305, 2335, 1730, -322, -1741, -1217, 92, 844, -264, -2020, -3198, -2502, -886, -35, -810, -2397, -2954, -1728, 201, 918, -61, -1433, -1594, -121, 1706, 2371, 1207, -247, -282, 1285, 2646, 2895, 1350, -61, -4, 1108, 2374, 2051, 321, -1309, -1115, -93, 863, 418, -1698, -2842, -2585, -987, 51, -552, -2185, -3012, -1881, -200, 729, 302, -1441]
1483a441k60J315J734R40q54j525l54J228J451N59j207j633k92J296J163oj613
1500E01j461l12J223J078k92j740j374J46J222J157n79j513j044O66J598J199
1516D75m86j412p86J101J695J136o41j293o74J191J658Q80q82j715m44J067J455
1533B325M11j297j792l80J216J099oj445j661k14R67J225j02j596j546J81J535
1550a080J190k34j615q53M50J818J422l57j389o21R26J863R06n07j554q43R37
1567D59J834L57r14j671o36R48J392K81j577j596m77J047J096j18j299j581k5
1584b480J310J067J29j262j375N16J596J560j01j413q27N26J806J051r1j539r37
1601d64Q02J623Q12n86j759j012Q03J497O08j332j843n83O82J428K40j344j721
$$ y = [-1441, -1701, -386, 1348, 2288, 1434, -91, -445, 783, 2234, 2793, 1586, -47, -339, 957, 2120, 2114, 501, -960, -1272, -49, 1029, 737, -1003, -2377, -2231, -1009, 148, -431, -1944, -2988, -2322, -724, 475, -11, -1423, -2209, -1108, 587, 1723, 1082, -211, -885, 306, 1964, 2844, 1962, 247, -197, 870, 2325, 2736, 1439, -353, -733, 483, 1582, 1576, 131, -1530, -1744, -777, 448, 346, -1250, -2796, -2615, -1080, 110, -124, -1739, -2592, -2142, -324, 1098, 741, -648, -1269, -343, 1520, 2426, 1919, 365, -478, 459, 2293, 2650, 1736, 65, -571, 377, 1769, 2050, 473, -1123, -1600, -553, 543, 425, -874, -2455, -2480, -1170, -103, 26, -1236, -2611, -2095, -499, 1061, 960, -453, -1280, -754, 1052, 2103, 2012, 473, -464, 338, 1961, 2773, 2187, 428, -584, 219, 1716, 2324, 992, -851, -1434, -752, 676, 916, -428, -2149]
1618b149m23J202J376K12j225j092j45J412J314K20j340j083M48J572J281J13
1634A693j226j011N39J638J187m17j501j008N18J276Q93p91j803q12N13J269M47
1651A404j093j614j088J034J482M64j219j577l83J124J442L53j000j305r6J755
1667c17J382K52j123q91K7J618J434k07j358r20K68J458J044o51j537j143L54
1684c10J346P55q18j960r00P82J161N22r75j635p24J078J412N05q04j344k23J288
1702h44J521N77j151j010mJ363J492K27j325j019J00J199J214j27j410j228J25
1719c00J316Q49o82j547j291L63J545N49p54j586r01N62J374P16n76j398p04J179
1737a286J555O76o68j372j10J070J564N19j025j226r0J347J202K72j057j468J8
$$ y = [-2149, -2572, -1370, 6, 218, -1007, -2099, -2244, -832, 482, 702, -638, -1721, -1273, 299, 1580, 1693, 467, -544, -5, 1633, 2820, 2403, 902, -106, 412, 1688, 2581, 1790, -13, -825, -312, 957, 1404, 311, -1303, -2391, -1357, 125, 589, -630, -2207, -2590, -1466, -24, 329, -671, -1976, -2072, -317, 1065, 1317, 194, -697, -670, 948, 2382, 2175, 817, -103, 165, 1623, 2667, 2016, 479, -664, -310, 1036, 1791, 973, -987, -1887, -1105, 56, 578, -397, -2032, -2756, -1678, -266, 239, -565, -1909, -2132, -844, 677, 1254, 103, -907, -911, 452, 1944, 2171, 846, -173, -73, 1126, 2340, 2213, 803, -425, -300, 1016, 1865, 1183, -364, -1655, -1292, 253, 802, 48, -1538, -2439, -1877, -503, 213, -363, -1761, -2465, -1286, 269, 945, 277, -1095, -1205, -135, 1429, 1948, 923, -303, -393, 954, 2156, 2428, 1371, -97, -79]
1754g9J080J137l21j457j388n8J232Q68l43j588j311K37J465R13p77j357p81N42
1772a986J794Q89o58j336l94J040J502P93q98j230k17J009J564M66r69j410k25
1789b66J045J268j49j152j479j38J056J158l08j595j409J14J416R35n16j404j048
1806b472M97J293J063l26j474o31Q05J590R29m28j341m67R34J575O26o21j426
1823A26o00R45J502K95j151j551l42R46J151Q2j420j437j53J226Q29j47j367j370
1841b436Q2J297J271k36j160r44M82J443J257m54j083q15N79J684J043o61j266
1858H3m57P07J469N33q47j594m39O33J385K37r60j618n61R48J064M8j203j583
1876b155q4J132J179J02j200j145L51J094J333Qj373p40L81J608J097k21j177
$$ y = [-79, 1001, 2138, 1817, 360, -1028, -1086, 146, 1014, 671, -917, -2228, -1991, -526, 387, -390, -1747, -2528, -1986, -192, 697, 39, -1297, -1691, -651, 851, 1644, 746, -484, -701, 308, 1872, 2338, 1369, -41, -266, 779, 2047, 1898, 746, -733, -871, 185, 1343, 1035, -560, -1969, -1855, -439, 496, -20, -1424, -2472, -1975, -682, 381, 55, -1419, -2050, -1245, 345, 1274, 846, -495, -962, -28, 1547, 2173, 1552, 126, -474, 471, 1973, 2268, 1117, -434, -776, 170, 1321, 1403, -17, -1454, -1607, -381, 448, 301, -1066, -2436, -2354, -1057, 214, -22, -1182, -2126, -1644, -201, 1056, 602, -481, -1296, -717, 967, 2010, 1349, 83, -374, 333, 1802, 2335, 1488, -106, -545, 88, 1473, 1710, 750, -868, -1429, -481, 583, 631, -572, -2155, -2239, -1107, 72, 174, -1026, -2171, -1820, -726, 607, 615, -758, -1498, -1117, 491, 1588, 1367, 190]
1893A90p76N87J343R45o86j310q73O91J244N81r67j424p07N82J227M19j250j287
1911a471m98P83J391M7r43j209l47J253J236K27j088j089K56J502J211p1r87r99
1929g96N15J465J007k62j433q92N40J264N75n35j548r24P04J221L51q38j392p26
1947a704O02J272L74j003j300m38J013J401K46r23j230n8J305J373K45j033j069
1964i27M58J302J152q2j269j068L05J398J112o20j415q75K98J119N69n91j409
1981e43j010L44J322O17q94j321o43O37J439M76r11j076m06J069J345N96r87j061
1999a007j5J004J470L30j014j321K06J251J336r7j278j259J67J288P36m20j556
2016a79q75J38J203N99n69j487q77M71J321P03p42j234m08Q48J316N33o01j260
$$ y = [190, -586, 1, 1344, 2289, 1603, 293, -580, 111, 1355, 1936, 969, -455, -1162, -580, 647, 1066, -184, -1471, -1969, -1186, 205, 252, -691, -1900, -2247, -994, 242, 469, -619, -1708, -1452, 50, 1261, 1190, 203, -796, -281, 1184, 2191, 1929, 496, -396, 144, 1408, 1983, 1448, -100, -1024, -320, 901, 1252, 414, -978, -1704, -1102, 170, 544, -459, -1759, -2197, -1184, 217, 463, -460, -1690, -1748, -443, 930, 1175, 142, -927, -469, 833, 1985, 1903, 634, -434, -129, 1269, 2381, 1761, 346, -529, -231, 888, 1457, 866, -543, -1553, -1209, 113, 730, -164, -1485, -2128, -1491, -52, 424, -487, -1563, -1969, -900, 445, 1041, 54, -1007, -1022, -18, 1452, 1782, 768, -553, -347, 904, 2240, 2143, 865, -394, -227, 1061, 1797, 1377, -179, -1054, -916, 287, 886, 317, -1170, -2047, -1576, -255, 448, -294, -1528, -1936, -1088, 228, 761, 160, -1100]
2034a100l23J056J583L75q47j079j95J239J211J55r89j194q8J080J035j74j288
2051D57j352pJ160P77m35j319j117L94J159Q34m85j397p21N70J274P89m75j210
2069a104m79Q79J312R32o36j318j89Q23J366M06p33j470j26R88J200Q4j326j045
2087d36j31P91R68o5j189j368JJ145Q92l46j305j069K28J397R05k74j099p89N49
2106a195J427Q88m13j367l29P64J476N54o09j186l19Q03J136M04j073j267j05
2123d11P30J068J65j260j272j18P50J068k19j177j242L9J200R81k22j098q99M95
2141a422J314P79j4j258n37O17J348Q37m83j065o65P78J128O23o80j232o80P20
2159A08J297J73r92j509k65P23J138P5j048j311j64Q59J021J86j159r77J4J203
$$ y = [-1100, -1423, -367, 1216, 1591, 744, -335, -530, 709, 1920, 2075, 1086, -108, -196, 884, 1919, 1745, 457, -895, -902, 258, 1035, 600, -719, -1836, -1442, -283, 551, 66, -1331, -2052, -1482, -208, 581, 106, -1104, -1583, -704, 608, 1540, 904, -414, -603, 220, 1586, 1992, 1259, -211, -337, 651, 1851, 1935, 609, -436, -567, 224, 1192, 1127, -62, -1430, -1429, -284, 608, 262, -1043, -2112, -1884, -487, 418, 144, -955, -1744, -1195, 232, 1120, 707, -660, -989, -225, 1251, 1805, 1196, 10, -309, 494, 1630, 2034, 961, -306, -411, 319, 1387, 1552, 292, -980, -1098, -348, 720, 501, -676, -1918, -1879, -679, 302, 80, -1018, -1917, -1422, -108, 671, 657, -601, -1138, -521, 827, 1664, 1181, 116, -549, 229, 1357, 1980, 1300, 68, -612, 108, 1405, 1578, 586, -923, -1188, -465, 673, 748, -300, -1611, -1775, -916, 105, 291, -868, -1845, -1831, -628]
2177f28J148R4j105q82L57J284J073k6j152p43N57J315O72n39j396m45L72J147
2195A103M86p01j446m33O84J142J23q15j463l66O58J144J76j067q55k26Q80J230
2213B54Q7r21r21M0J312J094J44r66q09K13J296R41j62j305q97M84J204P41m70
2232A359j204r22N73J008N10q31j352o68P73J018K13q47j161l63R33J047K13p58
2250d59j124q8J232R53L25q90r42O2J427J043n1r18r80K32J103R42l24j266p40
2269d63K91R73L73l86j239p63L18J137L14o04j178o36O57J230M99n99j365j99
2287a640P55J283K63o25r83k08J056J339J47p13j061k3J186R16p6j046r92K42
2305a80R16Q01m07j181q83j3J094O42n09j116r62M63J242O93q00r44o12N62J309
$$ y = [-628, 520, 614, -491, -1373, -1016, 268, 1341, 1315, 163, -580, -23, 1292, 1964, 1425, 29, -416, -44, 1103, 1589, 888, -558, -991, -307, 835, 958, 143, -1320, -1686, -1028, 116, 292, -775, -1630, -1856, -976, 254, 341, -580, -1501, -1461, -149, 945, 1089, 123, -686, -473, 823, 1764, 1602, 297, -600, -116, 1088, 1829, 1359, 155, -767, -194, 814, 1324, 493, -859, -1527, -754, 264, 477, -370, -1531, -1894, -961, 86, 299, -459, -1583, -1671, -439, 514, 839, -51, -993, -931, 496, 1539, 1488, 570, -410, -178, 925, 1867, 1543, 277, -463, -172, 801, 1174, 788, -451, -1214, -896, 241, 555, -49, -1227, -1863, -1206, 24, 523, -76, -1441, -1640, -885, 398, 661, 36, -947, -1155, -99, 1240, 1387, 674, -387, -410, 776, 1692, 1616, 570, -422, -180, 736, 1537, 1130, -51, -934, -947, 147, 789, 280, -836, -1798, -1335, -93, 600, -200, -1144, -1756, -1194, 115]
2324A15N21n90r89k86R07J102M60p05r37m05J111J217K22r54j028r1J027Q76m9
2343A524j116j053R1P66Q27l36j089r71K24J060N57k18j282o19J95J369N55m19
2361F5j076k50L62J269O03n47r28m28Q27J382M33q33j050k16R72J096O5r79j084
2380c17j77Q68Q61m1j199j128O1Q15P61j28j173q01K17J025Q57l49j094o62N81
2399a023J309P64l55q90p75P92J239M89m59j127m82O56J327L07o83j233l00P89
2417C45Q77J02j059j241j55R33R20j61j010r36o7J056O33J45j140q49K74J236
2435i7R32l09r51p09N43J306O76l86j037n33N35J352M82o01j184o79R29J044K91
2454A604n44j338n70O96J059M3r88j156j80Q20R97p1q27j036M2R87Q12J00r15
$$ y = [115, 636, 46, -943, -1229, -322, 780, 1240, 535, -402, -807, 304, 1521, 1743, 789, -239, -330, 697, 1573, 1524, 408, -645, -554, 212, 1039, 703, -386, -1357, -1133, -73, 484, 266, -1016, -1635, -1440, -71, 484, 65, -1011, -1261, -899, 370, 973, 426, -502, -930, -103, 1279, 1712, 879, -171, -387, 585, 1681, 1746, 767, -317, -494, 374, 1235, 1194, -5, -1133, -1072, -257, 504, 376, -797, -1598, -1381, -356, 501, 152, -942, -1604, -1023, 286, 1050, 695, -195, -970, -178, 1061, 1550, 1091, -36, -518, 138, 1465, 1772, 1089, -144, -444, 345, 1222, 1324, 265, -976, -1131, -198, 722, 561, -449, -1385, -1452, -396, 237, 382, -758, -1607, -1333, -97, 835, 526, -425, -1134, -591, 715, 1391, 1005, -32, -565, -30, 1322, 1804, 1203, 19, -660, 269, 1313, 1604, 1060, -278, -848, -152, 907, 950, -38, -1194, -1374, -554, 443, 372, -455, -1491, -1449, -462, 350, 450, -465]
2473d65r18L65J271R30j88r87p57L31J172Q22m79j028m40M16J146M37n80j121
2491g3p05N92J063J11o95j182n05N97J070K16r75r89k39R53J113J18r04q64J04
2510a194J271Q86M9q48r88L21J193O64rj056p53M45R45P19m09j142o51L14R16
2529F73M17n43j246n07O39P98K59o63j108m14Q03R28M19p00j066p6Q27J154K01
2548G95q14p43OJ016R93J73r17r93K77R42R21m23q07q62J88R43P43l85j224q10
2568i81M05P90P00o78j125m73K99J142L72p65j025k99P68R94N61o34r26k59Q68
2587b66J088J94o80q69K0R90J061p1j209n98p9J034P46k34j190p01K11R11N40
2606H98m83j034o56K97R85L55l54j037o13N02J112O21n35j035l19R16J037L92
$$ y = [-465, -1383, -1018, 253, 1183, 995, 8, -749, -418, 754, 1576, 1097, 69, -371, 45, 1191, 1628, 1048, -73, -778, -186, 877, 988, 293, -889, -1394, -797, 273, 489, -486, -1475, -1714, -761, 352, 470, -434, -1298, -1194, 77, 963, 1012, 164, -824, -503, 690, 1354, 1345, 289, -464, -19, 926, 1645, 1236, 94, -557, -243, 673, 1090, 547, -699, -1206, -567, 231, 490, -173, -1281, -1695, -892, 36, 455, -245, -1311, -1387, -560, 594, 795, -19, -762, -756, 260, 1253, 1426, 509, -484, -207, 735, 1656, 1233, 426, -436, -248, 695, 1438, 1053, -171, -981, -576, 214, 914, 236, -889, -1362, -1063, 79, 451, -314, -1339, -1638, -870, 124, 685, 51, -875, -1134, -266, 822, 1016, 336, -533, -513, 477, 1538, 1467, 258, -340, -419, 615, 1361, 1127, -63, -764, -553, 358, 898, 415, -619, -1275, -978, 7, 362, 8, -1029, -1642, -1140, -28, 593, 58, -977, -1296, -380, 657, 1049]
2624A049n37r46l51P74J175M64r00j132j6Q73R16p2r92j037J7Q94O71j49j048
2643c47j012J64Q99P63k77r98q96M81J143O19m97r43n70N97J299M30m63q54l44
2662h06O04J119K70m25r96l6O91P92K68q56r39l28Q67O27k3p31j142J24P37O75
2682D92n6j062p71J77R32O82j37r03q61M28J128O32k98j050l82M91J133O88m33
2701H30q35n78O10J069M49p67j032m58P49J094P8q26j020j73O65Q47k30q26r70
2720a324J47P25Q44j22r38p70J88J088P11o1j009m47L52R79P56k55q30o99N86
2739g9R02O15n57q55n33N58Q48M87o09j168l54N46P49K13p58j061k65P54R20J6
2759C69p42r20o8R10R00R2q29p12J12R07R29p0r54n73L85J043O23m12r08n03N16
$$ y = [1049, 512, -434, -785, -11, 1164, 1628, 728, -404, -420, 453, 1369, 1297, 305, -732, -715, 179, 850, 701, -347, -1359, -1195, -296, 467, 190, -808, -1704, -1223, -80, 539, 42, -901, -1471, -874, 425, 855, 392, -462, -806, -202, 917, 1187, 762, -234, -270, 421, 1213, 1481, 625, -314, -642, 225, 852, 829, 98, -1044, -920, -183, 492, 436, -626, -1397, -1220, -288, 394, 257, -646, -1507, -1079, 49, 681, 383, -667, -1049, -558, 575, 1263, 830, -5, -583, 27, 1096, 1545, 778, -254, -712, 37, 1131, 1209, 383, -637, -810, -145, 702, 472, -354, -1324, -1177, -452, 392, 270, -668, -1438, -1250, -162, 549, 488, -521, -968, -616, 363, 1119, 864, 34, -665, -79, 823, 1438, 881, 26, -507, 51, 899, 1386, 777, -391, -745, -199, 550, 763, 5, -1056, -1321, -567, 353, 369, -373, -1293, -1361, -451, 449, 541, -288, -1000, -888, 19, 948, 878, -76, -649, -264, 779, 1402, 990, 82, -421, 95]
2780I5R09M13m23j061o11O16Q94L85q51j216l12M60Q96M42q03j019j59P67J071
2799D93n5o39r04j6R62P40K03q56o31M4J144Q62l37p28o76J47J037N66k31j007
2819A18m83J70R18M53n64j033m01L20Q50M58o22r72m21M99Q01M03o76q64j02O11
2839e37J019L24p28p64n1R68P53Qo61q19K16Q62P56j12q77p66J58R63N12l04r76
2860e6p51K84Q88M01m07j097l92K85Q79N25n97r09l50P01P85M45n11q87l6N82
2880b18R85L42p05q23r9P91R56J49q24r17J70P72P70j61j107p13J04Q78N87l87
2900E50j033p80M28Q43M62l81q36n72L17J082L42l53r11k71O30R58M52n68j014
2919f55j59Q26J011J53p17o40k65Q12P17Q2q34r05J79O68O50j19q71r65J10R18
$$ y = [95, 1004, 1417, 994, -67, -678, -62, 832, 1217, 366, -850, -1162, -702, 194, 636, -167, -1186, -1345, -578, 493, 438, -201, -1105, -1121, -159, 581, 784, -72, -703, -659, 485, 1347, 1010, 282, -394, -247, 790, 1356, 1125, 118, -365, -195, 723, 1176, 612, -421, -822, -502, 348, 806, 184, -788, -1209, -710, 91, 494, -182, -1046, -1148, -537, 482, 806, 78, -686, -737, 231, 984, 992, 331, -488, -272, 590, 1346, 1234, 357, -409, -251, 712, 1224, 920, -56, -807, -523, 365, 766, 359, -738, -1130, -845, 34, 559, -38, -947, -1297, -596, 189, 634, 123, -764, -800, -218, 767, 1109, 404, -419, -518, 273, 1229, 1378, 554, -363, -193, 579, 1349, 1188, 81, -632, -528, 350, 937, 550, -483, -1263, -835, 8, 470, 89, -747, -1319, -1002, 80, 422, 69, -842, -1113, -483, 475, 927, 359, -655, -814, 12, 1023, 1176, 459, -181, -446, 366, 1083, 1165, 331, -574, -395, 273, 923, 804, -67, -1032, -922, -4]
2939dO42l46r03o33J74Q44O84l02q43n17M79J025M70o41n07n05P42R50M37m96
2959G50q89j71M16R14K50o73r44K1N29O79J31r10r81J2P46O91j40p66q93K25P98
2980b05O26j96q23q07L49R33Q36l97q74k99M69R42N27m77r06l17N24R91K57m51
3000G02p97n27N32R44L78q06j029l09P26Q07o2p66q64j03P64Q17r0r65n31L0R22
3021b27P94k77q49n74M02Q63N84j46p63o84O16R05N32l41r21m80M48R92L75n54
3041F95q86m90O05P94J84o76j114j55N17Q16J02p32p68pO24P48J56p90o18J05
3061h90P88P75O5r05m68K98R02O38k02q73n47K45P98O39m85r25l79L12P75M37
3081I98q43p95l10M58Q16K53o32q85j85O99P33L6n32r13O2P77P70J97p93o70J87
$$ y = [-4, 638, 292, -611, -1244, -1070, -226, 458, 156, -687, -1204, -725, 300, 770, 129, -378, -883, -141, 809, 1246, 750, -139, -310, 106, 1020, 1270, 597, -347, -326, 203, 882, 1013, 103, -878, -866, -120, 571, 431, -335, -1228, -1003, -205, 421, 225, -598, -1405, -1056, -123, 713, 316, -558, -857, -388, 554, 1081, 604, -302, -619, -95, 896, 1153, 702, -95, -622, -90, 854, 1232, 426, -603, -912, -186, 621, 559, -207, -1071, -1174, -410, 407, 317, -648, -1179, -1149, -227, 567, 290, -559, -1133, -731, 132, 716, 570, -193, -877, -261, 644, 1176, 835, -86, -566, -118, 874, 1249, 695, -191, -681, -76, 718, 902, 226, -888, -1043, -526, 290, 392, -340, -1108, -1115, -491, 257, 413, -377, -995, -890, -102, 673, 738, -167, -635, -337, 565, 1203, 1001, 128, -419, -174, 624, 1263, 778, -147, -526, -214, 561, 998, 155, -640, -950, -492, 324, 577, -55, -940, -1125, -426, 307, 343, -189, -1102, -1040, -263, 507, 704, -89, -759, -572]
3102e72Q10P55l5p35p01L15P49O34k03q94n78K95O49N88l89j067m64N52N83M00
3122F92o14q40m29K88J230K65p43p22k83O47R41J33n50p41m3P83P52K88j056n57
3142e59J74Q13Q19k26o30p83K54O05O25j90q07o68P6R21L76l31j002m03L91P30
3162A85L27m35o66l50M46P46L21l15r90l09O85J000J84m36p98l0O35Q86J16p07
3182D95p94J64N54O69j34q60o08J42P40M52k58q43n77K78N61O38l97r32m92L66
3202h36R16M43l04q69m31P18P05N13m54p19k77O29Q38J81n35p23j42O99O56m9
3222I59n78o02k05P37O13j20r49o28J70N17O59j08r00p20L87P42N50l23r16l52
3242a067L05J006N20l23r73j83M85Q72L75n35p43j55O50O92J85m30r09l04P59
$$ y = [-572, 238, 993, 958, 223, -478, -163, 586, 1220, 1017, 123, -455, -160, 489, 1077, 688, -379, -843, -291, 292, 692, 78, -762, -1191, -903, 327, 592, -151, -873, -1156, -509, 432, 565, 15, -726, -769, 14, 766, 1054, -2, -559, -385, 428, 1247, 1021, 391, -392, -138, 467, 1092, 902, 95, -573, -497, 424, 800, 469, -533, -936, -545, 185, 512, 77, -589, -939, -493, 253, 574, 259, -731, -1040, -355, 645, 829, 393, -405, -435, 200, 1086, 1202, 495, -299, -135, 419, 1088, 954, 94, -514, -372, 368, 820, 562, -281, -858, -580, -19, 619, 222, -710, -1202, -836, 80, 523, 219, -650, -1081, -363, 342, 855, 401, -318, -595, 34, 872, 1053, 518, -205, -347, 352, 1008, 959, 381, -221, -426, 311, 924, 804, -145, -773, -603, -86, 573, 465, -435, -1155, -768, -26, 524, 201, -715, -1067, -762, 244, 764, 441, -532, -715, -230, 642, 1017, 482, -261, -416, 234, 926, 1111, 681, -228, -532, 227]
3261B27N83J18o64q87j29P25P41p1q85p35J72N56O98k50o26o47K59Q98N64k62
3281C85n46o85L57R89L75k88o67n47N69P54M66m45r72k23O78P46k5n11q67k13
3301f70N67P56J42r03p81M9P13N12q8o30n44l8P07P39j02p56n29L78O43O73j79
3322F59q36l18J74Q36M29j19r97k95L73R27K49l88q86l51M17O67J44o40p43k46
3342i44N02P64km48q96qO40Q82n8o02p24N0O97O52L9q08m19J76P03Q21j48q06
3364F3m36K50O62O93o15p93l23L60O77M21n84r16j70M31O23J49m97r38n7M61P37
3385A98K47m81j029K8P63O31K11o16n35lQ24N39r1p39l26j5R21M03k55p01m64
3406d90K33P31L66j84q90n30L46P23K70k12r50m05N86N96K72o13o32l22Q02O02
$$ y = [227, 810, 928, 264, -623, -752, -27, 714, 643, -242, -977, -805, -249, 449, 199, -427, -1074, -815, 83, 647, 385, -161, -846, -489, 500, 875, 587, -80, -627, -58, 696, 1162, 717, -255, -478, 200, 946, 921, 410, -457, -670, -103, 653, 795, -108, -889, -840, -127, 385, 297, -333, -877, -915, -208, 531, 429, -327, -856, -478, 165, 838, 659, -177, -495, -321, 515, 944, 825, -172, -467, -94, 833, 1082, 694, -192, -543, -126, 541, 685, 45, -698, -944, -442, 322, 320, -128, -1024, -1032, -392, 490, 432, -170, -894, -844, -147, 505, 544, -264, -683, -507, 196, 1017, 869, 63, -373, -123, 539, 1232, 617, -176, -499, -139, 538, 959, 375, -541, -711, -280, 343, 492, -5, -943, -1000, -539, 198, 445, -36, -1065, -1037, -274, 357, 568, -48, -583, -586, 238, 777, 686, -53, -379, -394, 527, 930, 675, -26, -490, -257, 474, 840, 656, -234, -764, -418, 305, 575, 363, -587, -992, -406, 190, 462, -151, -783, -1105, -303, 299]
3426B99J85o18o33p4Q15N58R4n00o20J40O42P54j05p06o45K31P31L84l50n34o59
3447f11K18O29M88m91o71n21K99O66M30k60p95n11N10Q19J47l52o85k05O16O95
3467D15K51l62q47K2P80M92R3n22p20o3Q30O08p3o50n26k1O16M32j24r59m17R2
3489f53O94P00n74o54n32L21Q79K23k57p80k58L70P97L59k81p94r8L02P14J90
3509F68k19o57k61O93P67J07p66r02K40N65M80p3n45o95J25N81M33k46o06p06
3529a017K12Q44N14k17q50m54L91Q16L05k67o43m79N48Q45L64n31n45l89O97M94
3549F38K92n49p34l1O11N25J91q94o42J23N63M65o3o06n68j11Q85M32j38p83o04
3570i98K25Q69M92k23n64p12M43P70N17k47q13l11K80R02L83k65q76j50M25N19
$$ y = [299, 484, -134, -767, -841, -26, 532, 626, 126, -494, -354, 288, 1042, 937, 231, -414, -183, 548, 932, 582, 48, -611, -393, 236, 724, 233, -438, -959, -660, 6, 436, 176, -619, -1130, -620, 199, 346, -6, -691, -896, -280, 415, 666, 304, -543, -521, 259, 751, 844, 322, -398, -461, 369, 977, 904, 254, -272, -293, 323, 755, 631, -328, -745, -653, 41, 741, 167, -487, -1019, -698, 181, 404, 147, -633, -891, -521, 276, 635, 354, -440, -538, -236, 478, 668, 449, -208, -469, 224, 991, 1098, 332, -570, -330, 235, 715, 642, 97, -598, -473, 108, 541, 295, -311, -1017, -805, 39, 553, 336, -514, -968, -577, 239, 544, 277, -366, -845, -297, 548, 912, 381, -164, -553, 144, 638, 930, 381, -353, -384, 227, 752, 943, 49, -593, -470, 93, 558, 495, -111, -679, -790, 95, 527, 389, -394, -998, -773, 96, 588, 365, -199, -911, -468, 302, 819, 572, -241, -552, -272, 630, 1013, 748, -128, -278, 147, 666]
3590F66K53n38o21m36P99N63m0n30r22R3N86O44j38m57p84J47N85O26j73o35n13
3611h25J46P39O42k39n98m37L22O75N56k85p24m58M88O50K36k66r11j57M11O26
3631E91J90n41q04k15N32N66J08n95n64o3M82O53J8o22m88P0O80M72o7l72m56
3652d25q9Q83M53j45o14n51K39O73N80j97q46l19K24O93K21k27p56m47M31P98
3672E79n9m72p35k09M40N29L05m67p47q4P72O44q4m25o42J14O35O49r1p11k78
3693c37L2Q36M21j78n47n96L03N25L20l05o04l03J80M62L52l98p15m06M07Q06
3713B55K86p11m18l46M86P97K1l45o67J5M65P82Rn76l20j78O38N69l6p37m22K29
3735b04N63N68k89n74o57N2P83M46l01p51m12K81P09J21k92o44l36L57N52L79
$$ y = [666, 919, 381, -240, -676, 123, 686, 646, 116, -806, -713, -127, 517, 379, -78, -862, -715, -130, 496, 323, -312, -825, -679, 60, 702, 463, -135, -572, -250, 425, 981, 696, -28, -486, 2, 652, 888, 622, -289, -446, -35, 591, 781, 240, -564, -779, -247, 319, 427, -168, -732, -795, -313, 340, 358, -264, -752, -682, -2, 470, 403, 31, -425, -514, 369, 822, 677, 63, -488, -249, 424, 1004, 807, -39, -358, -134, 559, 780, 553, -203, -650, -219, 579, 520, 48, -687, -896, -456, 73, 378, -89, -836, -920, -148, 496, 412, -13, -655, -541, 94, 743, 652, -59, -337, -305, 531, 952, 774, 227, -369, -66, 459, 779, 474, -130, -433, -253, 209, 561, 163, -552, -958, -551, 255, 541, -170, -588, -934, -448, 349, 370, 25, -642, -627, -162, 620, 629, 53, -267, -445, 193, 762, 726, -11, -433, -204, 359, 927, 638, 64, -593, -541, 242, 688, 387, -364, -776, -495, 214, 335, 43, -601, -937, -580, -28, 351]
3755C51k41o38j50O09N08M1k61o44r2M89P51J48o59o48J45O03M83j64l78o09J1
3776c45M58N83k19m89p21J54O31L31j91n77n68K37Q19K94k72o66k49L57O51L56
3796E74l54p05j31M59O70J39l10p07j0M56P73l8o41m59j56O94M43q9n81o11k7
3817f11O01M27l3p21m26J51N48M40j79p37l46L00P59L76l00o85k29L56O00L71
3837F62m06o68j44M28O62M55n10o40j32L38N77J2l78p50k6M21N39J43p51n03L4
3858f37O63M72k15o06n57K49O14M84m7p15m23K73O61L62k45m98l96M25O52K82
3878G98l17p73l1K08Q46J70n60o88j3L49O17l5n62l65k81N34M79lm96o17L4N61
3900a45M32m8m38n37n3R35M00q6o08m30K48P46K71m5p41l12K72N22O07n38n06
$$ y = [351, 110, -528, -678, -69, 439, 480, 219, -425, -517, -28, 723, 871, 212, -436, -291, 312, 795, 631, 253, -356, -345, 113, 696, 477, -12, -733, -579, 52, 383, 192, -385, -953, -716, 103, 397, 125, -541, -790, -433, 218, 574, 220, -485, -616, -157, 513, 652, 342, -365, -375, 81, 854, 816, 175, -284, -440, 254, 697, 608, 27, -584, -611, -10, 417, 384, -337, -763, -612, -64, 376, 197, -540, -886, -586, 173, 549, 249, -436, -665, -309, 291, 662, 256, -412, -556, -128, 534, 989, 479, -161, -293, 45, 622, 634, 256, -494, -520, -99, 440, 583, -168, -671, -637, 26, 498, 283, -323, -880, -631, -17, 467, 420, -295, -718, -445, 216, 578, 333, -165, -561, -136, 516, 798, 481, -292, -323, -115, 731, 901, 341, -347, -360, -11, 606, 571, 9, -356, -637, -103, 376, 373, -123, -740, -706, -145, 287, 239, -199, -736, -789, 146, 546, 460, -148, -578, -330, 416, 687, 642, -99, -411, -139, 383, 990, 452, -54]
3921e4k85K01P19K14n88o96n3K25O03K64n44o87pK94Q93j40n40m82J00L18P80
3942E35q2n39m73J03O78N00k53m47l47Q6P73L41k59p57k56L75M87M04k57r48k57
3963e93L53O01L0k81n84j88L18P32J43m84n84j87M14O26K56o47n32K08L90O55
3983F46j2l86m84o0N53N31q7n28l80M3M91M38j18o49m92J92N02L71k44n51m02
4004f26L17M46K53m09o51p2K84O06L01l92p19N2N27O21k9l68p12L4N84P32j25
4025F54n26m38K8O36M61k84n99l25J18N28M08j88q53l51L43N06L93m50n79k56
4045g74L63N73K10l72p36n6M03P88K20m83n60m3M20N58K86p65l58NM96N97k2n40
4067B10n82r5N44N45k15m70m38N9N67L94k85m79k69n5P47J76q9p65l46M11O64
$$ y = [-54, -339, -138, 581, 795, 207, -489, -542, -317, 286, 550, 6, -681, -688, -394, 499, 359, -181, -663, -563, -245, 535, 453, -86, -559, -456, 222, 722, 469, 22, -325, -239, 534, 875, 616, -141, -397, -22, 465, 869, 612, -336, -593, -240, 361, 391, 110, -474, -662, -344, 388, 531, 47, -537, -724, -310, 316, 572, -75, -607, -399, -9, 646, 634, 248, -236, -296, 257, 788, 701, 173, -207, -164, 327, 765, 647, -2, -494, -302, 200, 571, 327, -224, -626, -309, 137, 390, -19, -670, -742, -458, 148, 449, 57, -662, -610, -83, 538, 509, 141, -571, -537, 47, 779, 654, 128, -310, -282, 354, 815, 531, -68, -393, -275, 253, 661, 473, -380, -731, -388, 118, 511, 61, -518, -774, -411, 162, 372, 0, -736, -792, -389, 399, 619, 136, -424, -467, -47, 511, 797, 32, -326, -321, 175, 772, 750, 210, -372, -467, 77, 622, 407, -63, -501, -442, 125, 519, 234, -245, -514, -569, 178, 354, 265, -500, -846, -435, 229]
4088B29J15j96o68o0M07O28K34l17m78l71O81L89pk82n84PL42M73M5o37m56J17
4110c89L32O88k71o07n11J26L93N02q4p23j91n9P22N36l18n16l14K46Q02J57k40
4131B81n04k13K30O72L37n76m25k64M78M72L08n72p94J41M08O12j33n05m20k05
4151f72P08L80j68o39l67P5N88N48j11n19l73J96N17L63k26n53k71L16N60M44
4171G96l92n51k15K04O69K63m14o94j35L84O95J0n27n33m3L72L75J03m81n93K20
4192d87L59M56jm25p15K74N16M10L2o37l19J55N69M43k78l65n02L81O87J49l42
4213C60l90m02K92O01J55n22m81j66L25N00O4l65m77q5K63O79L4o17n09J23M96
4234a22N09Nm05n38J89N69L55q3n47k75K09L44N71j40o64m35L16N04L44l59o09
$$ y = [229, 344, 148, -520, -580, -173, 455, 689, 372, -106, -477, 204, 593, 586, 304, -280, -273, 69, 542, 587, -50, -506, -389, -57, 631, 360, -247, -758, -632, -239, 263, 179, -544, -735, -794, -72, 464, 146, -370, -684, -438, 364, 521, 281, -223, -436, -206, 466, 803, 227, -198, -462, 16, 488, 796, 224, -570, -429, -21, 591, 458, -47, -467, -672, 36, 416, 248, -391, -758, -683, -95, 453, 342, -177, -550, -354, 163, 526, 300, -253, -524, -208, 352, 796, 404, -147, -362, -158, 511, 774, 360, -334, -469, -85, 610, 620, 93, -440, -483, -111, 264, 367, -114, -707, -487, -128, 328, 327, -98, -813, -539, -23, 387, 419, -218, -537, -382, 187, 630, 352, -13, -515, -134, 553, 702, 360, -30, -432, -140, 461, 616, 94, -387, -553, -228, 272, 336, -29, -506, -591, -328, 351, 385, -232, -741, -618, -122, 387, 392, -13, -551, -362, 207, 562, 479, -68, -343, -134, 210, 781, 641, -23, -458, -142, 362, 706, 347, -262]
4255b62l28M55M09J62l26n37j86L55M89K25m28n51j76L77O53l6m10m49Q7M71O59
4276F53j85m47l23N0N78N12k83n41l16R4N24M68k74n67l52J86N66L50l46o65l59
4297f77K38Q12R3l11n20k86M85M54n3l32m84j28M81Q11j31l51n57n0N95M97k6
4318E60l62m65o6N54L78N9n53m73Q4M67L98k17m88m76K40N27L50l23o16j61J58
4339d25N13K73k90n06j78L04N40K43m25l23k41N80L71K48m41n79J10M29N99q6
4359G16m86n07m4N42M31m9m63n70J84K29M67j07p97k51K68N50K92j73p31j64K08
4380d55N34M28k83m66k28K32O92J68m49l57k75M50N40K24m75m58lK09O33k2n30
4401A09l99j03N09K86Nn27k76P9L25N10n10m17j98N8N69O16k62p20k93K06N38
$$ y = [-262, -590, -135, 274, 436, 110, -427, -613, -258, 231, 456, 28, -523, -699, -322, 331, 295, -115, -564, -477, -6, 653, 468, 21, -302, -252, 326, 838, 555, 14, -302, -208, 316, 784, 510, -57, -409, -223, 343, 693, 347, -318, -677, -439, 373, 466, 155, -365, -651, -166, 288, 235, -97, -581, -709, -228, 583, 452, 101, -456, -506, 89, 586, 560, 198, -267, -333, 221, 599, 658, 105, -368, -284, 183, 581, 364, -124, -600, -360, 167, 517, 194, -422, -583, -425, 88, 361, 71, -435, -613, -309, 231, 474, 49, -274, -515, 65, 436, 684, 243, -336, -226, 203, 802, 716, 230, -277, -321, 221, 652, 603, 140, -430, -246, -17, 450, 343, -454, -705, -437, 113, 405, 232, -499, -663, -455, 79, 507, 224, -242, -470, -238, 454, 622, 173, -184, -459, -9, 531, 755, 280, -178, -181, 28, 661, 639, 109, -290, -393, 116, 402, 407, -120, -396, -317, 8, 518, 8, -409, -607, -549, 20, 636, 374, -346, -639, -433, 105]
4422A05L95k54n52k20N94M07J90m74n51k6K86P69J8n08n51q7M28M88L7n24m17
4443d47j14N57J57J38n33m38O3O12K65M3o07k98L04L68L70j68m18l05L22L82J62
4464D15r2l58k89K27M82M01l44m70k31J03O34N2m88m49j44N16L14K15n35m88j37
4485f66M77M81M1n22m16lN88M14j41n12l04J89N62M43k31o45j45L04N70N5k12
4506C27l32l60K48O49nl25m27j03r4P24R9k39o34n7L67L90K15o05l23j07L80N75
4528C63N1n75m59J90M34L92J3n67l04N9N34M39m1n70l30J10N76J80j63m57m12
4549e37L36M28J82l34m83n2J16N55R7k77n68j08L78N56J77m47m77K1L59M67J89
4570E78n18n40NN99M84j58m02k63K05L16L22k19n74k75Q7N96L14j93n09m94K86
$$ y = [105, 500, 246, -306, -526, 68, 475, 665, 191, -360, -386, -100, 669, 687, 179, -372, -459, -31, 457, 494, -30, -447, -561, -4, 153, 291, -242, -680, -617, -5, 260, 303, -304, -602, -298, 70, 440, 272, -146, -451, -129, 253, 415, 323, -35, -324, -97, 385, 786, 442, -28, -259, -156, 478, 530, 42, -407, -551, -35, 279, 494, -41, -529, -666, -189, 292, 333, -189, -605, -608, -20, 394, 253, -259, -563, -374, 188, 631, 400, -245, -390, -86, 484, 539, 327, -5, -365, -117, 532, 527, 202, -225, -328, -422, 302, 401, 162, -472, -529, -162, 228, 443, -162, -485, -592, -212, 363, 414, -161, -620, -430, 4, 396, 409, -158, -462, -403, 131, 570, 529, -41, -371, -261, 315, 495, 332, -125, -537, -201, 227, 409, 75, -408, -460, -344, 211, 308, 31, -537, -645, -267, 289, 466, 19, -458, -437, -78, 389, 578, 60, -480, -475, 124, 608, 450, 48, -215, -10, 306, 628, 409, -165, -440, -353, 243, 557, 364, -145, -639, -353]
4591c53M54K33l59l55k74M34M79K07m86n18O1J91O57O0l94m17mL84M46K52n98
4612A00l77PN40K67O3n86l57J0M88L94l03m15k15m2N54L26j29n82l51J96M53K79
4634C20k51n89j18K45M78K79j96n64R0J85N59Jk49n01n2K96N81k8k57m34j86M50
4656E9N74j70l08o15R6M43L24k08j86m35o6O31K77j25p08j03P4O07K88m30k93
4677b74k52L67L99J59j04k87m56M59M69K1l15n09K6M02K88J07k11n82l1M70L05
4698D51J6m24l61j11N04K61k61l00k22L3M96M83l54m49l82L43N41J48j85m16j22
4719c11J42O27o2j02n03j64M07M39J45l43n74m7K59M18J50k99m42q6L74L73K6
4740D27m73n48J44M65L33l08j83l66M5L95M53k58k95k68L07M31K72l14m47j95
$$ y = [-353, 101, 334, -25, -380, -654, -220, 259, 466, -20, -538, -477, -286, 371, 431, 37, -380, -384, 0, 446, 698, 100, -277, -270, 270, 537, 600, 14, -343, -333, 155, 549, 246, -169, -384, -426, 128, 454, 325, -257, -608, -412, 41, 320, 69, -520, -638, -393, 85, 364, 168, -396, -306, -121, 438, 439, 190, -311, -363, -67, 514, 486, 229, -205, -391, 59, 633, 463, 155, -460, -364, 79, 403, 195, 9, -426, -492, 139, 416, 291, -417, -520, -446, 161, 449, 19, -274, -526, -159, 240, 399, 295, 8, -448, 11, 480, 501, 186, -323, -297, 105, 393, 500, 289, -293, -324, 146, 451, 467, 43, -318, -429, 75, 336, 75, -225, -447, -414, 82, 565, 211, -238, -620, -277, 264, 412, 227, -189, -311, -169, 458, 396, 294, -209, -373, 34, 473, 618, 275, -299, -346, -87, 331, 481, 182, -260, -346, 28, 401, 427, -46, -594, -450, 15, 348, 40, -143, -509, -464, -69, 384, 126, -169, -437, -130, 301, 573, 259, -188, -383]
4760c83M32M74J17m11n38kK73M94Q9l88k98k20K52M26N3l57l61n9L19K75J09l45
4782d9m73M1M82M83j82m82k56J38L37M90p7m96l13K63N15J25j98n16k86L05O58
4803E09J9k56l03k38j4O83J1l10m71j58L56L82m8k61m79J96J25O23k18k86j98
4824c36m0M84L09n3l66l85J3N19K67j1l60m60K40N52Q7j61m26l22L47K04M41l10
4846B33o00k05K90N55P4m00k47k43L63M27O1l68l64p3L69L33J91m01n24K67K71
4867IN30k8m88k93R6L92K93m6n94k29R4N61Q7q8m32l78J47N32L5r5n23k25L33
4890c10N03J58l19l69j18Q8N99K25k17m99j94M22L60J29l82l07K9M74L07j45m23
4911A1k21Q1K53N27j85m87m03J50N31J72k39l75m65M32L34J22j71m18j06K45L04
$$ y = [-383, 49, 523, 640, 229, -309, -311, -38, 456, 545, 157, -141, -361, -109, 317, 370, 13, -348, -407, -88, 187, 296, -49, -522, -481, 1, 484, 302, -180, -436, -298, 39, 529, 452, -44, -357, -94, 421, 546, 348, -168, -454, -149, 509, 528, 272, -31, -269, -283, 400, 411, 101, -370, -528, -172, 210, 162, -99, -578, -382, -257, 366, 148, -138, -336, -376, 108, 417, 364, -2, -387, -374, 145, 412, 401, 41, -419, -179, 373, 460, 299, -127, -449, -102, 102, 543, 233, -367, -572, -282, 273, 347, -53, -300, -543, -180, 247, 308, -60, -424, -497, -128, 205, 396, -5, -529, -262, 9, 539, 511, 23, -270, -174, 218, 511, 465, -129, -358, -264, 297, 384, 296, -136, -514, -367, 165, 200, 105, -418, -643, -310, 193, 351, 32, -337, -455, -367, 232, 457, 240, -259, -453, -31, 329, 458, 76, -231, -202, 272, 579, 434, 11, -210, -129, 124, 651, 466, -21, -424, -274, 257, 429, 190, -185, -650, -218, 116, 238, 67, -351, -457, -212, 92]
4932I2K65k58l72l14N79L17J13k41n53k6M95L68rm00l04l4M61L46k15k37l60J2
4954b75L12K45K0l72l07o8N67K29k69k31l44J48N39O8l8n39j91L86K84K93l76
4975H1k72k33K84N44N2k29m12p1M32K45q7j59m80R0L31J86J40m31m47K3M88K54
4997C29j20l37l94L39J88K27M4l41l81J91M26J89k07m79n9K87M40K06k82m01j24
5018b59M21J87K02m93k43j66M47J53K49l92m27K5J68N34p2m10m25R4M29M53k40
5039B35m09j29o6L06L57j23l80k12R2P12PJ06o76q9J53L53K79k96l72j77L10L29
5061C10J68m26k82k20M15K82R5l38l97qL39L05J5m32l96K69L05K44Q7n33k87K38
5083b47N04K49k80j65m40K08M08K67Pn86l04K94L71J24o6n91j69K33M99J32l55
$$ y = [92, 357, 99, -273, -587, -8, 309, 422, 181, -372, -398, 97, 465, 456, 56, -248, -282, 179, 525, 310, 73, -287, -275, 37, 282, 302, -70, -377, -445, 122, 351, 82, -149, -493, -345, 194, 262, 224, -315, -506, -120, 164, 457, 81, -191, -424, -140, 404, 456, 227, -185, -256, 176, 421, 334, 175, -305, -215, 116, 302, 442, 11, -436, -413, 75, 329, 209, -128, -522, -183, 5, 232, 276, -65, -446, -255, 171, 360, 153, -326, -385, -98, 342, 548, 266, -135, -259, 162, 349, 551, 58, -185, -351, 96, 249, 498, 106, -321, -296, -128, 406, 334, -76, -501, -407, 22, 475, 235, -174, -303, -369, -63, 294, 171, -209, -421, -329, 383, 390, 496, -180, -269, -116, 237, 516, 220, -152, -329, -19, 310, 478, 52, -230, -450, -35, 247, 342, 4, -393, -401, -62, 243, 258, -174, -570, -301, 4, 248, 335, -198, -485, -247, 257, 506, 226, 61, -379, -171, 237, 504, 511, -75, -379, -85, 286, 410, 344, -247, -416, -183, 316, 448, 93]
5104I3l41j63J84M86R6l48m30m6L15M83k9l51l15j05N95K77o8l69k84M3M09K92
5126D24l2l11l06K01L86P2P0n51l71J84M24J86j47m64j14J96L64J55j88o34n8
5147e14L06L90J35m34l22m2M44K97O8l75j24k20M80K08j9k08m70K14L23M25j66
5168C96m10j37P2K29L43k07m31j98L14J85K56l34l72j22K44M85j4k78m28r6L62
5189a41L08J94l71k67k64N01M50J3m57k65J81J50L94Ql42l18P8L48K76j31k02
5210A43m21J01L17K54j39m34l02P8O63J6j61l16k12K79M61kj43m78j52M60K90
5231C02J70m25k07j94L42N02L4l97l47m2K89K79p9j49n24K68K52K87j47l99k09
5252c94P7L41K28j65l37k69J86M03K63j13m50k72L82K94Q4k28l05j73L06N05M5
$$ y = [93, -248, -411, -227, 259, 355, 7, -423, -469, -154, 329, 300, -51, -366, -471, 124, 401, 333, -36, -320, -277, 132, 424, 392, 81, -225, -24, 362, 434, 504, -47, -418, -234, 190, 376, 229, -235, -349, -153, 211, 366, 178, -456, -514, -208, 182, 317, -117, -439, -481, -37, 260, 328, -47, -171, -391, 89, 297, 278, 70, -400, -186, 137, 562, 396, -14, -151, -79, 150, 493, 286, -145, -343, -29, 156, 412, 78, -294, -416, -172, 313, 299, 21, -407, -503, -141, 167, 361, -10, -277, -541, -40, 410, 423, -34, -299, -118, 32, 426, 434, 92, -226, -148, 200, 476, 345, 143, -278, -177, 140, 394, 255, -179, -481, -403, 260, 276, 115, -201, -413, -134, 327, 325, 182, -296, -448, 12, 302, 472, 47, -160, -354, -12, 490, 524, 127, -220, -262, 27, 306, 227, 78, -446, -178, 74, 361, 214, -185, -394, -317, 24, 252, 87, -250, -519, -333, 70, 333, 220, -230, -502, -120, 174, 258, 30, -275, -448, -142, 363, 408]
5273D08k35l83k3K79M03om44q8l83N40K58l9l06m41K38J88L98o8k89l82J41K09
5295b5L08n3l35k47R5M79K40l85k39j82J52M19J40j14m95J00MM74K4l46k81nK97
5318B5K33%k85k69nJ94K94J3l06k10j38M00M35l64j83k71J52K59K42Jk63l16J63
5341a99M14J76j25m16j85K94K18J76k18m03L4R7M10J23k51l13j98L75K62P0l53
5362a2l60Q0K20K36K04l59m85Q9K64M37n1m02k82R1L71L29k26l52j9M9L31L10
5384D63k87j66k33m4M65P5o4l73j93K73M77K9l48l82o1K76L39J36k58n18K6L22
5406d6K01J39k13l96J9K84K06J41l59k00o3N23K34Mn45j46K24K00K28j52m21j36
5428b74J45M21J4k42l81ON1L39J97j52l75j32J29M06J52l98j90j11L33J85J05
$$ y = [408, 173, -210, -233, 46, 449, 443, -1, -89, -472, 68, 326, 287, -19, -460, -222, -34, 364, 296, 7, -375, -234, -25, 283, 230, -105, -352, -257, 222, 462, 77, -162, -344, -192, 227, 367, 253, -242, -142, -138, 336, 360, 14, -267, -272, 25, 258, 258, -27, -296, -301, -107, 187, 200, -106, -316, -454, -54, 381, 17, -166, -437, -285, -26, 216, 217, -46, -362, -199, 215, 391, 266, -150, -335, -41, 177, 353, 135, -268, -234, -137, 273, 396, 145, -168, -366, 9, 271, 341, -12, -372, -292, -72, 164, 368, 9, -476, -387, -123, 314, 263, -139, -421, -330, 41, 370, 144, -208, -227, -178, 153, 463, 176, 10, -223, -267, 198, 273, 209, -164, -357, -84, 393, 422, 74, -308, -369, -93, 246, 382, 124, -394, -368, -46, 155, 294, 81, -315, -296, -12, 194, 335, -24, -224, -287, 236, 470, 474, -71, -217, 7, 207, 435, 283, -138, -274, -129, 292, 306, 64, -317, -311, -260, 79, 276, 124, -251, -383, -254, 152, 304, -94, -284, -395, -62, 123, 228]
5449B28k1n80Q8M50K05M5l40l20J6M33K98k12j85l66J22K88K26k2l55l47J77K96
5471A24K22k29j84k49J51J88M05m04l72j10L49L77l0j61l36kK54L97j2l17j78
5492a17j90M36L16k7l21k11mL22J88o8k35m25K35K20J84j4m01j65M9L21J50j33
5514A10k94l8o2M79QL4n78j9K82K88R2j22j53j59M6M72mk70k92o7L09L44m5j87
5538A74m15Q4J54M14j41l13m07K33K46K33j41k37q5M9J55K41lm73k64J82N38J01
5560C25k50j58k12K19K50K20j56l61p0L30K77r0l07k11J0K59K53J3k95k80k8K94
5582C2J40J08m09j53M9K75K50l3l83j70m6K95K64j74k21k96K94L52K69l18k98
5603a73n8K08K88J12o9m07K1N8J95J23j15m05K6J95K43R5l91j45J4J96K71j08
$$ y = [228, 207, -373, -285, 165, 370, 415, 75, -245, -229, 204, 502, 290, 105, -261, -139, 149, 375, 353, -2, -349, -172, 124, 346, 117, -67, -316, -165, 23, 428, 24, -348, -458, -109, 268, 238, 77, -259, -261, -7, 390, 378, 61, -117, -307, 129, 445, 418, 97, -114, -118, 204, 392, 324, 89, -336, -101, 119, 303, 289, -112, -277, -228, 93, 243, 110, -184, -222, -284, 195, 203, 237, -341, -360, -78, 210, 302, 180, 27, -132, -86, 386, 382, 112, -180, -247, 62, 406, 361, 174, -241, -157, -3, 411, 270, -43, -450, -217, 29, 262, 121, -116, -201, -152, 3, 244, 241, -232, -496, -314, 224, 325, 75, -83, -295, -76, 174, 394, 238, -123, -193, 137, 414, 324, 17, -194, -184, 75, 328, 341, 46, -234, -262, 32, 172, 280, -129, -282, -233, 42, 292, 259, -124, -294, -340, -45, 219, 45, -176, -472, -178, 174, 443, 125, -173, -231, -23, 265, 377, 308, -99, -78, -20, 175, 298, 183, -222, -196, -1, 242, 337, -54, -199, -185, 11, 282, 174]
5625A74k57l29Q2L37J95j1m13j66K69J47L13j93k85j47J83K68J56j72l57r3K50
5646d9L19N9l07j53k66L21K67Q1k94k32j95L54J86Q4j33m99j6M32L05j09k50k36
5668c31j01N14L64l17k39k58K57K99J89j51k63k97J89K68J29j36k75p2R0M75Q8
5689D22l48k94J7N0K71J58j84l78K4J68K80M5k38l07j10L36M12J8l50l26Q9L53
5711A08K60j66j60l26J67K88L33l17k46k01J53K49Q3j01k23k12J73K17K93k80
5731I2l96k6J83L15K8j36l05N2K33J32J73m04l00j28M95L48j78k53j56P9L82J24
5753C54j29k08m31J76L17K69m9m51q6J54L30k5m7l71k52L04K43J42k00k43j90
5774c93K67L89M4k62k87k1L3N53q3j34k45j79L22M52N8m46k86N6L48J91k09k81
$$ y = [174, -83, -412, -330, 7, 202, 191, -222, -388, -119, 28, 341, 148, -137, -284, -101, 167, 323, 151, -206, -299, -49, 270, 329, 22, -131, -397, -76, 191, 272, -22, -254, -449, -95, 91, 175, 42, -457, -473, -41, 264, 155, -95, -331, -432, 82, 446, 129, -110, -368, -111, 188, 377, 226, -37, -334, -145, 123, 252, 116, -159, -231, -141, 334, 422, 74, -220, -203, -153, 118, 276, 92, -286, -262, -94, 186, 231, -7, -314, -424, -88, 324, 342, -8, -334, -245, 108, 368, 202, 42, -284, -117, 171, 504, 187, -59, -260, -107, 142, 225, 124, -99, -311, -138, 79, 372, 92, -304, -330, -147, 168, 196, 60, -245, -193, 40, 172, 345, -59, -359, -487, 8, 356, 178, -75, -231, -152, 230, 354, 225, 17, -414, -238, 79, 348, 299, -152, -238, -84, 246, 221, 174, -197, -449, -145, 98, 240, 40, -203, -393, -126, 263, 307, 45, -242, -263, -230, 323, 240, 106, -139, -318, 4, 456, 514, 68, -218, -162, 186, 377, 168, -113]
5796a13j56K15J12K74k20k71j75J10L93J37k31l04j8L4K39K26k10k65o0O5N31
5817C13j17J6l78o5J67L15J44l40k12j53L19J41L01m47j64K4L38K28j19k99l27
5838c15j10L98L39p5m94j11J51K15J65M0k46k68K25P9L66k03n04j3J65L80L06
5859D90n12j54j18J93L99J10k57k29l4K6M75p6k01l31pO2L56Q1l32k83M2N01J04
5882C05l03l9m22L21K12J72m6l98j31J01L92J31j73j60l21M37J65J81k26l00j48
5903b50K51L14Nl81qp1K12K54p1k24l62l8L88J62m8k01j12q7K41K19l3l31k03
5926c74J34M34M5o2k72n6K7M28R8l24j19j07J70K52p5m8m30Q1J0M97n2j28l64
5949b35P0J40L32j17j71l09J05J16L48m2l83k37J73J56L54Ql40l55K89K71K93
$$ y = [-113, -269, -54, 58, 332, 112, -159, -334, -224, 169, 306, 75, -229, -247, -213, 26, 252, 42, -223, -283, -218, 313, 196, 212, -166, -231, -64, 251, 395, 55, -157, -310, 9, 150, 451, 4, -160, -136, 202, 430, 311, 12, -315, -425, -27, 312, 237, -257, -368, -217, -2, 163, 203, -43, -311, -86, -7, 359, 156, -348, -361, -196, 184, 490, -22, -176, -294, -101, 298, 408, 151, -78, -112, -86, 389, 313, 112, -219, -226, -164, 192, 273, -59, -342, -300, 201, 305, 2, -37, -459, -138, 74, 246, 200, -198, -329, -228, 164, 295, 122, -38, -359, 78, 243, 424, 198, -102, -250, 1, 315, 320, -61, -69, -140, 72, 326, 255, 31, -331, -369, 19, 181, 133, -68, -180, -267, -26, 193, 160, -171, -374, -240, 194, 239, 177, -95, -151, -124, 304, 402, 78, -41, -148, 22, 274, 199, 151, -279, -198, -188, 309, 257, 129, -235, -165, -25, 307, 190, 19, -290, -185, -69, 279, 237, -146, -383, -210, -54, 300, 308, -32, -387, -98, 173, 466]
5970D66k18l10j79L11J92q1K4k24j82J20L79M2k26k07l11L94J16J64k29k12k83
5991d54L67J30K6o9j88%J55J87J09k27k88NL02J79R0k51n42M33K44N4Q8m67q6
6014b03J14L39Kj52j62k13J61J98J31k10j99M8O4K06K66l58k73j75L05L28rk02
6036Fj67q2R7K12J54k74l39K24J37L33K8k70k24k4J44L79j02l69r1Q1K97mq7k54
6060a95l20L88K20J41k59k29j54K77K76jj71r6j66L72K18K7k47k09l8J24K83R4
6082C35m07j27J31K03J32m1l20K7j84M51L8J0l86j33J64J8K88j76k31j44K67L79
6104B94q3k50j32j39J23M38J37k25m95K99j36M17R8j38j83k51K91K02l7j09l08
6125a87%L01Q3j29q8j39R1L08K5j04k74j13M4L24p2p0j50k41J17M37J01k06k43
$$ y = [466, 248, -62, -241, 70, 262, 181, 205, -19, -201, -81, 298, 340, 114, -93, -404, -10, 106, 270, 41, -171, -454, -87, 43, 69, 0, -188, -188, -33, 154, 263, 36, -252, -247, 55, 234, 324, 73, -469, -36, 208, 262, 350, -117, -203, -89, 250, 252, 100, -62, -275, -114, 84, 215, 5, -194, -146, -82, 124, 390, 32, -241, -416, -111, 217, 208, 6, -161, -243, -146, 66, 220, -54, -393, -169, -32, 301, 329, 59, -165, -189, -45, 334, 232, -137, -228, -147, 150, 146, 59, -195, -515, -127, 93, 234, -25, -254, -408, -131, 145, 144, -27, -123, -289, 83, 301, 328, 81, -128, -166, -42, 241, 335, -72, -199, -68, 135, 267, 226, -94, -67, -251, 200, 238, 248, -138, -271, -107, -89, 199, 23, -208, -352, -85, 294, 211, -39, -171, -310, -187, 251, 388, 163, -332, -33, -169, 248, 346, 208, 25, -226, 65, 267, 230, 121, -187, -187, 114, 197, 68, -20, -159, -68, 240, 265, 161, -113, -226, -182, 142, 70, 0, -150, -391, -274, 163, 264, 58, -185]
6148a85rJ82J80Q2j2m69O0J92K23P4k89q7o0R4K15J63k61k03j59K75K35j0l80
6171a49n5q8L08J67j51r8k44K2M29J13M5l00k00J78J75J84j71k72j80K23L63j0
6193B89q2k39j24J99K20O1j45l71q2K03K65R6l02l20K42J39M41k74q8m48J98K30
6215A08J63M1k99l10K47K31P6k9l10j12J18K55J84k53m6k57J77J69J69l06j4k57
6237b55K86J88J92m01j92k41L10K85O2k15k68L6J44K81L7k65l68K64N6L09Kl01
6259e4j08L6K49O9M7k98J6j33K37L14j71l85j6K90J11P5j88l69R2m9N34j21k34
6282e6j46k5K07K79j91j28m8o9L1L53j35k2l21M1L57K7K0j00k73M7J71L68k15
6305A72r2k03J02J66K33l09k02j49J13K41K34Km08j74J32K63P0j65j62j27J58
$$ y = [-185, -194, -12, 168, 250, 238, -231, -171, 21, 244, 318, 29, -58, -118, -24, 191, 354, 93, -110, -269, 6, 241, 231, -149, -204, -292, 16, 183, 32, -66, -310, -288, 141, 254, 299, -1, -201, -23, 152, 336, 165, -107, -287, -64, 299, 289, 207, -32, -156, 43, 263, 324, 179, -192, -274, -71, 194, 290, -12, -332, -90, 49, 490, 216, 128, -320, -122, 108, 271, 312, 13, -297, -50, 181, 257, 228, -82, -194, -76, 179, 363, 110, 64, -193, -16, 153, 322, 16, 2, -255, 31, 219, 411, 10, -182, -423, -113, 172, 234, 19, -249, -213, -69, 212, 249, -16, -384, -120, -64, 245, 247, -54, -162, -126, 123, 192, 239, -59, -43, -176, 61, 375, 204, -181, -197, 93, 204, 279, 91, -278, -186, -235, 299, 178, -56, -202, -227, -20, 259, 68, -60, -108, -177, -146, 207, 72, 50, -271, -230, 127, 154, 174, 74, -199, -152, 19, 387, 172, 80, -123, -21, 145, 378, 69, -133, -282, -169, 72, 306, 308, -100, -274, -142, 121, 191, 26, -136, -263, -105]
6326a05K12K00k43j97K6J9L50q1k14j59J42J56K04Q3n01j64Q3L36J13j19j75p6
6348a10P4K34%j20l11P8l8L77M3k87j72N1K5L07J02k80k30L5J02K93P3j36l07
6371a97J78k5K05O6l09n9J8Q2K45P4k48j10j05K65L36l24j51j61OL38J23k11l29
6394b93J38M1K56k0p2j83n4P7K76J9j18k36j57L67K36J48k92k38P8J96J10M3k76
6417D6j33j13K27L72j01l63j26J09J36K02J61m46l13K13K15J55j11l61L8l4L77
6438A50J59j41l62m8K04J85Q4m2k14k00K02L12J8k65m6k71J52M47j41k91p1j3
6460a92J14K08J44k94j95lL05lJ50k28l53Q3J22M11k0l33l5N2R6K02L5m61M7K5
6484a23L55K0k6k53j51K97PJ77j14l68P1J83J02k4k4k42j20K02K42Lk18j96J0
$$ y = [-105, 107, 307, 64, -133, -107, -88, 262, 181, -33, -192, -50, 106, 310, 393, -108, -272, -189, 147, 260, 141, -34, -110, -36, 198, 198, 78, -233, -155, -193, 184, 227, -60, -232, -181, -156, 151, 253, -27, -257, -222, -120, 173, 246, 110, -197, -19, -44, 161, 227, -82, -141, -123, -41, 204, 278, 30, -80, -185, 80, 416, 92, -59, -220, -214, 124, 247, 36, -293, -155, -114, 142, 122, 50, -133, -187, -110, 166, 185, 67, -169, -326, 41, 277, 425, 133, -105, -27, 169, 279, 322, 46, -87, -200, 27, 399, 298, -65, -191, -82, 54, 256, 417, -29, -342, -129, 86, 241, 130, -231, -193, -227, 150, 309, 168, -194, -242, -38, 147, 231, 189, -25, -225, -23, 289, 307, 42, -4, -275, -123, 324, 183, -108, -179, -192, -78, 130, 274, -20, -215, -218, 87, 84, 234, 6, -347, -264, -142, 269, 249, -84, -119, -67, 29, 231, 266, -195, -148, -123, 232, 252, 226, -27, -178, 119, 126, 303, 189, -179, -108, 75, 177, 153, 129, -113, -233, -31, 211, 214, -4, -200, -190]
6507a90K97P9o8j93j10nJ84J67J11l23j43P0K62M6j0k02k18N3L46N7j17j23k08
6530b38L39N6J53l72j67R8N1K30J16l32Qk89K12L08kk65j48M1L23N8j21k7j38
6553a06M2J77J20j66o3k78J06L13J17j61k00j17K67K15J10k72k51j21K09L0J76
6574A47J2k73j18K07J51P5j71k51j82L60N1M1j1k65O9P6J64J87k79j23q4L27L27
6597D37m08k4k65O0K24K74j16l19r1J36J51J40l21Pl5K39M2P5j12k21mK01J06
6620A76p4k28r0J13J17K92j40j83j3j56J98K29j45k5k54R4Q1J80j24J57m61Q4
6642a72K75J28p0j45l25J83J79J05o1j01k35K67J17l9Rm35J50J11K56N9l08j88
6664b40J43J46J06J8o0k25p3K39J76M2k12k31J62P2J93j01k15l05J42L01K9p3
$$ y = [-190, 107, 186, 118, -75, -185, -190, -6, 161, 272, -51, -194, -124, 138, 184, 174, -28, -246, -193, 153, 210, 93, -30, -238, 101, 157, 310, -62, -229, -131, -80, 150, 266, -66, -58, -347, -135, 173, 171, -94, -242, -201, 122, 180, 59, 32, -106, -64, 113, 233, 67, 4, -274, -168, 145, 262, 101, -99, -216, 51, 266, 376, 104, -147, -268, -59, -29, 147, 159, -114, -232, -25, 126, 201, 30, -221, -403, -43, 8, 49, 38, -227, -158, -82, 82, 269, -10, -133, -217, 110, 437, 29, 5, -260, -200, 24, 298, 182, -137, -228, -92, 59, 199, -122, -115, -150, 89, 131, 206, 94, -127, -131, 70, 176, 102, -126, -216, -103, 14, 306, 166, -17, -30, -186, 12, 241, 96, 71, -183, -89, -8, 172, 48, 205, -256, -172, 103, 231, 161, 16, -309, -126, 53, 158, 97, -4, -239, 28, 145, 106, 115, -320, -170, -59, 197, 256, -52, -240, -97, 49, 155, 173, 113, -112, -185, 54, 230, 272, 60, -171, -9, 63, 256, 155, -60, -365, -223, 78, 107, 34]
6686C4j20k31K33J39J91q3k72k13K16K13L8J6k42l9J22K16jo8l17P9K36J12Jj44
6710A16j91M6j7L16L8k31j96j4K43L3j5o6l39J5J98L53q4j96p1k44L95P9M2l01
6734i1m9J14R8L02m38or6J56J98R0j53j73j95J23K38r3m4k41K11L8J51L9k33j46
6758b00K8J69J01j42j3j94K04K0N5K0j00k03K70p0K02Lk65j8o9M64j5j64j87j31
6782b35J65K12j7j22o5k22K64N9J00j83Mn2J48K06j85q9k67q3M67J45k93nj17
6805a65k4L05rJ2j21j12K5K83mO7k48k30J41K19J3J32l33q0J59J18Q7k41j48j6
6829a70J51K15r0j27r7j66R8M62j47l4n00K26J58J99K5k01j83N4J11K60j79o4
6851Ak16K01O9J42j37j69l3J01K04J36l16r9j63K47K66r8r3j46j37J78M7J46k15
$$ y = [34, -86, -317, -84, 55, 246, 163, -109, -322, -106, 107, 145, 161, -81, -120, 2, 218, 217, 149, -168, -89, 147, 259, 260, 116, -75, -29, -46, 270, 308, 77, -119, -133, 110, 143, 128, 62, -277, -262, -64, 289, 205, 9, -62, -306, 89, 168, 210, -91, -140, -26, 72, 374, -64, -70, -166, -10, 188, 278, 125, -48, -243, -120, 118, 25, -19, -260, -49, -11, 140, 179, -54, -200, -172, -3, 98, -44, -57, -251, -47, -27, 28, 48, -52, -255, 15, -55, 147, 150, -115, -133, -202, 262, 247, 83, -104, -235, -70, 142, 125, 3, -62, -284, -20, 39, 139, -44, -40, -92, 56, 262, 77, -12, -279, -362, 105, 250, -43, -48, -165, -189, 116, 107, 119, -2, -114, -89, 194, 190, 257, 9, -221, -80, 139, 152, 284, -49, -129, 30, 148, 235, -6, -154, -170, -19, 196, 106, -21, -118, -284, -186, 276, 129, 95, -405, -179, -21, 178, 203, 2, -181, -127, -16, 244, 65, 1, -215, -14, 55, 197, 60, -109, -142, -41, 163, 299, -17, -116, -279, -32, 234, 136, 43, -103, -240, -62, -15, 131, -84]
6874h4nk40J70K54Kk20J6j68J92K58J4l41k3J68K5J58j4j63j63q4L09J55K4j78
6898F2k13J49J20m6J8j60k21K08L32m7j16j20j60J41K40N8j60k95M9J70J15l0
6920I4j17k50R3J94K85q6j62j35o5K80J50j13j06k55J87J04J74j28j41o1j39K01
6942DL85k58j47j87J21K30K1j03j64r1L33o8K17j43k76N1M7J33Rk14m9j7J05K04
6966A43m4J5k06L1L9K19m0k17k91J07L26K07q6j87n8j18K06J65k14m1j60LL73
6989A72L3j37r3r5k1M18k6k53q8o4O9M12j46r4l14J44N8K81j22j25j51m6K90K9
7013A31Lj13j86J0L06J0p3j68oJ75P7L9j79k21J5R4J56L11l54m3m9K3J53J5o4
7038F2j13p8K37o0K49j75l02O9Q0J31J8m7k69J21J95O0J13m05o6L6J08J16J11
$$ y = [-84, -89, -329, -159, 95, 97, -123, -107, -275, -83, 175, 189, -152, -175, -7, 18, 176, 162, -1, -164, -248, 61, 216, 240, 62, -151, -2, 118, 72, 90, -70, -291, -83, 249, 202, 86, -34, -194, -53, 187, 245, 85, -210, -161, 9, 124, 94, -23, -273, -180, 14, 299, 213, 51, -84, -149, 131, 281, 168, 62, -193, -6, 98, 272, 144, 3, -58, -197, 4, 389, 131, -16, -203, -82, 148, 169, 66, -98, -189, 144, 76, 293, 150, -126, -75, -28, 105, 114, -100, -149, -166, -61, 143, 99, 114, -92, -61, -22, 197, 157, -60, -351, -244, 82, 289, 203, 16, -42, -160, 46, 211, -3, -44, -204, -201, 172, 205, 68, -25, -120, -141, 277, 251, -2, -90, -154, -85, 327, 181, 87, -227, -83, -25, 256, 134, 9, -142, -188, 102, 131, 134, 21, -165, -155, 151, 161, 88, -80, -86, 89, 166, 205, 26, -195, -180, -86, 70, 381, 27, -16, -65, -42, 111, 126, 62, -51, -129, 108, 48, 297, 122, -180, -111, -31, 100, 118, 71, -198, -77, 118, 178, 291, -114, -180, -144, -36, 80, 191]
7061A91k44q2j11L44K5J6j45o2j57M04P9j72j76r4K28J01k7k40R7j64J32K93M9
7084B85l25j89M3J89J49K8j13k98J44Q1N6Kj53m3L6J52J81j51q3k26L5K09J63
7107A72o5Q2j69p5K19J4q5k00j32J96K33m0j10j55Q0j14L33N6j84k03k48N23j13
7130A5O1m9j87j78K70K58m6k77j11J41J60K27r0r9k55J70P9J66j71o6k3k48M56
7153B03o2l2j84k25J88J50J96k11j38q7J36J51O8o7m23J88J35K12k49N2k49R0
7175a58M8L00k4j48j44N0J34J65o0j84j19J4K48J12k0l23NM3O8K07q2j62k11J62
7199g9L1J83j57j29%J18K40j53p4j13N3M1K15r0k09L6m3J63Q5J29k15Lm3K97K
7224B91j06l01o1J7K26Q8n9j86n0J05L4J21L4m45R7Q2K98m2l8k63J5MK59O3Ql16
$$ y = [191, -53, -135, -246, 98, 123, 139, -6, -68, -225, 179, 258, 86, -90, -184, 44, 145, 118, -122, -25, -189, -57, 236, 285, -40, -229, -186, 3, 152, 180, 67, -231, -87, -6, 50, 52, -101, -144, -108, 44, 225, 74, -9, -235, -200, 9, 172, 107, 189, 20, -55, 164, 178, 93, -107, -239, -43, 190, 150, 40, -115, -35, -149, 184, 240, 56, -147, -395, 128, 15, 76, 27, -160, -338, -68, 190, 144, -133, -244, -103, 57, 284, 194, 95, -160, 10, 89, 255, 84, 18, -5, -253, 203, 141, 109, -75, -300, -112, 38, 234, 23, -115, -202, -66, 85, 153, 86, -337, -149, -14, 198, -51, 1, -248, -158, -110, 190, 166, 18, -126, -76, 58, 223, 163, -21, -140, -126, 122, 234, 214, -109, -104, -61, 7, 214, 132, -30, -241, -79, -48, 135, -22, -151, -151, -33, 207, 54, -20, -133, -80, -39, 176, 86, -123, -87, -130, 33, 118, 247, 32, 35, -8, 289, 291, 185, -116, -177, -160, 66, 154, 95, -91, -141, -36, -2, 119, 153, -292, -195, -113, 185, 143, 105, -158, -143, -139, 120, 183, 191, -125]
7250a25q9K60K95j67q9j78O2KJ74p6l1j08j5O0J86k0j67k67Q0J99K14k02p0j34
7274b06j3L15L6Qk86k5J29n0K48j78O6k32J27K83j02j83J4n5M4K17J49k17k52
7297a63lJ91J48r6k9j39p2J54K75j84k36lJ6K43J32o3k40O1r6K80k1j2k78r3J29
7322i9J17K90j55j44p1p6K06K21k37k10J7k0K48L04m62%J3K95n7Mj61k63K12J93
7346A65J7m8k14jJ8O7K46r8j28j39K8J34J01k17J57k58P2J12K39j39k02K3k9N9
7370c5J75k6k39kR8K84j26rl04J29M5m3J62l3j45j12J69R5J97m33J3L2K10M1j06
7395C7k55J91k96L98J32m3k02r8R6K87j15J2l27j14K42J61K2j01k64J0J52L34
7417B59k6k37o9P1J03J70j59r7q3j67L43KM9j89j46J54J59P8J9k40j27J1K42P5
$$ y = [-125, -214, 46, 341, 174, 85, -93, -31, -29, 145, 69, 38, -70, -85, -25, 161, 141, -26, -293, -213, -14, 200, -2, -72, -206, -219, 96, 132, 140, -146, -171, -42, -92, 156, -22, 44, -188, -61, 222, 120, -63, -49, -104, -60, 157, 306, 89, -163, -166, 25, 173, 77, 48, -91, -163, -9, 266, 82, -154, -157, -141, 102, 234, 171, -69, -8, -104, 176, 155, 143, -135, -228, -99, 18, 308, 153, 9, -62, -138, 68, 289, 52, -158, -141, -161, 87, 391, -71, -71, -58, 237, 180, 184, 23, -240, -28, 165, 182, 134, -80, -81, -63, 4, 250, 152, 24, -115, -87, 47, 148, -69, 88, -170, -98, 14, 253, 114, -88, -65, -94, -35, 140, 114, -125, -127, -29, 255, 129, 120, -184, -55, -10, -53, 109, 76, -69, -181, -12, 83, 280, -153, -140, -108, 102, 143, 37, -218, -27, -323, 75, 207, 164, -38, -136, -40, 247, 132, 144, -183, -297, -55, 106, 128, 27, -237, -227, -75, 259, 233, -4, -73, -2, 101, 271, 112, 15, -68, -235, 108, 110, 159, -30, -176, -22, 137, 215, 234, -6, -133, -122, 120, 195]
7441A95j22q1j21R4J59M9k03Pq2M6J12j12O8j51j20L04L5J28K2k91r0J00J30J07
7465A83k78n8n9K29J63L6k30l6j52K91J9P2k73j14J04K59N9K0k90n3J6K31r0K0
7489F9k84J39M5Q3J38j89k35M7J80O6L3l3j77j04J20L59m8r7k58L5R5R7K7k61
7513a53R4j57J85K53m0j77j67R3J4K89j34j52p9jJ02J51j36j58M3J6J41K6L5j49
7537f1M3KK89o4o8r1j74R3J72R3k90Oj2P0P9Nj20k0q7J37J56r3l4j80J18J18L0
7564A17K4l2k76J30P4K12k62j19m4J11J57j31M2j54%J67o3J44K5j96r8J52K20
7587B00L1j54j66J06q2J30J04r9j86K7K09Po4p5k43PK76J80j74lk10R9J71J9j23
7612a3k40J44J13N2kp0j79J8K29M4J09r6p9j07J98J5j3r9j32MK28m7P0j68j98
$$ y = [195, 73, -8, -129, -35, 124, 173, -30, -23, -105, -59, 53, -59, 9, -142, -262, 42, 77, 205, 227, -64, -154, -54, 76, 183, -95, -153, -212, 17, 180, 216, -14, -50, -202, 89, 108, 180, -93, -207, -103, 156, 215, 235, -55, -108, -92, 139, 49, 69, -215, -76, -31, 52, 190, 1, -234, -187, -7, 59, 92, 59, -118, -222, -102, 257, 209, 112, -146, -111, -16, 81, 108, -153, -59, -216, -31, 222, 182, 5, -162, -69, -55, 234, 100, -52, -131, -132, -30, 121, -15, -173, -130, -114, 27, 53, 88, -61, -18, -16, 273, 209, 141, 50, -124, -31, 141, 234, -56, -50, -62, 8, 87, 92, -28, -48, -135, 2, 158, 65, 31, -149, -31, 87, 117, 141, 109, -167, -37, 37, 249, -13, -132, -176, -65, 92, -39, 3, -151, -151, 16, -47, 97, 122, -74, -172, -20, 200, 231, 77, -89, 17, -65, 65, 169, 70, -116, -89, 120, 127, 63, -12, -255, -248, 28, 208, 34, 31, -179, -80, 91, 110, -13, -253, -109, 4, 56, 54, -16, -195, -177, 52, 96, 205, 109, 30, -77, 121, 136, 123, 24, -108, -104, 124, 77, 147, -21, -219]
7637b19O9Q2K05J04k85rNP4J29n2k28P7p9J61J71j40l9j22O2J19P1j44q1j4K4
7662e9J14J69q4k65q2K31J32pj86j98J54k6J01J98r7j81MR9K09j9m13J23j34J90
7686b7J73j37Oj93k4K32K96j40k26k3n0J39J21K0k29o6Q1Q2j8N6j52l3J23J88
7710A99J14k97j32nJ02J35j77J06k55K5K05N0J14k18r9J02J43k4R4m1j68L4K3
7733C0J58j37j72m8J86Q8J53J2k88r4J84J36Q0k84o6l0l8J66J18qj86l8J97L3
7757A52M8j34j01j41J45K15j77J1k05J34J50N1Qj85j65M3J54J11M6j14j78K6J47
7780D1R2J21m24O7P5J68J66k48j49j21K10Q5Q0j24j38Q2MJ0P5k00R3j07J60J17
7804A35K8k02Kq4J40J59o4k64Q6q8K59K30j72j70q7k6L71k55J17j48k33K55Q9
$$ y = [-219, -150, -68, 137, 241, -44, -53, -48, 26, 155, 103, -125, -48, -127, 34, 205, 65, 26, -96, -34, 85, 156, 12, -69, -83, -59, 55, 224, 140, -125, -207, 24, 156, 149, -37, -235, -81, -107, -6, 192, 95, -86, -82, 17, 226, 207, -206, -83, -217, -27, 146, 9, 15, -178, -202, 30, 326, 186, -40, -63, -113, 26, 147, 167, -62, -128, -47, 35, 17, 73, -79, -112, 11, 199, 313, 16, -116, -121, -19, 116, -61, 45, -210, -185, 20, 70, 184, -34, -133, -31, 112, 88, 182, 141, -27, 7, 30, 188, 51, -121, -169, 17, 105, 258, 270, -18, -112, 72, 208, 288, 4, -62, -92, -130, 36, 154, 146, -40, -78, 119, 152, 200, 66, -35, -176, -31, 184, 7, 18, -187, -53, 97, 148, 156, -29, -194, -151, 3, 114, 160, 46, -132, -106, 41, 133, 254, -170, -103, -28, 140, 306, 58, -91, -212, -2, 83, 163, 39, -99, -17, -13, -3, 72, -128, -35, -142, 18, 135, 163, -39, -37, -121, 19, 178, 114, -150, -64, -152, 107, 337, 165, -5, -92, -118, 253, -2, 115, -33, -266, -11, 78]
7827G8Q8o0j93k1K02P5K4j01J8k75N8J24J85j58k37K14M3O3P8j2k09k57L15J14
7851A56L8j07j81L6J01j9J39j98j09N2J43Np1kj61K01Q1N8n2l31J24J17M8Q5m9
7876A04j85J03M2J03M3j95j87J59J33J8r1P2j92m6K54k1j0l9j47K1Q7L2J1j61
7900i2j50M2K90l7M3r6j56J25M1J83j47r6l4n2J95J05j22q0j40J86J74Q8j79p1
7924B0k37L71K6j84p5K8R9o4J42M2k78n1r2K70J10p7j37K6L4J01J45k33M9j15
7948h0P5O8J42j08k36p5K21J81m8j8k46m6J17J76mj20j31O0J16j2J77r1k49J14
7972a7j3J75p1P3l64K57j42K27n6l3j56K2J70J82k54n8q1N9J9O8M0k2j21q9K64
7997G9Q6j63M0j94J17L0L1q4J00j99J05R1J61j04j79o3J9L97m9k55j05n5J61J19
$$ y = [78, 166, 106, -87, -108, 94, 169, 193, 92, 110, -165, -107, 17, 202, 44, -193, 21, 64, 127, 205, 193, -16, -273, 42, 156, 194, 87, -94, -58, 43, 24, 163, -35, -144, -92, 51, 56, -15, -17, -178, 23, 104, 162, 110, -221, -97, 20, 68, 153, 104, -81, 22, 64, 167, 210, 15, -172, -13, 120, 138, 47, 119, -73, -119, 135, 114, 104, 65, -82, -61, 26, 58, 69, -92, -242, -200, 90, 53, 96, 0, -156, -31, 10, 193, 46, -50, -84, -136, 59, 164, 42, -38, -178, 8, 182, 270, 91, 20, -217, 154, 180, -4, -79, -51, 48, -16, 126, 168, -110, -161, -253, 17, 127, 50, -87, -61, -27, 74, 219, -14, 35, -80, -5, 63, 205, 97, -139, -214, 7, 188, 140, 122, -124, -170, -53, 123, 119, -1, -132, -72, 44, 32, 209, 118, -131, -17, -30, 145, 74, 147, -217, 40, -102, 125, 69, 36, -120, -98, 72, 254, 0, -58, -139, -80, -61, 7, 47, 25, -96, -185, 79, 165, 2, 42, -152, -35, -5, 26, -58, 42, -157, -52, 39, 200, 96, -83, -146, -127, 270, 221, -34, -139, -194, -33, 86]
8021H6R5k19rjQ5O5j38j49J53n3J67O8J4l9k19lJ79J63k08j36J16L2o6J42J2k34
8047i7j1l4K69K7j20p6l5K00l4o0j24J91n3j11J84p3p3m0L4M5k5m9K4k9J7O5N9
8074G1j00Rk22J17J12K24j48j96L1L6n5K52o0k00mJ79M8k6o6J9k60K61J08L0j90
8099c0o9j33K63L5M7j49o0P9P3j1J40l24o3J47J41pM5j84k6J2Q8J46j11p1K0k18
8125b20K30K21k26j52R5L7L15k33k5j10j8J46J85l4j82q9n2R6J85Kj64j53P8O1
8149gJ35pj65r1M5J16J36k39R3j85J10K1R2p2O0q3n5J46Q2On9k21J48J83j9j90
8175b0j72J44J23O2R6j93q2j3J25l8J53k76m5K0J21J13
$$ y = [86, 181, -38, -47, -48, 37, 102, -36, -185, -32, -85, 82, 150, 164, 125, -94, -97, 82, 245, 37, -99, 17, 49, -17, 125, 137, -97, -108, -142, 127, 154, 34, -42, -77, 123, 89, 29, -95, 96, 43, -68, 116, 43, -30, -70, -36, 9, -16, -65, -41, -70, -53, 12, 71, -29, -20, -242, -125, -13, 211, 63, -133, -102, -66, -121, 131, 71, -129, -133, 46, 94, 68, 2, 21, -239, 22, 130, 160, -30, -99, -232, 31, 66, 113, -36, -96, -17, 56, 45, 185, -139, -202, -55, 86, 79, 124, -60, -86, -74, 14, 160, 49, -22, -2, -220, 10, 231, 5, -147, -52, -15, 300, 67, 42, -68, -86, 60, 245, 211, 29, -60, -112, -16, 169, 171, 7, -146, -68, -7, 128, 121, -44, -135, -90, 26, 162, -77, 16, -169, -59, -38, 54, -18, 42, -41, -96, 50, 132, 138, 79, -142, 6, 189, 170, -20, -192, -48, 75, 137, 233, 40, -42, -55, 70, 32, 185, -91, -136, -116, 5, 118]
8191A18
$$ Imaginary data points
##PAGE= N=2
##DATA TABLE= (X++(I..I)), XYDATA
0@%%%%%%%%%%%%%%%%%%%%%%%%%%%%%%%%%%%mJ0k5N7r3J23j46J63j76J89j98K08
47A08k24K44k75L11l43L73m04M51n04N57o25P00p89Q96j035J216j459J791k292
66a303L202n226J3648O8202k8279r628r636q52m110n265j1981j0264p517k87M46
81h850j422o062n522k357K878M087K242j157j80L080P505O759K418k342k326Q67
97c82M439L690L77k793j385K269N441L520j208m527l980m85J513l35m478o977
113e301m679j81K250N88k560l894m54M626O887M551R37n59K036M989M802N82m560
130A0060n882l282L29P08k273n434m720o55L677L880K29k854j848K551N988N265
146E739J132j557k80K968N152K424k627n481m342o68J359p11m447n635k949J470
$$ y = [0, 0, 0, 0, 0, 0, 0, 0, 0, 0, 0, 0, 0, 0, 0, 0, 0, 0, 0, 0, 0, 0, 0, 0, 0, 0, 0, 0, 0, 0, 0, 0, 0, 0, 0, 0, -4, 6, -19, 38, -55, 68, -78, 85, -91, 98, -100, 108, -116, 128, -147, 164, -179, 194, -210, 241, -263, 294, -331, 369, -420, 476, -559, 657, -802, 989, -1303, 1899, -3327, 10321, 78523, 50244, 40616, 30980, 30128, 26018, 20753, 8772, -1492, -9009, -9296, -8850, -10272, -16334, -21856, -24213, -21335, -17248, -15006, -16163, -16343, -13263, -5758, 1001, 3419, 1077, -1249, -382, 4057, 7747, 8124, 5331, 3946, 6215, 11656, 15176, 13968, 9441, 5461, 4976, 6489, 6154, 1676, -5301, -9980, -10161, -7911, -7323, -9883, -13777, -14231, -9605, -2718, 1833, 2770, 2211, 4247, 9236, 14038, 14620, 10060, 4178, 896, 1225, 1933, -340, -5774, -10494, -11149, -7472, -3592, -3363, -6217, -8065, -5514, 474, 5739, 6871, 5314, 5034, 8002, 13154, 15578, 12951, 7470, 3128, 2460, 3819, 3108, -1339, -6974, -9923, -8453]
162h453K962M32l285m454j841K502L475J079k233k279J524N344O179K978m39l07
178C184K961N892N291J457k377k227L76K207O35l673o845o163k459K01r11m340
194f791o089m064L95K786J565j494k876O5M297O359M618Q93p08J712M949N273
210A0890J887k303l540r98K349K741l84m208m308j288J909J552k010n129m574
225g414o15K755K245p79l223k047J939M221L117n01k813j333K271M452K470j211
241C534l179j330J956L475J258k780l768j502J939L042M54l073l506n28K830L400
257B222P93k363k251Q00L594L586L70l043l169j96K359J634j859m492l666k21
273e902K171J282j736m323k570J371L725K326p97k274k55L490N194L514k19j543
$$ y = [-8453, -5491, -5059, -8344, -12798, -14639, -12137, -8662, -7583, -9816, -12095, -10571, -5227, 952, 3930, 3491, 3184, 6145, 12037, 17328, 18785, 16408, 14181, 14557, 16764, 17399, 13726, 6881, 718, -1741, -1540, -2451, -6791, -12880, -16944, -16549, -13763, -12198, -13692, -16568, -16503, -12206, -5847, -1229, -336, -1044, 668, 5617, 10890, 12777, 10474, 6934, 5936, 8285, 11026, 10642, 6434, 2126, 838, 2747, 4299, 2289, -2840, -7414, -8029, -5274, -3029, -3808, -7031, -9078, -7139, -2918, 199, -302, -3115, -4448, -2177, 2275, 4745, 3534, 355, -975, 981, 4456, 5714, 2934, -834, -2336, -397, 2645, 3099, 26, -3480, -4008, -1178, 2222, 3015, 652, -1599, -799, 2795, 6381, 6751, 3708, 539, 343, 2702, 4336, 2477, -2015, -5681, -5902, -3731, -2449, -4185, -8508, -11078, -9707, -5982, -3656, -4453, -6727, -6982, -3492, 1702, 5216, 4997, 3454]
289C454k6L757M335J524k388l458j381J661K080r88m377m756k025J199J196j540
305a733m588m242o57K335K242k61l022j771J676M659L876O24j642l27K931N032
321E132L506j64k518j017J841L338Q75k779m176k444P91J823m05l600m574k025
337f396J513K269L1k652k938j5L256L784O81j995k364R26L207L174K2k379j939
354a815J135L560K671o02l133k217R52L027J683j586l381j872J503L042J516j855
370B628l447j399J858K933Q12k056l215j115K268K710J35l011l437r09K141K318
386g86m7k816k909K11L066K820K35k254j825J449M031L327K47j838j274J712L640
403F989K307j193l348k113Q98K264N41k646l943k668M96J933j3k817l849j495
$$ y = [3454, 3428, 7185, 11520, 13044, 10656, 7198, 5817, 7478, 9558, 8570, 4193, -563, -2588, -1389, -193, -1733, -6321, -10563, -11220, -8885, -6643, -6904, -9926, -11697, -10021, -5362, -1486, -862, -2504, -2831, 100, 5132, 8638, 8474, 5956, 4939, 6780, 10118, 10993, 8214, 4038, 1594, 2385, 4208, 3803, 203, -4371, -6396, -4883, -2614, -2583, -5235, -8173, -8188, -4932, -1148, -467, -2462, -4826, -3900, -693, 2481, 2503, 124, -1815, -680, 2880, 5551, 4949, 1816, -401, 551, 3578, 5261, 3675, 294, -1578, -75, 2967, 4483, 2628, -819, -2218, -360, 2573, 3385, 1329, -1886, -3001, -733, 1977, 2112, -899, -4336, -5245, -3104, -786, -833, -3649, -6558, -6347, -3281, -461, -226, -2480, -4305, -2856, 1175, 4502, 4749, 2911, 1637, 3349, 6989, 9296, 8103, 4755, 2642, 3540, 5804, 6345, 3699, -244, -2912, -2416, -483, -496, -3313, -7162, -8657]
419h657J709L010P89k270k289J82L039L879J037j355j454J037L855L602N19j733
435D900j961R50K856K109p33l335k982j2K073O58k191m064k778M68K135R60k077
452c024l079j241J609L101J450j241k463n05K983L330J381j472k329pK760L108
468D361O21k272k238p9K730K438k14k867k534mK208J965j047l023k312L52K491
485E76J510j253l103k089P93K591J412j248k944j506J692K704J364j432k792q90
501d615K268L165J321j652k082k01K680L226O33j673k237K1K589K365L40k733
517C415k508j31K015J518j164l466k972j16J958J372j547l209k127O23K837J500
533b002r51k457q03K094L358K216q06k107j15K324L413J569j343k290m30K375
$$ y = [-8657, -6948, -3938, -3149, -5419, -7708, -7526, -4487, -608, 429, -926, -2380, -1343, 2512, 6114, 6633, 4900, 2939, 3889, 6745, 8854, 8121, 4786, 1804, 1792, 3865, 4523, 2332, -1732, -4510, -4042, -1907, -947, -3024, -6103, -7344, -5735, -2634, -1184, -2425, -4888, -5393, -2410, 920, 2301, 829, -1500, -1507, 1253, 4361, 4982, 2710, 472, 393, 3123, 5561, 5347, 2480, -54, -58, 2150, 4115, 3068, 45, -2267, -1915, 576, 2086, 833, -2270, -4359, -3566, -975, 437, -811, -3755, -5261, -3569, -865, 499, -933, -3725, -4615, -2347, 818, 2139, 487, -1595, -1796, 884, 4110, 4743, 3070, 833, 854, 3443, 5808, 6148, 3415, 907, 776, 2791, 4309, 3145, -321, -3293, -3409, -1451, -79, -1626, -4835, -6962, -6339, -3502, -2002, -2953, -5410, -6213, -4119, -761, 1455, 649, -1458, -1573, 751, 4164, 5733, 4390, 2100, 1670, 4045]
549D045K468L37k445l084q41J784J455o00l216l152o35J890J418p72k837k422
565f607L38K675K043l21k277j273J506L189K283l71k139p62J770L197J862j315
581C798k191j072J621K711N86k078k849j058J655K122Q6k600k910q79J813J916
597F71l23k419k558R8K170K158m46k330j941P37K431K154l10k152j160J290K952
614A022J911n24k303j033J436K724J579j069k725r18J377K496P66k033k794j181
630a269J447K041J12k317k960r20J577J832o2k491k623q8K368K242O1k013j588
647d651J020K755K387J35j959j274J442L141K126m93k208j284J035K652R90j457
663D357l029j507Q71K046Q6k090l282j234J031J844L18k185k409p35K174K279
$$ y = [4045, 6513, 6850, 4405, 1321, 480, 2264, 3719, 3119, -97, -3249, -3884, -1994, -576, -1348, -4185, -6607, -6269, -3594, -1551, -1872, -4149, -5422, -3916, -727, 1556, 1185, -954, -1716, 54, 3251, 5113, 3798, 1607, 535, 2156, 4867, 5453, 3375, 526, -532, 1123, 3245, 3331, 731, -2179, -3058, -1245, 671, 348, -2071, -4629, -4531, -2361, -203, -649, -2979, -4920, -4183, -1752, 402, 92, -2060, -3220, -1930, 1022, 2933, 2409, 106, -927, 509, 3233, 4812, 3743, 1018, 100, 1477, 3973, 4739, 2706, -88, -1269, 178, 2219, 2331, 14, -2946, -3866, -2289, -457, -519, -3010, -5633, -5721, -3353, -1111, -1050, -3063, -4651, -3631, -876, 1511, 1646, -313, -1587, -145, 2996, 5122, 4629, 2421, 1137, 2172, 4824, 5814, 4357, 1328, -179, 692, 2738, 2824, 734, -2548, -3782, -2751, -907, -589, -2774, -5183, -5918, -3744, -1465]
679a465M94j707j798L04K741K460P48j721j392Q72K771K271k89j967j665R13K251
696C821J669j194k698j720M41J904Q93k011k602j851R81J928R24j803k385j241
712d944J498K475O68j533k187j83K125K778O49j629j859K27K575K517L38j833
728A682j786M53K384J991l60k398j910K60K118J527j070k781j730M91K024J012
744A907j628k702j663Q18K254O82j284k427q92J740K463R55j572j819m8K235K766
761A785R08j302j702J55K264K479J35j846j775O2J999J667m33k543k355J16J660
778A274J250j293k832k149N78J888J120j167k633j230J208K224J674j099j832
793c019o37K089K722J375j267j805k00K240K473P31j524k144j48J922J804j98
$$ y = [-1465, -971, -2678, -4476, -4172, -1431, 1029, 1777, 56, -1336, -464, 2307, 4578, 4289, 2322, 657, 1570, 3821, 5490, 4296, 1598, -122, 319, 2223, 3116, 1105, -1497, -3348, -2367, -439, 485, -1318, -3703, -4944, -3446, -971, -303, -1836, -4023, -4206, -2081, 697, 1346, -283, -2142, -1915, 660, 3177, 3515, 1682, -104, 349, 2733, 4724, 4364, 1966, 56, 316, 2434, 3961, 2891, 110, -1620, -1129, 895, 1907, 279, -2423, -4086, -3268, -1014, -332, -1616, -4043, -4935, -3195, -732, 223, -1349, -3168, -3216, -981, 1785, 2693, 1391, -311, -156, 2108, 4587, 4722, 2876, 1101, 1163, 3162, 4829, 4396, 1853, -502, -386, 1274, 2524, 1231, -1601, -3750, -3172, -1284, -164, -1331, -3964, -5194, -3986, -1762, -88, -1187, -3019, -3656, -1567, 1155, 2530, 1263, -542, -742, 1498, 3971, 4702, 3178, 1034, 886, 2808, 4612, 4414]
809D414k291k271m51J704J264p41k448k303J81J626J441p67k432j563P57K360
825a520J515o80j925r43J267K652J208p57j914n02J811K403J235j176k068m86
841A20J559K185K96j611k277n53J596J669j0k239k577j71J407J531n11k121k068
858c775J42J844J472m65k126j509Q44K538J648m35j823r17J507K608J645p35j867
875E96q47J451K461J084j356k068q64J486J763J99k050k406q48J464J496m64k088
892i91k399o29J677J588k94k195j512M53K323J822j04j670r96J169K655J614k56
909B255j787q32J266K321J066q85k157j014R18J999P60j701k240j178J074J659
925A524m1j997k294o66J392J740R3j719k039j14K000J940J15j681j334N76K252
$$ y = [4414, 2123, -148, -599, 1105, 2369, 1628, -820, -3123, -2942, -1316, 125, -642, -3074, -4637, -3880, -1520, -5, -685, -2610, -3553, -2286, 366, 1574, 817, -1097, -1599, 212, 2615, 3850, 2674, 606, 120, 1679, 3864, 4160, 2549, 272, -281, 1315, 2984, 2974, 735, -1842, -2013, -606, 925, 414, -1707, -3775, -3633, -1789, -317, -782, -2908, -4417, -3573, -1035, 613, 178, -1645, -2562, -1055, 1553, 3198, 2463, 596, -251, 1200, 3661, 4745, 3389, 1321, 457, 1943, 3706, 3905, 1855, -551, -1399, 65, 1561, 1097, -991, -3390, -4019, -2342, -754, -1048, -3243, -4755, -4302, -1979, -157, -261, -1931, -2927, -1758, 897, 2511, 2255, 468, -364, 902, 3223, 4289, 3404, 1247, 233, 1151, 3150, 3910, 2209, -31, -1209, -135, 1524, 1483, -514, -2808, -3474, -2082, -342, -249, -1968, -4007, -4121, -2121, -181, -66, -1747, -3081, -2505, -253]
942b53K216o5j780j140P62K371J586o84k115j361J224J977J114j036k430j178
958g92R19J808N77j771k180j032J024J730M68j937k343p33J584K043R4j725j593
975c859J65K030K135J21j397j234P54K379K077j37j597j187O49K105J256o06k383
992A271j283M55J797Q89j084k542j456O70J783M50j407k476r07J044J642P16j536
1009a974k023l04J744K048P53j226j196J68K183K434L74j433j516M03K057J595
1025D087k68k102j762K71J761J027j023k287j684K65J855R16j165k115j302R11
1041b615J969Q13j206j967p08J247K357P00j187j576l19J851K176N45j217j542
1057f79K64J870J906J43j601j678Q0J679J512m09k341j748J80J415J345r16k189
$$ y = [-253, 1963, 1898, 118, -1022, -260, 2111, 3697, 3013, 898, -463, 761, 2738, 3852, 2816, 386, -792, 127, 1935, 2512, 741, -1439, -2471, -1447, 283, 751, -1186, -3529, -4262, -2678, -635, -541, -2266, -3859, -3694, -1664, 471, 592, -805, -2039, -1285, 1094, 3171, 3034, 1437, 250, 899, 3004, 4260, 3654, 1271, -12, 443, 2240, 3129, 2045, -497, -1953, -1283, 500, 950, -457, -2933, -3840, -2796, -1154, -438, -1974, -3997, -4301, -2557, -509, 244, -982, -2178, -2010, 173, 2607, 2981, 1548, 32, 435, 2492, 4087, 3819, 1717, -45, 226, 1987, 3014, 1991, -296, -1980, -1715, 140, 1056, -109, -2224, -3526, -2615, -646, 167, -1039, -3006, -3714, -2467, -110, 590, -597, -2173, -2492, -641, 1535, 2080, 863, -679, -415, 1455, 3361, 3504, 1903, 225, 305, 1984, 3496, 3087, 746, -1002, -822, 593, 1938, 1022, -1167]
1074a167j591L93J810J014r91j986j056Q76K070P68q85j802o48J403K185P66q82
1091B77j542j00J781K461O49j277j676pJ762J706O8j936j755k52J245J231n97
1108B038k516j783o1J719J007o87k147j534O93J889J224n89k259o30J342K211
1124h3J395p56j693l41J521K049J056j058j657l23J545J821M31j425k062n28J213
1141A105J423k35k046j915l71J407J255o05j721j814K47J748J390k61j610j163
1157c166R43K068J432m06j810o36R88K133J128o52j946n98J125K072P26j240j764
1174C97p27J385J678L96j604k015n66J221J384k44j982j921k15J449J484k21j747
1191a848j515J88J887J549k26j526j100Q08K118J611m28j662p99Q59K195J238
$$ y = [-1167, -2758, -2365, -555, 459, -532, -2518, -3574, -2698, -628, 140, -745, -2547, -3195, -1792, 393, 1159, 277, -1265, -1365, 416, 2877, 3526, 2249, 573, 566, 2328, 4034, 4102, 2166, 411, 159, 1404, 2635, 2038, -478, -2261, -2322, -603, 404, -283, -2430, -3964, -3271, -1382, -158, -747, -3006, -3636, -2294, -83, 1312, 556, -1137, -1478, 43, 2092, 3148, 2090, 433, 110, 1655, 3476, 3907, 2482, 420, -108, 1105, 2528, 2293, 247, -1668, -2039, -632, 623, 18, -1703, -3517, -3270, -1522, -132, -393, -2003, -3166, -2223, -155, 1277, 871, -939, -1575, -587, 1546, 2674, 2022, 76, -522, 603, 2675, 3401, 2161, 397, -330, 1055, 2733, 3129, 1525, -490, -1056, 165, 1549, 1305, -677, -2598, -2813, -1364, 120, -101, -1848, -3363, -3175, -1288, 261, 35, -1491, -2591, -1783, 335, 1946, 1518, -144, -943, -84, 2111, 3349]
1207C349p61j574p62J114J739O65j358k034p68P76J469J86j497k111p35J032J479
1224B09j12j727j842j72J468J679J38j355j454O76J990J735K3j334j151J000K032
1241A803J601n32j583j085O45J795P87j029k008j160P44J477O20j655j864r52
1257b396J042J513M29j540k136k36J518J771L14j386j558j05J919J926J14j173
1273A6j405M83K036J589j75j511j236M90J735J279q45j790j254P03J455R21j073
1290A418k046j089P21J483O11j230k041o80Q53J719K41j060j617o47J658J790
1306H4M76j432j386K41J674J749M18j512p73J07J803J646nj606j537N14J533J187
1324C181p01j924j604N06J581O53j237j959j207O50J502O55j113j627o40J068
$$ y = [3349, 2588, 1014, 252, 1366, 3105, 3770, 2412, 378, -390, 386, 1855, 2041, 544, -1567, -2302, -1270, 209, 97, -1630, -3472, -3644, -2176, -497, -359, -1714, -3168, -2492, -502, 1233, 1256, -78, -1229, -229, 1803, 3404, 2872, 1289, 204, 849, 2644, 3431, 2402, 394, -766, -22, 1455, 2075, 420, -1444, -2396, -1354, 159, 588, -952, -3088, -3324, -1806, -35, 279, -1107, -2665, -2770, -851, 1075, 1189, 16, -1389, -906, 1130, 2719, 2544, 1033, -203, 287, 2022, 3301, 2456, 666, -588, 115, 1570, 2491, 1418, -628, -1717, -996, 487, 1098, -132, -2173, -2853, -2000, -281, -40, -1100, -2717, -3364, -1706, 84, 560, -872, -2258, -2017, -343, 1406, 1824, 312, -461, -354, 1449, 3095, 3090, 1484, -53, 461, 1994, 3181, 2480, 556, -1048, -542, 1039, 1692, 455, -1504, -2711, -2061, -559, 96, -1017, -2644, -3284, -2216]
1340b216J832M91j101j476j69J464K024O43j131j052N2J774J710K73j542j386
1356A90j6J455J394l95j643j690p6J283R37n63k013j417L13J655Q63o62j697j193
1374c275Q73K005R57r19j669n64J376K025O95p94j578j51J516J940L44j087j511
1391A83k17J282J689k83j492j588j29J333J138m41j874j337m3J470R35n66j894
1408a834j072K08K058Q70o87j497q66Q62J673R24n18j334n54J098J983J028r45
1425A397j646j85J289J760M38j213j565m54J365J442j29j544j879m04J279J040
1441I91l31j800j325q0J563J159n77j621j195O23J813J195l77j492o36Q87J950
1458G47J066n17j600l96J081J797P11j048j473l83J053J644j2j341j791n30P59
$$ y = [-2216, -384, 107, -994, -2470, -2639, -1175, 849, 1492, 361, -691, -639, 1135, 2845, 3118, 1576, 190, 174, 1629, 3023, 2628, 985, -705, -781, 502, 1439, 876, -1137, -2554, -2241, -586, 277, -385, -2082, -3275, -2402, -397, 560, -359, -2028, -2592, -1216, 809, 1504, 710, -868, -1019, 497, 2437, 2781, 1694, 183, -34, 1248, 2937, 2654, 1162, -426, -555, 778, 1916, 1475, -399, -1736, -1779, -309, 626, 60, -1834, -2906, -2698, -640, 230, -457, -1954, -2820, -1958, -285, 639, 121, -1213, -1767, -669, 1314, 2342, 1397, -249, -434, 855, 2615, 3053, 1840, 275, -179, 1186, 2628, 2499, 955, -924, -1328, -49, 991, 660, -1140, -2465, -2545, -982, 177, -400, -2021, -3216, -2593, -780, 415, 38, -1454, -2090, -1203, 747, 1813, 1296, -304, -700, 381, 2178, 2889, 1841, 368, -15, 1038, 2682, 2670, 1329, -462, -992, -233]
1475b33J257q1j374j851j64J390J203r7j607j229K77J739J158q9j357q54N77J908
1493E73J196l39j438r27Q96J927R57q10j566o50P54J617N57j092j640r06R96J199
1511A304K67j334j779o36J143J329J11j523j558p2J367J334J7j302j221L22J740
1528d91J660p6j356r80M66J921J184l25j435q95P88J576R41q47j568q95O98J443
1546A809M16j175j710q60R62J403J86j475j705m32R44J526J1j071j319LJ485J537
1564E35K55j151j154N04J377J568L0j414j034O24J496J318n10j672j157N10J588
1581A713P52q34j740j154O09J397L86j081j781r11R25J710L05r46j585k52J282
1598a205J667K21j030j263L0J625J566K51j194j170K15J554J455k28j571j061
$$ y = [-233, 1024, 943, -431, -2282, -2446, -1056, 147, 50, -1557, -2786, -2509, -770, 388, 299, -1058, -1912, -1335, 573, 1769, 1430, -8, -935, -39, 1888, 2845, 2035, 469, -181, 573, 2190, 2747, 1655, 15, -891, 105, 1304, 1571, 237, -1542, -2178, -1035, 294, 405, -1118, -2676, -2748, -1381, -47, -30, -1332, -2553, -2231, -491, 1169, 1093, -263, -1243, -777, 1144, 2328, 2003, 568, -327, 461, 2037, 2978, 2131, 563, -332, 366, 1809, 2225, 1050, -660, -1520, -558, 845, 1031, -444, -2149, -2581, -1637, -111, -100, -1171, -2490, -2487, -1002, 535, 790, -361, -1515, -1011, 366, 1934, 1964, 550, -484, 140, 1636, 2954, 2444, 772, -385, 125, 1713, 2465, 1631, -109, -1263, -654, 743, 1129, 48, -1733, -2644, -1719, -9, 296, -650, -2235, -2487, -1205, 462, 683, -347, -1610, -1580, 45, 1611, 1862, 668, -502, -287, 1267, 2722, 2494, 923, -138]
1614a38K27J475Q94m95j903j020K86J272O60p08j771r51O23J418P30j094j665
1631b160n78J012J409N71q55j253k34J347J512O27j026j169m3J596J477P2j200
1648A105j200J70J223J194l44j476j227J62J390R01o24j548j412K51J349P25q14
1665a75j461j104P47J461O63n50j383p09J115J604O63o09j264l01J385J595M31
1682B108r67j315k34J338J364K28j411j283j77J337R48k15j818j342J10J061J063
1699G95m56j626j119L81J292J035n89j506n65Q15J622P65o00j205m62Q77J734
1716A188P86q56j425j64R80J673K81j158j330j36Q56J399l35j197j656j50J012
1733b32J132l70j415j341p4J336J128l02j410j126N65J543J257n73j389p43P09
$$ y = [-138, 89, 1564, 2458, 1963, 60, -960, -674, 598, 1258, 550, -1221, -2172, -1549, -131, 599, -495, -2160, -2738, -1726, -317, 254, -601, -1854, -2088, -741, 771, 1398, 372, -797, -840, 756, 2233, 2305, 1105, -95, 75, 1298, 2492, 2148, 672, -555, -393, 997, 1898, 1274, -274, -1686, -1435, -86, 639, -175, -1636, -2740, -1993, -532, 131, -419, -1802, -2511, -1396, 208, 871, 262, -1002, -1303, 82, 1677, 2108, 1141, -174, -408, 930, 2294, 2522, 1111, -172, -349, 988, 1936, 1721, -97, -1439, -1329, -268, 795, 339, -1287, -2406, -2025, -733, 302, -287, -1793, -2358, -1543, 79, 844, 244, -961, -1423, -546, 1188, 1974, 1118, -307, -471, 509, 2182, 2463, 1305, -25, -161, 695, 2094, 1759, 562, -1094, -1244, -232, 900, 530, -885, -2226, -2300, -964, 164, -138, -1548, -2674, -2109, -566, 691, 118, -1271, -2014, -1305]
1750a305J659J065n13j251m39R18J643O60r06j421m19Q75J432K38j109j560m76
1767i09R82J213k12j327j512p4J093J127j13j462j124N8J363J158k38j182r25
1784b084K29K051J088m01j291o29P07J725P29n32j339n76O38J489N60r31j660
1801b27n69Q46J278K69j230j541n72J036J368j41j418j271k33J238J210J38j146
1818i65j219K65J482J295j4j206r35M56J621J297m59j375q35P34J393Q42o51j557
1836A69p96O65J461N87j172j502q60N89J351K62j158j524l77R89J278M44j141
1853g35j403k0J252J282K50j121r02J44J429J433n5j108j165N45J536J063l95
1870B030j463p53K66J333P36q01j445j013O24J144N44r66j513o91P14J226M18
$$ y = [-1305, 354, 1419, 906, -345, -784, 134, 1777, 2437, 1531, 110, -309, 566, 1998, 2236, 1127, -433, -909, 73, 1286, 1074, -253, -1765, -1839, -746, 381, 268, -1194, -2318, -2260, -897, 261, 23, -1159, -2084, -1855, 196, 1284, 883, -408, -1037, -330, 1395, 2124, 1592, 253, -323, 315, 1804, 2364, 1433, -227, -796, 50, 1328, 1597, 367, -1174, -1746, -710, 658, 517, -901, -2172, -2405, -1167, 43, 181, -965, -2184, -1919, -437, 858, 844, -362, -1297, -841, 780, 2077, 1618, 243, -592, 142, 1535, 2377, 1726, 169, -627, 38, 1499, 2086, 914, -588, -1448, -859, 492, 754, -404, -1928, -2305, -1316, -38, 406, -735, -2138, -2158, -906, 376, 626, -495, -1397, -1253, 176, 1609, 1554, 446, -719, -174, 1362, 2425, 2030, 567, -186, 80, 1413, 2149, 1348, -97, -1110, -486, 658, 1202, 236, -1277, -1968, -1254, -28, 390]
1887C90r65j337m47J078J399N02r71j313K02J042J492L41j118r74K55J365J339
1904B280l26j239j140L80J291R81m39j488r38K33J244P53o69j470j048L55J499
1921B59L98r36j485m50P98J263O16p29j309k11J076J462O96j004j154j21J182
1938C51J364J78j219r45l1J417Q56R3j373j080Q3J183P17m55j422j083L6J382
1956E2O27n54j562p88N80J430O48o80j333m14Q83J547M54n80j247j24Q28J435
1974A202N35q57j029l03J305J202K24j188j407K8Q70J357l81j446j024M7R09J033
1992A077n22j515q57J94J211R34m19j452p84O81J311Q69n75j231n60R16J613P95
2010A686q49j070l53J137J099N32r83j302l08J015J178J02j229j398NQ44Q37J2
$$ y = [390, -575, -1912, -2359, -1281, 118, 620, -351, -1664, -1462, -420, 1072, 1413, 295, -679, -424, 941, 2280, 1954, 715, -425, -45, 1246, 2227, 1788, 300, -638, -405, 839, 1592, 923, -547, -1595, -1240, 259, 657, -279, -1764, -2214, -1416, -153, 463, -266, -1575, -1786, -710, 752, 1448, 444, -710, -831, 351, 1715, 1893, 674, -271, -302, 1115, 1971, 2064, 691, -389, -306, 877, 1594, 1139, -283, -1366, -1330, 52, 679, 125, -1437, -2225, -1645, -215, 433, -247, -1580, -1994, -1111, 436, 890, 310, -937, -1061, -233, 1202, 1737, 880, -149, -452, 853, 2055, 2279, 1091, -316, -288, 582, 1939, 1558, 112, -912, -865, 44, 1077, 555, -960, -1817, -1623, -412, 522, 103, -1349, -2133, -1452, -141, 728, 153, -1078, -1638, -722, 891, 1686, 837, -233, -586, 551, 1650, 2182, 1199, -103, -411, 604, 1782, 1884, 655, -743, -738, 106, 943, 955]
2028I55j393j203o5J093J013k40j242r76L75J302P39j75j199o66N31J499Q86l90
2046H44j202l46O62J361O51o12j332l91P42J307L94j079j527m09Q87J317r2j178
2064cj325l6P89R58k3j289j087N1J202J211k70j075q69L94J387R62k19j132p69
2083a143O59J490Q95m17j468m23N48J248O04o84j164o59O23J041L82r94j455l86
2101a303N92J151Qr27j177m17J244J227m6j276j008mJ534J172l47j050p39L31
2119a035J452R38n9j229o58M86J336P95l86j444q96P02J192N76r97j290o63O08
2137e72J150K21q55j343n04Q24J149J97r64j261R3J062J131K29j159r85Q1J438
2155f8J270k9r61r25L97J044J089k5j370r31L07J239O48m40j353q58M72R97M88
$$ y = [955, -438, -1641, -1706, -613, 400, 160, -1082, -2058, -1683, -381, 358, 183, -1016, -1682, -1151, 348, 1234, 844, -358, -704, -42, 1319, 1970, 1358, 26, -365, 377, 1684, 2078, 999, -528, -937, -50, 1267, 1175, -3, -1328, -1364, -575, 383, 360, -929, -2016, -1965, -763, 448, 178, -897, -1766, -1372, 15, 977, 758, -374, -1143, -484, 1006, 1901, 1484, 16, -407, 141, 1389, 1993, 1309, 145, -514, 109, 1150, 1532, 538, -917, -1303, -711, 440, 448, -479, -1656, -2073, -829, 398, 352, -924, -1932, -1936, -402, 770, 423, -627, -1366, -1035, 417, 1355, 1296, 67, -591, -105, 1231, 2026, 1640, 196, -700, 2, 1194, 1770, 773, -517, -1180, -572, 578, 799, -56, -1399, -1903, -1079, 70, 267, -697, -1958, -1865, -803, 328, 557, -602, -1587, -1506, -68, 1202, 1173, 212, -713, -316, 728, 1817, 1792, 422, -509, -202, 1037, 1685, 1245, -108, -966, -494, 503, 991]
2174I91p42j382p18N74J399M69j121j169l90J091J228K18q23r09j15R85J463J33
2192A182q87q50j17J161J189Q7j146j042J89J269Q15m38j036j141L87R41R75q49
2210F89j286q10M50J220N13q17j335n95O01J391L83o44j087m44Q94J405K78q55
2228d9p99j3J059J195R9q63r33j2J206R79p1j288j022R8R36R90m07j033j243K16
2248i55J051O59n30j194q54M84J053O94n16j144n38N84J318N22n38j065l22J020
2266b71J439L50q09r73k07J032J150J43j061j072j42R88Q93j1j387j012J22Q73
2284D5R00l67j226r83L64Q53Q81l63j287p31N88J231Q54m51j053n25O87J488N36
2303A441o14j151l35R48J228L86o69j281k93P48J025J13j013r68k78R02R58o5
$$ y = [991, 249, -1133, -1851, -1277, 122, 591, -530, -1699, -2089, -998, 230, 448, -375, -1284, -1399, -414, 1049, 1182, 295, -555, -672, 489, 1678, 1765, 619, -423, -234, 1035, 1850, 1412, 376, -765, -378, 563, 1538, 689, -597, -1407, -957, 263, 776, -41, -1376, -1971, -1370, 21, 404, -240, -1327, -1771, -877, 528, 806, -49, -848, -861, 198, 1393, 1492, 629, -304, -316, 890, 1869, 1798, 510, -512, -414, 522, 1512, 1105, 72, -1171, -955, 96, 755, 225, -969, -1823, -1339, -286, 408, -108, -1252, -1790, -1206, 112, 634, 96, -969, -1291, -271, 1168, 1518, 709, -264, -471, 561, 1711, 1854, 793, -279, -421, 567, 1460, 1449, 62, -950, -828, 45, 945, 578, -648, -1631, -1267, -414, 467, 104, -1183, -1914, -1326, -95, 759, 308, -745, -1270, -583, 905, 1441, 827, -324, -659, 289, 1517, 1903, 1234, -47, -340, 408, 1433, 1546, 533, -435, -713, 189, 1147, 1082]
2321A082j218j081j2Q42R21j67j199q29O1J225R27k59j065q13O04J200Q49m58
2339F10j035l39O09J305N21o70j080l24O21J221K64p48j045m11O69J019O9j059
2357A97j269j35Q87R49Q6j177j065o8J009J007k14j006q00L09J300Q26k63j030
2375d57p52P09J175P58l53r70n82M82J338O10n72j187q88O23J144J08p59j202
2393g75l38N55J146J74j051j140l2P69R69K10r81r56n6J176J106j92q56q04K61
2412h15J195Q86j3j072p51M98J221O86m83j322m42M37R66N68o10j327o77O04J005
2431E54K04o75j225l14N70J243P4r18j039j55Q66J123J15q33j021L06J018Q37
2449G30K17r44p80L8J371Q99k34r52p75K45J165O64n18j178o79M74R21N50p12
$$ y = [1082, -136, -1217, -1229, -387, 534, 367, -832, -1661, -1600, -375, 552, 293, -772, -1585, -981, 219, 1068, 610, -425, -764, -155, 1150, 1671, 1001, -79, -403, 218, 1439, 1703, 955, -90, -501, 168, 1187, 1256, 197, -1072, -1207, -320, 629, 715, -462, -1527, -1595, -586, 421, 207, -799, -1599, -1290, 10, 836, 573, -457, -1209, -500, 675, 1433, 1080, 110, -472, 10, 1348, 1958, 1386, 199, -689, -66, 1078, 1186, 427, -775, -1113, -558, 588, 762, -289, -1429, -1461, -692, 277, 487, -494, -1450, -1506, -330, 776, 584, -272, -1076, -815, 380, 1266, 1253, 181, -570, -72, 1149, 1835, 1352, 30, -412, 25, 991, 1559, 949, -378, -1055, -451, 554, 758, 83, -1142, -1456, -886, 357, 431, -487, -1526, -1681, -815, 308, 423, -410, -1431, -1125, -107, 730, 947, 3, -777, -739, 632, 1531, 1297, 345, -430, -185, 980, 1644, 1126, -52, -731, -257, 664, 1214, 502]
2468E02j351o05O43P79O98r45r98m40O54J220M36p45j148l9P69J187K16r36p33
2487h36r3J140R74L20j170o84J59J013O71j9j206r40K93J030N81m89j274p23L30
2506i23R86N64n80j276m93N40J249L96o20r81m05P78J139K79m85r66k10J162J129
2525A283O1o71j076R2P25R91J3r08j164K63R94O62l80j085p72J13J059M64m80
2544A84j116n27M9J081O89m91j045n57O63J101N32m54r19m87R38J108L41m95j175
2563e80k5P24J109L34r86q42m31J059R70m6q90j099Q3Q65P45k59j065j005K04
2582a135R30O60l80j108n54L44J075O58k27j212n80P81J144O52m02j067k99P82
2600F2R09L22n19r72k18N76J099K73p38j306j06O22R41o7r27j101k1Q77P90j95
$$ y = [502, -849, -1454, -811, -32, 666, -279, -1277, -1717, -1063, 157, 593, -152, -1300, -1339, -570, 617, 833, -103, -836, -929, 211, 1185, 1505, 335, -349, -190, 823, 1494, 1475, 269, -671, -378, 652, 1233, 744, -530, -1253, -923, 63, 627, 47, -1229, -1722, -1182, 67, 463, -157, -1138, -1543, -765, 374, 653, 168, -798, -1008, 154, 1283, 1344, 673, -403, -311, 414, 1405, 1418, 510, -654, -391, 603, 1265, 885, -200, -972, -859, 200, 664, 184, -932, -1459, -1410, -329, 360, -131, -1176, -1733, -1070, 31, 563, 109, -810, -1297, -359, 749, 1090, 595, -580, -605, 119, 1228, 1562, 576, -266, -697, 362, 1332, 1286, 396, -703, -620, 245, 990, 731, -334, -1339, -1135, -205, 455, 75, -1033, -1587, -1243, -168, 490, 263, -949, -1529, -748, 396, 1048, 646, -421, -720, 62, 971, 1293, 774, -198, -416, 160, 1259, 1532, 794, -512, -618, 4, 945, 878, -49, -1150, -1171, -294, 496, 301]
2620C01q40q95P7R20Q49n5j132o12N86J102N29j27j072l67L46J271N36m40j036
2639e9n13P31J157K85p01j155l52P07Q71J85r78j007k27O92O83J72r44q74K7Q62
2659d38Q23Q2j266m83M8J109P51j09q52p32O28R60N99k67r90n04O15J040M49m34
2679A029j053m72O47Q82L09o25j046n21O48Q77K37p45j187n5M77J145j00q53r58
2698a364J29P34R90J19q17q32K98J226Q11k74r37o63K28J105O94k82p99p52L12
$$ y = [301, -539, -1434, -1357, -437, 412, 357, -775, -1387, -801, 301, 830, 703, -369, -736, -390, 881, 1417, 977, -59, -572, 159, 1316, 1601, 900, -255, -607, 100, 971, 1156, 178, -829, -1056, -364, 319, 491, -453, -1327, -1300, -438, 385, 467, -799, -1282, -1234, -125, 626, 517, -335, -1067, -439, 521, 1120, 853, -137, -641, -26, 1014, 1463, 1029, -24, -496, 151, 1033, 1342, 717, -329, -850, -202, 675, 912, 167, -1020, -1075, -598, 547, 447, -406, -1364, -1235, -501, 489, 608, -209, -1041, -743, 483, 1294, 1020, 83, -580, -352, 753, 1447, 1165, 366, -386, -74]
$$ [...]
8191g
##END NTUPLES=NMR FID
##END=
