##TITLE=1H_SA-phitetker
 DMSO, 8 sc, 
 30.5.2019
##JCAMPDX= 6.0         $$ Bruker NMR JCAMP-DX V2.0
##DATA TYPE= NMR FID
##DATA CLASS= NTUPLES
##ORIGIN= UXNMR, Bruker Analytische Messtechnik GmbH
##OWNER= root
$$ XWIN-NMR		Version 3.5
$$ Thu May 30 14:11:09 2019 Russian Standard Time (UT+4h)  she@DPX200
##.OBSERVE FREQUENCY= 200.13155
##.OBSERVE NUCLEUS= ^1H
##.DELAY= (6, 6)
##.ACQUISITION MODE= SIMULTANEOUS
##.ACQUISITION SCHEME= undefined
##.AVERAGES= 8
##.DIGITISER RES= 18
##SPECTROMETER/DATA SYSTEM= spect
##.PULSE SEQUENCE= zg30
##.SOLVENT NAME= DMSO
##.SHIFT REFERENCE= (INTERNAL, DMSO, 0, 15.7039)
##AUDIT TRAIL= $$ (NUMBER, WHEN, WHO, WHERE, WHAT)
$$ ##TITLE= Audit trail, XWIN-NMR		Version 3.5
$$ ##JCAMPDX= 5.01
$$ ##ORIGIN= Bruker BioSpin GmbH
$$ ##OWNER= she
$$ F:/spectra/data/she/nmr/H-F/1/audita.txt
$$ ##AUDIT TRAIL=  $$ (NUMBER, WHEN, WHO, WHERE, WHAT)
(   1,<2019-05-30 14:09:39.60 +0400>,<she>,<DPX200>,
      <created by zg, POWCHK disabled, PULCHK disabled
       configuration hash MD5:
       00 E9 B6 7A A2 85 ED C7 34 08 36 98 17 FE 4E 26
       data hash MD5: 16K
       41 C8 1E 4C 5D CB 88 7B 19 2D DC D2 C1 EE CB 50>)
$$ ##END=
$$ 
$$ hash MD5
$$ 06 6B 5A 4A CD 3C 24 44 D2 5C FC EE EF 7F CD 98
##$RELAX= 
##$RELAX= 
##$RELAX= 
##$RELAX= 
##$RELAX= 
##$RELAX= 
$$ Bruker specific parameters
$$ --------------------------
##$DU= <F:/spectra>
##$EXPNO= 1
##$NAME= <H-F>
##$PROCNO= 1
##$TYPE= <nmr>
##$USER= <she>
##$AMP= (0..31)
100 100 100 100 100 100 100 100 100 100 100 100 100 100 100 100 100 100 
100 100 100 100 100 100 100 100 100 100 100 100 100 100 
##$AQSEQ= 0
##$AQ_mod= 1
##$AUNM= <au_zg>
##$AUTOPOS= <>
##$BF1= 200.13
##$BF2= 200.13
##$BF3= 200.13
##$BF4= 200.13
##$BF5= 200.13
##$BF6= 200.13
##$BF7= 200.13
##$BF8= 200.13
##$BYTORDA= 1
##$CFDGTYP= 0
##$CFRGTYP= 5
##$CHEMSTR= <none>
##$CNST= (0..31)
1 1 145 1 1 1 1 1 1 1 1 1 1 1 1 1 1 1 1 1 1 1 1 1 1 1 1 1 1 1 1 1 
##$CPDPRG= <>
##$CPDPRG1= <>
##$CPDPRG2= <>
##$CPDPRG3= <>
##$CPDPRG4= <mlev>
##$CPDPRG5= <mlev>
##$CPDPRG6= <mlev>
##$CPDPRG7= <mlev>
##$CPDPRG8= <mlev>
##$CPDPRGB= <>
##$CPDPRGT= <>
##$D= (0..31)
0 1.2 0 0 0 0 0 0 0 0 0 0.03 0 0 0 0 0 0 0 0 0 0 0 0 0 0 0 0 0 0 0 0 
##$DATE= 1559210978
##$DBL= (0..7)
120 120 120 120 120 120 120 120 
##$DBP= (0..7)
150 150 150 150 150 150 150 150 
##$DBP07= 0
##$DBPNAM0= <>
##$DBPNAM1= <>
##$DBPNAM2= <>
##$DBPNAM3= <>
##$DBPNAM4= <>
##$DBPNAM5= <>
##$DBPNAM6= <>
##$DBPNAM7= <>
##$DBPOAL= (0..7)
0.5 0.5 0.5 0.5 0.5 0.5 0.5 0.5 
##$DBPOFFS= (0..7)
0 0 0 0 0 0 0 0 
##$DE= 6
##$DECBNUC= <off>
##$DECIM= 24
##$DECNUC= <off>
##$DECSTAT= 4
##$DIGMOD= 1
##$DIGTYP= 9
##$DL= (0..7)
0 120 120 120 120 120 120 120 
##$DP= (0..7)
150 150 150 150 150 150 150 150 
##$DP07= 0
##$DPNAME0= <>
##$DPNAME1= <>
##$DPNAME2= <>
##$DPNAME3= <>
##$DPNAME4= <>
##$DPNAME5= <>
##$DPNAME6= <>
##$DPNAME7= <>
##$DPOAL= (0..7)
0.5 0.5 0.5 0.5 0.5 0.5 0.5 0.5 
##$DPOFFS= (0..7)
0 0 0 0 0 0 0 0 
##$DQDMODE= 0
##$DR= 18
##$DS= 0
##$DSLIST= <SSSSSSSSSSSSSSS>
##$DSPFIRM= 0
$$ [...]
##$SUBNAM2= <"">
##$SUBNAM3= <"">
##$SUBNAM4= <"">
##$SUBNAM5= <"">
##$SUBNAM6= <"">
##$SUBNAM7= <"">
##$SUBNAM8= <"">
##$SUBNAM9= <"">
##$SW= 24.9336996594482
##$SWIBOX= (0..15)
0 0 2 0 0 0 0 0 0 0 0 0 0 0 0 0 
##$SW_h= 4990.01996007984
##$TD= 16384
##$TD0= 1
##$TE= 0
##$TE2= 300
##$TE3= 300
##$TEG= 300
##$TL= (0..7)
0 120 120 120 120 120 120 120 
##$TP= (0..7)
150 150 150 150 150 150 150 150 
##$TP07= 0
##$TPNAME0= <>
##$TPNAME1= <>
##$TPNAME2= <>
##$TPNAME3= <>
##$TPNAME4= <>
##$TPNAME5= <>
##$TPNAME6= <>
##$TPNAME7= <>
##$TPOAL= (0..7)
0.5 0.5 0.5 0.5 0.5 0.5 0.5 0.5 
##$TPOFFS= (0..7)
0 0 0 0 0 0 0 0 
##$TUNHIN= 0
##$TUNHOUT= 0
##$TUNXOUT= 0
##$USERA1= <user>
##$USERA2= <user>
##$USERA3= <user>
##$USERA4= <user>
##$USERA5= <user>
##$V9= 5
##$VALIST= <valist>
##$VCLIST= <CCCCCCCCCCCCCCC>
##$VD= 0
##$VDLIST= <DDDDDDDDDDDDDDD>
##$VPLIST= <PPPPPPPPPPPPPPP>
##$VTLIST= <TTTTTTTTTTTTTTT>
##$WBST= 1024
##$WBSW= 4
##$XGAIN= (0..3)
0 0 0 0 
##$XL= 0
##$YL= 0
##$YMAX_a= 317886
##$YMIN_a= -363944
##$ZGOPTNS= <>
##$ZL1= 120
##$ZL2= 120
##$ZL3= 120
##$ZL4= 120
##$ABSF1= 10
##$ABSF2= 0
##$ABSG= 5
##$ABSL= 3
##$ALPHA= 0
##$AQORDER= 0
##$ASSFAC= 0
##$ASSFACI= 0
##$ASSFACX= 0
##$ASSWID= 0
##$AUNMP= <proc_1d>
##$AZFE= 0.1
##$AZFW= 0.1
##$BCFW= 1
##$BC_mod= 2
##$BYTORDP= 1
##$COROFFS= 0
##$CY= 11.3945322036743
##$DATMOD= 1
##$DC= 2
##$DFILT= <>
##$DTYPP= 0
##$F1P= 18.9103706918063
##$F2P= -1.10871071338519
##$FCOR= 0.5
##$FTSIZE= 0
##$FT_mod= 4
##$GAMMA= 1
##$GB= 0.15
##$INTBC= 1
##$INTSCL= 1
##$ISEN= 128
##$LB= 0.24
##$LEV0= 0
##$LPBIN= 0
##$MAXI= 10000
##$MC2= 0
##$MEAN= 0
##$ME_mod= 0
##$MI= 1.114404
##$NCOEF= 0
##$NC_proc= 0
##$NLEV= 6
##$NOISF1= 3.799351
##$NOISF2= 2.8
##$NSP= 1
##$NTH_PI= 0
##$NZP= 0
##$OFFSET= 15.70392
##$PC= 1
##$PHC0= -8511.214
##$PHC1= 30.40023
##$PH_mod= 1
##$PKNL= yes
##$PPARMOD= 0
##$PSCAL= 0
##$PSIGN= 0
##$REVERSE= no
##$SF= 200.130013532006
##$SI= 16384
##$SIGF1= 3
##$SIGF2= 2
##$SINO= 400
##$SIOLD= 16384
##$SREGLST= <1H.CDCl3>
##$SSB= 0
##$STSI= 0
##$STSR= 0
##$SW_p= 3612.71676300578
##$SYMM= 0
##$S_DEV= 0
##$TDeff= 0
##$TDoff= 0
##$TI= <>
##$TILT= no
##$TM1= 0
##$TM2= 0
##$TOPLEV= 0
##$USERP1= <user>
##$USERP2= <user>
##$USERP3= <user>
##$USERP4= <user>
##$USERP5= <user>
##$WDW= 1
##$XDIM= 8192
##$YMAX_p= 0
##$YMIN_p= 0
$$ End of Bruker specific parameters
$$ ---------------------------------
##NTUPLES= NMR FID
##VAR_NAME=  TIME,          FID/REAL,        FID/IMAG
##SYMBOL=    X,             R,               I
##VAR_TYPE=  INDEPENDENT,   DEPENDENT,       DEPENDENT
##VAR_FORM=  AFFN,          ASDF,            ASDF
##VAR_DIM=   8192,          8192,            8192
##UNITS=     SECONDS,       ARBITRARY UNITS, ARBITRARY UNITS
##FACTOR=    0.0002004,     1,               1
##FIRST=     0,             0,               0
##LAST=      1.6414764,     0,               0
##MIN=       0,             -363944,         0
##MAX=       1.6414764,     317886,          0
$$ Real data points
##PAGE= N=1
##DATA TABLE= (X++(R..R)), XYDATA
$$ [...]
2311a184q66J530K181P16k430k767P23L418J854j377k725l00R81P01p43J91J258
$$ -1184 -2050 -520 1661 2377 -53 -2820 -2097 1321 3175 1798 -927 -1227 -246 455 -288 -97 1161
2328A161M56k114k161L47L530K874j264m297k271K490L910P81k638k188K4P91
$$ 1161 1617 -497 -2658 -2311 1219 4093 2829 -1468 -3739 -1249 2661 3442 804 -1384 -1360 -569
2344e69M95J59M14J015j079k282q32K540K980K4k791l090R34L205J432j298j982
$$ -569 -74 85 499 1514 435 -1847 -2679 -139 2841 2865 74 -3016 -2082 1123 2555 1257 -725
2361g25J05Q27j01r31J4J902Q85j757k468O1K276K445k50k527j865P23J970R78
$$ -725 -620 207 106 -825 -811 1091 1976 219 -2249 -2188 88 2533 2283 -244 -2109 -1386 584 1562
2379A562o14k55o43j041p80N37K352J270j192l011j574K322K791J619j980k887
$$ 1562 948 693 50 -991 -1771 -1234 1118 2388 1196 -1815 -3389 -1067 1724 3343 1363 -1524
2395a524p14J191K053L05p28j011o81k72K43J433P22K18j237j801N54J089J104
$$ -1524 -2238 -1047 1006 1311 583 -428 -1109 -1381 -1138 295 1017 1235 -2 -1803 -1249 -160 944
2412I44M60r81j114n50L16Q20J250m21m85j507j94P22J030J183P7j246j887n52
$$ 944 1404 423 -691 -1241 -925 -105 1145 724 239 -1268 -1462 -740 290 1473 1550 304 -1583 -2135
2430b135J441K338J069j419k960r84J300K767J093j573j685q96M88J366N18L93
$$ -2135 -694 1644 2713 1294 -1666 -2650 -1350 1417 2510 937 -748 -1644 -1156 210 728 1121
2446A121l58r24j111l35J751J870K96k749k057P82K077J611r21k036l9O73N95
$$ 1121 763 -161 -1272 -1607 144 2014 2310 -439 -2496 -1714 363 1974 1053 -983 -1022 -349 246
2463B46n84j40J532Q88j550k287j47K610K348p32l057j830J123K749O57j396q86
$$ 246 -338 -478 1054 1942 392 -1895 -2042 568 2916 2184 -873 -2703 -1580 1169 1826 430 -456
2480d56M17j45o03k22J745K185r05l417j793J994L855J233l350l064l6K666J703
$$ -456 -39 -184 -787 -1009 736 2921 2016 -1401 -3194 -1200 2655 3888 538 -2526 -2562 104 1807
2497A807j068r88k62O09o35q25N77K315R36k043k966J2K910K160r62l030q20J422
$$ 1807 739 -249 -511 98 -537 -1362 -785 1530 2466 423 -2543 -2531 379 2539 1577 -1453 -2273 -851
2515h51J660o57p03P64J118o36k147o81K232K880k10l336k775J246L365J468j876
$$ -851 809 152 -551 213 1331 695 -1452 -2133 99 2979 2769 -567 -3342 -2096 1269 2737 861
2532H61k124k12P11P13kL91Q86p31j839j372J932L071M92k292k665m68K807J923
$$ 861 -1263 -1475 -764 -51 -53 338 1224 493 -1346 -2718 -786 2285 2777 485 -2180 -2648 159 2082
2550B082j025j732o51O45K72j73M81Q76O12j531j366j54J858J811k71j735j732
$$ 2082 1057 -675 -1326 -681 -409 -582 -101 775 1387 -144 -1510 -1664 194 2005 1734 -1 -1733
2567a733N27J046R90r9o79l85n22j58N44J224J260p97j904r16L79K042J271n67
$$ -1733 -1206 -160 830 731 52 -333 -855 -1013 -469 755 2015 1218 -686 -1602 -1223 819 2090 1523
2585A523j899j089J28J165J229M04j070j418o95J081J446J066r22j330o44J02
$$ 1523 -376 -1465 -1337 -172 1057 1461 391 -1027 -1722 -641 805 1871 949 -381 -1025 -923
2601i23R64O45P61k96j299j414m6J694J305K92j640j593K66J417Q87j64p06L73
$$ -923 41 686 1447 1151 -148 -1562 -1608 86 1391 1683 43 -1550 -1284 133 1020 856 150 523
2619E23q31m59o9R01J932n27k367j785P45K745J728j254k308p29J326Q52N53m56
$$ 523 -308 -767 -836 65 1997 1470 -897 -2682 -1937 808 2536 1282 -1026 -1755 -429 423 976 520
2637E20P6k70j001r33O02K463J134j790k964r05K892K339J0k957r09P75J535l31
$$ 520 596 326 -675 -1608 -1006 1457 2591 801 -2163 -3068 -176 2163 2173 -784 -1693 -918 617 286
2655B86p80Q73Q93n83j880q47J614K508K64k911k194O78K832J114j224j434J10
$$ 286 -494 379 1272 689 -1191 -2038 -424 2084 2348 -563 -2757 -2079 753 1867 643 -791 -681
2672f81R85m57j040J097J600N20k777k063N14L625J878k155l271o62K729K125
$$ -681 304 -153 -1193 -96 1504 2024 -753 -2816 -2302 1323 3201 1046 -2225 -2887 -158 1967
2688A967o95j439k66N26p2q18L37J549J284j387k744q96K166K776j98k667j583
$$ 1967 1272 -167 -433 93 21 -797 -460 1089 2373 986 -1758 -2654 -488 2288 2090 -577 -2160
2705b160P88K068N48r81k25N03J32j074j130J135K069L54k357k025O91K412J361
$$ -2160 -1372 696 1244 263 38 541 673 -401 -1531 -396 1673 2027 -330 -2355 -1664 748 2109
2722B109q48k136m89P36Q46o9N65N94n45j338j357R88K036J216j527k251q76J672
$$ 2109 1261 -875 -1364 -628 218 149 714 1308 763 -575 -1932 -944 1092 2308 781 -1470 -2346 -674
2740f74K125P3o99j227o12O85L10N82N44J49j403j131J63J509Q07l50q09j079
$$ -674 1451 1524 825 -402 -1014 -329 -19 563 1107 1256 -147 -1278 -1115 394 1201 851 42 -1037
2758a037J98K58J310L86m41q52p89k55R81J045O23p17j593m82L99J561M65k63
$$ -1037 -839 -581 729 1115 674 -178 -967 -1222 -241 804 1427 710 -883 -1365 -966 595 1060 797
2776G97p53r86n90O79J611R36p42k058r66J032J889J034j014j568m08N70K06K56
$$ 797 44 -942 -1532 -853 758 1694 952 -1106 -2072 -1040 849 1883 869 -699 -1107 -537 -331 -75
2794g5J070m6q95j307n87J710J881L51k005k013N40J776O75l35p51l06K29l47
$$ -75 995 949 54 -1253 -1840 -130 1751 2102 97 -1916 -1376 400 1075 740 -11 -317 -88 -435
2812d35n59P15J397N82j631j863o7K167J888p81k199p83J162J423n4l10l28l2
$$ -435 -994 -279 1118 1700 69 -1794 -1861 306 2194 1413 -786 -1569 -407 1016 962 652 324 292
2830B92l36j248j06K005J572p57l045j108K213K514L16k065j860K40J836R7k12
$$ 292 -44 -1292 -1398 607 2179 1422 -1623 -2731 -518 1996 2312 247 -1613 -1373 463 560 348
2847C48k20N33R4j838o94J369J868O41k032k073K8K651J688j113j775l78P67L65
$$ 348 128 661 755 -1083 -1777 -408 1460 2101 69 -2004 -1976 675 2363 1250 -525 -903 -136 229
2865B29m71k85J481K91j012k137J18K183J747n28k609j094J216J996M89j434o25
$$ 229 -242 -527 954 1245 233 -1904 -1786 397 2144 1616 -993 -2087 -871 1125 1614 180 -445
2882d45R3J44o49L58J108N82m07k037p79J401K446p4j617j670l3J658R67k47r55
$$ -445 -352 -208 -857 -499 609 1191 784 -1253 -2032 -631 1815 1741 124 -1546 -1579 79 1046 799 -156
2901a56K12j76m15k48Q27Q57M59j546j723Q82J211R24k27r83j009K18O98K57P05
$$ -156 56 -120 -535 -783 44 901 1360 -186 -1909 -1027 184 1108 881 -102 -1111 -893 -195 62 767
2920G67R5m22j018q99Q31Q78J467r31j856m72O93J475M00J14j238j024p7O47J300
$$ 767 862 440 -578 -1477 -646 232 1699 768 -1088 -1560 -867 608 1008 1122 -116 -1140 -1217 -570 730
2939G30N49r42p87p00N16J042R10m89r23o81O2P5J185M52j3q24j432Q6J398J224
$$ 730 1279 337 -450 -1150 -634 408 1318 829 -94 -775 -713 -638 547 999 986 162 -1270 -1184 214 1438
2959A438l59r92q37J28M47N28O1M02k27n58j043K42R41J588n40j553j437O71J752
$$ 1438 1079 87 -750 -622 -175 353 414 816 589 31 -1012 -770 171 1759 1219 -334 -1771 -1100 652
2978F52R89j033r62m04J79J31L12O75K39l97j288o16R91J912M82j567j744k14
$$ 652 1641 608 -354 -758 -579 -448 -136 539 778 381 -907 -1523 -532 1380 1862 295 -1449 -1663
2996a663K115P70k06j164m99M56m0l74O11O74N39j012j586k60J863J672m08j852
$$ -1663 452 1222 1016 -148 -647 -191 -231 -605 6 680 1219 207 -1379 -1639 224 1896 1488 -364
3014c64j756J190J300M71q49k62L43O2j160J91R36J891o07k169j538J451K156
$$ -364 -2120 -930 370 841 -8 -270 73 135 -1025 -834 102 1993 1386 -783 -2321 -870 1286
3031A286N55j269j477o41J326Q63m52q7J03r5o55m28O93J804M21j585k046L88
$$ 1286 1841 572 -905 -1546 -220 643 191 104 207 112 -543 -971 -278 1526 1947 362 -1684 -1296
3049a296J325J770n67j352q66M99N81n5J0L01N04q20j076l71J488J700q16j202
$$ -1296 29 1799 1232 -120 -986 -487 94 39 49 350 854 34 -1042 -1413 75 1775 959 -243
3067b43j148L74J400R60k10j216p57K41P8N46M31N08n58q91j081R38J243R16o59
$$ -243 -1391 -1017 383 1343 1133 -83 -840 -599 -521 25 456 964 406 -485 -1566 -628 615 1531 872
3086H72k037j71N57J268N43o46p78j31o5K0R87K73j40n95q05k7R53N99N04p31
$$ 872 -1165 -1336 -779 489 1032 386 -392 -523 -588 -568 419 692 552 -43 -848 -875 78 677 1181 450
3106D50r57m73N08N78J140m07j096p54N41L18O88J69K08j406n87J80Q91P42K11
$$ 450 -507 -980 -472 106 1246 839 -257 -1011 -470 -152 536 705 913 -493 -1080 -900 -9 733 944
3125I44m30j524k94L47J906L33o80j231l83M39M87R19k79n09m00m98J34R70P51
$$ 944 514 -1010 -1304 -957 949 1282 602 -629 -1012 -573 -86 833 554 45 -355 -853 -719 251 1002
3144A002l9j031j017n7J294P93p0p94r43L96J56O28K92l13J07j21r80m6Q54J375
$$ 1002 963 -68 -1085 -1142 152 945 875 81 -862 -466 -310 318 610 297 404 283 -697 -743 111 1486
3164A486m36j602j086P68J420P06l84j152l66J63K38M25M09k3k23j020p30P16
$$ 1486 1050 -552 -1638 -870 550 1256 872 -280 -646 -483 -245 180 589 566 343 -677 -1407 -691
3182f91J364J014r67j934k93J297J097k66k16o83j78J95J22K75K40K80m26j033
$$ -691 673 1687 720 -1214 -1507 -210 887 621 405 -278 -456 -261 -139 136 376 656 230 -803
3200h03o70J519J333l60j085j102J45J006N72J23o13j47K4l30l6N97Q62j05j215
$$ -803 -1473 46 1379 1019 -66 -1168 -1023 -17 555 678 65 -82 -58 -388 -424 173 1035 930 -285
3219b85r75L44J247R89l32j729l42M94O81O07k13k21l06o46n8P05R84N17q48j599
$$ -285 -1260 -916 331 1320 988 -741 -1083 -589 92 699 486 265 -41 -687 -745 -40 944 1461 613 -986
3239i86j49N47J447M00o85j057j56J53O59L39j87j20o86j8k89Q25P55J71p95q65
$$ -986 -1135 -588 859 1259 574 -483 -639 -486 173 512 325 205 -481 -499 -788 37 792 963 168 -697
3259f97m03J133Q98J86j047p32n8M08R57J41k80n69m83l32O84M24O15L1j173n34
$$ -697 -1100 33 931 1117 70 -662 -720 -312 645 786 506 -63 -546 -878 -194 230 845 876 -297 -831
3279h31n8J036O93J60j005r63J1Q11O09J62l78m34n61r9O85N88M46l84p86p48
$$ -831 -889 147 840 1000 -5 -968 -957 -146 463 625 247 -187 -748 -847 -162 426 872 488 -298 -1046
3299a046L48J270N13m94o28q67J64Q91K79J95l04r87J19O9J06J003M99p87o70
$$ -1046 -698 572 1085 591 -37 -904 -740 151 430 625 321 -666 -547 -478 -372 631 1130 343 -327
3318c27n96Q4J208Q81n71q87n63Q3J151J12jo48J11q21M6O31O68M77r73j027k07
$$ -327 -923 -839 369 1250 679 -208 -771 -688 463 575 574 -74 37 -784 -738 -107 561 1038 65 -962 -1169
3339a169J277Q16j15o45j090M0O23P77j26J29J5o79q42J7J248N77j23r30q47K59
$$ -1169 108 924 809 164 -926 -886 -263 514 388 517 532 -147 -989 -972 276 853 730 -200 -1047 -788
3359g88J022P09o3j026o06R7N49P8J83J48Q1o33o58J34J403Q44n64j688l84M82
$$ -788 234 943 880 -146 -752 -655 -106 -28 155 303 384 -249 -907 -773 630 1474 910 -778 -1162 -680
3379f80J047P45o19r01l82N52J55L38L05K3o46l00l52K73J096J78o39r71k80N65
$$ -680 367 1112 493 -408 -790 -238 -83 255 560 583 -63 -363 -715 -442 654 832 193 -778 -1058 -493
3399d93J188J76l83p26J83k35L16K82L88k85m91p50j43R92O46K57j161l29l89
$$ -493 695 871 488 -238 -55 -290 26 308 696 411 -80 -830 -973 19 665 922 -239 -568 -957
3418i57J024N21j0n29l54j79J02L11L64M64n25n66m06N35N39N29l02r25n78L22
$$ -957 67 588 578 49 -305 -484 -382 -71 293 757 232 -334 -740 -205 334 863 561 -364 -942 -620
3438f20O60N12R3m65l56m40J23O93N10Q8k88q83l84L92Q69K51l70m24q62L37R73
$$ -620 40 552 645 180 -176 -616 -493 200 710 798 510 -373 -757 -365 504 755 385 -39 -901 -564 409
3459D09M50l29n96j84m83L47L49P72j32l99r00k65R60Q32K97j094m80k27M33P68
$$ 409 859 530 -66 -250 -733 -386 -37 735 603 204 -696 -961 -1 831 1128 34 -446 -673 -240 528
3479E28L06n08k99k63k12J16M61O22l61o46m13K77M91O20n3p29j029N27N28M02
$$ 528 834 326 27 -236 -448 -332 129 751 390 -256 -669 -392 99 719 666 -63 -1092 -565 -37 365
3499C65J90m97j45l76J65j43O79M30j78o19n68o3R06Q33n28o53q81O84M02O00
$$ 365 555 58 -87 -463 -298 -441 238 668 490 -129 -697 -760 146 979 451 -202 -1083 -399 3 603
3519F03l31k04k29m26j63N40R52J2n40q34l37O82Q49J65k73r86j00M08O16R2k17
$$ 603 272 68 -161 -587 -750 -210 742 754 214 -620 -957 -275 574 739 466 -520 -620 -212 404 496 279
3540B79j71p7m68m0K22J010p7q41m01m21Q18P52L45r14l75J16J75P24r4j17m22
$$ 279 108 31 -437 -477 -255 755 678 -163 -564 -985 -167 585 930 16 -359 -243 -68 656 562 445 23
3561B3l18l61L29N54L75J31j036r18L91J013M98J48r29l93l6K37O25k4R1j95q17
$$ 23 -295 -656 -327 227 602 733 -303 -1221 -830 183 681 829 -100 -493 -529 -292 333 309 400 205 -612
3582f12JM63M23O58q11m28l91N7J299J17k77p10m77L59J39P34R1o7p59k78j37
$$ -612 -611 -148 275 933 122 -306 -697 -640 659 776 499 -211 -688 -329 -190 544 635 568 -191 -469 -606
3603f06N92O19K21q15o50m4M63Q80j68m77m02l32M09N08R7K1r0l30p14Q4Q85N75
$$ -606 -14 605 826 11 -639 -683 -220 660 492 15 -387 -719 -310 198 295 316 226 -104 -818 -734 151 726
3625G26j73l60o07j22N54M28K46o71k36n44N19M05N29m69J29p51j97M23M40M99
$$ 726 553 193 -414 -536 18 446 692 21 -215 -759 -240 165 694 225 354 -397 -594 -171 269 768
3645G68k02r18l00J17O30O09j58m26n26lJ63K7N90K73n96l53j93K70K81R84o98
$$ 768 566 -352 -652 -535 95 704 546 120 -406 -409 -246 -219 371 644 48 -305 -498 -228 53 1037 339
3666C39m65n05N34N77K20j4q06n18K18L16O07k06J33o46l60k30P34O16jm37o97
$$ 339 -126 -631 -97 480 700 686 -120 -638 -420 -104 503 297 430 -216 -576 -806 -72 544 543 106 -591
3687e91J20L32P07L9l75n56J9Q3P5L82M08l67q4q08K49M19N06j67o03n82M68K30
$$ -591 -471 -139 568 607 232 -324 -305 -222 -147 235 643 276 192 -616 -367 52 558 391 -212 -794 -326 -96
3709i6N27P9l98k65l0M4K28M63o9k56o32m5K41M27M50m26l92p75J37R89L69m54
$$ -96 431 510 112 -153 -183 -139 89 552 483 227 -405 -450 -209 218 668 242 -150 -925 -788 201 570 116
3731A16j81n0j20j63N00M48r7m11m28k62N13O78%k80p22j27L47K73M02j99J57
$$ 116 -65 -115 -235 -398 102 550 453 42 -386 -648 -135 543 543 263 -459 -586 -239 34 436 237 394
3752C94p49J77k4L29J73M67p42m92m1L43Q68q1n85o01M4M09L41J68k48m28n1j44
$$ 394 -355 -178 -202 127 300 767 25 -467 -508 -165 703 622 37 -564 -520 -111 230 398 150 -278 -329 -473
3774d73J03N56N55m52o13m62N07K56P20k32l87k21l5p0M80M62n46k68j60o6J60
$$ -473 -370 186 741 289 -324 -786 -279 -23 697 465 78 -143 -178 -248 232 694 148 -120 -280 -346 -186
3795a86P31k1k71q34N1J60R44k63J13p25k31K13M82o2J67j99k05m36P8N08N31
$$ -186 545 524 253 -581 -530 -370 574 311 424 -301 -532 -319 163 101 268 69 -136 -572 -494 14 545
3816E45k79O2p80k75R73J11M19n71o04j8jL15K44J24J75o51l05J29L30O25q0o25
$$ 545 266 328 -452 -727 246 357 776 205 -399 -417 -418 -103 141 265 440 -211 -516 -387 -57 568 488 -137
3838a37l95K34L14L31K96m63n10KJ99L47R8j08k57O4k96j58Q39K28k43o17n06
$$ -137 -532 -298 16 347 643 180 -330 -328 -129 218 316 208 -49 15 -281 -439 400 628 385 -232 -738
3859g38J20Q98K44k3l13p55K59P9L16J60k7j57m11J90k70R12L62o66k70q03O29
$$ -738 -618 280 524 501 188 -567 -308 -229 87 247 220 63 -348 -158 -428 484 846 180 -90 -893 -264
3880b64M18K65j58r12lL06M09m6K49P1n82j84K5N98L29o1n47k09nJ09N15K43m03
$$ -264 154 419 261 -651 -654 -348 61 15 264 335 -247 -431 -406 192 521 460 -87 -296 -301 -192 323 566 163
3903A63k84k98J30M33L56k31M7m10l14M2L59M03j61k24n17l23Q65M73j96j19p10
$$ 163 -121 -419 -289 144 500 269 316 -94 -408 -366 -7 396 235 11 -506 -829 36 509 313 194 -516
3924e16k32O06K87M59l71l03k49j9J32O24K89n53l05p01P38J85N76k78k99l86
$$ -516 -748 -142 145 604 233 -70 -319 -338 -206 418 707 154 -151 -852 -114 71 647 369 70 -316
3944c16Q3K9J63M02K17n17l79j63M33P06J6m15o07j94M14L10J38j50l76m56N54
$$ -316 -233 -204 -41 361 578 61 -318 -481 -48 658 674 259 -348 -542 -128 182 320 170 -206 -662 -108
3965a08L30K16k2l61k35k50j68P62L57j6m69q33M48J4P27q9K22n15k52j56M63
$$ -108 222 438 416 55 -180 -430 -598 164 521 505 36 -797 -349 -335 392 303 525 10 -242 -398 65
3986F5J78M03j50p74k0j89P16K62l19k53j70k85M77K90J65l57m14J00Q9J14L83
$$ 65 243 646 496 -278 -298 -487 229 491 172 -81 -251 -536 -59 231 396 39 -375 -275 -186 -72 311
4007C11K70m37l62l07O13K35o2L25o51k40J99N8O90k36l53j59l18M06L48j3K04
$$ 311 581 144 -218 -525 88 323 261 586 -65 -305 -106 -48 642 406 53 -106 -424 -18 330 317 521
4028E21p99k80k8M30P94k34l18l23j68P6P15k19J30n43K90j90L6J93M14k90m97
$$ 521 -278 -558 -586 -156 638 404 86 -237 -405 -329 386 167 297 -246 44 -146 -110 83 497 207 -290
4049b90n08P8Q57Q7J85l30m80k1P8P63J45k75m11M6k77M30K13L1k60k54j80NL78
$$ -290 -798 -720 137 224 409 79 -401 -422 -344 419 564 289 -122 -76 -353 77 290 321 61 -193 -373 -368 10
4072A0N64j21n80m18L21L00N06k99K1n69n8O7K9N71N5j98p83JQ06L4J53jl45n12
$$ 10 574 453 -127 -545 -224 76 582 283 304 -265 -323 -256 -227 344 399 201 -582 -581 225 259 412 411 66 -446
4096d46N0M03J35L2k80j04p8o0N47K07j31m52l34K00K08M48j7k64m09j14M72J02
$$ -446 -396 7 142 174 -106 -210 -288 -348 199 406 275 -177 -511 -311 -103 345 328 64 -345 -459 13 115
4118A15K18J22l92k30k33J86L05N03j93p07j88J84J05N72N6n61l98K51J96L32
$$ 115 333 455 63 -167 -400 -214 91 594 401 -306 -494 -310 -205 367 423 -138 -536 -285 -89 243
4138B43M85m51j59k42n27O87K12J9j60n00k32O22l7L25L04m97j98j5j25N08J0
$$ 243 728 277 118 -124 -651 36 248 267 107 -393 -625 -3 -40 285 589 92 -106 -121 -246 262 272
4159B72l49O6m26K00N3P48j56k43l40k06j6L53L41pk05j60J45j81N32k97J44k40
$$ 272 -77 -11 -437 -237 -184 564 408 165 -175 -381 -397 -44 297 290 85 -75 70 -111 421 124 268 28
4181B8k67k75M77O99m34j58p15M13m8N14L43n42k13RJ8K27n6M68p77r8kJ42O18
$$ 28 -239 -514 -37 662 228 70 -645 -232 -280 234 577 35 -178 -169 -151 76 20 488 -289 -387 -389 -247 371
4204C71Q4j15p55q3M29j14M49Q2k34m59J98J64J4J7J28R5n54r2L08J41L57m96
$$ 371 455 340 -415 -498 -69 -183 266 348 114 -345 -147 17 31 48 176 271 -283 -375 -67 74 431 -65
4226f5m16L73j4J70L42j43O1n57O6K71L74j76l57K40n47o9N08M24p7k71m15K5
$$ -65 -481 -108 -122 48 390 247 308 -249 -183 88 462 286 -71 169 -378 -447 61 485 408 137 -278 -253
4248b53J55K54N75m70l95m0J7n5K00M42j14k52l29k97P19L11k66j91l59J1O34
$$ -253 -98 156 731 261 -134 -174 -157 -212 -12 430 316 64 -265 -562 157 468 202 11 -348 -337 297
4269B97k42L74l7l68j93J15K10R3j40j05j46m31M33M85k16n7l35k06J3M41L56
$$ 297 55 429 392 24 -169 -54 156 249 109 4 -142 -573 -140 345 129 72 -263 -469 -456 -15 341
4290C41k57Q8k29j65J77j7M63j5k83m36p7J39L13L81j75m66J47l13N26K68j67
$$ 341 84 172 -57 -222 -45 -62 401 386 103 -333 -410 -271 42 423 248 -218 -71 -384 142 410 243
4311B43kl02j94L4L07L65j5m69J18m14L90m1L03M7o02L6O6q8N51l16L3j98j72
$$ 243 241 -61 -255 -221 86 451 436 -33 85 -329 61 20 323 370 -232 -196 -130 -218 333 17 50 -148 -320
4334c20J61N37j59j61k51k93K15L84Q0K88n53j98O7K20P4k8L8k40j00j25L70K28
$$ -320 -159 378 219 58 -193 -486 -271 113 193 481 -72 -270 -203 17 91 63 101 -139 -239 -364 6 234
4356B34K34k09n86Q4K00J00K88j64k65l0l7J90L9M0k7k72k0J71QO01n08k15K5
$$ 234 468 259 -327 -243 -43 57 345 181 -84 -114 -151 39 78 118 91 -181 -201 -30 -22 579 71 -144 -119
4379a19o0J31K21J30l19r8l41Q8L69M31k54R5n38m67N02N2L37J10k28k44O1L19
$$ -119 -179 -48 173 303 -16 -114 -455 -367 2 433 179 274 -264 -731 -229 -177 160 270 42 -202 -141 178
4401A78j74L36j05o48J36k9M45q3M57o06k39L0N2N39P1k54m46J75j31O8O18m75
$$ 178 4 340 235 -413 -277 -306 139 56 513 -93 -332 -302 -250 289 360 106 -340 -165 -296 -228 390 -85
4423h5J9k04J18JJ98K35m0j68j54m1Q2N67P4o73j11k19K21K56J05K47n88k96L7
$$ -85 -66 -270 -152 -151 47 282 242 74 -80 -121 -39 528 602 -71 -182 -401 -180 76 181 428 -160 -456 -419
4446d19L52M65q9k4o6k69m90P18K9J86j53k94o8l3M48j69J21m28l22L62K54q9
$$ -419 -67 398 309 285 219 -50 -540 178 207 393 240 -54 -122 -155 293 124 245 -183 -505 -143 111 22
4468B2L59l43l56K11L5M39J01l11k95k33K05O6M40l9j84l32J51l72O92o2k26J25
$$ 22 381 38 -318 -107 -72 367 468 157 -138 -371 -166 -100 340 301 117 -215 -64 -436 256 194 -32 93
4490I3n09J91N3K70L03l96n5l65L80K42J55l27rq5j82L48K54o9q2k26l31l48O14
$$ 93 -416 -225 -172 98 401 5 -50 -415 -35 207 362 35 26 -59 -241 107 361 292 210 -16 -347 -695 -81
4513h1K90rq6k88j84M62R8p9N8j58k54N6J34j25L12P3m35j69L78J01K10k4p9n90
$$ -81 209 200 114 -174 -358 104 202 123 181 23 -231 -175 -41 -166 146 219 -216 -385 -7 94 304 280 201 -389
4537c89j95N43L76K0k53k37Q4k73J72M66k35k40j00K30l18N92K7k22k38k01PK67
$$ -389 -584 -41 335 355 102 -135 -51 -324 -152 314 79 -161 -261 -31 -349 243 270 48 -190 -391 -384 -117
4559a17M33k27L0lj94n7J61Q3J67l81k52K99j73L36R9k29o5l21P4L80K39j55j97
$$ -117 316 89 119 116 -78 -135 26 109 276 -105 -357 -58 -231 105 204 -25 -90 -411 -337 43 282 127 -70
4582g0l21J93J47L7M47m34J87n39o7K47J57j1j47J46j21J97M1J23J22l13r3l8
$$ -70 -391 -198 -51 -14 433 -1 186 -353 -420 -173 -16 -27 -174 -28 -149 48 89 212 334 21 -72 -110
4604a10M67j60K3Nn34j64J36L05L46j49m62J46l63L53N46k31L5j27l70r7K98J33
$$ -110 357 197 220 225 -309 -473 -337 -32 314 165 -297 -151 -514 -161 385 154 189 62 -308 -405 -107 26
4626B6K54m26R5j35L22K74k47j50j31q4K89j05N9l4P6k64k0r0M94L4r0J72l84
$$ 26 280 -146 -51 -186 136 410 163 13 -118 -202 87 -18 41 7 83 -181 -201 -291 203 237 147 319 -65
4649f5p8K54J69J95m41j93L48n17M58J12K03l07l87R1r2L47J02J03k86k70O4P0
$$ -65 -143 111 280 475 34 -159 189 -328 130 242 445 138 -249 -158 -250 97 199 302 16 -254 -190 -120
4671a20L45K85k59o60J75K5J38P8J63k15l22L03m01L56L22k28l31l7Q1O18j91
$$ -120 225 510 251 -409 -234 -209 -71 7 170 -45 -367 -64 -465 -109 213 -15 -346 -383 -302 316 125
4692A25l0k5J4l32J06J72N8L3j81j91j94M34J75K80k86n50j58L04M01J45k61K64
$$ 125 95 70 84 -248 -142 30 88 121 -60 -251 -445 -11 164 444 158 -392 -550 -246 155 300 39 303
4714C03n77l2K49J46oj8l22l5J01J42L31j70o9k56J96j12J76Q4P5o40J1K41K65
$$ 303 -274 -306 -57 89 83 65 -257 -292 -191 -49 282 112 43 -213 -17 -129 47 131 206 -434 -423 -182 83
4737H3qJ31j69k54P3N7R2K71O7l50l22k3M25P6j51j3O1l24L5N04N4M3l05j89j42
$$ 83 75 206 37 -217 -144 -87 5 276 343 -7 -329 -352 73 149 -2 -15 46 -278 -243 261 315 358 53 -136 -278
4762b78J04K16M93n74j95j16J22K51Q7J9m04L97k18l0L56p4J34k60m57k4M02L79
$$ -278 -174 42 535 -39 -234 -350 -228 23 110 129 -275 122 -96 -126 230 156 290 30 -427 -451 -49 330
4784C30j54P8k32m39K58J29L47k98J48k50k4m7L9K41J86k30n60O0N06L8J01j47
$$ 330 176 254 22 -417 -159 -30 317 19 167 -83 -107 -154 -115 126 312 82 -478 -418 88 126 227 80
4806H0k37l22M26L44K27mo18j21N4L84k50K68k79n2j25L7K54J08r5J70n11j41
$$ 80 -157 -479 -53 291 518 514 -104 -225 -171 213 -37 231 -48 -100 -225 -188 66 174 79 249 -262 -403
4828d03L19J85N7r6Q9l66%K51j86L96j96k37%J42K10J23n7l43OL36k71J91Q8q7
$$ -403 -84 101 158 62 151 -215 -215 36 -150 246 50 -187 -187 -45 165 288 231 -112 -106 230 -41 150 238 151
4852A51m60M3P5J90L72Jm57J88k75K70o5J50o6l69k58N61J30N6j37j64k10j73
$$ 151 -309 -266 -191 -1 371 372 -85 103 -172 98 33 183 117 -252 -510 51 181 237 100 -64 -274 -447
4874d47K21M48L6k57k49j56J97J76L30N8k91l60J86O7Q2QK08n10L46j38K67J37
$$ -447 -226 222 258 1 -248 -404 -207 -31 299 357 66 -294 -108 -41 41 49 257 -253 93 -45 222 359
4896C59j79m4k56j98L18J67r9J3O1l40j31L94q7K30k16J42j6k51J02L23K27k95
$$ 359 180 136 -120 -318 0 167 68 81 142 -198 -329 65 -22 208 -8 134 118 -133 -31 292 519 224
4918B24l05k61L84O3L50J00o03O8l76M82j12J09J3l41K30p4j62M24j26j41P9j25
$$ 224 -81 -342 42 105 455 555 -48 20 -356 126 14 123 136 -205 25 -49 -211 213 87 -54 25 -100
4940a00M7L98J24m59k00M8j16L92L1k6Q0j83l31l7M58L0k85m8J25j37M76k24j11
$$ -100 -53 345 469 10 -190 -142 -258 134 165 139 219 36 -295 -332 126 156 -129 -177 -52 -189 287 63 -48
4963d8RJ3J81l75L03J00L5J3l02J15j83J94R7k20k52J7J42J53O8j6k31j31K8K69
$$ -48 -39 -26 155 -220 83 183 218 231 -71 44 -139 55 152 -68 -320 -303 -161 -8 60 44 -187 -318 -290 -21
4987b1J22K5N4J8j99j74N20j46K9m09o8L3R4J83k0L28n10%j59M45n9k41Q7L5o5
$$ -21 101 126 180 198 -1 -175 345 199 228 -181 -249 -216 -122 61 41 369 -141 -141 -300 145 86 -155 -68 -33 -98
5012i8J70J01j7j56j05J00J73l66N53m08o1P4k57Q8K26J71L6m93O8Q7M1L88N2
$$ -98 72 173 156 0 -105 -5 168 -198 355 -53 -114 -40 -297 -209 17 188 224 -269 -201 -114 -73 315 367
5035C67n85K38j21m60P34J55l08O9j93k8K41mJ50k9k60J35m1j76n3M59J97n20
$$ 367 -218 20 -101 -561 173 328 20 89 -104 -132 109 105 255 226 -34 101 60 -116 -169 290 487 -33
5057c3k61m4K74M83m03L2j2j80J88J22J20l61M5L8m18O04qJ25R5k94l05P0K73
$$ -33 -294 -338 -64 419 16 48 36 -144 44 166 286 -75 -30 8 -410 194 186 311 406 112 -193 -123 150
5080A50L79o40j84K07k45L38J05K72j90j74j98j07O54k20J22k75j41j15N38m25
$$ 150 529 -111 -295 -88 -333 5 110 382 192 18 -180 -287 367 147 269 -6 -147 -262 276 -149
5100a49L33J18l13J81J92m5k18K86l12l52M12k10K76j22j09j17k78M67k82L01
$$ -149 184 302 -11 170 362 317 99 385 73 -279 133 -77 199 77 -32 -149 -427 40 -242 59
5120E9o4J58K59l63J20p8M9N5m5o14J10K73L10J6p8n57O4L28N5p3J71m22L21k35
$$ 59 -5 153 412 49 169 91 140 195 150 -464 -354 -81 229 245 167 -390 -326 2 57 -16 155 -267 54 -181
5144a81q2J01J63K80l28j38Q6L39J00k07l9j63N3k1k64L28K05o5k34K7J89K05
$$ -181 -263 -162 1 281 -47 -185 -99 240 340 133 94 -69 -16 -37 -301 27 232 167 -67 -40 149 354
5166C54j72k51j50J13oLJ33O1P7l34j48M72NJ47k81k94K48o8R0J69J6m66M6P5
$$ 354 182 -69 -219 -106 -112 -109 24 85 162 -172 -320 152 157 304 23 -271 -23 -91 -1 168 184 -282 -236 -161
5190a61K16J74l05M1M10n02k15O16j35R0n7o7M7k44K12k38J77J17k75j28j33N56
$$ -161 55 229 -76 -35 375 -127 -342 274 139 229 172 105 152 -92 120 -118 59 176 -99 -227 -360 196
5212A96k10K44l12Q0k6J5K2J52k14n1J36O0o1R9j2r1r4L4l6M15k10k42j6J3K52
$$ 196 -14 230 -82 -2 -28 -13 9 161 -53 -104 32 92 31 130 118 27 -67 -33 -69 346 136 -106 -122 -109 143
5237A43J53P9j33l85J16j54j98N83k22L05l3p9n75K78N10n37L57q9j32q9K50J02
$$ 143 296 375 242 -143 -27 -181 -379 204 -18 287 254 175 -400 -122 388 -149 208 119 -13 -102 148 250
5259B50l43J24l04R8J64j65L42Q6n79K32j07n6L91k20J85l6k06M26k78j42L87
$$ 250 -93 31 -273 -175 -11 -176 166 252 -327 -95 -202 -258 133 -87 98 62 -144 282 4 -138 249
5280B49n19L78J08Rj07j17J78m04K89k15q7N69l22J06l22OJ94J55j75j5O4k89
$$ 249 -270 108 216 225 118 1 179 -225 64 -151 -238 331 9 115 -207 -201 -7 148 -27 -42 22 -267
5302b67K23q2K39J59m2m22J71j37K33N4J0r4p3j4N8j01K87l16kj86J34K94q0n6
$$ -267 -44 -126 113 272 230 -192 -21 -158 75 129 139 45 -28 -42 16 -85 202 -114 -116 -302 -168 126 46 -10
5326a0l3J92k58J55j29J75j21l35J76J39K55m8J48l10P5k48J71J44J18J90o16
$$ -10 -43 149 -109 46 -83 92 -29 -364 -188 -49 206 158 306 -4 71 -177 -6 138 256 446 -170
5347a70J99j86nk3M09q8n9l07K77J31k18N1j52J44q3j08N62j86l85K49q4J99j16
$$ -170 29 -157 -162 -185 224 136 77 -230 47 178 -40 11 -141 3 -80 -188 374 188 -197 52 -32 167 51
5370E1J59l42j02K27k16K72O6m9j17J50l28l9J32L14j42j17K1r3K72J0k5o6jj85
$$ 51 210 -132 -234 -7 -223 49 115 66 -51 99 -229 -268 -136 178 36 -81 -60 -153 119 129 104 38 37 -148
5394a48%K25j18J18L81o64J52j2L3L22k54Kj49p1N5K79n4P8l56J87K16k04o4K10
$$ -148 -148 77 -41 77 458 -206 -54 -66 -33 289 35 37 -112 -183 -128 151 97 175 -181 6 222 18 -46 164
5418A64j29K2k13J05M33m79J90k22j29J37R5K88l53L1l10L51J53k85K12K8m03
$$ 164 35 57 -156 -51 382 -97 93 -129 -258 -121 -26 262 -91 -60 -370 -19 134 -151 61 89 -314
5439c14K21L13q4k5K05m26J60o5J97M6Q2n03J53J94l42M17j90J21P2k80j1N7O8
$$ -314 -93 220 136 111 316 -110 50 -15 182 228 310 -193 -40 154 -188 229 39 160 232 -48 -59 -2 66
5462F6r5J88q3j06n2q2L82j30oK31n90j64M22j24J48L07n29K21J05j26J90k35
$$ 66 -29 159 76 -30 -82 -164 218 88 82 313 -277 -441 -19 -143 5 312 -217 4 109 -17 173 -62
5484f2J09l8j32K03k27K91j95L25n16L60j85K71j93l11L38q3k2K65J85j24j95
$$ -62 47 9 -123 80 -147 144 -51 274 -242 118 -67 204 11 -300 38 -45 -67 198 383 259 64
5505F4k59J4J56J95l5k17p3L23Q1k76J41jJ69k93J62k48R2K83l63j3j13J48J60
$$ 64 -195 -181 -25 170 135 -82 -155 168 249 -27 114 113 282 -11 151 -97 -5 278 -85 -98 -211 -63 97
5528I7r8J99M3m98K48K29k93N4r0J74J86l04J18j60Pj13j02L35k29J37o3R6J39
$$ 97 -1 198 241 -257 -9 220 -73 -19 -109 65 251 -53 65 -95 -88 -201 -303 32 -197 -60 -123 -27 112
5551A12l81K72m0K12n2k9q9j36J08j4J41k5k86K20R4j45K33l02J67j01K29j60
$$ 112 -269 3 -37 175 123 94 5 -131 -23 -37 104 79 -207 13 107 -38 195 -107 60 -41 188 28
5573B8j69J42j51J80j8j01p9M39j32Pl79J97k26K06J13PJ5j35Q7j6J6J71l04K61
$$ 28 -141 1 -150 30 12 -89 -168 271 139 146 -233 -36 -262 -56 57 64 79 -56 31 15 31 202 -102 159
5597A59k54j74L04J45j7j3k47J62j23K01J16m22J49j80R7j06J25P4p%j34P6K4
$$ 159 -95 -269 35 180 163 150 -97 65 -58 143 259 -163 -14 -194 -97 -203 -78 -4 -11 -11 -145 -69 -45
5620d5L1k4n5j45J92NK74j52K55r8l74J00K54j03j27n3l1r8k9K18k25L15k3j39
$$ -45 -14 -38 -93 -238 -46 -41 233 81 336 238 -136 -36 218 115 -12 -65 -96 -194 -223 -5 -230 85 62 -77
5644g7J33P4Q6M5j68l53J53p9J69O0L15m27k10J76J8k6J77l6l29K88q3M9J06K47
$$ -77 56 130 216 261 93 -260 -107 -186 -17 43 358 -69 -279 -103 -85 -111 66 30 -299 -11 -94 -45 61 308
5668C08n16K37j63M1J69o1j75L6J02L3q4P6M4j46K63p2l35K02L50l80kK43k2k14
$$ 308 -208 29 -134 -93 76 15 -160 -124 -22 11 -73 3 47 -99 164 92 -243 -41 309 -71 -73 170 148 -66
5692f6p8j47M02n17L07j04K08J22j16m27K27M14j33K54j92j17m5K45j13J19j52
$$ -66 -144 -291 111 -406 -99 -203 5 127 11 -416 -189 225 92 346 154 37 -8 237 124 243 91
5713I1O6J18j09N7l64L44J44k57l14J26K3k0K64N9k63L02k53j29K12j50O2J95
$$ 91 157 275 166 223 -141 203 347 90 -224 -98 -75 -95 169 228 -35 267 14 -115 97 -53 9 204
5735B04j03k94L09L24k74k5j84P4j50j12N44l35q8J8j72J15L20L8o8l9k19J39
$$ 204 101 -193 116 440 166 141 -43 31 -119 -231 313 -22 -110 -92 -264 -149 171 209 141 102 -117 22
5757B2K42l50L09q9j29k27K61P3k66K86K53k64k2J14k17rL38m76K67j37J06j29
$$ 22 264 -86 223 134 5 -222 39 112 -154 132 385 121 99 213 -4 -13 325 -151 116 -21 85 -44
5779d4M64n90J87M6k4J6l6R8j27J80k54n8J51K32k26J11m95N98k13r4J56N8l02
$$ -44 420 -170 17 63 39 55 19 117 -10 170 -84 -142 9 241 15 126 -369 229 16 -78 78 136 -166
5802a66K20m5J12p3k35n0K5L20q3J24L3o2j8k09k05k3L92j57N0k04K38O8J94l89
$$ -166 54 9 121 48 -187 -237 -212 108 25 149 182 120 102 -107 -312 -335 57 -100 -50 -254 -16 52 246 -143
5826a43j42J79J18M0k43M60k79J17n45K73L6K45j3J18j44K5k9j30n7K47j49Mq2
$$ -143 -285 -106 12 52 -191 269 -10 107 -438 -165 -129 116 103 221 77 102 73 -57 -114 133 -16 -12 -94
5849i4J88K3M8k6R2l01L48n39R5L03l44L43j19M1l47K93r2K9P8j41P2O3j1J39
$$ -94 94 117 165 139 231 -70 278 -261 -166 137 -207 136 17 58 -289 4 -88 -59 19 -122 -50 13 2 141
5873A41L0k39j62K79q4n7q2m4K9L05q6j11K39j63R4j62n4L45j60K04l38O2L9j94
$$ 141 171 -68 -230 49 -35 -92 -174 -218 -189 116 30 -81 158 -5 89 -73 -127 218 58 262 -76 -14 25 -169
5897a69J72k28P9J67l18J81J34J26r1o5j40Q7L92j74p3j78p4M64k93K69k83mQ9
$$ -169 3 -225 -146 21 -297 -116 18 144 53 -12 -152 -65 327 153 80 -98 -172 292 -1 268 -15 -19 70
5920G0L4j24J19M0n3m6m2j54K54j27O4r8j12J72m9J10k9j02K2r7m48N38r0K63
$$ 70 104 -20 99 139 86 40 -2 -156 98 -29 35 -63 -175 -3 -52 58 29 -73 -51 -148 -596 -58 -148 115
5944A15l8J34k20j5K9Q9lj60J49q5J91k54L72m09J56L7k56L8P3l2K29o5k64K00
$$ 115 77 211 -9 -24 5 94 91 -69 80 -5 186 -68 304 -105 51 88 -168 -130 -57 -89 140 75 -189 11
5968A1K57m33J88L4k20m2j7L05j37K12J03l92l4L24m7J01R6m10R7j0L46k78l1
$$ 11 268 -165 23 57 -163 -205 -222 83 -54 158 261 -131 -165 159 112 213 309 -101 -4 -14 332 54 23
5991B3J41j12n3J88J6m22L37n3m48K93J82j92o3N10l91o6Q8J70M7j41K39m67K36
$$ 23 164 52 -1 187 203 -219 118 65 -383 -90 92 -100 -163 347 -44 -110 -22 148 195 54 293 -174 62
6014F2j56L41k56n8K05l13L32m20j25O74n29L1N08m82M56k52o7P4k47M57l64R1
$$ 62 -94 247 -9 -67 138 -175 157 -263 -388 286 -243 -212 296 -186 270 18 -49 25 -222 235 -129 -38
6036c8Q4q7k6L3q4J87N4j40j78K69j50K2J80P0J11k39j50j6R6K8oj7r4J59O4K68
$$ -38 46 -41 -67 -34 -118 69 123 -17 -195 74 -76 -54 126 196 307 68 -82 -98 -2 26 20 3 -91 68 132 400
6062D00l46l08Q8J55J39l4K87l11j59Q8j6o5R3K17j90j26J45k68J41J07j95j07
$$ 400 54 -254 -166 -11 128 94 381 70 -89 -1 -17 -82 11 228 38 -88 57 -211 -70 37 -158 -265
6084b65L94j39J11r0O4j7P5l01k2M44Qk18L9J21m19J73j61K25K4J23J04k19L6
$$ -265 129 -10 101 11 75 58 133 -168 -190 254 262 44 83 204 -215 -42 -203 22 46 169 273 54 90
6107I0K6J79k28J33m66L31J84j67k06J47Q7l79M77j71Q6P0k34P3j47J35L34k94
$$ 90 116 295 67 200 -266 65 249 82 -124 23 110 -269 208 37 123 193 -41 32 -115 20 354 60
6129F0l30J1J49K33k36MK45m44j19J72L58J08k93OL49k13O5j42R7n23N58j09k75
$$ 60 -270 -259 -110 123 -113 -109 136 -308 -427 -255 103 211 -82 -76 273 60 125 -17 80 -443 115 6 -269
6152b69N88j64k32M5N8j46M56m49L29j24n4j1k0l9j01k6K95m4J18j86o1Q1k76
$$ -269 319 155 -77 -32 26 -120 336 -113 216 92 38 27 7 -32 -133 -159 136 92 210 24 -37 44 -232
6175b32J20j48j9N33l97J56J05l51N3K79k87q3L61J09j33j53j28K19j06j7K11
$$ -232 -112 -260 -279 254 -143 13 118 -233 -180 99 -188 -271 90 199 66 -87 -215 4 -102 -119 92
6196I2q6k66K54n4M5L14l13K03L4J19l13L3j22j00k13N60O5o1q0LJ46l30LP5J77
$$ 92 6 -260 -6 -60 -15 299 -14 189 223 342 29 62 -60 -160 -373 187 252 191 111 114 260 -70 -67 8 185
6221A85l18K90j32m10M65J14q9N6l08K96j85J40o9j38o9L36j48M4J45k53K20l29
$$ 185 -133 157 25 -385 80 194 105 161 -147 149 -36 104 35 -103 -172 164 16 60 205 -48 172 -157
6243a57M4K17K84m13k33O98k29j41P7j80R4o0J5q0J29O9m60M03J03k16J62N8n5
$$ -157 -113 104 388 -25 -258 440 211 70 147 -33 61 1 16 -64 65 134 -326 77 180 -36 126 184 129
6266A29M0k8j37J07l36O40j76l32J83J8m83K76M94m87J28k84K33J91k85Q0L31
$$ 129 169 141 4 111 -225 415 239 -93 90 108 -375 -99 395 -92 36 -248 -15 176 -109 -29 302
6287C02l81jk6P7k3l8J95k93K64r1r6L68n3l53J60k74M42l92P0j52K84J2P7R2
$$ 302 -79 -80 -106 -29 -52 -90 105 -188 76 -15 -111 257 204 -149 11 -263 179 -213 -143 -295 -11 1 78 170
6311A70k67J75q4p1N8j28q3O33l98L35k19k40J79p0J07j34L18k36m5L3j87J37
$$ 170 -97 78 -6 -77 -19 -147 -230 403 5 340 121 -119 60 -10 97 -37 281 45 0 33 -154 -17
6333a7J07Q1k9r4r0O3J24j99L0P1j08J10p8l46J60J43N6R4j48J54k43J54m7j65
$$ -17 90 171 142 48 -42 21 145 -54 -24 47 -61 49 -29 -375 -215 -72 -16 78 -70 84 -159 -5 -52 -217
6357b17K72j39j96K55J62l02K06J76l15J56j17n1N4J76K5J9M2j7m05J22L05n26
$$ -217 55 -84 -280 -25 137 -165 41 217 -98 58 -59 -110 -56 120 145 164 206 189 -216 -94 211 -315
6379c15M81k28j12lK82Q5Mr7k9k87M21k6p7j45j35p5L53R2n9Q7k37m1k36J91L05
$$ -315 166 -62 -174 -177 105 190 194 97 68 -219 202 176 99 -46 -181 -256 97 189 130 217 -20 -61 -297 -106 199
6404A99l4q8l68J03M97m61J21r4K88j58M2K1J9k89j49J71M7J79m2O0J39p35P12
$$ 199 165 77 -291 -188 309 -152 -31 -125 163 5 47 68 87 -202 -351 -180 -133 46 4 64 203 -532 180
6427A80k61J43l16L47j11J5J06j19K23k10p7PJ40k10K2J56k00R0K15j91p4O2L09
$$ 180 -81 62 -254 93 -18 -3 103 -16 207 -3 -80 -73 67 -143 -121 35 -165 -75 140 -51 -125 -63 246
6450B46j54j79J86k15L69o66O31j75k43K57j67m6J80L19m28J53j79K63m3N2k40
$$ 246 92 -87 99 -116 253 -413 218 43 -200 57 -110 -156 24 343 -85 68 -111 152 109 161 -79
6471g9J69l54L76m49Q5L43j56J06j6j49Q8J89j10L0m1j28l8N3J93j07J03j46k76
$$ -79 90 -264 112 -337 -252 91 -65 41 25 -124 -36 153 43 73 32 -96 -134 -81 112 5 108 -38 -314
6494c14M27p0r8KkO3l7mK21K60k18k69K85m12K27L7j89L13q3j65j87L39p0kj44
$$ -314 113 43 -55 -53 -55 8 -29 -33 188 448 230 -39 246 -166 61 98 -91 222 139 -26 -213 126 56 54 -90
6519i0p4p5L65Q5L9l90L09l90J95m6k01o2K11J46j99J81j50o1K03q9P4J53J67
$$ -90 -164 -239 126 211 250 -140 169 -221 -26 -72 -273 -335 -124 22 -177 4 -146 -207 -4 -93 -19 134 301
6542C01j65q3k24P8N9q6J68j89J02J16Nj51P0j5j57m0L90l69J21oJ02q1j04N4
$$ 301 136 53 -171 -93 -34 -120 48 -141 -39 77 82 -69 1 -14 -171 -211 179 -190 -69 -75 27 -54 -158 -104
6566a04r5J50L4J31q6K40l50K51j83J47k92j13K25l3K74kK14n24K77P1j81K98
$$ -104 -199 -49 -15 116 30 270 -80 171 -12 135 -157 -270 -45 -78 196 194 408 -116 161 232 51 349
6588C49j12l10R0j37N1om28O58j99j33J39j74R7J53q1k1q8N00n4m85M78m03J38
$$ 349 237 -73 17 -120 -69 -75 -503 155 -44 -177 -38 -212 -115 38 -43 -64 -152 348 294 -191 287 -116 22
6611B2ol67K25L05k48J13k62L21k59J03L71m66P2j0M30j04k68K21k75K50n9j59
$$ 22 16 -351 -126 179 -69 44 -218 103 -156 -53 318 -148 -76 -86 344 240 -28 193 -82 168 109 -50
6633e0Q8j20p2k5K22J44J38l56J50j64j98L56j02J6J90Lj20o7j61L9P2J04j25
$$ -50 38 -82 -154 -179 43 187 325 -31 119 -45 -243 113 11 27 217 220 100 33 -128 -89 -17 87 -38
6656c8o2m8L0Ok1J80j73K31k59L35k73K35j29l2p5j19L19N3l05j16M0R4R2j24
$$ -38 -100 -148 -118 -112 -133 47 -126 105 -154 181 -92 143 14 -18 -93 -212 107 160 -145 -261 -221 -127 -35 -159
6680a59j0K17k79K88k52M95k45J0m2n82L87J01K36l98L46l35j6R9K70k29J74j05
$$ -159 -169 48 -231 57 -195 300 55 65 23 -559 -172 -71 165 -233 113 -222 -238 -139 131 -98 76 -29
6702b9j26k2J98lQ9k74j72M34k22L57l98j75J11J82N0k04M62m52J70J7Qj25k5
$$ -29 -155 -177 21 18 107 -167 -339 95 -127 230 -168 -343 -232 -50 0 -204 258 -194 -24 -7 1 -124 -149
6725a49J97q9j61L52k72l64N67j32qJ9P2Q1P2p8j60r9L96k99j98L9L41j89N2k9
$$ -149 48 -41 -202 150 -122 -486 81 -51 -59 -40 32 113 185 107 -53 -152 244 -55 -253 -214 127 -62 -10 -39
6749c9j51n1L18J33k82j5J05l0ll26O31n18J52R4Q6J8p2L4j75M6Q6K0Qj17J17
$$ -39 -190 -241 77 210 -72 -87 18 -12 -15 -341 290 -228 -76 18 104 122 50 84 -91 -45 41 61 69 -48 69
6774F9o4k80j1J96M8J63k66Q2J48l68J40L40k15J29k45kL4j74J32N7N0o6N7l4
$$ 69 5 -275 -286 -90 -42 121 -145 -63 85 -283 -143 197 -18 111 -134 -136 -102 -276 -144 -87 -37 -103 -46 -80
6798h0K77l37M6K05j63kj25N80l79j64J91j81R1M5q8o3J65m33P02j73p1k39K39
$$ -80 197 -140 -94 111 -52 -54 -179 401 22 -142 49 -132 -41 4 -84 -147 18 -415 287 114 43 -196 43
6821D3k49O8K42O4k71J88l55N8L32M1k14j58K47J64l03q4L85r1k43J14j10l0m0
$$ 43 -206 -138 104 168 -103 85 -270 -212 120 161 -53 -211 36 200 -103 -187 198 107 -136 -22 -132 -162 -202
6844b02K34j15J52j5j43L7J76K87m73k7l31L81J55j30l94K75m3N3o4J79J88j13
$$ -202 32 -83 69 54 -89 -52 124 411 -62 -89 -420 -39 116 -14 -408 -133 -176 -123 -187 -8 180 67
6866F7N6J20l95K11M2M7l49J32J21K4P3j15j4k21J81K5o8J21k20M42l91k11L54
$$ 67 123 243 -152 59 101 148 -201 -69 52 76 149 34 20 -201 -20 5 -63 58 -162 280 -111 -322 32
6889C2o3K07J74l45j4qL18m86L02l0j20j81K91k8M1M9j99n6l27L36L73J53o34
$$ 32 -31 176 350 5 -9 -17 301 -185 117 87 -33 -214 77 49 90 139 -60 -116 -443 -107 266 419 -215
6912b15K13j41J69on7J16l78J64l1J33Q9K3J03k75nK94j42k4J64k22L3k80K01
$$ -215 -2 -143 26 20 -37 79 -299 -135 -166 -33 56 79 182 -93 -98 196 54 30 194 -28 5 -275 -74
6935g4Q7n3LJ10n3j54p4K70q0R1k06J34j75j72N25l38NM4R2K16m71M31K3n07J67
$$ -74 13 -40 -37 73 20 -134 -208 62 -18 73 -133 1 -174 -346 179 -159 -154 -110 -18 198 -273 158 181 -326 -159
6960a59J17L23j56p8N9R5j24J6q2n1r1R0o1J11j67J67J6LJ64o5N9l33K83k94K06
$$ -159 -42 281 125 47 106 201 77 93 11 -40 -131 -41 -102 9 -158 9 25 28 192 127 186 -147 136 -158 48
6985D8k42L77m61L16N0j07j67K01J05k56K23L1k31J85K12n13K90J30q0k57Q7M5
$$ 48 -194 183 -278 38 88 -19 -186 15 120 -136 87 118 -113 72 284 -229 61 191 111 -146 -59 -14
7007a4Q7m2j04N1n7p7J00j35M60l87R8j11j59K53k5J95O6j46k32J34j47Q5K32
$$ -14 73 31 -73 -22 -79 -156 -56 -191 269 -118 -20 -131 -290 -37 -62 133 199 53 -179 -45 -192 -107 125
7030A25k10K09k31K74j36L1J58k82J99n83M10L39k02k6k43L18k16P4l6r0J83J55
$$ 125 -85 124 -107 167 31 62 220 -62 137 -446 -36 303 101 75 -168 150 -66 8 -28 -118 65 220
7052B20k29J46r9j75k1J17l71J38N46k49N0q0J6n5l21N06o4k36N6l12L25J49m
$$ 220 -9 137 38 -137 -158 -41 -412 -274 272 23 73 -7 9 -46 -367 139 75 -161 -105 -417 -92 57 53
7075E3r5J08q0M8j28j10R0J73M31p76J21rL84k29L1nJ12J49k78R3P4p9k16n3k4
$$ 53 -42 66 -14 34 -94 -204 -114 59 490 -286 -165 -174 210 -19 12 7 119 268 -10 83 157 78 -138 -191 -215
7100b15L21k37N8J58j57mM4J04o1J8p9k25L13K5j39k51O07k50r9n6J48K66l01
$$ -215 106 -131 -73 85 -72 -76 -32 72 11 29 -50 -275 38 63 -76 -327 280 30 -69 -125 23 289 -12
7123a2j84j23M43n4Q1j35L32k06l45O9J13n7L86n23J59q9L67J88m74p6M1J64l33
$$ -12 -196 -319 124 70 151 16 348 142 -203 -134 -21 -78 308 -215 -56 -145 222 410 -64 -140 -99 65 -268
7146b68O44k7k48j28O9K05j50q9K19o8j98J99J65l32J40j81L4P0QK21k57j41J60
$$ -268 376 349 101 -27 42 247 97 8 227 159 -39 160 325 -7 133 -48 -14 56 64 285 28 -113 47
7169D7J16l30N0K84j05j00M6O7j16l9M6j65L07m25J99P6Q4N2j14r2k14M03kJ38
$$ 47 163 -167 -117 167 62 -38 8 75 -41 -80 -34 -199 108 -317 -118 -42 42 94 -20 -112 -326 77 75 213
7193B13o7l54L07j13m08M99k17J04J98j16q8J04l18K74o8J28J49o36M88j14J95
$$ 213 146 -208 99 -14 -422 77 -140 -36 162 46 -42 62 -256 18 -50 78 227 -409 79 -35 160
7214A60J17m58J38L7J60l62R4K23o0J25p1k19K30J00l39k2J26j0j78J45J61o4
$$ 160 277 -181 -43 -6 154 -208 -114 109 49 174 103 -116 114 214 -125 -147 -21 -31 -209 -64 97 33
7236C3j87J95O0j79P9J07j50r4k15L06NJ32l1k46K1j4J59j1K38k57K65j86p2O0
$$ 33 -154 41 101 -78 1 108 -42 -136 -351 -45 -40 92 61 -185 -164 -178 -19 -30 208 -49 216 30 -42 18
7260A8P7p2j90K88l54J44J56k06J84m8n6J35qj75K39k05R6r7J72l55K95l33J88
$$ 18 95 23 -167 121 -233 -89 67 -139 45 -3 -59 76 68 -107 132 -73 23 -74 98 -257 38 -295 -107
7283a07J11j2r1M9j16J31o7j33K11j31J41n2r3K8MkQJ38m6K49k54J5N3M5j87J03
$$ -107 4 -8 -99 -50 -166 -35 -102 -235 -24 -155 -14 -66 -159 -131 -127 -129 -121 17 -29 220 -34 -19 34 79 -108 -5
7309el3l3j50L49j92K1j52N9K46L01p17n5L34o2n0RO6J02l33K55j06L25p8l08
$$ -5 -38 -71 -221 128 -64 -43 -195 -136 110 411 -306 -361 -27 -89 -139 -130 -64 38 -295 -40 -146 179 101 -207
7333b07M97n21L25k13Q0J87k08J40l07Q3L3l0r8J48Q3l62L06K27j51K5j50n7K34
$$ -207 290 -231 94 -119 -39 148 -60 80 -227 -144 -111 -141 -239 -91 -8 -370 -64 163 12 37 -113 -170 64
7356F4r4J57n6n4J24k58L01j14k34J20q0NM26k43K05l78J54N1l30O19k49k4j49
$$ 64 -30 127 71 17 141 -117 184 70 -164 -44 -124 -119 307 64 269 -109 45 96 -234 385 136 112 -37
7379c7J47Jm67L46K95p14N66k31K03k55j17L75q3j4j22J5K3j85L76j40j10J61
$$ -37 110 111 -356 -10 285 -429 137 -94 109 -146 -263 112 29 15 -107 -92 -69 -254 122 -18 -128 33
7401C3j83P7K36k33J3J2p9j4j33K92j77L39l53m6J64j3j06K56kj01k47M31K67
$$ 33 -150 -73 163 -70 -57 -45 -124 -138 -271 21 -156 183 -170 -216 -52 -65 -171 85 83 -18 -265 166 433
7424D33m55j1p2N8J41L0l17K27k09j63J42J79k40J86J89j51l87M26rk96J48L18
$$ 433 -22 -33 -105 -47 94 124 -193 34 -175 -338 -196 -17 -257 -71 118 -33 -420 6 -3 -299 -151 167
7446A67n5k34M8M42o91M40m7k62k42K06O38m03r1J25l04K10m1J91jK50m23J07
$$ 167 112 -122 -74 368 -323 117 70 -192 -434 -228 410 7 -84 41 -263 -53 -94 97 96 346 -77 30
7468C0j62K0J05%J57k26P4P9l1K9j8l89L61o4K97k84J05l09P3J1J27k48L41R1
$$ 30 -132 -112 -7 -7 150 -76 -2 77 46 75 57 -332 29 -35 262 -22 83 -226 -153 -142 -15 -263 78 169
7492A69K8j61j6J11q3J11j32j26o2Q5O2J71p2k66K94p2J45L8o2j65J6k07oJ52
$$ 169 197 36 20 131 48 159 27 -99 -161 -76 -14 157 85 -181 113 41 186 224 162 -3 13 -194 -200 -48
7516d8k2K22P1l55J53j42J91r0K94l82k74P6K41J7J71k34J7K96j66r0KJ37k01
$$ -48 -70 152 223 -132 21 -121 70 -20 274 -108 -382 -306 -65 -48 123 -111 -94 202 36 -54 -52 85 -116
7539a16J02k92L98K25j77K6k52J90j19J46k24J0O0m36L14M57m16M52n03J93l61
$$ -116 -14 -306 92 317 140 166 -86 104 -15 131 -93 -83 -23 -459 -145 312 -104 348 -155 38 -323
7560c23K77j09R0O2L0J67k14j29J33m1n5J99k76K14J9j86J28j60m5lK27M2J96
$$ -323 -46 -155 -65 -3 27 194 -20 -149 -16 -57 -112 87 -189 25 44 -142 -14 -174 -219 -222 5 47 243
7583B43k10j89J59j21K80l77L49k42l6J23j50K73o2P6k35K50j21N7q1q4K3l20
$$ 243 33 -156 3 -118 162 -215 134 -108 -144 -21 -171 102 40 116 -119 131 10 67 -14 -98 -75 -395
7605c95N19k23J4N99l94l57J90k21K52P9j23J02j13J17K27Q5p6l55o7K09J53k4
$$ -395 124 -99 -85 514 120 -237 -47 -268 -16 63 -60 42 -71 46 273 358 282 -73 -140 69 222 198
7627A98o4l6N2j39M5m50M70Q6qk19P2l3PR6j68k2K48l16k1P3M25j18K80k72l19
$$ 198 134 98 150 11 56 -394 76 162 154 -65 7 -26 -19 77 -91 -113 135 -181 -202 -129 296 178 458 186 -133
7652a33J32k29K19K20k20k2k22M18k09L10j65k45J23o4J07j67K09M9n4Q8m86K70
$$ -133 -1 -230 -11 209 -11 -33 -255 163 -46 264 99 -146 -23 -87 20 -147 62 111 57 145 -341 -71
7674g1J76n1l34J22j87K71K20r6J13l48K41o9K02j33j30N2J19m04J31j24K83o3
$$ -71 105 54 -280 -158 -345 -74 146 50 163 -185 56 -13 189 56 -74 -22 97 -307 -176 -300 -17 -80
7696h0J09j00J68J58m86J53K3K50l82K52J80k6j09n10M99k54J81Q1r7n4r2Q7R
$$ -80 29 -71 97 255 -231 -78 -55 195 -187 65 245 219 110 -400 99 -155 26 107 10 -44 -136 -49 -40
7719d0L61m88J82N7n7j15j75P87m64j23j3k24N2K20J7m1J04OM3N3m6j38J61l26
$$ -40 321 -167 15 72 15 -100 -275 512 48 -75 -88 -312 -260 -40 -23 -64 40 46 89 142 96 -42 119 -207
7743b07j95K49O1K78k31K09k27m6M1k51L82j95K26j73O5lQ1L0o6R4l35J87K93
$$ -207 -402 -153 -92 186 -45 164 -63 -109 -68 -319 63 -132 94 -79 -14 -17 64 94 28 122 -213 -26 267
7766B67n88L67K6k36L45l13M58m73J09o0K34q2K63m35M8J36j58J12j38q0O10p49
$$ 267 -321 46 72 -164 181 -132 326 -147 -38 -98 136 54 317 -118 -70 66 -92 20 -118 -198 412 -337
7788c37J13K97m67N45k30O8n3J8Q6k3RP9n1k37J4L29k35K40k79L70j99q6K36l03
$$ -337 -224 73 -394 151 -79 -11 -64 -46 40 17 26 105 54 -183 -169 160 -75 165 -114 256 57 -29 207 -96
7812i6J91Q6j31M9j97k6j55J97R0k08J00J87j02J3k25K67J07j01J03k54MJ11p0
$$ -96 95 181 50 99 -98 -124 -279 -82 8 -200 -100 87 -15 -2 -227 40 147 46 149 -105 -101 10 -60
7835f0M1L3k76O5J55r6l5Q4qJ8O9J35j00O4J28j41Oq2k53M31r9k77K77p1qJ60
$$ -60 -19 14 -262 -197 -42 -138 -173 -89 -97 -79 -10 125 25 89 217 76 82 0 -253 178 79 -198 79 8 0 160
7861A60l72j9L43k9R3k8q8k3k41p5L36J33l22jJ4LJ00J40lj75l31K43J39J98l06
$$ 160 -212 -231 112 83 176 148 60 37 -204 -279 57 190 -132 -133 -119 -116 -16 124 121 -54 -385 -142 -3 195 -111
7886a11R4K49j84pj95M30k49k9K87k83j53O7N9J84k04j4k47L32J98l58L13j95
$$ -111 -17 232 48 41 -154 276 27 -2 285 2 -151 -84 -25 159 -45 -59 -306 26 224 -134 179 -16
7908a6M5L51l48N1J3k3K25l18K68k47K19r9q2j05j45p1N50l91M74m66K23m2n7
$$ -16 29 380 32 83 96 73 298 -20 248 1 220 121 39 -66 -211 -282 268 -123 351 -115 108 66 9
7931IP2l06J97J6O6k57J30qK66k46k12J59k5Q6J33P7j90J81l71L38j10jk8l04
$$ 9 81 -225 -28 -12 54 -203 -73 -81 185 -61 -273 -114 -139 -53 80 157 -33 148 -223 115 5 4 -24 -328
7955c28L14K68m30J18J49l20j0RM95j18m80J65P3j65L51L5Q7j59j79m4R4K37j59
$$ -328 -14 254 -176 -58 91 -229 -239 -230 265 147 -333 -168 -95 -260 91 126 213 54 -125 -169 -75 162 3
7978Cj86K12r6K18j4j23Q7q1l1k56J12Q2p4MP5R7l54L17O9K7j93K90l33M9J22
$$ 3 -183 29 -67 151 137 14 101 20 -11 -267 -155 -73 -147 -143 -68 29 -325 -8 61 88 -105 185 -148 -99 23
8003B3N9L18o81J95K67l54L40k11L10k48K7L3k5j79j19M10k28j70R3lP7L75k13
$$ 23 82 400 -281 -86 181 -173 167 -44 266 18 45 78 53 -126 -245 165 -63 -233 -140 -143 -66 309 96
8026I6k26K75L4l96J94J01j57Q4k66J13J63J13l84J46K42l76L84O8m22N06p2j79
$$ 96 -130 145 179 -217 -23 78 -79 5 -261 -148 15 128 -256 -110 132 -244 140 208 -214 292 220 41
8048D1r8L03jk80J54j18J25j39R1j78J25O5j78N0o8K06m62L61L13k91R6j25j71
$$ 41 -57 246 245 -35 119 1 126 -13 78 -100 25 90 -88 -38 -106 100 -362 -1 312 21 117 -8 -179
8071a79M9L3K0L23k07R1o2j05n1j07L57J70n15R5K60j58j32j86R4M05j93J96j43
$$ -179 -130 -97 -77 246 39 130 68 -37 -88 -195 162 332 -183 -88 172 14 -118 -304 -210 195 2 198 55
8094E5j38M00k98r9m1M03k62O7r3m2K82l52R7J42k89J75k36J48L21k01K81l16
$$ 55 -83 317 19 -80 -121 282 20 87 -6 -48 234 -118 -21 121 -168 7 -229 -81 240 39 320 4
8116DJ42R5J2k63j33K31j96j4J29k17q9M95j7j33L42l06J18l45M73j51l26K72
$$ 4 146 241 253 -10 -143 88 -108 -122 7 -210 -299 196 179 46 388 82 200 -145 328 177 -149 123
8138A23j24K22o22M04L2j05j41M21m81J69K15k3r5J16k81J53J74K01l17J41k39
$$ 123 -1 221 -401 3 35 -70 -211 210 -271 -102 113 90 -5 111 -170 -17 157 358 41 182 -57
8159e7m13N90JK77r5k30j85J29O9m4o7k9J65k52K48K09k63Q5k91P7j28K39R3j27
$$ -57 -470 120 121 398 303 73 -112 17 86 42 -25 -54 111 -141 107 316 53 138 -153 -76 -204 35 128 1
8183Ak03j72L69j4k81N98m97K53
$$ 1 -202 -374 -5 -19 -300 298 -199 54
8191E4
$$ Imaginary data points
##PAGE= N=2
##DATA TABLE= (X++(I..I)), XYDATA
0@%%%%%%qJ6qQj6J6k4L2l2M0n3O1p2Q8j01J18j39J57j82K09k34K67l06L43l86
$$ 0 0 0 0 0 0 0 -8 8 0 8 -8 8 -16 16 -16 24 -29 32 -40 48 -53 65 -74 83 -99 110 -124 143 -163 180 -206
31b06M39m90N45o11O80p53Q38r31J031j144J266j402J554j718J904k117K358k634
$$ -206 233 -257 288 -323 357 -396 442 -489 542 -602 664 -738 816 -902 1002 -1115 1243 -1391
49a391K958l338L791m352N056n976P240r078J2021j7515L1189j25722k58827K11449
$$ -1391 1567 -1771 2020 -2332 2724 -3252 3988 -5090 6931 -10584 20605 -105117 -363944 -152495
63a52495L36446J33935k16164k89508q0022K05614K49174N1715j92916k18002
$$ -152495 183951 317886 101722 -187786 -267808 -62194 186980 238695 45779 -172223
73a72223l8154J66811J93292M4740j50969k03986n4268J77112K32752L3678k20545
$$ -172223 -210377 -43566 149726 194466 43497 -160489 -214757 -37645 195107 228785 8240
84H240k30526K1870K58223K05845p7823k80567j68930J28870K80758J13979j71795
$$ 8240 -222286 -200416 57807 263652 185829 -94738 -263668 -134798 145960 259939 88144
95H8144k58408o3463J83296K26052M1568j71314k05173l7201J67590K08160M1203
$$ 88144 -170264 -233727 -50431 175621 217189 45875 -159298 -196499 -28909 179251 220454
106B20454j73043k21212m4517J87493K32994K9481k17593k38908K36K42683K22443
$$ 220454 47411 -173801 -218318 -30825 202169 231650 14057 -224851 -224615 18068 240511
117B40511l6389k49255j87299P2480K44763J51621r4951k27446j17658J02976
$$ 240511 204122 -45133 -232432 -159952 84811 236432 141481 -85965 -203623 -100647
127a00647K03509Q9549j09823j92728p8783J14815J90298O4380j31297j88115
$$ -100647 102862 192411 82588 -110140 -188923 -74108 116190 180570 49273 -138842
137a38842m2170J53780J88721K0557j73930j83352P994J92529J66432m2377k05587
$$ -138842 -181012 -27232 161489 182046 8116 -175236 -167242 25287 191719 149342 -56245
148e6245j49432O1046K03189J34199p3725k06977j26168Q9861K16784J18287j03188
$$ -56245 -205677 -144631 58558 192757 119032 -87945 -214113 -124252 92532 210819 107631
159A07631k17300j05211J17999K18593Q8783j37806k18388o6044J51718J98523
$$ 107631 -109669 -214880 -96881 121712 210495 72689 -145699 -211743 -60025 138498
169A38498L5518j54295j72548j5766J48914J56300P325j40585j40874L637J40848
$$ 138498 174016 19721 -152827 -168593 -19679 136621 143946 3361 -137513 -133876 6972
180F972J33375j1544j49463j35746K5519J67242J29177n9010j89132j08121R8832
$$ 6972 140347 128803 -20660 -156406 -130887 36355 165532 106522 -82610 -190731 -91899
191i1899J98591P7184j29070j88408l6823J52965J70357N008j55797j44919R680
$$ -91899 106692 183876 54806 -133602 -170425 -17460 152897 157905 2108 -142811 -133131
202a33131J40906J26661p620j30399j30666m467J31783J44874J1354j43812j56484
$$ -133131 7775 134436 126816 -3583 -134249 -138716 -6933 137941 149295 5483 -151001
213a51001J111J71923J63611k8526j95129j45814O7469J99689J04220j01737j84195
$$ -151001 -149890 22033 185644 157118 -38011 -183825 -116356 83333 187553 85816 -98379
224i8379o3106J13529J53334K9244j09321j19938r159R7883J01083J0941q1925
$$ -98379 -161485 -47956 105378 134622 25301 -94637 -103796 -5913 95170 106111 24186
235B4186r8698k1047Q4740J12804J9184j10194j30463l663J39461J31315k9590
$$ 24186 -74512 -95559 -10819 101985 121169 10975 -119488 -123151 16310 147625 118035
246A18035j65713j17934O8375J82722R1956j01101j75826n6725J16321J53618
$$ 118035 -47678 -165612 -97237 85485 177441 76340 -99486 -156211 -39890 113728
256A13728L0151j12667j33613k5867R6253J18413K8699q5763j17991l7294Q4147
$$ 113728 143879 31212 -102401 -128268 -32015 86398 115097 29334 -88657 -125951 -41804
267d1804J28611M3160r2974j37379l1199J14696J36427M247j33728j22534K5439
$$ -41804 86807 129967 36993 -100386 -131585 -16889 119538 123785 -9943 -132477 -107038
278a07038J37858R2563n3595j34910o4359P1368J21664M1070p4491j04300k5980
$$ -107038 30820 123383 69788 -65122 -129481 -58113 63551 104621 30130 -74170 -100150
289a00150P5064R8013K3232p6251j00483k2988Q1497J06136J6205r7759j14602
$$ -100150 -25086 72927 96159 19908 -80575 -103563 -22066 84070 100275 2516 -112086
300a12086o731J13572J16147p430j25121j07364K6222J32778R8569l7117j30450
$$ -112086 -118817 -5245 110902 103472 -21649 -129013 -102791 29987 128556 91439 -39011
311c9011q6898M4522J25038P4700n0503j20927o7921N3059J15812N9543n8215
$$ -39011 -125909 -81387 43651 118351 67848 -53079 -121000 -67941 47871 107414 49199
322D9199j10350m4884O8000J07198L1766p3460r6279j5384P8318Q5201Q88q1891
$$ 49199 -61151 -106035 -38035 69163 100929 27469 -68810 -84194 -5876 79325 80213 -1678
334a678p7348P471Q1886P0537j4434q6262o8181K4963R8059O9634l5750j08431
$$ -1678 -79026 -71555 10331 80868 66434 -19828 -88009 -63046 35013 104647 68897 -39534
346c9534o3580N5304J18315N1524p5060j21991l6185Q6716J12826J7047r2584
$$ -39534 -103114 -47810 70505 122029 46969 -75022 -111207 -24491 88335 105382 12798
357A2798r9070m947Q6846Q7282N424p4322p9309r716O8580Q1993J4695p0627q9155
$$ 12798 -86272 -91219 -4373 82909 88333 14011 -65298 -75014 -6434 75559 90254 19627 -69528
370f9528j5782P9596R0164L30r5408q5524K2798J05776O7261m6848j03170l8560
$$ -69528 -85310 -5714 84450 84780 -10628 -96152 -73354 32422 99683 52835 -50335 -88895
382h8895O6491R1195J3800p3046p3421K966O6538N5698r693n9842n1446K150N3869
$$ -88895 -22404 68791 82591 9545 -63876 -60910 5628 61326 51633 -8209 -59655 -57505 -3636
395c636N8923O272o0185p2027o060P8890Q5403m706r8240q8025K3864J12775P5703
$$ -3636 55287 61559 1374 -70653 -76713 2177 87580 82874 -15366 -103391 -79527 33248 108951
408A08951m8428j18303n6344O2683J05693L3730o5244q5112j7489N7238O8194
$$ 108951 60523 -57780 -114124 -51441 54252 87982 22738 -62374 -79863 -22625 45569
419D5569J5452m2705n6435j9726L2975N6242K6219l5972o6911k7680M6878P4750
$$ 45569 61021 18316 -38119 -57845 -24870 31372 57591 21619 -45292 -72972 -26094 48656
431D8656J5375o5989p3709Q084Q3836O3806l0862q8203m3093N1745Q5080K3188
$$ 48656 64031 -1958 -75667 -67583 16253 80059 49197 -39006 -82099 -30354 54726 77914
443G7914o1968p5229r896N9264O2725M696n3174n8636q753M9388O3373J7834m9207
$$ 77914 15946 -59283 -69179 -9915 52810 57506 4332 -54304 -63057 -13669 49704 67538 18331
456A8331p0044j8839N7421P9862J5225o8829q2017o235P6542P4981r196q0779
$$ 18331 -51713 -70552 -13131 66731 81956 13127 -68890 -75125 1417 76398 67202 -13577
468a3577o2187K1392P6978M7640k7663o6516l2397L1507N9517K4755l2341n2625
$$ -13577 -75764 -54372 22606 70246 42583 -23933 -56330 -24823 34694 59449 27108 -25517
480b5517j9082L2589M8755J2812l7836n0483r116M3875N1057L409n1144n0158
$$ -25517 -44599 -12010 36745 49557 11721 -38762 -47878 -4003 47054 50463 -681 -50839
492e0839O517N9516N0813j3646o5239m8201K0687O9503M3832k9791p5237m1198
$$ -50839 -44322 15194 66007 52361 -12878 -61079 -40392 29111 72943 43152 -32085 -73283
504g3283L5372P5034L4825m0638p3169k8157M5337O9766K2980m4644o1861j7097
$$ -73283 -37911 37123 71948 31310 -41859 -70016 -24679 45087 68067 23423 -38438 -55535
516e5535M1392N4513J2653l9475n0733j4201L5779M7273J1591l7630m7430o063
$$ -55535 -14143 40370 53023 13548 -37185 -51386 -15607 31666 43257 5627 -41803 -47866
528d7866M3168M7443j138n0040m2679J5238N7251L3990l0418o1323k2886M1026
$$ -47866 -4698 42745 41607 -8433 -51112 -35874 21377 55367 24949 -36374 -59260 -18234
540a8234N7294Q759m8721n1222N91M9580M5123l452m4278l9992K480M1511M2650
$$ -18234 39060 47819 -902 -52124 -51533 -1953 43170 39718 -4560 -44552 -42072 -561 42089
553D2089L526m1540m9964q883M5725N6430N670n5661o0180J807O4524N6938j3275
$$ 42089 45615 4075 -45889 -54772 -9047 47383 53053 -2608 -62788 -60981 3543 60481 47206
566D7206o6862m3880K6941O3816K9740l2941n2549j5130L1497L8735N279k7490
$$ 47206 -19656 -63536 -36595 27221 56961 24020 -28529 -43659 -12162 26573 31852 4362
578D362k9980l951K1756K6054P125j8808k8852q533K6722L8720P370l8519m3615
$$ 4362 -25618 -29569 -7813 18241 25366 6558 -22294 -30827 -4105 34615 41985 3466 -40149
591d0149L454N0949M2278j7990o1983l6634L0835O4575K4908m1097n9500j2628
$$ -40149 -36695 14254 56532 38542 -23441 -60075 -29240 35335 60243 19146 -40354 -52982
603e2982M4441N1447Q211l7648m2069q461L0030L8924J2853k6296m1897j8273
$$ -52982 -8541 42906 51117 13469 -28600 -37061 -7031 31893 44746 18450 -23447 -41720
615d1720K4014M4672J9270k8708m8620j4746L6976M8865N827m2792m0521P969
$$ -41720 -17706 26966 46236 17528 -31092 -45838 -8862 40003 45830 3038 -37483 -29514
627b9514M4932K8941j9528m3576j8169K5318L6965O831k9340l2199j338K9213
$$ -29514 15418 44359 24831 -18745 -36914 -11596 25369 32200 2860 -29339 -30677 -1464
639a464K8735O61k7277k7906l31K8698L1853K392l2895l7505k881L7466M0063
$$ -1464 27271 27932 655 -27251 -27582 1116 32969 35361 2466 -35039 -37920 -454 39609
652C9609j111m5324m2796N980M9414M1165j1652n1764l4401J9065N0872K7591
$$ 39609 38498 -6826 -49622 -43642 5772 46937 35285 -16479 -50880 -31815 19057 46648
664D6648k2012m5171k0633K1099L6816J4432k0402l1880j2006J7548K6580R740
$$ 46648 24636 -20535 -41168 -20069 16747 31179 10777 -21103 -33109 -15561 11019 20759
676B0759j5029k3738p836J7172K5731P664k1015k7956k337K8493K7763o584l6140
$$ 20759 5730 -18008 -25844 -8672 17059 24723 3708 -24248 -26585 1908 29671 23087 -13053
689a3053k6839J3949M1482K2348k2991m4058j5244L1733M3912R158l2634l7966
$$ -13053 -39892 -25943 15539 37887 14896 -29162 -44406 -12673 31239 40397 7763 -30203
701c0203m537L1308L3920L858k8289l2152o970K3684L1205J0249k1909l4022j1710
$$ -30203 -34740 -3432 30488 34346 6057 -26095 -33065 -9381 21824 32073 10164 -23858 -35568
714c5568K3544L8147J3139k6936l8479o117L2963L4970l082l6352k7227J1269
$$ -35568 -12024 26123 39262 12326 -26153 -32270 693 35663 32581 -3771 -30998 -19729
726a9729L4245J5823j9565l0080n550K2906K4051r65k1780j6443M548J9433J5374
$$ -19729 14516 30339 10774 -19306 -24856 -1950 22101 21136 -644 -17087 -12539 6894 22268
739B2268k016j7874j8989k216J9821K4329K356k7303l1824n8L5564L4171n593
$$ 22268 20252 2378 -16611 -18827 994 25323 27679 376 -31448 -31506 4058 38229 32636
752C2636m1296l1926J4480M6440K6329k1798m3758j7150K3486L4927R415k1191
$$ 32636 -8660 -40586 -26106 20334 46663 24865 -18893 -36043 -12557 22370 31785 10594
764A0594k8106q571J4628K1832Q996j0260j8519r905Q020J9913J3291q997k3389
$$ 10594 -17512 -26083 -11455 10377 19373 9113 -9406 -19311 -11291 8622 21913 12916 -10473
777a0473j2474J5814K5763L192k5300k4004N832K8759J8013j4830l1570j1841
$$ -10473 -22947 -7133 18630 21822 -3478 -27482 -21650 7109 25122 10292 -21278 -33119
789c3119K3854L2402N099k7417k7622J625K6498K2462k132k2606k1759k451J8152
$$ -33119 -9265 23137 28236 819 -26803 -25178 1320 23782 21650 -956 -22715 -25166 -7014
802g014K3043N950j8789k6030q421K0319L1017J0617k3194l3158o465K8672L2770
$$ -7014 16029 21979 3190 -22840 -31261 -10942 20075 30692 7498 -25660 -32125 -3453 29317
815B9317k05l2310k6804O574K9388J7651j1826k4938j0154J4131J9426M575j2829
$$ 29317 29112 -3198 -30002 -23428 5960 23611 11785 -13153 -23307 -9176 10250 14825 1996
828A996j2596P41J1499R838q8r342j0942k238J0632J4277J816j6919j9838L13
$$ 1996 -10600 -9859 1640 11478 11390 2048 -8894 -11132 -500 13777 15593 -1326 -21164 -20851
842b0851K3652K2826m017k8860k2511J0899L4571K1270j6340l5222j5515J9538
$$ -20851 2801 25627 21610 -7250 -29761 -18862 15709 36979 20639 -14583 -30098 -10560
854a0560L1517R732j9869k7166q019J5803K2265P812j1916j8803p615R206J7859
$$ -10560 20957 30689 10820 -16346 -24365 -8562 13703 21515 9599 -9204 -16819 -7613 10246
867A0246J0938o474j8754j2117Q356K0362R306j4255k1614m032J7789J7691l847
$$ 10246 21184 14710 -4044 -16161 -7805 12557 21863 7608 -14006 -18038 -249 17442 13595
880A3595k0878j2576J1699K2960O819j7701k0203R4K0348J7556n076j9993j4844
$$ 13595 -7283 -19859 -8160 14800 21619 3918 -16285 -16191 4157 21713 16637 -3356 -18200
893a8200K935J6655J3610j018j5649j6483k376J5932K1239O120j7527k5164n419
$$ -18200 -15265 1390 15000 13982 -1667 -18150 -20526 -4594 16645 22765 5238 -19926 -25345
906b5345K2341K7774J669k6219k6616K028K6821K0057p688k5062j4261J0171K0892
$$ -25345 -3004 24770 26439 220 -26396 -24368 2453 22510 14822 -10240 -24501 -14330 6562
919F562P858r861j3625k657Q522R043J816n624o969k233L657O992K658o702j0702
$$ 6562 14420 4559 -9066 -11723 -3201 5842 7658 2034 -4935 -7168 -3511 3481 6139 -563 -11265
934a1265k745J0999J4262J36j6845j5241N773K3618J5488j0986k6579j2752J6522
$$ -11265 -14010 -3011 11251 11387 -5458 -20699 -14926 8692 24180 13194 -13385 -26137 -9615
947i615K6992P295j9277k5191m684J7890K0762L527j4105j6631l643J0794J5280
$$ -9615 17377 24672 5395 -19796 -24480 -6590 14172 17699 3594 -13037 -16680 -5886 9394
960I394P990o521j5433j0123N678J7254J1204q416k0216r784J1388J9974M061
$$ 9394 17384 10863 -4570 -14693 -9015 8239 19443 11027 -9189 -18973 -7585 12389 16450
973A6450j5045j5961L430J7785J0213q645j5870k975J3387J3004k830j5236r813
$$ 16450 1405 -14556 -11126 6659 16872 8227 -7643 -10618 2769 15773 12943 -2293 -12106
986a2106N156J2559O741m926j0999p595K007J0358J1746K169j1705j5987k736
$$ -12106 -6950 5609 12350 7424 -3575 -11170 -9163 1195 12941 15110 3405 -12582 -15318
999a5318J5883K0574J935k1307k2659J136K3848J9835o526k4984j5354R007K1817
$$ -15318 565 21139 23074 1767 -20892 -19756 4092 23927 17401 -7583 -22937 -13930 7887
1012G887J0641r542j6106n347Q459J1443K987m711p558l545J144M837M046j105
$$ 7887 18528 8986 -7120 -12467 -4008 7435 10422 5711 -1847 -5392 -4248 589 4635 3530
1026C530o716n468K908R128M618p460j1150k42J4044J2148n326j8538r640J1080
$$ 3530 -3186 -8654 -5746 3382 8000 540 -10610 -10852 3192 15340 10014 -8524 -18164 -7084
1040g084K0125N461j6813k0449j785J7384J7208j103j5523j3364Q08J2482J2032
$$ -7084 13041 18502 1689 -18760 -20545 -3161 14047 12944 -2579 -15943 -15135 -2653 9379
1053I379L040q208j2013o504O325J4400Q902p301j7587j0419R302J8955P299j2588
$$ 9379 12419 4211 -7802 -14306 -7981 6419 15321 8020 -9567 -19986 -10684 8271 15570 2982
1067B982j7460j533J4615J4090k909j3707o682P705J0982O06r334p363K819Q400
$$ 2982 -14478 -16011 -1396 12694 9785 -3922 -10604 -2899 8083 8689 -645 -8008 -5189 3211
1081C211L007m063p041k719L332O292M870o70n993p733q37J0137J2155P20j4168
$$ 3211 6218 2155 -4886 -7605 -4273 2019 6889 6219 226 -7507 -8344 1793 13948 14668 500
1096E00j5718O23J8598J5765n393k0978j4330Q677K0700J0976r675j7405o204
$$ 500 -15218 -14595 4003 19768 14375 -6603 -20933 -12256 8444 19420 9745 -7660 -13864
1109a3864J0023J3343L689o332q586m008K289N532M753m16n754o897j88O819P604
$$ -13864 -3841 9502 13191 6859 -1727 -5735 -3446 2086 6839 6423 669 -6228 -6416 403 8007
1124H007j613q806m355O040J0130J290j0882r108M896J3563M862j1101j5108j367
$$ 8007 6394 -2412 -6767 -727 9403 10693 -189 -9297 -4401 9162 14024 2923 -12185 -13552
1138a3552J3889J2937k666j4241j0045L885J2832Q355j627r220q218j685P221
$$ -13552 337 13274 10608 -3633 -13678 -9793 3039 11394 9767 547 -7671 -9356 -2135
1151b135J0049M432o699j4457p328Q087J5833O399j0412j6826l926J3599J5269
$$ -2135 7914 12346 5647 -8810 -16138 -8051 7782 14181 3769 -13057 -16983 -3384 11885
1164A1885K49j3311j0365M018J1156N260n854q807o26N748L442k230m776j281
$$ 11885 12134 -1177 -11542 -7524 3632 8892 3038 -5769 -6395 -647 2795 565 -4211 -5492
1178e492K790L216P55j003k145k321N37M236O136J30p979r369N38J1828J0730
$$ -5492 -2702 514 1269 266 -1879 -4200 -3663 573 6709 6839 -1140 -10509 -9971 1857 12587
1193A2587l805j6582j1173Q030J8017R130r603j7074n545J1736J4058L110q562
$$ 12587 8782 -7800 -18973 -10943 7074 16204 6601 -10473 -16018 -4282 9776 12886 4324
1206D324j0398k696N114O953L249j935o256n634k96O470P994N60p869p195K589
$$ 4324 -6074 -8770 -3656 3297 6546 4611 -1645 -7279 -7575 -1105 6889 7449 -420 -7615 -5026
1221e026R393N316n451q727n26Q412N602m704j0292k308Q546Q968j554j1027o828
$$ -5026 4367 9683 4232 -4495 -5021 3391 8993 4289 -6003 -8311 235 9203 7649 -3378 -10206
1236a0206M968J0931N502m591q695m125K902O742N186q6o297q767l130O654J1453
$$ -10206 -5238 5693 11195 6604 -2091 -6216 -3314 3428 8614 8528 2231 -6536 -9666 -3012 8441
1251H441L873q652j3821l834J2063J4768J402j2675j2866K073J2843Q335m350
$$ 8441 12314 3662 -10159 -13993 -1930 12838 14240 1565 -11301 -9228 3615 11950 7600
1264G600j0400m669M468N671O14l772k258J328J262K5o18O16P60j12n31J534J270
$$ 7600 -2800 -7469 -3001 2670 3284 -488 -2746 -1418 -156 -131 -749 -133 627 515 -16 1518 2788
1281B788k109m604q17N447O431j933j0767p494N222J3657O499q340j4753l619
$$ 2788 679 -3925 -4742 705 7136 5203 -5564 -13058 -7836 5821 12320 3980 -10773 -14392
1295a4392J1716J3643J309j1013j0479n30P900P364Q48m733o759l515J881O220
$$ -14392 -2676 10967 12276 1263 -9216 -9746 -1846 5518 6366 1633 -5126 -8641 -6760 -540
1309e40N948q3p001p208R13R427P702l140r783m177N366P885O4p471m967L431
$$ -540 5408 5325 -1676 -8884 -7971 1456 9158 6018 -3765 -7942 -2576 5309 5373 -2098 -7065 -3634
1325c634O701J147o592m897K758Q342L394n099o662j100N228N781R04l146n266
$$ -3634 3067 4214 -2378 -7275 -4517 3825 7219 2120 -4542 -5642 -414 5367 6271 3125 -2141
1340b141k986N05M886N945J074o701r439j517R929J1602J214j1722j1383J574
$$ -2141 -5127 -4622 264 6209 7283 582 -8857 -10374 -445 11157 12371 649 -10734 -9160
1354i160J2810R604l952j1472o788M357Q143K645l691m553j185J832J501Q75J419
$$ -9160 3650 13254 9302 -2170 -8958 -4601 3542 6187 2496 -2057 -3242 -1410 91 966 2385
1369B385K47j230j866j17K480J890j652l197n8M071O61m542m834J635P662M654
$$ 2385 2632 1402 -464 -581 1899 3789 2137 -1060 -1118 2953 3614 -928 -5762 -4127 3535 8189
1385H189n550r584k206R045J0815o5j0323r228J180R937P129k582q102n418Q0
$$ 8189 2639 -6945 -9151 -106 10709 10644 321 -8907 -7727 2210 9339 6757 -1345 -6763 -6683
1400f683M677N202K195k200o035m370J251P891P334j980j0003o699M185R711L663
$$ -6683 -2006 3196 5391 3191 -2844 -7214 -5963 1928 9262 7282 -2721 -9420 -5235 4476 8139
1415H139o265q650k81O096M246k556n246k2M937L502k895m973m58N136M058j497
$$ 8139 1874 -6776 -7057 -961 3285 729 -4517 -4539 398 3900 1005 -3968 -4426 710 4768 3271
1431C271m922k550J263J737K038P33k12k991m874l38O657P649J34r385q865K483
$$ 3271 -1651 -4201 -2938 -1201 837 1570 1358 -1633 -6507 -6845 -188 7461 7595 -1790 -10655 -8172
1447h172J1726Q752m503j2713o561N900J0224L041n542p252j229L420L765J294
$$ -8172 3554 12306 7803 -4910 -11471 -5571 4653 7694 2152 -5100 -6329 -2909 856 2150
1461B150M31j226k424j628R39L766K970j438n371k297L213M120p54m691j627M155
$$ 2150 2581 1355 -1069 -2697 -1758 2008 4978 3540 -1831 -4128 -915 3205 2451 -2240 -3867 288
1477B88L900j966n944j569N805P281o49p580o489K533Q961M771m520q035l495
$$ 288 4188 2222 -3722 -5291 514 7795 7146 -434 -6923 -4390 4571 9342 4822 -3213 -6708
1492f708L391N501K525l17l516m183j860L071O802M168l363q171m879M161R702
$$ -6708 -3317 2184 4709 4392 876 -3307 -5167 -2096 4706 8874 5511 -2660 -7539 -3378 6324
1507F324L366o024r406k210O844O450o59n685l131K781L119j4k029m53K070J373
$$ 6324 9690 3666 -5740 -7950 -1106 5344 4685 -1000 -4131 -1350 1769 1755 -274 -727 1343 2716
1523B716r13l265j016J995K275m61j826q73o38m24J50K903K909K14n608m928K739
$$ 2716 1803 -1462 -2478 -483 1792 1331 -495 -1368 -2006 -2430 -2280 623 3532 3746 -1862 -6790 -4051
1540d051P557N438m228r707n093N426J0044K866o779q317j681N549O261J057l046
$$ -4051 3506 8944 4716 -4991 -10084 -4658 5386 8252 1473 -6844 -8525 -2976 3285 4342 1296
1555A296l290j789J035K649K970R99k236m303k296K247M813J764l927m847P96
$$ 1296 -1994 -3783 -2748 -99 2871 3870 1634 -2669 -4965 -2718 2095 3859 -68 -4915 -4119
1570d119L918K391k385k746J271M245J236m254m548J510O421L445l754p281k076
$$ -4119 -201 2190 -195 -2941 -1670 2575 3811 -443 -4991 -3481 2940 6385 2631 -4650 -6726
1585f726M406O159O63l806l741j117J759L112L062J326k918n010k348L491P383
$$ -6726 -2320 3839 4502 696 -3045 -4162 -2403 709 3771 5097 2179 -2831 -5179 -1688 5695
1600E695K685n692q883j981O939P818Q8o912n686J790N986K585j661k603k85J228
$$ 5695 8380 2688 -6195 -8176 -1237 6581 6669 -243 -5929 -4139 1847 4432 2771 168 -117 1111
1616A111L66j544k87K108R85j728k688p05K144J786o34q83L08P18j036k125Q87
$$ 1111 1477 -67 -354 1754 2739 1011 -1677 -2382 -238 1548 914 31 339 1057 21 -2104 -1217
1633a217M086L289k606o633l309M693P631K014p283p830j78O877O166k74n344
$$ -1217 2869 6158 3552 -3081 -6390 -1697 5934 7948 665 -7165 -7343 -466 5700 5426 82
1648H2m091P32K810L039J267o94k382l845r66K866M666J395m555n506l43N198
$$ 82 -4009 -3277 -467 2572 3839 3145 763 -3082 -4048 -1182 3484 4879 324 -5182 -5525 -327
1664c27M352r83m655k140K852L176q08l259QK883K215k735m366j521M722L694
$$ -327 4025 3042 -1613 -3753 -901 2275 1467 -1792 -1784 1099 3314 579 -3787 -5308 -586 3108
1680C108l03m749l140J481L409K407K62j200k331j797l44K946M121J808n150o614
$$ 3108 2805 -1944 -5084 -3603 -194 2213 2475 1275 -1056 -2853 -3197 -251 3870 5678 528 -6086
1696f086j102N951O973J34p234o178J678O941M817k273m988j593J764K672M09
$$ -6086 -7188 -1237 5736 5870 -1364 -7542 -5864 1077 5894 3621 -1367 -2960 -1196 1476 1885
1711A885j210J18J15j713j540J49K355K487j161k898j085K084K020k12j416O18
$$ 1885 675 793 908 -805 -2345 -2196 159 2646 1485 -1413 -2498 -414 1606 1394 -22 596
1727E96J634m46l231j953K470N236R80n593n709M49O529N372j317o579m050K397
$$ 596 2230 1784 -1447 -3400 -930 4306 5286 -307 -6016 -5567 962 6334 5017 -1562 -5612 -3215
1743c215N612K766j036l334k020p72M52K804K678Q7l816m992n9N610M650j033
$$ -3215 2397 5163 4127 793 -1227 -1999 -1547 1257 3935 4022 206 -4786 -4845 765 5415 4382
1759D382n713k952K350M719J756l037k566O16K369j10l050q04K448K323j122m111
$$ 4382 -1331 -4283 -1933 2786 4542 1505 -1061 -445 1924 1814 -1236 -2040 408 2731 1609 -2502
1775b502j848K562M107R88k433k438l58J140J060J118R71n4k841l842LM665M669
$$ -2502 -4350 -1788 2319 3307 874 -1564 -1922 -782 278 1396 2367 2313 -528 -4370 -4367 298 4967
1792D967p93o253n185J675P707M499l131o409k460L219M566R96j919k633m80l16
$$ 4967 4174 -2079 -7264 -5589 2118 6617 3486 -2923 -5383 -2164 2402 3398 1479 -1154 -1634 -1950
1808a950J38J103J764J083k025l336o65L296L389k36l160k059J630K196l80j995
$$ -1950 -1812 -709 1055 2138 113 -3223 -3888 -592 2797 2561 -599 -2658 -1028 1168 788 -1207
1824a207M38K199J01k724l439N63N266L535k483n041k910L258N661J572k783l717
$$ -1207 -769 1430 1531 -1193 -4632 -4069 1197 4732 2249 -2792 -5702 -2444 3217 4789 2006 -1711
1840a711j289J640J816K126q9j337k677k691J020M547L697j572n681l257K576
$$ -1711 -3000 -1360 456 2582 2493 1156 -1521 -4212 -3192 1355 5052 3480 -2201 -5458 -2882
1855b882N988K568l084m567q79K943K484n18j827o11J006K5k033j83J839K656
$$ -2882 3106 5674 2590 -1977 -2856 87 2571 2053 226 -385 621 646 -1387 -1570 269 2925
1871B925k13k728k193P54L052J428q89j707n84l75n49M11J703K092j270m116k730
$$ 2925 2712 -16 -2209 -1455 1597 3025 2136 429 -155 -530 -1079 -668 1035 3127 1857 -2259 -4989
1888d989K248N878K965l065o503j890L837N822J051m026m151n19K301K093J84
$$ -4989 -2741 3137 6102 3037 -3466 -5356 -1519 4303 5354 1328 -2823 -3342 -1041 1052 1236
1903A236j93p18j574j747O29K956K583p61l298k547J697L059J657j938k443KJ710
$$ 1236 1043 325 -1249 -2996 -2367 589 3172 2411 -887 -3434 -1737 1322 2979 1041 -1402 -1400 310
1920C10l79j523l55K162J746j003l704j543L473M150R21l655l907m12L784K475
$$ 310 -69 -1592 -1947 215 1961 958 -2746 -4289 -816 3334 4255 600 -3307 -3719 65 2540
1936B540o32j753j885r21K71J319K291J528j779l883k064K250N799K244l505n408
$$ 2540 1908 155 -1730 -2651 -2380 -1061 1230 2758 979 -2904 -4968 -2718 3081 5325 1820 -3588
1952c588j502M420M181k25l479k329L99J896J84m83O26J067l38j780j478J761
$$ -3588 -5090 -670 3511 3286 -193 -2522 -2123 -227 -43 -526 100 1167 829 -951 -2429 -668
1968f68K849J128k127l181R4J951J311n94m89J90m89j149j696J933L496J742l041
$$ -668 2181 3309 1182 -1999 -1905 46 1357 763 274 464 -25 -1174 -2870 -937 2559 4301 1260
1985A260m341j052L718N298L20m855m214N76M026K484r72k093j486l69M32J334
$$ 1260 -3081 -4133 -415 4883 5203 348 -3866 -3290 736 3220 2248 155 -1331 -1700 -1268 66
2001F6J509J213q45l321j556J920L972J392k645m143p64L175J669m25j745m10
$$ 66 1575 2788 1943 -1378 -2934 -1014 2958 4350 1705 -2438 -3202 -27 1642 1217 -528 -938
2017i38J053r4j033p60J810K770J69l374k668R89L607K302j929l166j571R57J800
$$ -938 115 21 -1012 -1772 38 2808 2977 -397 -3065 -2076 1531 3833 1904 -1262 -2833 -1876 -76
2034g6P14P90m95j493j632m73K090L320J087l051m442o40M307M429q97m442k941
$$ -76 638 1428 933 -560 -2192 -2665 -575 2745 3832 781 -3661 -4301 6 4435 3538 -904 -3845
2051c845Q40K905J548m99j466n17J27n57L74J811J112k02k282j780K28K662J726
$$ -3845 -3005 -100 1448 949 -517 -1034 -907 -1464 -1090 721 1833 1631 -651 -2431 -2203 459 2185
2068B185r31k468p56R09O01L70J83O31M55j473k146j45L051L088j94l964l473
$$ 2185 1254 -1214 -1970 -1061 -460 -90 93 724 1179 -294 -2440 -2585 466 3554 3360 -604 -4077
2085d077Q60M212K754j581l327k147R73K322J268M26o38j614j050j13J660K578
$$ -4077 -3217 995 3749 2168 -1159 -3306 -2333 -11 1257 1683 1045 -569 -1619 -1732 -72 2506
2101B506P22k468l077j029K983L268Nl246k463J136J965J088r55n06Q26M32j061
$$ 2506 3228 760 -2317 -3346 -363 2905 2910 -336 -2799 -1663 302 1390 435 -71 755 1187 126
2118A26j630P78K589J503j709l708r64K284K865N59j937k114j01J127M48P24J276
$$ 126 -1504 -726 1863 3366 1657 -2051 -3015 -731 2134 2693 756 -1358 -1459 -332 116 840 2116
2135B116K02j817k967N6L220L713r24m648l398J346M642K722k476l454j140J649
$$ 2116 2318 501 -2466 -2410 810 4523 3599 -1049 -4447 -3101 1541 4263 1787 -1667 -2807 -1158
2151a158J784K46n8J26k07j376j607R57K857J318j919l359q21K686K153j29j863
$$ -1158 626 872 814 940 733 -643 -2250 -1293 1564 2882 963 -2396 -3217 -531 1622 1493 -370
2168c70p25N86P72n87o77J846J525m01l615k086J954L744J669k548m129r73K820
$$ -370 -1095 -509 263 -324 -1001 845 2370 1969 -1646 -3732 -1778 1966 3635 1087 -3042 -4015 -1195
2185a195L222J08j655j172k12n92O63J287K192l19k847l000P39L486K856j336
$$ -1195 2027 2135 480 -692 -904 -1496 -833 454 2646 2327 -520 -3520 -2781 705 3561 2225
2201B225m135k057J885L181J203j601j667q3O27k1q9J223P36k26j934j559P32
$$ 2225 -1910 -3967 -2082 1099 2302 701 -966 -1049 -422 -443 -532 691 1427 1201 -733 -2292 -1560
2218a560K122J692j135k041j160O04J686Q36J96l16q31j079o05J321K480Q17j667
$$ -1560 562 2254 1119 -922 -2082 -1478 208 1044 1240 924 93 -986 -1591 -270 2210 3027 1360
2235A360l435j368J937L666J121j736l617p93J385L310O32j155j540n61j12J074
$$ 1360 -2075 -3443 -1506 2160 3281 1545 -2072 -2865 -1480 1830 2462 1307 -233 -794 -906 168
2251A68R86O25l66j911j128k45K030J850K9k090k013j5K308J502l74j001j66n8
$$ 168 1154 1779 1413 -498 -1626 -1871 159 2009 2038 -52 -2065 -2080 228 1730 1356 355 189 131
2269A31l31o66O41J378R68j650k711m64J875L452K90k606l015J69K555K153k0
$$ 131 -200 -866 -225 1153 2121 471 -2240 -2704 -829 2623 2913 307 -2708 -2539 16 2169 2149
2286B149j656r61l46n28O48J517J494q00k692k511J730L337K049j982l897q10
$$ 2149 493 -468 -814 -1342 -694 823 2317 1517 -1175 -3686 -1956 1381 3430 1448 -2449 -3259
2302c259K887K153M1j870p58N42L12r21n84J674J868j373k614j431J606L548Q78
$$ -3259 -372 1781 1822 -48 -806 -264 48 -873 -1457 217 2085 712 -1902 -3333 -1727 1821 2699
2319B699k405k279L05K036N31o44j60Q48k86j894j571J476L436R38k251m188k60
$$ 2699 294 -1985 -1680 356 887 243 83 931 645 -1249 -2820 -1344 2092 3030 779 -3409 -3669
2336c669M019K993o91l591k122J784K084M73n42J16k18q59j964M08K540K330j653
$$ -3669 350 3343 2652 -939 -3061 -1277 807 1280 738 854 636 -223 -2187 -1779 761 3091 1438
2353A438l044j686J800L813L20k324j830N50J484L44p95r2J210J22k004j777P14
$$ 1438 -1606 -3292 -1492 2321 2641 317 -1513 -963 521 865 70 -22 1188 1310 -694 -2471 -1757
2370a757K942J621j533k759r37J630K437K74j047r97n53R6j45J130J632J63k480
$$ -1757 1185 2806 1273 -1486 -2423 -793 1644 1918 871 -126 -679 -583 -728 402 2034 2197 -283
2387b83k293J03K801K475l86k846k293P08K622J698l28j579j306p5K24J066J089
$$ -283 -2576 -2473 328 2803 2417 -429 -2722 -2014 608 2306 1978 399 -907 -982 -758 308 1397
2404A397k7j228j109n51L28J856R51o90j048j218Q0J475J105r7o32j064r05N35
$$ 1397 1370 142 -967 -1518 -1190 666 1617 927 -121 -1339 -1259 216 1321 1224 592 -472 -1377 -842
2422h42Q11R01K70p54j362j013Q14J603J516k05k111k171L31K294K432j47k819
$$ -842 -31 870 1140 386 -976 -1989 -1175 428 1944 1739 -372 -2543 -2212 82 2514 2367 -452
2439d52k045N05J745J193j22j93r39r83o45R68K190J015j078k631j071J790K255
$$ -452 -2497 -1992 -247 946 824 631 -308 -1291 -1936 -968 1222 2237 1159 -1472 -2543 -753 1502
2456A502Q56j870k104N03R10M99n87J03P53L57j727j645J167K851J601k177k979
$$ 1502 2358 488 -1616 -1113 -203 296 -291 -188 565 922 -805 -2450 -1283 1568 3169 992 -1987
2473a987p40K744K359n78j904j025N83K47k22J53J341J233j968k425p48K991L489
$$ -1987 -2727 17 2376 1798 -106 -1131 -548 -301 -523 -370 971 2204 236 -2189 -2937 54 3543
2490C543m66l932k431J579L581R48k132j921O50O12l24o51R12J787J90k524k036
$$ 3543 3077 -855 -3286 -1707 1874 2822 690 -1231 -581 31 -293 -944 -32 1755 1945 -579 -2615
2507b615J325L033J393k107k885j97K571Q25l44j211P4R21n85j891j82K784J682
$$ -2615 -1290 1743 3136 1029 -1856 -2053 518 1343 999 -212 -138 783 198 -1693 -1875 909 2591
2524B591j239l512j105K877L027j60k538j738M43J240Q93m06j25L19p67j209p87
$$ 2591 1352 -2160 -3265 -388 2639 2479 -59 -1797 -1354 -114 779 373 248 567 -200 -1409 -2196
2541b196K174K504m75k494k559J543L082J099j717j840o92J070R01j16j33M4K68
$$ -2196 -22 2482 2007 -487 -3046 -1503 1579 2678 961 -879 -1571 -501 400 284 151 195 463
2558D63j181j482J008J930J358j274j932p78J122J933j1m36q00q68r9j18J031
$$ 463 -718 -2200 -1192 738 2096 822 -1110 -1888 -766 1167 1156 720 -80 -948 -1047 -1165 -134
2575a34J062N17j807j607M9J848J869l2j084k042m53J177J475R13p84j374j314
$$ -134 928 1445 -362 -1969 -1920 -72 1797 1765 681 -1361 -1814 -637 838 1751 967 -407 -1721
2592a721J1J200J670L88j552j239j13R29R73P67j99r45p67q12R11J389J007j175
$$ -1721 -1710 -510 1160 1548 -4 -1243 -1356 -427 546 1313 1114 169 -598 -1410 -499 890 1897 722
2610G22j496j018J152J517K51l50j026Q5j58KJ70R47R47j023k093r49J789K458
$$ 722 -774 -1792 -640 877 1128 778 -248 -163 -321 -319 -149 798 1745 722 -1371 -2320 -531 1927
2628A927M61k068k430L41J662J521l74r10k81J15p51k56J229J875m3k534k207
$$ 1927 2388 320 -2110 -1769 -107 1414 1040 130 -151 -36 -787 -1043 186 2061 2018 -516 -2723
2645b723R49K975J496j429k839p06K006J437k44j014K60N70l71j562P8K130J643
$$ -2723 -1774 1201 2697 1268 -1571 -2277 -271 1166 922 -92 168 738 367 -1195 -1117 1013 2656
2662B656j121k930j332J788K876N3k116j434Q57P61L20p96M35J745o02k308j264
$$ 2656 1535 -1395 -2727 -939 1937 1990 -126 -1560 -703 58 378 -418 17 1762 1160 -1148 -2412
2679b412J538L331M73k795l238N92L029J536j055k126J28O32M50n16K46J363M46
$$ -2412 -874 2457 2930 135 -3103 -2511 518 2054 999 -1127 -999 -367 83 -433 -187 1176 1622
2696A622j645k203J12L233J644j559k763j058J898K229l23j299p95Q51O1j015
$$ 1622 -23 -2226 -2114 1119 2763 1204 -1559 -2617 -719 1510 1187 -112 -907 -56 5 -1010
2712a010L10J378J438q29k227j305J416K144J422k788j423l6J170Q57j89j05l1
$$ -1010 -700 678 2116 1287 -940 -2245 -829 1315 2737 -51 -1474 -1510 -340 517 328 223 192
2729A92n47o44m51J590K085l45k197j874N04K151J304j97j859r93J66J031O70
$$ 192 -355 -999 -1450 140 2225 1880 -317 -2191 -1687 464 1768 1571 -288 -1281 -1115 -84 586
2746E86J29K91n42j440l48J171J241L76p60j677j61P31J047K92m2o23j081k98
$$ 586 715 1006 464 -976 -1324 -153 1088 1464 704 -973 -1134 -403 644 936 894 271 -810 -1108
2764a108O38J014M67j49j331q09K51J138Q70L13j029r08m09K85P84J570q6j751
$$ -1108 -470 544 1011 862 -469 -1278 -1027 111 981 1294 265 -643 -1052 -767 17 1587 1501 -250
2782b50j642L27J651J679k88j261j673N21Q09O20K85K18n27j048o73J81J672J214
$$ -250 -1892 -1565 86 1765 1477 216 -1457 -936 -127 493 778 996 469 -579 -1252 -1071 601 1815
2800A815o49k176j112J305J725N73r98j320K34L48K86k45M97N69K82j709j575
$$ 1815 1166 -1010 -2122 -817 908 1481 483 -837 -603 -255 31 -214 283 852 1134 -575 -2150
2817b150J347K149J097k224j983j66J861J580n26j136j88P29n80j007P13J798
$$ -2150 -803 1346 2443 219 -1764 -1930 -69 1511 985 -151 -339 390 -190 -1197 -484 1314
2833A314M81j798k256K22K395K111q96k793q02J179J476O81j349o5N03k68j106
$$ 1314 1795 -3 -2259 -2037 358 2469 1573 -1220 -2022 -843 633 1314 -35 -100 403 135 -971
2850i71l47J570J495k43k227j765J377K582N64j809j701K14J368L00l28R6P23
$$ -971 -1318 252 1747 1504 -723 -2488 -1111 1471 2035 226 -1475 -1261 107 407 79 175 898
2867H98k07j255j441R41K252J289k071k802M53J940J642l24j732m73L49M98J55
$$ 898 691 -564 -2005 -1064 1188 2477 406 -2396 -1943 -3 1639 1315 -417 -890 -541 -43 112
2884A12j91R58J00j090j367r2K252J489o46k639q53J123J524Q37p98r14j87K65
$$ 112 -79 879 979 -111 -1478 -1570 682 2171 1525 -1114 -1967 -844 680 1517 719 -195 -382 -117
2902a17l62L11N37R91m96j534q37O70J512R24j105j040p79P23J060M94j00l96
$$ -117 -479 -168 369 1360 864 -670 -1507 -837 675 1599 494 -546 -1325 -602 458 952 852 456
2920D56p64m93j23J042R11J44j316j103n72J891J033P7j019q64l32M76J205M90
$$ 456 -308 -801 -924 118 1029 1173 -143 -1246 -1818 73 1106 1183 164 -700 -1032 -556 649 1139
2938A139R2j409j184L40J031O56O93r57r85n64M35P74N78K78p11q45r35J121J214
$$ 1139 1231 -178 -1362 -1022 9 665 1358 401 -584 -1148 -713 61 639 917 206 -639 -1574 -453 761
2957G61O67o41j088q86M79J203J65O1n66p1p98j42O54Q25Q10j247j733qJ649J153
$$ 761 1428 787 -301 -1187 -708 495 660 721 155 84 -714 -856 -202 623 1433 186 -1547 -1555 94 1247
2977A247K79j047j560Q6R80O7L53K27l45k97j236N42J031J265l60j889j159Q28
$$ 1247 1526 479 -1081 -995 -15 52 405 632 287 -10 -1246 -704 327 1592 1232 -657 -1816 -988
2995i88J788P59r48j246l54P54K57k61L97N15M1j572o79Q18J475J266j075k126
$$ -988 800 1559 611 -635 -989 -235 22 -239 158 673 714 -858 -1537 -719 756 2022 947 -1179
3013a179o60J481J561k07j004k87L27l86k08M07Q25P69q86j802q81J891J973P4
$$ -1179 -1839 -358 1203 996 -8 -295 32 -354 -562 -155 670 1439 553 -1249 -2130 -239 1734 1808
3031A808j800j660N80J417P60o11m93j69j41r6o93J072J451n44j407j165M50K145
$$ 1808 8 -1652 -1072 345 1105 494 1 -168 -309 -405 -1098 -26 1425 881 -526 -1691 -1241 904
3049I04Q31r53j767n09J323O67l01j99j1K61q45k23KJ339R26n30j644j013J117
$$ 904 1735 782 -985 -1494 -171 496 195 -4 -15 246 -599 -822 -820 519 1445 915 -729 -1742 -625
3068f25J547M70r51j034k70N95K83M90L3l2j32j474J47J107R12L10j688j016J69
$$ -625 922 1392 441 -593 -863 -268 15 505 538 506 374 -1100 -953 154 1066 1376 -312 -1328 -1159
3087a159J051J143M6p44q72m54M83P47J88K63k51r67m78J19J407O87l91j190p11
$$ -1159 -108 1035 1081 337 -535 -989 -506 241 429 692 441 -526 -1004 -885 522 1209 818 -372 -1083
3106a083K46J088N95j84p19m69l52L89P33O20l25n54p03m87R18P31N79k48j208
$$ -1083 -837 251 846 662 -57 -526 -878 -489 244 864 539 -15 -718 -1205 -287 444 1023 775 -433
3125d33o96M54J033O96k97q95r68K89Q91P84P5p73k71p63K15N34P03J42k54r92
$$ -433 -1129 -675 358 1054 757 -138 -1106 -817 74 858 933 160 -111 -874 -659 -125 578 720 466 -526
3145e26q23N61J602P51j064j456m7M35R01N03l00l18m26l73o6K66J130N03q84
$$ -526 -1349 -788 814 1565 501 -955 -1002 -567 334 837 537 219 -207 -580 -646 -380 750 1253 369
3164C69j037o31J069R77N09r13j107k36Q71M14q1p5J37m86m14n12J513R06J15
$$ 369 -668 -1299 -230 747 1256 343 -764 -1000 -129 285 204 129 266 -220 -634 -1146 367 1273 1388
3183A388j538j422M27J388J316q77j365o4J41P17p0K78k9J59n17q67K0J800O21
$$ 1388 -150 -1572 -1145 243 1559 682 -683 -747 -606 111 41 319 290 449 -68 -935 -915 885 1506
3202A506p45j419r00J034J244O11j252k55l49K07o7L23N02M50o02q86p58R98J660
$$ 1506 761 -658 -1558 -524 720 1331 79 -176 -525 -318 -385 -62 440 890 288 -598 -1356 -358 1302
3221A302j6r57j296l00J017J289J04q33o85j69%L90L47Q28j27p42j305M4J212
$$ 1302 1286 329 -967 -1267 -250 1039 1143 310 -375 -544 -544 -154 193 1021 894 152 -1153 -1109 103
3240A03J088k28j468q02O76O42M27L20p23l72j07k0R6Q84L00k97j078o55N87J042
$$ 103 1191 963 -505 -1307 -631 11 438 758 35 -337 -444 -464 -368 516 816 519 -559 -1214 -627 415
3260D15P90m66r67j011N20Q70QL35m18n99m31L46N18R71j05l83j190j85O56Q73
$$ 415 1205 739 -228 -1239 -719 151 159 494 76 -523 -954 -608 -90 881 776 393 -797 -982 -326 547
3280E47N22m99j110o2j80J072O40k79l85p29k36J33R19N0Q7n27j059J98Q56O65
$$ 547 1069 570 -540 -602 -782 290 930 651 266 -463 -699 -566 353 403 490 -37 -1096 -898 -42 623
3300F23M87q39j172j70J075P91k23ko00m19K8K91N74L7J06j021p35J2J289Q84
$$ 623 1110 271 -901 -1071 4 795 572 570 -30 -449 -421 -130 444 481 587 -434 -1169 -1157 132 1016
3320A016r2j068q21j17R66O18J31l27q23K19k89L93N86M69j85j026n75M8J575
$$ 1016 924 -144 -965 -1082 -116 502 633 306 -517 -298 -587 -194 392 861 676 -350 -925 -877 698
3339F98M02o57j096k81p3J507N1k20l47j54ol39L16O17O53o04j442j5O79J090
$$ 698 1100 443 -653 -934 -1007 500 551 331 -16 -170 -176 -515 -199 418 1071 467 -975 -990 -311 779
3359G79L04o67r76k64K97Q89K89l32l44O3m59n39P16J176P0r93j273K00R40J275
$$ 779 1083 416 -560 -824 -527 362 651 319 -25 38 -421 -960 -244 932 1002 9 -1264 -1064 -124 1151
3379A151k04p23q95j28Q51K77J56k63M5q11m1K13P62O65o3j357l18l3J309M19
$$ 1151 947 224 -671 -799 52 329 485 222 267 -544 -585 -372 390 1055 992 -365 -683 -716 593 1012
3399A012m36q37j50k45M43M30J74O0j65p66n64L14R91N56o44p86k61N78Q12L00
$$ 1012 576 -261 -411 -656 -213 217 391 451 286 -480 -1044 -730 261 817 173 -613 -874 -296 516 816
3419H16k89n29o42K70J40P11K9J25o34q75L45M44R24J69o71j087j8P84N74N9l62
$$ 816 527 -2 -644 -374 -234 477 506 631 -3 -878 -533 -89 835 1004 333 -754 -772 12 586 645 283
3440B83p61k10J02L88P76Q8p8p89o12K45P82N06J44r34j056L70P06Q75j58n66
$$ 283 -478 -688 -586 -198 578 666 588 -201 -813 -568 214 720 864 -70 -1126 -756 -50 825 667 101
3460A01o15L8J50K45M22K72k10o46l75L8Q95O41l11j091n13L56O03R71n05p76
$$ 101 -514 -476 -326 -81 341 613 403 -243 -618 -580 315 956 645 -446 -959 -603 0 971 466 -310
3480c10k23N8J96M27K76j03l22p24K34L63N00N64q24o49m19O72J035l80O2p29
$$ -310 -533 -475 -279 148 424 321 -1 -725 -491 -128 372 936 112 -537 -956 -284 751 371 433 -296
3500b96q2l06P43J07K89J56n54n59n15J163M53N76r13j140j09Q06O27L3k70m80
$$ -296 -378 -684 59 166 455 611 57 -502 -1017 146 599 1175 262 -878 -987 -181 446 479 209 -271
3520b71m22K60M83L69J00l32l83q59O06O38N69j02j008n73M59L42N36J6k01m33
$$ -271 -693 -433 50 419 519 187 -196 -1055 -449 189 758 656 -352 -925 -466 -124 412 428 227 -206
3540b06p6k47L39O88J11j78r18l67J73J164K62k64r25l02L16Q29J62l36j30j96
$$ -206 -282 -529 -190 498 609 431 -487 -854 -681 483 745 481 -444 -746 -430 399 561 225 95 -101
3560a01m82K59K78P76l9o34q12J46K48Q89K10m70o49l18M22L30N04j06k54m58
$$ -101 -583 -324 -46 730 691 57 -755 -609 -361 528 738 268 -381 -699 -277 53 557 451 197 -261
3580b61j96k06O62O76j13j75j053K8N82R08j49o72n74o9N32M73L65l97l87k86
$$ -261 -457 -663 -1 675 562 387 -666 -638 -56 852 703 31 -543 -612 -80 393 758 361 -26 -312
3600c12m02N14M71K30j42l42n29k19J159K71q9n91r39N68M29K76R5k71k95k74
$$ -312 -714 -200 271 501 359 17 -512 -731 428 699 610 19 -920 -352 77 353 448 177 -118 -392
3620c92r4N44J81N18k26r90m59J25J118M90l25n95m83M60J04N07j61q3m57m20
$$ -392 -486 58 239 757 531 -459 -918 -793 325 815 490 -105 -588 -128 -24 483 322 239 -218 -638
3640f38K58O40Q8K06m49p75m4N51P18N5k25o46j94J34N57m5J93k86r2n80J91N62
$$ -638 -380 260 348 554 105 -670 -714 -163 555 610 385 -261 -455 -321 236 191 384 98 6 -574 -383 179
3662A79K76K38r83l01l22R39O47k57m19m42j33L30L49K47J59q04m03o7K90O76
$$ 179 455 693 -290 -591 -913 26 673 416 -3 -445 -578 -248 101 348 507 -297 -700 -767 -477 199
3682A99N16k70q93k81N15L60O47m86l60p92M10J36P54k33M3k17p63J64L16N44
$$ 199 715 445 -448 -729 -214 146 793 307 -53 -845 -435 -299 455 222 265 48 -715 -551 -235 309
3702C09K82l23r05M4L24L98M73k43o75k30J72L48L10j4J10k28p14K5O75O74k26
$$ 309 591 268 -637 -593 -269 129 602 359 -316 -546 -374 -26 284 270 380 152 -562 -537 138 812 586
3723E86m81m91l97O74N34J79n62k69j51j31N46R0K50Rp76q8J80K35M66J83o58
$$ 586 105 -386 -783 -109 425 604 42 -227 -378 -509 37 127 377 386 -390 -478 -298 -63 403 586 -72
3744g2k80k68O44M90J84p34l05L5J21M59k18O31o75l68m20K83L44N74l20m06m55
$$ -72 -352 -620 24 514 698 -36 -341 -306 -185 274 56 687 12 -356 -776 -493 -149 425 105 -301 -756
3765g56L89L40Q47k31m19j58m47Q1M67L43l53J48o00J30M7P82K04n96p21J26K2
$$ -756 -367 -27 820 589 170 12 -435 -354 113 456 103 251 -349 -219 -172 610 814 218 -503 -377 -355
3786c55K26N28n95j08n9n7K46L41J94p3l70o43J70M50M65L10n61o65KK85O83L51
$$ -355 -129 399 -196 -304 -363 -420 -174 167 361 288 -82 -725 -555 -105 360 670 109 -556 -554 -269 414 765
3808G65m88o33K33k73J0P81j0l30k34k32K09K38P26l53m77n00J61M64L75j13l80
$$ 765 277 -356 -123 -396 -386 395 385 55 -179 -411 -202 36 762 409 -68 -568 -407 57 432 319 -61
3829f1k46k83L36P9N34K96m60l57o95Q21N21K16m83n35k48J28L28N97J19l02o65
$$ -61 -307 -590 -254 -175 359 655 195 -162 -857 -36 485 701 218 -317 -565 -437 -109 488 607 305 -360
3850c60K5n0M47K96j64l45n35J11L25P52J69k75r15j0R4M37L62j23j45m13L8q8
$$ -360 -335 -385 62 358 194 -151 -686 -575 -250 502 671 396 -519 -529 -435 2 364 241 96 -317 -279 -367
3872c67M33K78M2o38l74o2M32R69j96p16m55K93J62M57K91k62n29J04j61K65L95
$$ -367 66 344 386 -252 -626 -688 -256 713 517 -199 -654 -361 -199 258 549 287 -242 -138 -299 -34 361
3893C61P9m4n27n52K77P19J95J97q26j95p9M99oL69j5p78m5j33M94O3L19j22n18
$$ 361 440 396 -131 -683 -406 313 508 705 -121 -316 -395 104 98 467 452 -326 -371 -504 -10 53 372 250 -268
3916b68k00J23Q25L44m60o03M1j18M15L42J07l70k65m88K05J61O94Q2r12l52J84
$$ -268 -468 -345 480 824 364 -239 -198 -316 99 441 548 178 -87 -575 -370 -209 485 567 -345 -697 -513
3937e13N66N11Nm40j00n78K21M15J06P4l3m17k03J93N90j89K04n57l13j8M03L81
$$ -513 53 564 569 129 29 -549 -328 87 193 267 234 -183 -386 -193 397 208 412 -145 -458 -476 -73 308
3959C08J15l95n43J90j39L52N58k43j15n24l9J23O19N24p30l58n0J7L06N21q1
$$ 308 423 28 -515 -325 -464 -112 446 203 88 -436 -475 -352 267 791 61 -297 -347 -330 -24 497 416
3980D16n02j07l88M44L54L09l37l6m94k35O22K02N92n11j027L43J03N42m6L04
$$ 416 -86 -193 -581 -137 217 526 189 153 -341 -576 46 248 840 329 -698 -355 -252 290 244 548
4000E48q04j54k26L39M73L02m66l7m22K31K23M41k8m83j64m7M77J53J43l47l41
$$ 548 -256 -410 -636 -297 176 478 12 -25 -447 -216 7 448 420 -63 -227 -274 203 356 499 152 -189
4021a89j81J58n4M66J15l32k15m02L21N01M94m82n29L4l3Q41K38m89q6n09j2L26
$$ -189 -370 -212 -266 200 315 -17 -232 -634 -313 188 682 200 -329 -295 -328 513 751 262 176 -333 -345 -19
4043a9N2M19k85L5l34l69L74K34L90m9n32m75j95R44K81L9p66p7L5k17P45O2k01
$$ -19 33 452 167 202 -132 -501 -127 107 497 448 -84 -559 -754 190 471 510 -256 -333 -298 -515 230 292 91
4066I1j76j21k73M71Q35m04n64m68J75K26M52L23l92l11N5l98L25N31K8j21l81
$$ 91 -85 -206 -479 -8 827 423 -141 -609 -434 -208 244 567 175 -136 -81 -479 -154 377 405 284 -97
4087i7m66K21N27J36J81m42m27r0M67M2K43Jn48Pk6K11N49k65Q4o75k39K14M29
$$ -97 -563 -342 185 321 502 60 -367 -457 10 52 295 296 -252 -245 -271 -60 489 224 308 -367 -606 -392 37
4110C7K89k03l67k92L33M48q5M2J08m94m8R6M66Q6J34k92n42J2J94L07J13j98
$$ 37 326 123 -244 -536 -203 245 160 202 310 -184 -232 -136 330 416 550 258 -284 -272 -78 229 342 144
4132A44l25k00L23J78J30L35o90Jk28O5N68M1k48j72j83l30L80L63M10j71o02
$$ 144 -181 -381 -58 120 250 585 -105 -104 -332 -267 301 342 94 -78 -261 -591 -211 152 562 391 -211
4153b11n69O56M15j82J18j95l69j55N71j1O11k42p12o5K23K31K81P6m89k98p7
$$ -211 -780 -124 291 109 227 32 -337 -492 79 68 679 437 -275 -340 -117 114 395 471 -18 -316 -393
4174c93M04J17J60j78q4l28O6J20N88j32l45r7m94K26M42L85l67l3n26Q6M34m
$$ -393 11 128 288 110 26 -302 -236 -116 472 340 -5 -102 -596 -370 72 457 90 57 -469 -383 51 47
4196D7K21J94o18r9jL83L90l33j43k96n9N58j02L5L5k60o73N56j2N43j30l20J36
$$ 47 268 462 -156 -255 -256 127 517 184 41 -255 -314 244 142 177 212 -48 -721 -165 -177 366 236 -84 52
4219E2l28k8L69L64j22m19j58K74R0K25j41k64j56N9J55L39J19l07l13jl19M63
$$ 52 -276 -304 65 429 307 -112 -270 4 94 319 178 -86 -242 -183 -28 311 430 123 -190 -191 -510 -47
4241d7Q3K97m2l05k86J33J60N43l85l34j69j65L19J63M52L27n21l22l52M97K43
$$ -47 36 333 291 -14 -300 -167 -7 536 151 -183 -352 -517 -198 -35 417 744 223 -99 -451 46 289
4262B89J34j11o28p3K95r3L24J43o03l5K47PJ32JL57n92j51p4N27K21j44j78o5
$$ 289 423 312 -316 -389 -94 -187 137 280 -323 -358 -111 -104 28 29 386 -206 -357 -431 96 317 173 -5 -70
4285g0k79K30O15m72J79k75k05O3M97k40M41m12j41l51N62J41m3J33n24j41K02
$$ -70 -349 -119 496 24 203 -72 -277 -214 283 43 484 72 -69 -420 142 283 240 373 -151 -292 -90
4306i0L97O4j6J1n26j94J92J89L26K86o10n48J90K41K66J02j44k59l98L29K23
$$ -90 307 371 355 366 -160 -354 -162 27 353 639 29 -519 -329 -88 178 280 136 -123 -521 -192 31
4327C1J77M7k92j68j43K83L37M42l31k94m46k1K11M04J22k28n92M41p6L08K62
$$ 31 208 255 -37 -205 -348 -65 272 714 383 89 -357 -378 -167 237 359 131 -461 -20 -96 212 474
4348D74q8n13k88M3J12N25J64j34l40m71L30K27M16L2m54k47k37M03K31J12k13
$$ 474 386 -127 -415 -372 -260 265 429 295 -45 -516 -186 41 457 489 35 -212 -449 -46 185 297 84
4369H4k29l38L11J71L49p2n5m83R0j30L96L66j00n26r1mJ76M78k95n3l8k72j07
$$ 84 -145 -483 -172 -1 348 276 221 -262 -172 -302 94 460 360 -166 -257 -261 -85 393 98 45 7 -265 -372
4392c72L66J18J35J06p76J95K34J46K99j24l90j12k18K69L34K7j17l47m6k86P13
$$ -372 -6 112 247 353 -423 -228 6 152 451 327 -63 -175 -393 -124 210 237 120 -227 -273 -559 154
4413A54M86j14k46q39K17L79K84j74J57k61k60J64PM90j36k61j3k42j70O51K6
$$ 154 640 526 280 -559 -342 37 321 147 304 43 -217 -53 -46 444 308 47 34 -208 -378 273 299
4434B99L5j92r1j51P8L18J1l35k48N1j98N75j0j3l49k23j09O62Q5j73J60j88m33
$$ 299 334 142 51 -100 -22 296 307 -28 -276 -225 -423 152 142 129 -220 -443 -552 110 195 22 182 -6 -439
4457d39J14K91N16l94j3l43J73J56K95R2m35K0k79j45M61K22j21k55q3L1N7L28
$$ -439 -325 -34 482 88 75 -268 -95 61 356 448 13 33 -246 -391 70 292 171 -84 -167 -136 -79 249
4479B49L20m39p5j92q6M3N43k46K12n11k48N6M93J76p2l17KN7n03R90J37k77k50
$$ 249 569 130 55 -137 -223 -180 363 117 329 -182 -430 -374 119 295 223 -94 -92 -35 -538 452 589 312 62
4502F2n80K45N12j64M14m59k64k85K71L42K21l77j35k16K31J6M69j01j97l57K
$$ 62 -518 -273 239 75 489 30 -234 -519 -248 94 315 -62 -197 -413 -182 -166 303 202 5 -352 -350
4523c50l4J25L61K74m50o4q6p2L32K35m46q0O1p3M86j00K8j78j6k23K07J40KJ68
$$ -350 -384 -259 102 376 -74 -138 -224 -296 36 271 -175 -255 -194 -267 219 119 147 -31 -47 -270 -63 77 79 247
4547B47l37k85K03M35lj44m7l04j52K19L17J68m65K07j76J85n4K53P9jm44o3p6
$$ 247 -90 -375 -172 263 260 116 69 -235 -387 -168 149 317 -148 59 -117 68 14 267 346 345 -99 -162 -238
4570b38J76L68j08k86m94J81J91O10k29J53o16J43K2J46J25L50m89P6k33k27P64
$$ -238 -62 306 198 -88 -582 -401 -210 400 171 324 -292 -149 -127 19 144 494 5 81 -152 -379 385
4591C85P7m87o23N36m8K13j39N9J49l21k65J73L08J75j92Kl38K67k5N47N0n21
$$ 385 462 -25 -648 -112 -160 53 -86 -27 122 -199 -464 -291 17 192 0 2 -336 -69 -94 453 503 -18
4613a8k30L31k06L16J80k25n4n1k49j36L20K16Pp4m59R1J41M61m07O4m4l94J73
$$ -18 -248 83 -123 193 373 148 94 43 -206 -342 -22 194 201 127 -332 -241 -100 361 -46 18 -26 -420 -247
4636b47L44j05L88j59o36L36o3J31M08j78k62k57M78k97L03l7k07j37k34L62J55
$$ -247 97 -8 380 221 -415 -79 -142 -11 397 219 -43 -300 178 -119 184 147 -60 -197 -431 -69 86
4657H6J37l10R3l76K10j49N00J20k87l49O4J97L24K54k97n60J87j56J23L13J28
$$ 86 223 -87 6 -370 -160 -309 191 311 24 -325 -261 -64 260 514 217 -343 -156 -312 -189 124 252
4678B52K06o10m0l8J87N09k58m30L8L24l07L00J75m52n3K30j40J7R9J16n01L01
$$ 252 458 -152 -192 -230 -43 466 208 -222 -184 140 -167 133 308 -144 -197 33 -107 -90 9 125 -376 -75
4700g5p7r5L66J07k43j68k5Q7L5L13n7k09J60m83J14M16J73k09l7n68L91R9K18
$$ -75 -152 -247 119 226 -17 -185 -210 -123 -88 225 168 -41 119 -364 -250 166 339 130 93 -475 -84 15 233
4723B33l8K1l38m2N9K83K15q8l78J28O9q3J55j29J43l43k8K27k25L68k9r8k89
$$ 233 195 216 -122 -164 -105 178 393 305 -73 55 124 41 196 67 210 -133 -161 66 -159 209 180 82 -207
4746b07J68k18L22L51l12k7M7j36j34L99K8k44j76k93M16Q5K95m7m19l88K22M64
$$ -207 -39 -257 65 416 104 77 124 -12 -146 253 281 37 -139 -432 -16 69 364 317 -102 -490 -268 196
4768A96nj06K00m70N7M8J38k30K76k4q5m15j6M90K93N8m77L4J16j87L72n9j26
$$ 196 191 85 285 -185 -128 -80 58 -172 104 80 -5 -420 -436 54 347 405 -72 -38 78 -109 263 204 78
4791G8k25j76LR0P56m35o4p2k94L21m6K91J99m20n95N86J15j21K43M4l92k11M04
$$ 78 -147 -323 -320 -230 526 91 27 -45 -339 -18 -64 227 426 6 -589 -3 112 -9 234 278 -114 -325 79
4814G9j50J43O1l60k03M35p5M12l29L03p69Q2M52O8J01j08j19j34k16M93j51K32
$$ 79 -71 72 133 -227 -430 5 -70 342 13 316 -453 -371 81 149 250 142 23 -111 -327 166 15 247
4836B47o4l87j8N3J7N73k64n2n4k9N5j78L86l8l20k39L81k34N82k62l7j79O5j63
$$ 247 183 -204 -222 -169 -152 421 157 105 51 22 77 -101 285 247 -73 -312 69 -165 417 155 118 -61 4 -159
4860a59N18l27j15j54R7k15R2L32lL19m06j28q8M86j70k0m6r1l79L51J81K04l53
$$ -159 359 32 -83 -237 -140 -355 -263 69 66 385 -21 -149 -237 249 79 59 13 -78 -457 -106 75 279 -74
$$ [...]
8191A09
##END NTUPLES=NMR FID
##END=
