##TITLE=1H_SA-NO2New
 CDCl3, 8 sc, 
 2.08.2021
##JCAMPDX= 6.0         $$ Bruker NMR JCAMP-DX V2.0
##DATA TYPE= NMR FID
##DATA CLASS= NTUPLES
##ORIGIN= UXNMR, Bruker Analytische Messtechnik GmbH
##OWNER= root
$$ XWIN-NMR		Version 3.5
$$ Mon Aug  2 12:35:57 2021 Russian Standard Time (UT+4h)  she@DPX200
##.OBSERVE FREQUENCY= 200.131506
##.OBSERVE NUCLEUS= ^1H
##.DELAY= (6, 6)
##.ACQUISITION MODE= SIMULTANEOUS
##.ACQUISITION SCHEME= undefined
##.AVERAGES= 8
##.DIGITISER RES= 18
##SPECTROMETER/DATA SYSTEM= spect
##.PULSE SEQUENCE= zg30
##.SOLVENT NAME= CDCl3
##.SHIFT REFERENCE= (INTERNAL, CDCl3, 0, 15.7039)
##AUDIT TRAIL= $$ (NUMBER, WHEN, WHO, WHERE, WHAT)
$$ ##TITLE= Audit trail, XWIN-NMR		Version 3.5
$$ ##JCAMPDX= 5.01
$$ ##ORIGIN= Bruker BioSpin GmbH
$$ ##OWNER= she
$$ F:/spectra/data/she/nmr/H-F/1/audita.txt
$$ ##AUDIT TRAIL=  $$ (NUMBER, WHEN, WHO, WHERE, WHAT)
(   1,<2021-08-02 12:32:36.67 +0400>,<she>,<DPX200>,
      <created by zg, POWCHK disabled, PULCHK disabled
       configuration hash MD5:
       00 E9 B6 7A A2 85 ED C7 34 08 36 98 17 FE 4E 26
       data hash MD5: 16K
       6E 12 26 40 A7 A2 40 A2 AD 5D 0C 4D 61 A7 32 B7>)
$$ ##END=
$$ 
$$ hash MD5
$$ C1 5F 4D 7F A5 7C 49 CA 8A 9C 05 27 C3 8E C8 BF
##$RELAX= 
##$RELAX= 
##$RELAX= 
##$RELAX= 
##$RELAX= 
##$RELAX= 
$$ Bruker specific parameters
$$ --------------------------
##$DU= <F:/spectra>
##$EXPNO= 1
##$NAME= <H-F>
##$PROCNO= 1
##$TYPE= <nmr>
##$USER= <she>
##$AMP= (0..31)
100 100 100 100 100 100 100 100 100 100 100 100 100 100 100 100 100 100 
100 100 100 100 100 100 100 100 100 100 100 100 100 100 
##$AQSEQ= 0
##$AQ_mod= 1
##$AUNM= <au_zg>
##$AUTOPOS= <>
##$BF1= 200.13
##$BF2= 200.13
##$BF3= 200.13
##$BF4= 200.13
##$BF5= 200.13
##$BF6= 200.13
##$BF7= 200.13
##$BF8= 200.13
##$BYTORDA= 1
##$CFDGTYP= 0
##$CFRGTYP= 5
##$CHEMSTR= <none>
##$CNST= (0..31)
1 1 145 1 1 1 1 1 1 1 1 1 1 1 1 1 1 1 1 1 1 1 1 1 1 1 1 1 1 1 1 1 
##$CPDPRG= <>
##$CPDPRG1= <>
##$CPDPRG2= <>
##$CPDPRG3= <>
##$CPDPRG4= <mlev>
##$CPDPRG5= <mlev>
##$CPDPRG6= <mlev>
##$CPDPRG7= <mlev>
##$CPDPRG8= <mlev>
##$CPDPRGB= <>
##$CPDPRGT= <>
##$D= (0..31)
0 1.2 0 0 0 0 0 0 0 0.06 0 0.03 0 0 0 0 0.0002 0 0 0 0 0 0 0 0 0 0 0 0 
0 0 0 
##$DATE= 1627893156
##$DBL= (0..7)
120 120 120 120 120 120 120 120 
##$DBP= (0..7)
150 150 150 150 150 150 150 150 
##$DBP07= 0
##$DBPNAM0= <>
##$DBPNAM1= <>
##$DBPNAM2= <>
##$DBPNAM3= <>
##$DBPNAM4= <>
##$DBPNAM5= <>
##$DBPNAM6= <>
##$DBPNAM7= <>
##$DBPOAL= (0..7)
0.5 0.5 0.5 0.5 0.5 0.5 0.5 0.5 
##$DBPOFFS= (0..7)
0 0 0 0 0 0 0 0 
##$DE= 6
##$DECBNUC= <off>
##$DECIM= 32
##$DECNUC= <off>
##$DECSTAT= 4
##$DIGMOD= 1
##$DIGTYP= 9
##$DL= (0..7)
0 120 120 120 120 120 120 120 
##$DP= (0..7)
150 150 150 150 150 150 150 150 
##$DP07= 0
##$DPNAME0= <>
##$DPNAME1= <>
##$DPNAME2= <>
##$DPNAME3= <>
##$DPNAME4= <>
##$DPNAME5= <>
##$DPNAME6= <>
##$DPNAME7= <>
##$DPOAL= (0..7)
0.5 0.5 0.5 0.5 0.5 0.5 0.5 0.5 
##$DPOFFS= (0..7)
0 0 0 0 0 0 0 0 
##$DQDMODE= 0
##$DR= 18
##$DS= 0
##$DSLIST= <SSSSSSSSSSSSSSS>
$$ [...]
##$SUBNAM2= <"">
##$SUBNAM3= <"">
##$SUBNAM4= <"">
##$SUBNAM5= <"">
##$SUBNAM6= <"">
##$SUBNAM7= <"">
##$SUBNAM8= <"">
##$SUBNAM9= <"">
##$SW= 20.0188882624521
##$SWIBOX= (0..15)
0 0 2 0 0 0 0 0 0 0 0 0 0 0 0 0 
##$SW_h= 4006.41025641026
##$TD= 16384
##$TD0= 1
##$TE= 0
##$TE2= 300
##$TE3= 300
##$TEG= 300
##$TL= (0..7)
0 120 120 120 120 120 120 120 
##$TP= (0..7)
150 150 150 150 150 150 150 150 
##$TP07= 0
##$TPNAME0= <>
##$TPNAME1= <>
##$TPNAME2= <>
##$TPNAME3= <>
##$TPNAME4= <>
##$TPNAME5= <>
##$TPNAME6= <>
##$TPNAME7= <>
##$TPOAL= (0..7)
0.5 0.5 0.5 0.5 0.5 0.5 0.5 0.5 
##$TPOFFS= (0..7)
0 0 0 0 0 0 0 0 
##$TUNHIN= 0
##$TUNHOUT= 0
##$TUNXOUT= 0
##$USERA1= <user>
##$USERA2= <user>
##$USERA3= <user>
##$USERA4= <user>
##$USERA5= <user>
##$V9= 5
##$VALIST= <valist>
##$VCLIST= <CCCCCCCCCCCCCCC>
##$VD= 0
##$VDLIST= <DDDDDDDDDDDDDDD>
##$VPLIST= <PPPPPPPPPPPPPPP>
##$VTLIST= <TTTTTTTTTTTTTTT>
##$WBST= 1024
##$WBSW= 4
##$XGAIN= (0..3)
0 0 0 0 
##$XL= 0
##$YL= 0
##$YMAX_a= 20624
##$YMIN_a= -26692
##$ZGOPTNS= <>
##$ZL1= 120
##$ZL2= 120
##$ZL3= 120
##$ZL4= 120
##$ABSF1= 10
##$ABSF2= 0
##$ABSG= 5
##$ABSL= 3
##$ALPHA= 0
##$AQORDER= 0
##$ASSFAC= 0
##$ASSFACI= 0
##$ASSFACX= 0
##$ASSWID= 0
##$AUNMP= <proc_1d>
##$AZFE= 0.1
##$AZFW= 0.1
##$BCFW= 1
##$BC_mod= 2
##$BYTORDP= 1
##$COROFFS= 0
##$CY= 11.3945322036743
##$DATMOD= 1
##$DC= 2
##$DFILT= <>
##$DTYPP= 0
##$F1P= 2.36226072786647
##$F2P= -0.459571619588291
##$FCOR= 0.5
##$FTSIZE= 0
##$FT_mod= 4
##$GAMMA= 1
##$GB= 0.15
##$INTBC= 1
##$INTSCL= 1
##$ISEN= 128
##$LB= 0.24
##$LEV0= 0
##$LPBIN= 0
##$MAXI= 10000
##$MC2= 0
##$MEAN= 0
##$ME_mod= 0
##$MI= 1.114404
##$NCOEF= 0
##$NC_proc= 0
##$NLEV= 6
##$NOISF1= 3.799351
##$NOISF2= 2.8
##$NSP= 1
##$NTH_PI= 0
##$NZP= 0
##$OFFSET= 15.70392
##$PC= 1
##$PHC0= -13153.54
##$PHC1= 10.80099
##$PH_mod= 1
##$PKNL= yes
##$PPARMOD= 0
##$PSCAL= 0
##$PSIGN= 0
##$REVERSE= no
##$SF= 200.130013532006
##$SI= 16384
##$SIGF1= 3
##$SIGF2= 2
##$SINO= 400
##$SIOLD= 16384
##$SREGLST= <1H.CDCl3>
##$SSB= 0
##$STSI= 0
##$STSR= 0
##$SW_p= 3612.71676300578
##$SYMM= 0
##$S_DEV= 0
##$TDeff= 0
##$TDoff= 0
##$TI= <>
##$TILT= no
##$TM1= 0
##$TM2= 0
##$TOPLEV= 0
##$USERP1= <user>
##$USERP2= <user>
##$USERP3= <user>
##$USERP4= <user>
##$USERP5= <user>
##$WDW= 1
##$XDIM= 8192
##$YMAX_p= 0
##$YMIN_p= 0
$$ End of Bruker specific parameters
$$ ---------------------------------
##NTUPLES= NMR FID
##VAR_NAME=  TIME,          FID/REAL,        FID/IMAG
##SYMBOL=    X,             R,               I
##VAR_TYPE=  INDEPENDENT,   DEPENDENT,       DEPENDENT
##VAR_FORM=  AFFN,          ASDF,            ASDF
##VAR_DIM=   8192,          8192,            8192
##UNITS=     SECONDS,       ARBITRARY UNITS, ARBITRARY UNITS
##FACTOR=    0.0002496,     1,               1
##FIRST=     0,             0,               0
##LAST=      2.0444736,     0,               0
##MIN=       0,             -26692,          0
##MAX=       2.0444736,     20624,           0
$$ Real data points
##PAGE= N=1
##DATA TABLE= (X++(R..R)), XYDATA
$$ [...]
1147D84K54p07M5l35l18J21k91l3L69k20K27K94k29L44r1m0R9j02r4l4l15L21
1169b51j82N9K95j07L08L37j82M13N7j6J53l65rj40l47J87m75k50L99m62L46R7
1191a35j40M82j15m7L20k54N5K38m20R8j73j8J14k85J91J85j41M21n7o8K55j83
1213C23R1jl15J47m16j40J91l64L5K19l24L75j7Q0K72j74J84J11l34K45l71j22
1235c05J54k07J08j0j59M98j52o3L44j20J11l0j30L2j63k27K33m01J2J22m1L00
1257i4jJ9M49j83L56o2k43J80j52k39J29l09j5O5j81K09n2k5M25k34R4K52j66
1280B22J42k27j74J00k86J9J0j76J83J16J53L50j76L65J25k22K89k00k51M5l53
1301E4j69M5n26J57j23nL91j77K77J29n5K50p3j44J93l02k60j9l01K85j11o7M23
$$ y = [484, 738, 31, 76, -259, -577, -456, -747, -780, -411, -631, -404, -110, -339, 5, -86, -126, -27, -129, -223, -257, -572, -251, -433, -374, -79, -186, 122, 459, 277, 690, 747, 731, 884, 519, 510, 370, 23, 210, -265, -515, -116, -578, -232, -135, -275, 207, 92, 45, 365, 111, 166, 404, -16, 82, -91, -109, 5, -280, -89, 96, -45, 376, 319, 251, 506, 323, 414, 413, 98, 245, -171, -311, -120, -484, -449, -230, -554, -179, -196, -116, 156, -18, 166, 277, -57, 188, -183, -305, -151, -358, -250, -260, -419, 79, -73, -136, 208, 88, 199, 169, 39, 71, -92, -319, -86, -487, -475, -353, -394, -94, -95, -76, 373, 190, 546, 484, 241, 421, 269, 30, 159, -150, -165, -100, -281, -72, -124, -149, 276, 42, 136, 388, 222, 364, 137, -37, 63, -223, -204, -194, -370, -187, -71, 82, 432, 256, 621, 746, 524, 813, 613, 362, 407, 54, -115, -70, -596, -439, -562, -567, -176, -353, -76, 53, -2, 248, 175, 31, 224, -78, -338, -357, -658, -373, -484, -551, -128]
1324a28j60K58L34n5M66O1k39K25l55o8j87n80J18j84l73Q3r8J66K67j1K89J57
1346a4P3L01k30L5N9l14Q7j86j20K00p4Q7K35qL04J78n5M93k60JL9m98n8j46m43
1371c14j6l20q6J11j72L04O2L7M70p5J65L31k35L08l22k06J57j24o0O3j50J25
1393E3R8j6L92k9oJ12j24L4j48l83J67m57j95l5l48o8R0r9K77J4J18L46m9L91
1417A35K1o7K25Lk23J05J2k7J16k99K63L2k34L90l35R4M7j93P7k50j22J70l68
1440d28M1o8k34J70L6o1J69k15L15K52j34L55j0O8K51q4J33J32j45J96n3j44J16
1463F58k84l6o5k89P3k17k0L6l00J39M4m4J58j0j43J47j51Q1l5k4J09P4k32L00
1487c1m0O3M14j16L38J00j51K06k08k6j35l24j09k05k89j2k87J06O3j36J80J10
$$ y = [-128, -288, -30, 304, 249, 715, 776, 537, 762, 407, 339, 152, -428, -310, -494, -867, -784, -882, -716, -449, -460, -171, -14, 59, 360, 130, 165, 224, -90, -3, -189, -309, -109, -183, -96, 139, 131, 435, 613, 558, 1051, 791, 792, 831, 333, 275, 129, -314, -330, -650, -736, -625, -797, -493, -431, -394, 76, 1, 166, 497, 262, 570, 248, 42, 199, 75, 15, 78, -72, 53, 151, 135, 527, 498, 492, 604, 480, 514, 366, -17, 150, -307, -502, -537, -885, -953, -863, -962, -685, -671, -553, -207, -256, 135, 156, 89, 314, 317, 94, 199, 211, 184, 300, 1, 264, 296, 62, 452, 117, 211, 258, 65, 142, -108, -230, -60, -428, -387, -455, -689, -519, -483, -544, -375, -590, -275, -23, -157, 198, 188, 256, 507, 423, 556, 688, 543, 739, 686, 542, 658, 374, 338, 273, -16, 57, -160, -180, -144, -444, -305, -261, -305, -147, -157, -300, -153, -304, -223, -258, -282, -173, -99, -331, -31, -71, -8, 406, 290, 628, 728, 577, 783, 575, 549, 414, 90, -19, -224, -513, -525, -812, -706, -643, -779, -599, -489]
1509d89K10K63j31J09J85k48J65j52l11P4j80J74J26n1L78R7J90L10O0K2K24k64
1531G61P7l34l05j92l59j62k51k24J48J14oL86K23K71L12j17K52m2j78k7j77j55
1553A5n2k04O2j59J18L56R2J93L88K4J45l2k73M6m11k58j93m38j68k20k49K54
1575i64K4K98K48L05K11K56R2K03j47q6M4n25p2j06k68K95k59J42K27L1K85J72
1597D06N6L02j50j17k8l96j98k94l55o7j85Q7J60m1L79J88K66K87J35J33J49j43
1619E74r9ln33J82l01j06K1J5N4K04R9L67k7l6J79j03l9p8l53m3l18j57P5j72
1643e98L6K76l1L42J59oL45j60K36r9j23l0k58j56O5k85P0nk0J96K8L2L16l9p3
1668B18P8k45R9k82j09j22o8n6J13j01K62k3J1M43j3L3M3j48J73k44k36R9j28
$$ y = [-489, -279, -16, -147, -38, 147, -101, 64, -88, -399, -325, -505, -331, -205, -256, 122, 219, 409, 719, 779, 801, 1025, 761, 838, 504, 199, 7, -352, -514, -765, -989, -841, -727, -733, -347, -124, 147, 459, 342, 594, 552, 374, 347, 170, 15, -37, -241, -179, -338, -220, 136, 228, 421, 809, 833, 978, 946, 673, 719, 308, 50, -143, -581, -749, -969, -1218, -964, -940, -642, -394, -89, 122, 378, 470, 673, 526, 440, 484, -41, -113, -219, -487, -192, -451, -309, -82, -51, 234, 406, 462, 764, 614, 497, 469, 73, -125, -419, -774, -841, -1026, -939, -779, -820, -441, -253, 13, 300, 435, 568, 717, 574, 475, 472, -61, 121, -180, -286, -265, -250, -196, 8, 107, 474, 447, 411, 590, 487, 448, 370, 17, -26, -344, -501, -426, -598, -562, -286, -317, 25, 184, 178, 523, 363, 599, 500, 377, 347, 89, -67, -2, -287, -217, -222, -242, -46, -18, 14, 330, 291, 218, 296, 51, 150, -132, -241, -363, -431, -487, -374, -475, -213, -236, -225, 218, 205, 238, 281, 133, 306, 62, -174, -75, -203]
1691b03JL3l04K66q1J99K16m9O4Q5j41P6j18k60J81k43j30K64k07J98J46k4K73
1714B42J9O5J61k67J03r2k43L2j30j03Q3k56K65o7R3L27j83K13K71j93Q9O6l22
1737A73O8k88j4j1l11O9O4N4K78n8J85L39j86L9lj32p9k32j23j33k10J0n1%J77
1762c75O0K13J77L8R3J80m5J02j64j20n3l93K1K2j81K04p1M3K36P4J30J23j29
1785A85K65k78j18L7l15j12l2j75j1O1o1J95J36K81J51K6K80J9N2P0l09j41L5
1808B41k99J11l40Q7J48l1O0N9J15J71k3j01J50j96o9K1k16j00q5j04N4j68K62
1831b53L9J32K80l1J27J68J1M6O4k72M4r2j69q3j23j23M0rO6K4l0K3NqO3p4O7
1858f8k5j86J0j05PJ04o4J80J1L6K24q4J87J47j95J97j8p6Q3j88q9k4j49O5k30
$$ y = [-203, -202, -169, -473, -207, -288, -89, 127, 78, 142, 227, 86, 162, 44, -216, -35, -278, -408, -144, -351, -153, -7, -31, 242, 261, 326, 487, 220, 323, 231, -12, 20, -110, -213, -130, -386, -121, -188, -95, 232, 49, 262, 533, 340, 429, 495, 173, 241, -47, -61, -72, -383, -314, -250, -196, 82, 24, 209, 548, 362, 401, 398, 266, 187, -45, -168, -301, -511, -501, -552, -552, -375, -315, -102, 75, 113, 206, 386, 341, 443, 279, 159, 106, -287, -266, -244, -425, -221, -292, -249, -13, 61, 191, 314, 185, 450, 172, 54, 91, -224, -336, -368, -543, -554, -493, -554, -359, -223, 58, 209, 235, 515, 534, 586, 656, 347, 206, 241, -58, 53, -287, -200, -52, -83, -23, 36, 151, 322, 299, 198, 348, 152, 83, 104, -112, -212, -297, -401, -347, -515, -253, -214, -82, 198, 167, 294, 462, 473, 519, 583, 311, 355, 263, 94, 11, -112, -235, -195, -204, -138, -114, -144, -121, -116, -124, -61, -135, -68, -93, -279, -269, -374, -367, -263, -327, -147, -136, -100, 124, 40, 227, 374, 179, 376, 358, 282, 365, 177, 88, 64, -85, -20, -250]
1883b50l7J23j86J77j50mQ5lJ04o1J19P3Q8j23K95k28M7J33j53P3N2q8K03j51
1907A38l3J37K0P2O8k20J87j29j10K4j33r4j01j92N8k04J9P8nJ64L1K38Q8J26
1931B27m2K65j38J28j30j79P0j72j68K5p8QK27j17K15m1J57J26k44N4l4l43K9
1954a55j73j97%k24L4J86m4K74Q4J95K48J51Q7N5j5o3J0k82M1l78m7J8k24K09
1978b10J12n6L08m4J57J37p1Oj94j45N3k59k42Pk11Q1J17n1L45Q3L41J64J20J73
2002G21M4j69J63l51k30m6l01l8Mj98O9Q8Q4K09P3J41J32o3m6o2j82o1k58m0p1
2027c88k74J28L2Q2K60K8L06K11J04J86k10m4N2k60j47j15j87j07k6j39Q4l4K06
2050b52J74p9J85J17m2P6o6j35j05k33P2r2q3J81q0J17K73M2Q2J64Q0J94k16o0
$$ y = [-250, -287, -164, -350, -173, -323, -327, -242, -245, -141, -202, -83, -10, 78, -45, 250, 22, 69, 202, 49, 122, 174, 86, 289, 138, 105, 242, 262, 334, 402, 182, 369, 240, 130, 154, 21, -73, -174, -366, -308, -512, -493, -415, -420, -256, -225, 13, 101, 227, 185, 450, 312, 440, 310, 131, 201, 29, -139, -114, -192, -184, 43, -74, 141, 100, 257, 383, 139, 193, 159, -184, -155, -328, -525, -525, -749, -715, -529, -573, -299, -215, -20, 228, 379, 466, 521, 506, 443, 453, 171, 212, -166, -213, -195, -419, -210, -98, -154, 154, 110, 267, 404, 333, 339, 145, 0, 53, -206, -448, -441, -652, -571, -454, -505, -160, -77, 264, 428, 548, 721, 765, 596, 759, 408, 178, 132, -169, -207, -203, -401, -332, -244, -160, 49, 122, 263, 395, 332, 286, 224, 42, -19, -277, -317, -388, -662, -534, -502, -420, -160, -132, 174, 385, 489, 675, 465, 421, 473, 213, 66, -49, -236, -343, -369, -508, -424, -458, -252, -78, -157, 28, 145, 103, 179, 113, -22, -127, -360, -288, -380, -463, -282, -362, -245, 28, 70, 152, 316, 396, 590, 374, 314]
2074C14Q9k33k7j93k51J07r3j23K38m8J81O8q0R0J79o6J23j40q0j59K7N9j99K20
2098Cp2J3Q9R5JJ53mr6O2l4M6j20q9N6k76O1M5j87J66Oj63K25nO1P9j64K04k69
2126a14M3O8k01R7K5j11O6P6K2J22k7L4j7Jn2j0q5N6j83M8MK4J08j04JJ20P8K
2154I1P6j33L0n1j58J60l1n9m2o8J40N2J3J73j46N8L6K9jn3q8p1Nk5R6k88R2N8
2182a05P5Q0Q4n4R6O8pK4p8k5q4j33J16j36m0M3o4K48r6p7K34j48L1K06j93L9
2208A04j33J7Nj78Q0j55K7K5R2pJ82k5J08m9n9K00j75k3r3o1L1rj73J81r9l2J43
2235g6kn0P6kJ81l4kmj54R7o5j66J98k7j17K10l6ooR4J85j21K9O4o1j7j43q8M9
2264Fn3m3J3K4qP4o2N3P8j8J12p2m6J17j56m7J50j14r5O3pK7l6L3J26m8J65p3
$$ y = [314, 403, 170, 143, -50, -301, -194, -287, -410, -172, -220, -39, 29, -51, 39, 218, 152, 275, 135, 55, -104, -77, -18, -217, 3, -69, -56, 33, 128, 129, 282, 278, 182, 244, 210, 256, 136, 47, 103, -173, -112, -67, -254, -88, -82, -245, -20, -25, 36, 115, -49, 155, -114, -71, -3, -204, -107, -82, -193, -127, -51, -29, 93, 66, 100, 83, 84, 32, 22, -63, -7, -190, -142, -138, -114, -6, -110, -109, 11, 89, 91, 167, 34, 64, 13, -145, 15, -16, -75, -117, -185, -45, 7, 20, 193, 47, 105, 141, 170, 169, 116, 28, -43, -38, -63, 33, -255, -163, -105, -30, 50, 134, 80, 176, 244, 237, 261, 183, 158, 74, -59, 57, -79, -119, -76, -140, 108, 12, -65, 169, 21, 52, 258, 65, 104, -29, -12, -7, -185, -105, -260, -233, -208, -116, -123, 59, 34, 142, 93, 34, 234, 59, 36, -57, -118, -87, -96, -269, -88, -187, -219, -76, -78, -128, -52, -54, 127, 93, 91, 87, -67, 30, -35, -201, -3, -30, -147, 63, 27, 21, 15, 109, 294, 173, 202, 266, 205, 188, 45, -43, 6, -47, -90, -77, -53, -61, 13, -49, 4, 82, 64, 176, 104, 58, 175, 19, -28, 122, 8, -87, -24, -31, -4, -40, -7, 119, 71, 236, 163]
2292A63p5L4q1k6n1o1Q7j90L7R1r4j4j48J52J69o2l9J18m9K06k64R1J35j24L2
2317C7L7k9n8k3Q5O9j70R6j18Q5m1%r8J95o3l2O5j08k0n0m1J83j36n3O1q2R6O0
2345e3M1O7k3J39J50K4j48M4l8l9l7J08j51j99J56n9l2Q2j27J14Q8k43Q5R1j11
2370g1K16j24j30K35k73J03q5l7J32k8R1L6qO6R1L0L7l3k5k1j21mj00j03P8j60
2396b08k5J0j08L11j10P0J14j23O9Q3k28N3J44k00J99k44Q9j3M4J41l1M2L4J39
2420B52J8M5j40k9L8j46K8j58n0p3p3R2r1N5J06N0L2J84p5m2R3p6K13k03j28O7
2446a1j29M9NQ2L8J37l0J28j30J74L2j51n7N4j80P5j81r4m5j05Q0j2K8J00n6J94
2472eL7q8K75j77pJ63j59j15Q9p4j08R9J3K0QJ61j3r0J34k8p6R2k37KkMj09p5
$$ y = [163, 88, 122, 41, 15, -36, -97, -10, -200, -163, -72, -166, -180, -328, -176, -7, -69, -108, 10, -39, 167, -97, -6, 129, 5, 37, 74, 45, -13, -36, 49, 118, -52, 44, -74, 11, -30, -30, -128, 67, 4, -28, 37, -71, -91, -141, -182, 1, -135, -188, -127, -209, -113, -53, -12, 55, 32, 171, 321, 345, 197, 241, 203, 164, 127, 235, 84, -115, 41, -18, -50, 32, -95, 19, 107, -136, -51, 40, -71, 145, 21, -109, 126, -147, -44, -129, -166, -34, -62, 29, 65, 57, 123, 214, 244, 281, 248, 223, 202, 81, 77, -23, -126, -48, -208, -233, -223, -331, -20, -130, -60, 54, -69, 0, 83, -145, -92, 52, -148, 51, -193, -104, -117, -73, 68, 37, 79, 113, 252, 270, 315, 175, 146, 184, 38, 66, -92, -142, -215, -288, -196, -287, -232, -126, -76, -44, 140, 65, 23, 116, 40, 253, 50, -78, -11, -140, -91, -86, -4, 34, 171, 141, 269, 139, 313, 345, 194, 137, 191, 11, 86, -95, -189, -234, -339, -259, -271, -243, -143, -199, -5, 32, -56, 219, 42, 35, 198, 39, -76, 13, -61, -169, -70, -57, -37, -29, 132, 119, 29, 163, 135, 59, 151, -86, -84, -86, -82, -191, -266]
2500b66M2J28k02Q0M6M1J93mqJ06m2r6J15j89J42j47LK9mJ59%j38J69l7j30K08
2526A98j73nPr2K4mj61J17j02N3J14r2L6M7J4J11O8p2J18j11j7q4J7J21r7L7m1
2553C1q2J14k2KP5p5q5J17j54J25j10k7M1p2j9J23j33Q9kl9l7L7J75j27R6l1l3
2580b3k6J06j82Q6J21r9J5m7NL3l9j8Jo5J69k6p1J5o2j0J10j52J04kk2J90n3k9
2608B9K6m2J7O7q0J7K8m3J50k11K2J15j36K17k42K3J61k3q6K6P0q8l9n2J33j0
2634D9o5NN5N0l7o5J75j57P7l1j60K41j18p0O4j03P2P8j62J07j15J51k2m2O6m7
2660dj50K31k2pm6Rj20L9L3p8R1L0Oj00O5M3o6M5O2Oj17O2r4P0j61Q7o5J91n6
2689a6Ko6PQ5n1J04q7J64j30m3O9j00J93j13j55K47m1k0l9j07J41O5j37J43q9
$$ y = [-266, -224, -96, -298, -218, -172, -131, 62, 58, 50, 156, 114, 18, 133, -56, 86, -61, -58, -29, -33, 126, 126, -12, 157, 120, -10, 198, 25, 20, 27, -65, -41, -45, -206, -89, -191, -138, -24, -116, -80, -33, -19, 92, 160, 88, 206, 95, 78, -6, 11, 132, 35, 72, 31, -51, 63, 41, 43, 118, 43, -42, 75, -79, 46, -64, -91, -50, -122, -141, -18, -151, -62, -64, -103, -140, -103, 72, -55, 41, 10, -23, -49, 57, -125, -39, 82, -17, -2, -49, -44, -11, -50, -68, -67, -132, 37, 11, -60, -45, -107, -117, -7, -159, -55, -57, -79, 111, 58, 29, 55, 13, 30, 97, 17, 34, 62, 19, 169, -42, -20, 95, -41, 176, -66, -43, 118, 95, 9, 35, 105, 17, -22, -74, 59, 49, -16, -11, 44, 94, 57, -8, 167, 10, 87, 56, -104, 137, 19, -51, 13, -90, -18, 60, -102, 5, -110, 41, 19, -23, 43, -4, -154, 77, 55, 48, 2, 11, -109, -70, -37, -115, -24, 6, 12, -88, -23, 20, -46, -1, 61, 67, -50, 12, -82, -12, -173, -86, -151, 40, -16, -14, -80, -73, 12, -39, 65, -22, 142, 12, -31, 38, -62, 131, 18, -137, 110, 69, 49, 10, -97, 44, 109, -28, 115, 26]
2714B6K5o0p5R3Mj47J78n8l7K06k57R1J48j22J32k9K1Rj33J79j28O2j5k5q4M4
2740D8j16O8q7o0J09Kl6M3Ml3K9qN8j98J47K3j35J14n8N9l0J38m3L6r7J18l8r0
2768c3J05r6QL8j59J65q3p8K18j34K8P8j28N0j2m1P8j1L9O2j07N9l6o0J15j92
2794a27J36J97j89J12o4p3J35R9j31m0P6j33P3q1J05o6j21L4O7k4L5jl2Kp5J86
2820A00k38J93N4j73J07l1o8L4M8j9M8JNk8j4K40j57K6j85M1M8j38J13oj22l6
2846a57K09j21kM0J4M9k48J90j9n4J51p2R0q8n0O9m5M8L0K3j0j22J54j5N3j47
2872c0Q4j00j4N0k8j16N3RM2j16jK32o3N3J1p9L5O5p1J16m1k2m1n1O1l9L6r9J24
2901F0P1q6L9M3jj20J75j45k5O1j15k8l4L6R8r7J3P9r4P1mJ3J12Lp9R9j24Q2q4
$$ y = [26, 51, -9, -84, 9, 13, -134, 44, -14, -51, 155, -102, -11, 137, 15, 147, 118, 139, 148, 15, 194, 66, 128, 113, 88, 4, 48, -68, 0, -87, -147, -38, -36, -72, -29, -25, -58, -29, -37, 21, -177, -30, -7, -142, -28, -86, -27, -57, 81, 38, 74, -23, 95, 57, -33, 72, -24, -16, 22, -137, 28, -55, -133, 85, -49, -21, 57, -71, -21, -33, -74, 4, -7, 32, 94, -13, 46, 10, -50, 65, -127, 9, 206, 17, 129, 65, -8, 127, 226, 95, 55, 131, -2, 71, -10, 95, 29, -92, -58, 9, -15, 20, 19, -13, -11, -86, 100, -138, 55, 109, -64, 43, 12, -56, -22, 26, 7, 55, 56, 61, 33, 19, 259, 102, 128, -57, -16, 32, -106, 7, 1, -121, -157, 52, -69, -71, -31, -17, 32, -216, -26, -45, -99, 52, -20, 70, -18, -68, 1, -44, 4, 34, 57, 47, -75, 79, 64, 117, -30, 54, -46, -60, -10, -38, -154, -101, -92, -50, -166, -167, 65, 2, 55, 66, -13, 22, 87, 16, 132, 91, 69, 28, -23, 38, -1, 35, -64, 60, 131, 45, 84, 127, 126, 6, 181, 36, 11, 72, -43, -71, -105, -69, 29, -68, -55, 24, -70, 1, -3, 10, 122, 125, 46, 145, 21, 103, 19]
2930A9o0O0j36Q4O7j80K12M6j39K15k51L9m2J7p5K4J0Q2j89Q1P1p9O8Q4j18J24
2956C4qJ9P2p5j9m4O2Q0p1j39J77j92J57j20K3N3l7n5J40Nql6K8Pp3%J25k03R7
2985aj8j46J16J5J36r5q9J80k5K5MK9K3p1l4j17R6PJ1m6l2j00K04j05P4j56J49
3012C4m6J04o7r4QP7p6J68r7J1l8j9P4P0m8r1k7K3J7JK5N4j45O8J04j32j40N6
3040a26L8J37j98J36n0J44p7n5P0J02k38J95q6o6J24j12J9j07O1P2o7Q9j6n0R6
3065C5%l1K9Pl7J15r9j2Q3k38R7j6j2J29n5J49j53k0J06O0o2Oj05J65j29K7k7
3092A2j1j24J99j13M8L1r9K1J66j21M5K9K4j08j5K0r2O0N2J4j61K2j1O4L8j0N
3119a5L2P1l9q7m7N7j00%J52m5P8j02j9qj4R7j04J64j29J40k46J61pN0L5o7m5
$$ y = [19, -41, 19, -117, -33, 34, -146, 66, 112, -27, 188, -63, -24, -66, -49, -124, -100, -90, -8, -197, -116, -45, -124, -56, 28, -90, 34, 26, 45, 117, 42, 23, -21, 41, 121, 50, -89, 88, -104, 53, -67, -44, 9, -28, -83, 57, 62, 54, 18, 46, 53, -20, -20, 105, -98, -1, -19, -165, -49, -34, 102, 7, -82, 98, 73, 98, 102, 131, 154, 83, 49, -68, 28, 35, 46, 0, -32, -132, 72, -33, 41, -115, 34, -12, 92, 25, -69, -61, 16, -60, 108, 11, 22, -16, -35, 39, 109, 61, -30, -57, -34, -17, -16, 9, 63, -82, -14, 90, -42, -182, -126, -88, 49, -149, -13, -63, 81, 4, -51, 19, 121, -117, 78, -8, -74, 50, -62, -43, -150, -89, -17, -84, 5, -11, -61, 35, 35, 4, 33, 40, 3, 118, 19, 7, 90, -148, -51, -67, -79, 50, -5, 144, -9, -29, 77, 137, 75, 81, -24, 141, 12, 39, 12, 1, -123, 76, -37, 11, 42, -57, -36, 130, 9, 54, 83, 107, -1, -16, 4, -88, -28, 24, 38, -123, -101, -112, -48, -10, -20, -15, 17, 88, 49, -38, -85, -28, -128, -128, 24, -21, 57, -45, -64, -72, -86, 11, -93, 71, -58, 82, -164, -3, -10, 40, 75, 8, -37]
3146c7n1J88K9j30o8K2j0Q2j55J40L9M5q8k6NJ30j09j5j0N9j6R7j44k2L5k4N1
3173A7q7J23ko8J9l7J39J17k38J01M5j24O3K2m4qK8Jn0q8OL0m3J38k20K19k8K0
3201E1J2m1Q3q7j02j3L1k8R3m0N9k6q0Q9mJ6r3J13n9J69j44j10J90j81n0j7j9
3228a88J97k20K42o1K2M9j1n7J65p6Pj01kJ05r2j05J72j56Q8J29m8K8o6N3J16
3253A90j21J7k9l5j9j11Q5Q5j37r0Q3j13J93J2M9R8k15J16j3KJ6O2j06K4j91R7
3279e1jj41K06j01K5P0K1J12j51RJ57j57J02r2p9Kj38J5J6K5J30j27P0O9p9M0
3305d8J58l4j27J61r3m2p5qMj7m1M3O1J5j2l8R7N1K3j8j5r5O2P2k5j65Q0r7j02
3334b25J22N0P1N3j9L3j5M3R3j00r9J11p6j28P1j54O0R7n8O2n1r6K73r3P3J13
$$ y = [-37, -88, 100, 129, -1, -69, -47, -57, 25, -130, 10, 49, 94, 6, -20, -15, 115, 6, -9, -19, 40, 24, 121, -23, -45, -10, -34, 17, -70, 53, 51, -17, 2, -35, 104, 221, -17, 84, 129, 5, 68, 90, 46, 38, 66, 67, 17, -71, -65, -35, -78, 60, -160, 59, 31, 51, 63, 22, 105, 18, -84, -97, -66, -94, -1, -41, 18, -8, -88, 1, -3, 13, -80, 33, -26, 143, -1, -111, 79, -102, -152, -169, -188, 9, -211, 31, -30, -8, 41, 30, -27, 138, 62, 69, -32, -34, 71, -21, -126, 46, -110, -22, 107, 59, 87, 21, 74, 190, 69, 86, 57, 22, 3, -108, -23, 62, -75, -165, -82, -195, -2, 10, 59, 157, -58, 58, 45, 47, 63, 125, 19, 43, -148, -51, -52, -193, 13, -88, -63, 7, 28, 140, -11, -2, 155, -2, 100, 8, -71, -69, -207, -192, -176, -151, -21, -148, -78, -9, -88, -48, 110, 76, -51, 110, 17, -25, -100, -108, -104, -121, -162, -119, -58, -43, -55, -93, 4, 55, 78, 60, 45, -50, 12, 84, 59, -106, -26, -123, -225, -103, -53, 18, 71, 52, 85, 70, 113, 206, 106, 7, 118, 42, -86, -15, -169, -109, -12, -70, -8, -59, -155, 118, 25, 98, 211]
3360B11k13J64j68m6J80j09j40P7j6q5M9N9M9n0J10J63j23Q0mj54l0K9l3k1l3
3385e4L3m0L1o1j47J29J78j14l3J53r6N0J32j63r4j0j26J83j65K20k74K24Q5p6
3409c5M7K9q5J03l0p3M5k9J31k42J47rr8qj7RJ09Kj01J80j86J02L7lJ6P8j21k4
3437b6J01j37M4r3R1q6M5N7j16P7J32J0r2J35j26O3K3q5M3j25Q3j64MJ71q2l9
3463i2J30n9J10j90J41j0O0n9l7J8r4J0M9O7j26L4Nj23J10K7O5L9l0Jm2P9o0M5
3491F8k41J97j20j17Q2J42pj6R6r5j32J95L5j03J66q0j60J11j37J0J30j10O0l8
3515f4Q7j01J9L4L3nO3p8M2m0M7o5R2j07j1J30k10R6j9M2P7j69J40o6R0r6J80
3542A41j48M5n2K1Pj00n9J35j22J52n8J43o5j57K22q4r0J90k25Q3J08j41o6J8
$$ y = [211, -2, 162, -6, -52, 128, 19, -121, -44, -60, -145, -96, -37, 12, -38, 72, 235, 112, 192, 188, 34, 4, 33, 0, -21, -54, -21, -61, -30, -91, -238, -109, 69, -45, -78, 75, -21, 29, 161, -2, -96, -106, -232, -49, -214, 6, -268, -44, 41, -35, 12, 41, -44, 59, 29, -44, 1, -28, 103, -139, 8, -1, -99, -107, -124, -115, -6, -4, -105, 75, -111, -9, 28, 25, 41, 119, -2, -26, 75, -62, -18, -111, -20, -106, -61, -4, -120, -43, 89, 99, 7, 142, 16, 79, 102, 17, 60, -65, 18, -146, -142, 29, -53, -92, 38, -21, 89, -101, 40, 30, 90, 31, -6, 12, -82, -72, -23, 44, -82, -48, -43, -166, -56, -29, 36, 75, 45, 46, 4, 83, 23, 68, -173, 24, -96, -213, -131, 11, 4, -12, 84, -11, -143, 52, 87, -16, 150, 70, -90, 21, -116, -106, 24, -86, -26, -64, 23, -78, -59, -25, 8, 3, 66, -12, 30, -10, 37, -28, 64, -43, -54, 76, -134, -38, -57, -15, 62, -107, 33, -33, 57, -39, 141, -7, 38, -14, 7, 14, -86, -145, -10, -132, 20, -38, 105, 40, -117, 105, 21, -69, 121, -104, -21, 87, -54, -120, -102]
3566a02Q1L2j01L4J10j84N5P4RK9j00K2L4K4K3M0j55P2j57J84j15L3l4J40j15
3591f7J28o7k0J48k18J17l0l3J07p9L6l2l5J76k22j7R8k6r4J40l3P7L9j24J08
3616G7K3m3l7k8J27j81J32n2k0l3J34k14L2R5p7J03q2J17l8K5Ql0j09l0J17m4
3642b8O4p1M8n5m1J17j18MO2o0M1J29j09L9q0N6R0k06R8J6q6J09or9J1R9K4m3
3670EJ8P6p2qr7Q3M3m6p4N3q9J08r3j9J46J4R8r3k9p1J95k12J62o9K1J2j13j8
3698f9Jj1K4L3j37J75nOJ14O6j34r1J14o4k3k6P3k47K24jj09J45j01R6o2l7K0
3725b6J33n1l6O6p2o8N6j31rK8M9m9j4J15o7Q1m4J5J05M7l0L5j23R9j31q7J28
3752A9j05k9J56j41J37p5m1J38m0k6P0p2J31J7k54J11k3k5K5o1Q7K3p9P0K4l2
$$ y = [-102, -21, 11, -90, -56, 54, -130, -75, -1, 8, 37, -63, -41, -7, 17, 40, 80, -75, -3, -160, 24, -91, -58, -92, 48, -67, 61, -6, -26, 122, -96, 21, -9, -42, 65, -14, 22, -10, -45, 131, -91, -108, -10, -36, -130, 10, -23, 54, 93, -31, 77, 100, 57, 20, -8, 119, -62, 70, 18, -2, -35, 99, -115, -83, 12, -65, 38, -44, 73, 35, 60, 68, 38, -71, -101, 16, -28, 36, -35, 13, -42, -83, 34, -84, -80, -18, -78, -37, 92, -17, 22, -58, -2, 88, -118, -20, -4, -90, 19, 13, -86, -75, 24, 48, 5, 23, 99, 27, 19, -78, 5, 48, 2, -72, -19, -108, 0, -93, -112, 34, 48, 146, 53, 24, -47, 148, -64, 98, 29, 50, 62, -51, -69, -68, -79, -55, -22, -159, 16, 11, 17, 131, 197, 63, -28, 86, 22, -1, -27, 46, -201, 23, 22, -87, 58, -43, 53, -9, -46, -26, 107, 56, 20, 86, 14, -54, 2, -129, -138, -110, -61, -110, -124, -9, -76, 5, -39, -24, 81, 128, 98, 133, 10, 109, -22, -109, 19, -86, -115, 41, -100, 37, -38, -79, 59, 19, -7, 63, -9, 122, 139, -115, -4, -27, -52, -27, -88, -1, 22, -57, 13, 37, 5]
3778EQ6n0qJ19j01No0o9K3k7j22K12q6J04q7J57n7L5K3p5J12R4j16n5J71l26M5
3805d8M3r8K2J42L6r4m1L7O7L2j7J40j31N1k16O7J2j88J25k2N3j3M8j54J45N7
3831E5M2j32J66m9ln1Lq6O2j09Q4l3r3P2P1j29P8M6P3o4p6J80J6j74K5n9J5Q2
3859A2k05Q4l1NJ21N5o2L8J33j77K17j91N0k8r5Q2o8kJ3J61k05J6J31r9oN8R2
3886I9K5L8r0j04J21J0p4n4K7k8K1q4M0P9K6O9j97J71M9j34RJ8Q2j46O5l1nq7
3914h5J26j09OK9M4Pq3L3K9l2J39m2n8l6J9n0K7J6P7j54O4J9K4MO2L3p2m7K5r0
3944g5J58j13jl7j5j2n3J58r7j0J75q2r0L9K2J13j43l4L8M4m6J54n2j24J49r9
3970c3L8nm2n9J24j01Q4l5J52p9j06KRP3kK0p1p9RJ07k6L9JK8j06K5j6Q6o6J20
$$ y = [5, 91, 41, 33, 152, 51, 56, -4, -73, -50, -77, -199, 13, -73, 31, -56, 101, 44, 79, 102, 27, 139, 233, 117, 62, 233, -93, -48, -5, -103, -81, 61, 97, 3, -38, -1, 66, 98, 81, 221, 90, 141, -75, -8, 4, -184, -59, -81, -28, -41, 7, -147, -2, 55, 97, -35, 131, 82, 79, 28, 31, -55, 7, -102, -18, -51, -144, -72, -1, -130, -52, -6, 67, 3, -73, 107, 123, -51, -26, -85, -70, 12, -193, -109, -140, -135, -14, 41, -21, 17, 150, -27, 190, -1, 49, 21, -74, 8, -60, -62, -49, 112, -93, -77, 54, -45, -51, 7, 99, 124, 162, 72, -32, 89, 99, 25, -29, -2, -30, -9, -93, -53, 26, 52, 121, -76, 95, 144, 10, 19, 37, 119, -27, 38, 7, 2, -85, 41, -68, -62, -33, 11, 18, -65, -32, -3, -35, 104, 62, 4, -32, -13, -63, -36, -20, 57, -97, -33, -14, 10, 14, 76, 109, 37, -10, 15, -75, 83, -30, -31, -68, -83, -95, -148, 10, -87, -97, 78, -4, -94, -55, -33, 80, -63, -97, -59, -15, -61, 93, 41, -83, 66, -33, 5, 0, -42, -101, 23, -78, 6, -29, 123, 44, -62, -60, -51, 22, 20, 40, -31, -110, -101, 6, -20, 19, 20, 48, -58, -33, -49, 37, -29, 91]
4000I1l4lMm8j43Q8L8KO6j97K02j02m4J14n5l0M2p2l6Q0oqN1k5n0L4J0q4lK45
4030A27j98L0M3k9K4Oj24N6J6M7k0q3L5P8O9j66MP7QK1M8L9j66K20j37n4N5j09
4058h3K0m5R5N2N1j77Q5K9n5O4j14J66j01l0R3m6J46k1j34j5P6q2O8o8k0oJ40
4085H8r8n6K1K48k33k1M9M2K6j6m0O8p4J0j3K3j7K8k3K6j97J53M9l0J3p7P6M2
4113F7l3k86J99k1P2L0j34L9Q1n7J24r9Q9j06L7p6M1J0o4K9N0n2O9M6j16M8n1
4140f4kJ29r4J7N4%J19k34P1L7R7j09M1l8N6j52Q4K8N4%q6J8p7M2L3QL2p4P3r7
4170c4L9P9k09R7O3k0j15J11o3m6K16r0l1j03J96j10Q5n9m5N9p7O0k9N3j8j13
4196a04O1J01j19J31m1J1l8L8ok9o5K7N4m4k2j8R8N3o6j3q5R2j1M7O5p3l3Q6r3
$$ y = [91, 57, 54, 58, 10, -133, -45, -7, -5, 61, -136, 66, -36, -80, 34, -21, -51, -9, -81, -117, -37, -43, -51, 0, -25, -75, -41, -31, -115, -118, 127, -71, -41, 2, -27, -3, 3, -121, -65, -49, -2, -22, -105, -70, 8, 77, -89, -85, -8, 0, 21, 69, 108, -58, 162, 25, -29, 26, -83, -63, -108, -13, 39, 90, -87, -2, 27, -28, 36, -78, 88, -13, -43, 50, 4, 150, 129, -5, -20, 56, -26, 42, -26, -46, -52, 88, -10, -66, -45, 203, -30, -51, -2, 40, 66, 50, 10, 78, 4, 14, 1, 24, 7, 35, 12, 38, -159, -6, 43, 13, 26, -51, 25, 67, 34, -252, -53, -74, -2, 28, -106, -67, 14, -43, 81, -18, 71, -35, 2, -74, -33, -23, -87, -58, -8, -60, 9, 55, -61, -13, -64, -66, 63, -31, -14, 40, 40, 159, -75, -4, 33, 130, 21, 62, 24, 80, -72, 12, 40, 94, 94, 8, 26, -51, -9, 24, 32, 64, -10, 63, -34, 5, 84, -125, -28, 35, 15, -100, 11, -52, -98, 118, 28, -3, -106, 90, -20, 65, 6, -39, 20, -57, 3, -26, 27, 9, -104, -43, 58, -61, 70, 29, 40, 2, 40, 34, 5, -60, -33, 21, -23, -45, -63, 35, 88, 22, 9, -76, 16, 5, 52, 117, 44, 11, 97, 4]
4225Dm6L2j5m1n8J93j38J55l1j6j04Q0nO7j46J54r6j9j06K15n9j26J58L3pl4j2
4252C2M5Q2o4j7j5L6j21Q5n6m1L3O1N4j37m7Q7q5R8L7p5O8J8o6K4p6j6P4j12J2
4281h2P9m8J29Lj2j03J24n6M5O1j13M8j00p3P2J24k54J61r7O9m0Q8r0KL6k8N8
4308Cp1O3mk8M7Mm1k5Q4L5n8j4P8k5L5m1m9J57j32Qk7J60p5n6j28O7l8K3k9L5
4338d2l2R5j2M4J15k51J21m3K2mn0J6J14N1p2mn5M8o4q6J80p8J9K2j25J19j66
4365a18J38j07pR8P8j28l3O1j23J82j40J45m1K0p4oK5lj19J11J03mk6j42J20M9
4391E9k3J0kj10J6n4Q0Oo8P1Lk6j5j8l2J13llLJ2J36j50P9p9O7p2j03N7MR9L7
4422I4r7l9P0R2j29qm2Q5O7j17N8J38k51M8QL1J4p5m4J72m7l4K5n6J94n6j36k8
$$ y = [4, -42, -10, -25, -66, -124, 69, -69, 86, 55, 39, -65, 15, 10, 77, -69, 85, -11, -30, -136, 79, 20, -106, 52, 85, 78, 44, 32, 77, 159, 95, 78, 63, 99, -22, 63, 7, -34, -1, 60, 114, -23, -70, 17, -68, 30, 67, -8, 60, 78, 12, 36, -40, -56, 18, -94, -82, -3, -51, 78, 81, 69, -34, 90, 34, 79, 140, 27, 75, -25, -98, -26, 98, -156, 5, -92, -23, -63, 25, -65, -63, -27, -55, 3, -68, -5, -9, -37, 10, 14, -27, -52, 32, 67, 9, -5, 73, 48, 83, 42, -7, 150, 18, 26, -1, 159, 84, 28, -100, -33, -71, -48, -77, -42, -74, 21, 9, 53, 168, -83, 38, -5, 17, 13, -37, -21, 93, 144, 72, 68, 13, 61, -3, -89, 91, 13, 32, 54, -71, 48, -118, 20, -87, -94, 4, 82, -46, -79, -18, -141, 41, -99, 46, 5, 25, -49, -55, -30, -33, -152, -41, 62, 58, 32, -110, 10, 59, 36, 46, 44, -66, -50, -104, -24, -18, -86, -15, -12, -38, -53, -71, -103, 10, 7, 4, 7, 19, 155, 5, 84, 5, 72, 0, -103, -46, -42, 57, 94, -3, -42, 28, 120, -9, -17, -59, 26, 93, -24, 34, 172, -79, -31, -23, 8, 22, -53, -97, 75, 28, -6, 19, -37, 157, 101, -35, -63]
4450f3J64j31n5J11J8K6kr5L5J6J0n3oq7J56m8j9J8M1j18RO4J2m9m2L5J17j70
4478a06Q2R5q4kk8R6o9lJ27j09l7m3N7j0M9MJ5Mo2L4j8L9n5o8J16K8l2K6o8R7
4508G5j76J29o0N3n7P5q5J62o9j49J14L3r2J0M3P3j54J0R4n1M2l3Pl9K6j4J97
4535A64l07Q1K12k56J23O8j96J12R1Rl0m4m8J13m7q3P4l8k5K5L0Qn4o0Q7j03L9
4562e5RK39j52n9J53j65MP7n8n6L5L1m1K1rpr4J17K5L0m0j17L0K8N5l5q9M0J3
4591g0JN3K7j04K04rj9q5qJ02o7L1n4K4J19p8Nj05J51r8N3j1j04R0n2r3J07L8
4619D8o5%p2N9l7%P2j1k3J49k34K06J6q8J02J3p7J0j57J9Q8p1J14k4Ol0l4j0M2
4648A1m5K3jj31J91j70O3K6o5n4Q9J33pj00J22n6j2J07n2r7P6L8o2j72R0J04j09
$$ y = [-63, 101, -30, -85, 26, 44, 70, 68, -27, 8, 24, 34, -19, -25, -112, 44, -4, -23, -5, 36, -82, -73, -9, 3, -46, -88, -53, 64, -106, -24, 71, -13, -15, -43, 53, -16, -19, 108, -1, -38, -81, -24, -34, 15, 19, 34, 38, -24, 10, -8, 31, -24, -92, 24, 52, 20, 46, -22, 75, -101, 28, -32, 21, -36, 39, -46, 116, 47, -102, 12, 45, -47, -37, 6, 79, -75, -65, 29, -22, 20, -13, -6, -45, -19, -33, 164, -143, -62, 150, -106, 17, 85, -111, 1, 92, 101, 71, 27, -21, 92, 45, -38, 36, -2, -27, -2, 28, 36, -18, -78, 9, -94, -55, -46, 193, 41, -18, 135, -30, -26, 51, -7, -63, -28, 3, -38, -17, -26, -33, -127, -10, 15, 45, 5, -112, -82, -54, 1, -34, -123, -83, -70, -69, -16, 11, -93, 111, 102, 83, -2, -10, 92, 25, 56, 2, 26, 145, 67, 72, -33, 118, 20, 73, 62, -42, 48, -4, -97, 10, 48, -17, -17, -89, -30, -67, -67, 5, -6, -29, 120, -114, 92, 108, 20, 122, 135, 58, 68, -89, -70, 18, -53, 61, 37, 43, 13, -21, -31, 11, -34, -11, -12, -143, 48, -122, -59, -33, -98, -152, -63, 70, 63, -37, 85, 29, 17, 124, 72, -25, 51, 89, 27, -145, -55, 49, -60]
4675f0Q4r9R6qj33Q1J24k5m0mP0o2o8qJ09k38L23q3p9J87j63O9n4J23o5l4M1p4
4703A0O8k6M9j32J09j18n6Q8J9r7J13m9J87j15j42K20j54j03J84j55L5N5n1N5
4727fJ55j64Q2j9q9R2j42J29no9J46m4p8J30j33j7K6nO7j95J47KJ2o3l3q6J77
4754A7n3j0P7k4q2P6k7M5J0Mp2J37n6m9K2J37j47j7J15o2K9m1p9n4O9k7K5J5P
4783a5N6j05L2j7K7M5PL3m3K6M1j41O9J35r2L2q6J7O2m8QL2m1J12j26K9L7j59
4811g3P3l6Rp9M4q6K1k2J53q7K7J9J27j36O3K6j6R6j1L9p1m4P9j18j10K05j75
4838h3M8P6l04L59j4k56J37m3J7l7M8l1l5L0J36l4q1m1MJ90r9L6R1j33P3K7lN9
4866A37l5M9k7l7m3m2p9J33j72k7J32m7J0K9n9Q8J47j92K8N9j13Ql2J32j10n8
$$ y = [-60, 24, -75, 21, 13, -120, -39, 85, 60, 20, 16, 86, 24, -44, -52, 57, -181, 142, 59, -20, 167, 4, 73, 19, 142, 77, 43, 84, 10, 78, 52, 101, -31, 78, -40, -96, -8, 11, -86, 27, -22, 165, 50, -92, 128, -26, -129, 55, -100, -65, -10, -61, -6, 149, -15, 67, 48, -41, 51, -91, 38, 33, -36, 110, 66, -12, 118, -15, -32, -6, -11, 56, -139, 8, 10, 22, -41, -74, -160, 17, -36, -46, 31, 7, -75, 1, -26, 19, 29, 33, -39, 98, 42, -7, 15, 152, 5, -12, 103, 41, 70, 29, -50, -104, -35, -62, -37, -22, -15, 41, -64, -32, -49, -22, 23, 30, 63, 20, 46, 87, -54, 15, 150, 58, 90, 4, 21, 83, 35, 43, 75, 34, 146, 20, 49, 86, -73, 0, -36, -27, -106, -62, -148, -127, -149, 4, -83, -56, -37, 90, -46, 17, 43, 27, 123, 112, 151, 80, 36, 115, -3, -113, 92, -83, -35, 41, -263, 96, 82, -174, -37, -80, -63, -100, -52, -83, -118, -88, 48, 14, -67, -108, -104, 86, -13, 23, 114, -19, 54, 81, 78, 137, 102, 151, 124, 87, 44, 2, -77, 56, -116, -143, -11, -58, -48, -19, -78, 10, 157, -35, -7, 52, -61, -53, -85, 47, -63, -121]
4892a21J85o2O3L1rQJ29k11O5l6K2pj5o4K1jq1m2J12MK2j26J04q8J09j07L7k3
4920h1j5J21M2j78J14p4N7m1Q5O4j35L2L2j2q2J23j3o8Q7l8K0j66o5N7kJ68j07
4947g5Q6J20k13Q2Q1r2M9J6Nrj38K16j20r1M0J78j54Q5l9M1M1j09L2J7K1j01P0
4974C9m8j33J80q0J14q3k5J01j4m3k9M5O7r0l5l1L8K0o3j0L2P4P2p7k2n9L8k6
5002d8RR0M7j27N7Qr6K7m2Q2j46J23J7K6k9k6M5k8J2M5j36J94j87qJ5j10J31L6
5030a9l4J03j39J71o5l3L1L0L1k0o0l3j5o9K21k05M2M3lJ49k5k3M8n7n5P9k29
5057a36J25l1m2P8q7J21N1p1K0O2j14Q4r8J26Np9o2K3K8K7K4j51k0J06K1J9P0
5084I9J12n1m7j3J0j00pr8Lm5L0J42j48nJ66k41K75m4M5l4Q0O5j86nl2o3J10p8
$$ y = [-121, 64, 2, 65, 96, 87, 95, 224, 13, 78, 42, 64, 57, 42, -22, -1, -2, -83, -125, -13, -9, 13, -113, -9, -97, 12, -95, -58, -81, -96, 25, 67, -111, 3, -71, -14, -55, 30, 94, -41, -9, 23, 11, -71, 52, 39, -29, 58, 20, 40, -126, -191, -134, -136, 32, -75, 11, 131, -82, 0, 81, -11, 38, 54, 59, 50, -88, 128, 8, -83, -43, 135, -19, 66, 27, 68, 109, 0, 32, 49, 70, -31, 39, -9, -142, 38, -42, 72, -11, -36, 65, 51, 8, -21, 24, 91, 1, -34, -65, -27, -7, -70, -80, -48, 26, 98, 21, -1, -60, -22, -48, -39, 51, 98, -29, 28, 36, -60, -33, -75, 7, -139, -16, 1, 27, -2, -28, 17, -11, 1, 46, -90, 104, -83, -91, -76, -186, -55, -19, -53, 50, -89, 82, 17, -16, 15, 45, 76, 56, -4, -37, -52, -121, 100, -105, -63, -20, -23, 126, 101, 78, 126, 69, 14, 93, -136, -11, -42, -84, -6, -93, 28, 79, 8, 28, 90, -24, 60, -38, 88, 93, 14, -48, -25, 3, 30, 54, -97, -117, -11, 10, 29, 99, 211, 160, 113, 100, 110, 10, 3, -95, -92, -137, -107, 35, -113, -118, 48, -193, 82, 38, 83, 49, 129, 194, 8, 3, -29, -92, 18, -60]
5112f0r9L20j94m8R1k1R4Q8j33P7j25K3k4Ll6N9j32K9L8%R9j7p3N4N9p8M2l6Q1
5141H1n1n3p5m9J38m6o8J02P8j14Q2kN3J4r0L4Qk4K5j44ol1O7J04j18J4R5l6o4
5170g6J54PP3r7n8J15L8j83L4J65k31J2N1%M5j2O0k52K33j40R5r2J60j25K4K4
5196B4r7l4m6L6k0N2O4j59J62k7J65j27J04J6j20J26o2j6N5m4j0J2p8l8j2J21
5222D7r6L7J2j51O4l0K02r0j0m1N1m3J6NR7n0N4o6Jq5K36j14l8J42j29J1jP8N6
5251A65o6J1o8p4Q0kj11p8R7nL4k6J23j68N4J33q0J8n5j3J67k51J04j94J57N1
5277CN6o4j8R0r2R3k9N0rj04J39j05j56K71k34lJ3kl2M6K3mM6R3j55J30M9j89
5305i4R6O5r1J13o4o0L1j9J26j60K7M1R1RN3j12q2K06r6j9j45M1l1lj29J49l0
$$ y = [-60, -159, 161, -33, -81, 10, -11, 83, 171, 38, 115, -10, 13, -11, -8, -44, 15, -117, -88, -50, -50, 49, 32, -41, 13, 72, -6, 36, 0, 81, 30, -23, -98, -147, -9, -55, -123, -21, 57, -57, 25, 23, 76, 90, 0, 34, 42, 18, 43, -101, -107, -138, -71, 33, -85, -71, 24, -12, -76, 78, 85, 158, 61, 3, 118, 156, -27, 7, 172, -59, -47, 4, 4, 49, 37, 97, -155, 78, -62, 33, -59, 101, -24, 0, 24, -73, -107, -153, -117, -137, -85, -21, -180, -18, -45, 120, -7, 97, 113, -7, 119, 57, 41, 96, 52, 42, 54, -24, -62, -74, 47, -49, -12, 0, -151, -87, -117, 85, -5, -15, -56, -5, -48, -32, -27, 70, 20, 74, 8, 9, -76, 160, 46, 8, 150, 21, 32, 31, 109, 165, 99, 110, 42, -32, 48, 46, -65, -143, -46, -51, -17, -43, 80, -88, -34, 99, 19, 37, -18, -31, 136, -115, -11, -205, -48, 3, 59, -5, -23, 67, -25, 68, 39, 89, 80, -24, 115, 10, -146, 125, -109, -112, -99, -101, -133, -87, -64, -68, -22, 71, -84, 46, 95, -94, 2, 67, -24, 89, 25, -35, -4, -23, 103, -57, -30, 11, 102, 111, 164, 52, -30, 176, 80, 61, -84, -43, -74, -77, -206, -57, -87]
5332h7J00J8J7R8l8J4Ljp3q2J09o1j02M4O9j6m7J30l8K4l2pQ0P1j99Q5j28J29
5360H0k03L7K7p2MQ2O3l0J5n5M4J39j8j11M4J5O9j04j0r2R7o0qj5J2J35Kk03J68
5389E2m1O2j2p8j14R5o2J19j73Q2M0m6L7R2o4N6N5k3j2K8m1l6O4j29Q5k4j7O6
5417F1p3J5RR5n0j6j06J3Q9nm4QM9j50J9No5J33M7K2N2l6p4N8Pk6q0K9k9k4oP
5449f6j5lP7o1J60k6o1P6r0pL8j04K6M8o9M5j63J58m8J7J13PL9j65J67N2j51m4
5477e0J15l0j6k1j23K9J00L7J1j42J40K8K3j89J26J9j03J56o8j01L3P4j48N0O6
5502A6n7K1k2Q7K9OJ0lr7P4j64j9P3M1K2o3kN7N0l5J07J7j06J2J3L0j00k4Rl7
5532e5P4r2L2J19N6k60J18R8j10R8o7R3j19J6rj06R4k8L6r8Q8n8J21o0R5n9O5
$$ y = [-87, 13, 31, 48, 146, 108, 122, 125, 124, 51, -31, 78, 17, -85, -41, 28, 12, -35, 95, 57, 81, 49, 42, 122, 193, -6, 79, -49, 80, -123, -86, -59, -131, -127, -45, 18, -12, 3, -52, -8, 131, 113, 2, 46, 61, 130, 26, 16, -76, 21, -39, -47, -62, -50, 85, 87, -116, 52, 11, 73, 61, -17, -131, -36, -98, 21, -152, -70, -30, -76, -39, 53, -11, 45, 100, 77, 65, 93, 52, 16, 80, -49, 36, 12, -5, 61, -12, 3, 12, 107, 57, 41, -65, -52, 37, 32, -12, -4, 45, -105, -86, -81, -146, -13, 34, 56, 108, 72, -2, 56, 63, 37, -43, -14, -43, -67, -73, -66, -81, -84, -7, -68, 92, 66, 5, 81, -9, -16, 22, -82, -56, -8, -77, -32, -195, -37, -85, -68, 45, 52, 91, -74, 93, 145, -6, -50, 65, 35, 19, -2, -125, -96, 4, 41, 52, -90, 50, 78, 101, -88, 38, 57, -46, 110, 42, -59, -26, 48, -100, -50, 16, -41, -20, -42, 45, 74, 80, 90, 87, -10, 64, -100, -119, -46, -5, 17, -46, -48, 9, 59, 24, 131, 148, 42, 54, 67, 97, -3, -27, -18, -55, 19, -73, -41, 78, 134, -126, -8, 90, -20, 78, 11, 104, -15, 1, -8, -114, -20, -48, -12, -110, -22, -80, 41, -19, 76, 17, 82]
5559H2j7j31J57n6M4j50O7j09l5J21o5O8J01j51J40j26N2Q3j26K3Q4j67Q3LM3
5584A8rQp6m5P2K21j21l5M3N2R4k44J25m6J3J1k03J03O2Lj17Q3r0%J22j38J93
5611I9j12k4O8n1P6j11l2O9L5j40J42l2J6L4N3j1p4R1l6l7l3k1L5o5L5N4Mj64
5639a32M1o0O3Q3o2j3Q2l4M7j1j60J34K7r7J28n5M9N1m9jQ6r3Q3k8M6J1p2n2L
5668A5r4P5R5j51k0ok2N9R4j20n6R1J36q8o8Q2L2n3L6mN0l0R7j50k9J30l7j4J4
5697F4q9J3p2R6n0M2j1k2L6p8K4Jl1M6o0R6q8J18m9O5l6PP2n5J37r2P4k29J97
5726A26m9j8r3J27k67K49k56J75J7m5L8J7K8j38J44q8Q9j12Oj08Q4JJ3m5J24m5
5752b6J50j44P9M4q3J40N2j59J71k36jQ4l2j25R1m7j29J16p3J69J7j4k6k4J43
$$ y = [82, 65, -66, 91, 35, 79, -71, -4, -113, -148, -27, -92, -24, 77, -74, 66, -60, -8, 75, -51, -28, 56, -111, -28, -25, 18, 9, 17, -59, -104, -32, 189, 68, 33, 76, 128, 222, -22, 103, 57, 70, 81, -122, -19, 43, 46, -71, 12, -78, -78, 44, -94, 99, -13, -37, 31, -20, 56, -55, -87, -18, 17, -123, 19, -13, 3, 37, 90, 79, 5, 96, 60, 23, -10, -31, 4, -61, -26, 28, 32, -132, -91, -151, -88, -5, -67, -80, 2, -32, 15, 4, -156, -22, 5, -92, 36, -19, 30, 81, 32, 31, 117, 24, 107, 79, 125, 136, 64, 12, 15, -79, -4, 91, -60, -80, -86, -108, -49, 45, -75, -131, -40, 96, 8, -60, 22, 54, 1, 37, 33, 83, 53, 150, 0, -29, 101, 64, 50, 64, -25, -12, -84, 12, -38, 4, -7, -29, 7, -71, -47, -46, -77, -31, -91, 5, -83, 35, -14, 51, 15, 22, 94, 39, 176, 84, 158, -71, 126, 77, 59, -34, 93, -174, 75, -181, -6, 11, -34, 4, 21, 49, -89, 55, -33, 56, -56, -50, -158, -74, -73, -60, -105, 19, -26, 124, -20, 59, 103, 20, 160, 212, 53, 224, -12, -13, 71, 39, -86, 5, -42, -171, -55, -128, 41, 58, 44, 18, -6, 137]
5777A37j10m4K8l4J9p1M4m5J25m3J8J84j75N7J2J24j18J2q1o5M6Km7Q9j53L4l2
5804h7n6K2O4rQ3O0p8m3l5R5L2j98J01l5o2J11L4L8npJ22j60R9j03R0qq6n2K7
5833d6j8k4Ql0N1K4M3j5j15J77L5n5k1J18j77ML9J11j31q1K27q0K2M9j40O1L6
5860G2j5j3nj5pqk1j05J11k9R9o9P2j2r0R2p2R2k9q3J14j40J16j05J54m8j02j4
5888f0RoN4J42q8p8LL5O7jj23L7j4m6J14o2j4O3n2K6j2L2k6M0J8m6L3J2j28N5
5918a6Q2j77J72O7k22R8nN1N7n3l1j55J89n7J9k3nNl4mR2k5l8R0l5J08p8l8N5
5947H9j20O4J69j92n3K7Qj7M2l9J6M5N3L0m4j17k1J3lM0P6k6q5j8J11K3l6m3P6
5976F8j59N6k3M1J6O0q0J8N0m1j52J33l9m1J16N8o7n3L0M2R8j17j6j2L8q8m7K05
$$ y = [137, 27, -17, 11, -23, -4, -75, -31, -76, 49, 6, 24, 208, 33, 90, 102, 226, 108, 120, 39, -26, 20, 22, -25, 64, -89, -55, -87, -143, -121, -57, -66, 17, 77, -1, -44, -79, 16, 48, -150, -49, -84, -146, -35, -1, 37, 32, 25, 147, -13, 86, -17, 73, 65, -21, -73, -46, -64, -88, -80, -110, -59, -35, 8, -7, -122, 55, 90, 35, 14, 132, -45, -41, -2, 109, -22, -103, 124, 44, 66, 115, -25, 36, 72, 57, 44, 39, 24, 17, 9, -12, -117, -6, -35, 64, -5, 67, 55, -35, 57, -15, 77, 48, -35, 79, -61, 55, -50, 104, 56, -46, -60, -51, -57, -3, 139, 51, -27, -24, 11, 78, 77, -46, -9, -23, -69, 45, -17, -31, 32, -20, 6, -6, 26, 0, 40, 58, 12, 45, 57, -71, -16, 66, -111, 61, 128, -94, 4, -1, 50, 107, 54, 23, -132, 57, 0, 19, -4, -9, -4, -38, -42, 50, 25, -13, 77, 42, 150, 72, 34, 89, -31, 33, 202, 10, -43, -16, -8, -25, 17, -22, -6, 39, 92, 122, 78, -39, -60, -47, -50, -10, 66, 40, -45, -63, 48, 71, 35, -8, 68, -91, -35, -58, -17, -1, 59, -21, -3, 47, 6, -146, -13, -52, -93, 23, 81, 14, -39, -9, 33, 131, 14, -2, -14, 24, -64, -111, 94]
6004I4j38J12l5j05P7j14K05q3K0j5j1qok3n2K8Rl9OrN4j1N8l1p5K04j63R7j2
6033C4J12k08Q6j65J00J9J11r6N2r9J60j68jJ19l9m5J24j72R8j35POJL3j3M8P
6060b4L7j60J66N6q6J05oN0j64k6P3L9j19N4M9nk9r3K04p0q1L1q1K8J5j0o1J6
6088i2K75k49J12l1j64J7J36j23Q1O7j01J4J3N6K1P5m1o4Q9o9k4ojM2Q0p3l9Q3
6116H4j70J09J20j40j04O1Pj2m2J46j60J28j11M5m2J26k8N7J3r3P2j6o0J35o7
6141E8M0p2j5L0P1p9o3n3R9rq6O1p3M0k2J54j83O1n9N1k9K2O2N0o5O1r5J14k2
6170D9m9M6j08P4R5k5m7N9n4j7N5n0p1J1k1po7k4J25j00M6Q0j17L5O2L1J17k09
6198h1O0N1mK4l0L7m3o5J9K9J03nj71J15N2j25R3p1M8o0Q9r8r3R3n5k2J54l6M3
$$ y = [94, -44, 68, 33, -72, 5, -109, 96, 13, 33, 18, 7, -1, -7, -30, -82, -54, -45, -84, -78, -87, -33, -44, 14, -17, -92, 112, -51, 46, 34, 146, -62, 24, -141, -41, -22, 89, -7, 45, -54, 106, -62, -63, 56, 17, -28, 96, -76, 22, -113, -106, -100, -99, -66, -79, -31, -24, 13, -147, 19, 75, -11, 94, 88, 138, -26, -52, 21, 60, -59, -5, 44, 39, 10, -83, 121, 51, -30, 1, -80, -52, -37, -47, -108, -92, 183, -66, 46, 15, -149, -132, 4, -119, -38, 29, -72, -58, -45, 11, 32, 107, 66, 2, 91, 22, -2, -8, -9, 33, 113, 40, 1, 84, -86, 23, 143, 3, -101, -40, -33, -45, -87, 59, -101, 27, -84, -39, -81, 45, 17, 74, 87, -6, 66, 50, -10, 125, 58, 98, 26, 11, 41, 112, 33, -30, -83, 16, 7, -79, -18, -91, -51, -73, 81, -102, -41, -100, -49, -78, -56, 6, 56, -9, 52, -43, 71, 49, 0, 46, -62, 12, 107, 82, 35, 94, 40, 23, 78, 28, -43, -32, -53, -60, -127, -151, -26, -126, -80, 0, -117, -82, -20, 11, 128, -81, -21, 30, 26, 50, 20, 57, 14, -51, -32, -3, 100, 95, -76, 39, 91, -34, 59, -12, 36, -24, 65, -33, -126, -33, -88, -110, 44, 8, 51]
6227E1o4o2J6R1k0R3o8M1j2J4o3j9J12k4j29K15k64K04j53mQ0j51J00j35J99p9
6253c1P2m3N8j32K4o8J94l1Q5j58q9J19k3jO1K0nM7j52J06K2o0K9L6j72J07p8
6280f3J00L9q7J10q4p2P2p0m3J99q7j5j2l2k0Q1j5J07q2l7O4qK8j31Q8k1o4j7
6308g2J48k0O0o1k1P1j51oLJ83j92P0o8p6K18q1K5n2R6o3K0L1r4L3N6Q1j06k8
6336DQ6j13k2J29q5LN9o9l4J8j1%ln4J5N7J7p7O4l8Q7j52l7K97j45OM7j10pN2
6366a6%j4J82j49j02J69j18kj5Q2pj0m7J20q3o0J50n6K0R7j35k7J28k47J48l3
6392b5no8J09m5K2l8M0P7n4ljqJ56j26P1p2j9J7o1L6n6j3m9J98m5P2p6j3K8j0
6422C9j8P3Pl0m2j1m8PK9J6j6j3m2Q8O6j24l2rRQ2p4K9O9m0Mpq4J16l3K4q6J01
$$ y = [51, -13, -75, -59, 32, 12, 105, 37, 78, 66, 80, 17, -2, 110, 86, -43, 172, -92, 112, -41, -45, 35, -116, -16, -151, 48, -31, 41, -2, 56, -76, -52, -120, 74, 43, 128, -30, -119, 0, -23, -24, 37, 57, 52, 99, -53, 53, 75, 15, 44, 80, -92, 15, -63, 37, 76, -11, 99, 15, -57, 15, -55, -98, 101, 14, -1, -13, -45, -65, 16, 1, 108, 26, -11, 53, 45, 73, -58, 30, 9, -55, -72, 76, 56, 116, 55, 34, 105, -46, -52, -49, 134, -58, 12, -56, -132, 86, 5, 30, -22, 74, 11, 31, 62, -32, 1, 57, 138, 32, 4, 90, -23, -45, 84, -1, 2, 61, -8, -42, -24, -35, -35, -38, -92, -77, -20, -3, -80, -16, -54, 33, -119, -156, 141, -4, 2, 49, -61, -68, -16, -16, -30, 152, 3, -99, 70, -48, -50, -65, 17, 10, 0, -47, 73, -10, -70, 80, 24, 44, 141, 6, -21, 107, -140, 8, -25, -30, -98, 11, -34, -12, -50, -10, 67, 13, 10, 9, 1, 157, 31, 102, 30, 11, 28, -33, 3, -53, -66, -115, 83, 38, 110, 34, 21, 49, 39, 21, 94, 101, 71, 29, 18, -30, -23, 6, 22, 6, -7, -49, 39, 105, -19, -51, -60, -51, 31, -43, -14, 55, 15, 19, 12, -72, 44, 11, 35, -51, 50]
6454E0jjKok4L0o1N4R9j35q7N6M9O8l2j15o4N8L5J3k3L8kM2o2m2pM8rN9m1R8j5
6487G2K3j50M2P3K9Pp1M5M2p3j00J55k66L10k00J86j98M6p7L0J23q7J3p3N7NL3
6514dLO4K8N2j9o9n1MJ7O7J2o1K1l9pm7%K8l8O9m7L2n5O2nm0k5J04m4l0M1r2R4
6547B5j20Q8Q9n5l8K2J2%j0Q4p2k0L4j7M9j78N6Q8n3o3Q2J25r0l5P2j54Q0n3O6
6576A4ln2Poj6O4m6O3L2r5qJ21M7j20M0L0k6L6j39k2J7M3lm3k3Q4n9O5n9r2J70
6607B1J30j56L7N4j17P6j20L8K6n1J26k96L57pj39o4K50o9r9J6m8N5q9O5l7l7
6633g8M8m7R6n4L8n3n3qPR0R3l8rL0Mj53J17j03J9O7P4q2L0l7n5J43N2n3j39O7
6663A3j15R3j05J35q3j4R8j50J09n3Q5m8J2KqJ3Nom5N7n4N5M8p3L1RO7m5Ml0J07
$$ y = [50, 49, 48, 50, 44, 20, 50, -11, 43, 142, 7, -80, -24, 25, 93, 61, -54, -118, -60, -25, -12, -35, 3, 1, 43, -19, -61, -68, -20, -29, 30, -11, 87, 72, 95, -55, -13, 60, 89, 96, 25, 70, 112, 39, -61, 94, -172, 138, -62, 124, -74, -28, -105, -75, 48, -39, -26, -99, -42, -37, -4, -1, 63, 91, 143, 124, 55, 4, 8, 25, 92, 104, 43, 64, 25, 18, -29, -29, -1, -39, 30, -17, 15, -40, 22, 17, -23, -48, 56, 12, -18, 23, -69, 25, -95, -7, 82, 27, -11, 11, 23, 23, 13, 97, 25, 5, 39, 22, 71, -107, -51, 37, -16, -79, 3, 128, 38, 3, 75, -79, 1, -52, 14, 11, -41, -34, -40, -56, 8, -38, 25, 57, -38, -46, 75, 122, 2, 42, 72, 46, 82, -57, -79, -62, -19, -22, -65, -88, -4, -63, 2, -57, -149, 21, 151, -5, 32, 86, -31, 45, -75, -37, -11, -62, 64, -232, 125, 118, -21, -85, 165, 96, -3, 13, -35, 20, -69, -4, -41, -78, -30, -77, 19, -35, 3, -50, -103, -111, -104, -14, 79, 41, 32, 62, 66, -87, 30, -73, -54, 13, 87, 5, 35, -2, -57, 86, 138, 85, -54, 13, -102, -9, -114, 21, -62, -76, 22, -128, -19, -72, 13, -35, -23, -21, -29, -16, -11, -17, -62, -5, -59, -4, 44, -29, 2, 11, 78, 33, 37, 7, 114]
6694A14Nj51k6K6oJ11j13o6k7P5K9k0l2L8Q8m4L6p5J03p3J20j16M1R3j27k7L2
6721Ho7K0J42l7j06P6P0p6L5j25n9J86o8r3N7l3J25M8r5J7%J10j14M8kj32J75
6748A10n4mn4O9l0K1P3o4r6M8P8O6j24j32O6M1Mo7K0pl2R5m7J6K9j09J04RK0l4
6778A5N1p2N0k5m0OK2J8r1M5L9J59k18N1n3J05j25J07j08k3o1R4KK1j9j0n6J68
6806E2q6N6jLO5l3k6j19J88r6O2m4o1l9J46o4J1Kl4M9R6o8oo4n2L8k5l5N6N3L8
6837F2p5O3n9M1J93j85rJ5j35K8K9R7j23J7N0l9o2m9J79J4N2%j28LR2o6k4L1p5
6866f3l0N8N1l8J4J29j99J18L1J2j03lP2lr7k4N4L3k2kK1M9l5m8Km6P7J09j12
6895El9K0lNl1mP0l0j99J40Q2K4M1j83J25m1L2k0J2j5l5O5J2j46L4N9J3n9qN8
$$ y = [114, 119, -32, -58, -32, -38, 73, -40, -106, -133, -58, -29, -49, -81, -43, 45, 1, 37, -38, 65, -8, 112, -4, 37, 130, 3, -24, 8, -59, -39, 103, 66, -40, 36, 106, 30, 65, -60, -119, 67, -1, -94, -37, -70, 55, 103, 8, 25, 25, 135, 21, 69, 67, -65, 110, 56, 52, -2, 67, 37, 58, 131, 67, -29, 19, 97, 163, 39, -93, -27, 14, 18, -49, -29, -36, -68, 27, -20, -4, 25, -84, 20, 29, 49, 15, 66, -6, 44, 19, -21, -15, 7, 25, -66, -21, 18, 177, -41, 10, -43, 62, -63, 44, -64, -87, -148, -54, -52, -31, -50, -60, -116, 52, -34, 22, 21, 24, 89, 56, 30, -89, 99, 3, 65, 21, -40, -79, 67, 3, 14, 16, -18, 31, 127, 59, 53, -11, -63, -25, -50, -85, -29, 24, 62, -13, 50, -9, 32, 225, 40, 31, 46, -89, -61, -32, 65, -58, -41, 9, -30, -92, -141, 38, 52, 104, 104, -24, -21, 71, 5, -19, 12, -63, -93, -35, 16, -22, -8, 121, -78, 40, 71, 83, -20, -23, 49, 46, -51, -75, -21, 12, -10, -12, 9, 58, 23, -25, -23, -69, 8, 117, 5, -34, -14, -17, -12, -43, -47, 23, -7, -206, -66, 16, 40, 81, -102, 23, -18, 14, -6, 6, -9, -44, 21, 33, -113, -79, -20, -7, -66, -74, -16]
6925a6M0j12J16qn5J02m6M3r5j4k3O2K7j00R6K7Op6m4M9O8q4rK4O0n6N9p3J4k0
6955c8j15K56j46R3M9Q2j69Q7j45J37j02k8J6Q8o2l6J01m4K1o9J11j67J01Q8q1
6980B8j13j4M4NPn0J2j1rR7K3L3j9j0j02K10j29Pj34Q6O9p8J05n7k9K1o3Q9J63
7009A81j02m6l9J6P7nr6j12J18p7j1l9K4J00m5J85j23k6J11m2n1L4O0p4M5j70
7035a07M3Rk6J39r2p3M8mO2J4L5%k7r2M2j35R6Q4p3P1r4J32m7q7R0O2L2m6l9J3
7065C0k5L3n5J20j04o2qM7n3Q8o0Q2p0L7M5L8j24Q9P1q8r6O2J4r6OJ05J0k4k7
7094a5NJ06K3p7RO8M3o1j27K5j30J6K8M4R7m0l0m8j4J06m0j6mQ7q2q9K09j32j5
7123e4L9Nm9L8l3J66p8M3L2p4P7m3L8K0r0J2j20K8J7PP6J15j66J5Nm5o7J30m9
$$ y = [-16, 24, -88, 28, 20, -35, 67, 21, 64, -31, -45, -68, -6, 21, -79, 17, 44, 50, -26, -70, -21, 47, -37, -46, -22, 38, -18, 41, -32, -18, -38, -153, 103, -43, 50, 99, 181, 12, 99, -46, 91, -11, -39, -23, 65, 3, -33, 68, 24, 45, -24, 87, -80, 21, 109, 28, -85, -99, -55, -50, -43, -93, -81, -92, -101, -4, 19, 52, 33, 23, -79, 131, 2, 9, -125, -39, 30, -48, 57, 0, -29, -8, -71, 18, 181, 79, 33, -6, 10, 87, 82, -14, -126, -8, -85, -96, -135, -111, -11, -56, 129, 6, -20, 91, 49, -2, 32, 92, 18, 63, -107, -64, -55, -81, 58, -34, -107, -59, -63, -1, 13, 48, 48, 21, -71, -29, -164, -68, 16, -57, 14, -80, 52, 5, -82, 8, 70, 102, 56, 17, 30, 5, 38, -17, 103, -1, -63, -71, -24, -77, 11, -49, 33, -37, 0, 45, 83, -41, 48, 119, 31, -65, -3, 11, -85, -79, 26, 36, 12, -15, -10, 96, 119, 42, 51, 119, 162, 101, -26, -1, -131, -115, -87, -43, 54, 14, -16, -64, -78, 28, -12, -28, -32, 55, -27, -116, 93, -39, -54, -15, -10, -59, -21, -54, 112, 34, 77, 109, 35, 112, 69, 107, 127, 37, 49, -71, -43, -26, -19, 57, 172, 6, 21, 26, -19, -86, 44, -5]
7152eK5poL5q8J1o1J76j59J19Mq7J09l0J06k28J02JLL9k08J64r9L7o3J4L7N9J3
7181A3q6L4P2j00J32m4r4L9Q7p6J28p0l6J22j5q2Q7j13P7J8j88R1o6Q1J24j13
7207B2K1j38R6K5q6O2K9q3L3p6J11Lm8Q4p0O0Q7q6j38K38j30n3J84q0o5LL0j4
7235B1n1Q7m5K0p0J9l8L7k2J18j23P1M3p1N6J1j41KM8k8L0R3j13M3J8l7O7j2j1
7264B2R9j30jj6L1K1R4j59m9Q1j05J74m0M2j57Q0n4J98j39J18j20pl4L2O2n3k9
7291c9L5R9ok13J03M8Q0l5p4J5o4J90j41p8J53j19k2k0J58m8q0J67m8l7j42O7
7317e1m5J71q3k9n1J35O5j12k4N7pO4qq2P1l2J06j02j1p9P3n1k1l3L0J08L1k6
7345F4o0Rj02J73j06nJ28j19l3P6K7j0n3lj10J40r9J43m2m9M8M6j17J5O8J4K6
$$ y = [-5, 20, 13, 7, 42, -46, -35, -96, 80, -79, 40, 44, -43, 66, 36, 142, -86, 16, 17, 20, 59, -149, 15, -84, -47, -110, -96, -59, 0, 13, -73, -39, 33, -67, 65, 21, -73, -34, 53, -23, 105, 35, -1, 121, 106, 24, 111, -2, 75, 93, -95, -4, -70, 11, 135, 22, 43, -95, 1, 26, -60, 2, 31, -52, -19, -95, 16, 19, -29, 55, -15, 45, 132, 46, -92, 146, 16, -37, 147, 67, 2, 5, 35, 21, -30, 57, 12, 32, -38, -19, -57, -20, -42, 76, -47, 24, 67, -4, 52, 63, -78, -76, -28, -56, -26, 67, -46, -3, 15, -22, 45, 33, 22, 121, -9, -10, -26, 5, 26, 120, -39, -88, -7, -112, 62, 22, 64, -93, -13, -67, 131, -8, 110, -10, -17, -51, -19, 43, -10, -39, -4, 95, 89, -124, -21, 27, 107, 72, -2, 13, -51, 139, -2, -80, 73, -46, -68, -88, 70, 22, -58, 109, 61, 24, -118, -51, -96, 75, -8, -37, -88, 47, 112, 0, -24, 33, 26, 90, 82, 0, 71, 39, 145, 43, 32, -47, 26, -25, -46, -79, -49, 59, 90, 64, 4, 13, -89, 84, -22, -27, 101, -18, -51, 25, 52, 42, -11, -14, -124, 16, -83, 60, 18, -31, 17, 63, -54, -39, 29, 43, 69]
7372F9j64Q9K6jN5pj38P1N7j09O0OJ2N4j7j50LN1o9J18kM9r7J24j0j16k6PO5p
7402Cp4P0m2J12j39J63p5j35J46q9J03M0Oj14O5mm3M5j96J45N1J4p9Jl7J20J9
7429G6p9K0m1O4m2q1P8Q2j96J67r0P1r3J9j0O1P1j31K8omo4J71m1o1l7J82l4q6
7458fj26P5J3K8M2m3J9m5l1M3ML2j03N5M4j10M6O2N5p9N7lJ58k08L7K7qJ0j52
7487a07J23n7mr5J38j32R4J08Nn3j00NN5l9R4Ro7O3j23j9J47o9Q7j15J14o1j3
7514a2K0Q1Mj7kj33J80j29oq3R5R0n8K3n6k7L2l6L4M4P5r5o5R5o0K3j5K7j6k9
7544a6pk6P0J81k63j0J34j53P3m0J47n9j41K08j8o4r1L8r0J23p8j9J59q8N6o7
7570d1LO7n6KN9rN5n0O7j07OO2j92R8j04L05j27k6j35L8Q4Mo2O4m7k3M1J04j44
$$ y = [69, -95, -6, 20, 19, 74, 67, -71, 0, 57, -52, 8, 14, 26, 80, 63, -87, -84, -33, -102, 16, 14, 63, -34, 90, 80, -36, -62, -55, 10, 3, -71, -1, -43, 69, -70, 93, 18, -117, 29, -60, 43, 83, 89, -25, 40, 36, -7, 38, -158, -13, 38, 52, -27, -26, -63, 57, 76, -3, 17, -24, 40, -2, -83, -5, 77, -119, 48, -42, 29, -64, -45, -55, 6, 77, -54, -26, -32, -36, -100, 71, 30, -31, -68, 114, 80, -6, -132, -57, -44, -16, 26, -17, 2, -43, -74, -31, -27, 5, -98, -43, 1, -109, -63, -1, 54, -25, 32, 29, 187, -21, 16, 43, 35, 45, -107, 16, -41, -45, -140, -2, -134, -40, 68, 73, 20, -80, -75, -20, -59, 35, 44, -23, 40, -83, -102, 45, -24, 63, -52, 62, 1, -12, 8, 89, 93, 76, 74, -59, 121, -8, -14, -97, -2, 88, 30, 53, -3, -30, 2, -34, 0, 44, 119, 24, -41, 54, -6, 17, 2, 29, 13, -16, -23, -49, 21, 202, -61, -71, 63, -90, -17, -57, 90, 31, -110, 98, 80, 16, -75, -37, -127, -4, -82, -101, 58, -30, 26, -41, -38, 29, -27, -25, 34, 25, 80, 30, 97, -10, -4, 58, -134, -36, -140, 165, 38, 12, -123, -85, -1, 3, -59, 5, -42, -65, -24, 80, -64]
7599f4j19K38m6j63J38N0o1j13J29N8K9j27Q1n7O0j4M7j00J02j40J41j36J9J09
7623F1n6Lp0Q3n4Q0p7k5J1m5NlP5q8LJ23q7K0KP8o6k8J86j57N8L3m9j8QpR3q0
7655A2m6L8K0j03M6o8J51L0n2Qo0n1J1J39p8J54j52L0j21J17J4N7j21R0O1j05
7681B1k5J27r5%n4k7P4M4j46J2M7L2O6j61J31j34J23p7J50n1Nj13N3o2Q1n5Q7
7708E3Jl9K2o4M2l8j4rJ23p9NPnk03K13J4p0J07Qj94L0J14rL8p5p6J67m3M9o0
7738A5J2O9r4M1k6l4k9ORJ09L3j57l1J13K7K0k14J58j02M9P2j7j62J25j5j4L5
7765bl3pK0M4p2J08K4n1j10J02J46j93o3J72k1M2j12J7O2Jm5l6m0M6R8j00J05
7792A02j15oj2N1L2l4m2K9o3O7p6K0J01K4j22N4Lj13J28M3p5p8K1j5J93j44P3
$$ y = [-64, -183, 55, 9, -154, -16, 34, -27, -140, -11, 47, 76, -51, 30, -27, 33, 19, 66, -34, 68, -72, 69, -67, -48, 61, 5, 8, -62, 21, -33, 47, -30, -55, -44, -89, -84, -87, -12, -100, -97, 26, -61, -41, -39, 39, -27, -55, 131, -26, 32, 65, 16, -2, 6, -1, 92, 12, -34, 4, 24, -79, -33, -101, 50, 80, 28, 36, -24, -75, -64, 75, -3, 151, -1, 29, -92, 25, 39, 96, -25, 65, 126, 21, -4, 123, 28, 28, -26, -53, 21, 65, -81, -69, -22, 10, 76, -85, 46, -88, 35, -42, 108, 57, 62, -51, 2, -60, 21, -34, 53, 54, 15, 37, -27, 15, -23, -37, -46, 77, -2, 3, 10, 5, -198, 15, 29, -41, 66, 74, -120, -90, 24, 15, 53, -22, -98, 69, 26, 75, 15, 27, 96, 2, 43, 17, -17, -46, -40, -31, 78, 111, -46, -77, 36, 63, 83, -131, 27, -75, -26, 46, 29, -133, -8, -23, -37, -2, -35, -42, -22, 22, -50, 58, 82, 31, -79, 23, 169, -24, -87, 85, 64, 106, -6, 11, 73, 74, 29, -7, -47, -1, 97, -3, 102, -13, -19, -31, 20, 52, 18, -24, 5, -58, 9, -67, -47, 54, 78, -44, 10, 13, -100, 28, 71, -4, -82, -61, -76, 117, -27, 46]
7819D6j61R6j29J13K0N6Rp8k9M4q2R6O0j5O7j39O6p4J34j01J10r7n0K3P0j08p0
7846a23J25r9J82j38J33n4Q2J4j10K6n4m2Q4L9j5Po6j5k8N7M3o9N6n9L1J8Pj00
7874f8J11Qqr5O7Q1q2o2J44l0j9o1O8j13J4k9J51n2j9j8R8j93K05j40M9k0N9M3
7902H9r8J7M3q0M5L0p7q1J28L8N8j18n3P9o6o1J54q0J06j19QJ9L1n5M9P9l8j55
7930a08M6lJ2j7J17Nr9O4n1K0Q0j45J10o2L8J08r5M6j3j58J19l3k1K3k0N0M7j29
7958f9J54p6Q0j18J11j44K0K0oJ02k09J68o4N1Q3j21J9p6RJ32r3K9m8J8O9r3J4
7985c8Q0r2O7jj25J33l7k7L3%j6M1l5K0K9R1kj07j72J06m3R0jM8l6P5j25J2J09
8014G7n4m8j6J00q5Q9p2M2j04J03j7L6r6O8l2lO1p5K5p2N7K3L4j95J22mk1J03
$$ y = [46, -115, -19, -148, -35, -15, 41, 50, -28, -57, -13, -95, 1, 61, 46, 113, -26, 40, -34, 100, -1, 109, 12, -38, -15, 55, -53, -123, 2, -97, 85, -53, 80, 26, 108, 122, 12, 38, -16, -58, 26, 65, 50, 57, -9, -24, -52, 5, 48, -21, 35, -24, 7, 25, 32, -68, 43, 51, 43, -52, 15, 96, 14, -48, 96, 66, 47, -14, 54, -59, -45, -74, 77, 25, 6, -12, 86, -107, 98, -42, 7, -13, 46, 89, -9, 8, 51, -29, 16, 46, -31, -112, 16, 54, 112, -6, -59, 20, -46, -107, 47, -33, 73, -46, -38, -19, 12, -43, 6, 85, 47, -108, -62, -65, -53, -70, 47, 52, -47, 17, -34, -14, 66, -79, 31, -31, 7, 115, 20, 66, 53, -105, 14, -19, -40, -17, -37, 13, 60, -69, 85, 9, 89, -29, 82, -62, -42, -22, -28, 74, -135, 33, -31, 20, 103, -18, 1, -75, -66, 66, -27, 2, -46, -28, 41, -52, -38, 42, -50, 17, 16, -109, 24, -13, -40, -7, -7, -23, 18, -17, 3, 32, 123, 121, 14, -158, -52, -95, -5, -6, 42, 6, 81, -44, -32, 77, 23, -25, -41, 59, -26, 63, -9, 33, -71, 32, 15, 51, -45, 23, -9, -12, 49, -26, -1, -73, -16, 7, 41, -154, -32, -36, -57, 46]
8042D6M2j33M4q1P4P2n5l0J22j19n6J29q2P7j10P7J82k12K8l4P3j6j46N0R3o3
8068b8k5M6m0P8j02J8P5M6j06M4P1k2J4q9n4N7K4K7p8JP8m8J43j11l2RO0o6J50
8097A40q5P4j24O4o2k5M0q7Q6n6JP2N0k8l6o2J5M4Q0m5Q3j55J1o9N5j5O3j03J04
8126C0L6q7K6lN6o7j37K26j35K1l0Q0j20J52o9Q7k5Pk2K6j7Q8k19K5P6q4J40o2
8154ak2j26K32q6J00j08q8J96o4q1O7j4P2j41N1MO3n4O9r1j8R4j8Q4j83J20J5
8181G2n4N8j57N0NQ2N9m9j46K0
$$ y = [46, 88, -45, -1, -82, -8, 64, 9, -21, 101, -18, -74, 55, -27, 50, -60, 17, 199, -13, 15, -19, 54, 38, -108, -58, 35, -28, -53, -7, -47, 31, -71, -53, 22, 68, -38, 6, 77, 55, 69, -20, -74, -17, 7, 34, -44, -43, 35, -13, 130, 19, -13, -4, 56, -10, 140, 55, 129, 5, 69, 7, -18, 22, -65, 21, -35, -34, 38, 88, 60, 24, -38, -23, 21, 101, 56, 139, -16, -5, -74, -19, -34, 29, -74, 30, 66, -21, 5, 2, 58, -9, -146, 80, -55, -34, -64, 16, -104, 48, -21, 66, 41, 48, 26, 52, 35, 123, -96, -71, 5, -79, 61, -1, -23, -149, 83, -3, 97, -11, -99, 97, 33, -48, 19, 5, 77, -64, -13, -9, 54, 0, 69, -22, -40, 54, 36, 120, -63, 57, 72, 18, 76, -81, -31, -26, 56, 115, 66, -80, -60]
8191f0
$$ Imaginary data points
##PAGE= N=2
##DATA TABLE= (X++(I..I)), XYDATA
0@%%%%%%%%%%%%%%%%%%%%%%%%%%%%%%%%%%jKlNqJ0j1J3j5J6j6J7j8J9k1K4k7K8
52A4l1L5l9M4m8N4o1O9q0R4j12J35j69K21l09M81r20K458Q175k0218o334P066
74i475r076q141J2873J1318n100M935J5202p520p547J3634N25j0288L934L604
88H878j1614r029P373J402q447J0970J1276q157K491J0675l235m562O750L770
102A8541j1733o290M344j1412j1188P772r2p533N156O702l244j144J1363N084
116F326n757P128O360j1110k523M985n607n417M103K728o512o17Q830k742k406
131b231J0973J898n861K690J697o296n396K704j142r017J456K709q034M44P304
146f102l67m6N925M670k945p04O962k548m473N607p97o415Q73J817k701j716N241
$$ y = [0, 0, 0, 0, 0, 0, 0, 0, 0, 0, 0, 0, 0, 0, 0, 0, 0, 0, 0, 0, 0, 0, 0, 0, 0, 0, 0, 0, 0, 0, 0, 0, 0, 0, 0, -1, 1, -2, 3, -5, 5, -6, 7, -8, 8, -8, 9, -9, 10, -11, 13, -14, 14, -17, 18, -21, 23, -25, 29, -32, 37, -43, 51, -61, 74, -95, 126, -183, 298, -622, 1836, 10011, -10207, -16541, -9475, -18551, -26692, -13819, -2501, -7601, -2666, 12536, 5016, -2531, 11103, 11628, 1340, 5274, 8878, -2736, -11765, -4392, -2990, -11437, -467, 10809, 2652, 5143, 15818, 12583, 8021, 14771, 18541, 6808, 518, 4862, -6550, -17738, -9966, -10058, -17591, -12435, -5733, -8977, -10121, 1242, 6326, 569, 7697, 14057, 2947, 424, 5409, -198, -5615, -1512, 1216, -5296, -5913, 2917, 175, -2231, 8742, 10640, 4779, 7469, 9166, 2870, -2526, 178, -964, -9981, -8525, -5816, -13850, -13406, -6102, -6469, -6515, -590, 4080, 1135, 431, 7393, 4845, 372, 5979, 5182, -1233, -360, 1457, -1244, -2960, 2281]
163B281K603m775K980M456n868j83M322k964l570O16j24m907k428M786j848k881
179g504O133O33l140L159L067q47n08L302J321m943R71K847m558J86L838j670
195B287j373J327J411k211j308M003j563m028K878j183m526Q71J029j306j131
210d823K089J707l150J754L963k922O78L509j712j848Q95O25j887r70L280o21
226E67k644L673L67k190K166J463j019j152M08q0l969l93J789l315m36K074j143
243c834j94J535J911N61R1L341lk714K245k02l001M05J59j164j138M87J305j588
261a798J259L741j546M31K690j373j171J25j54j506k325Q74j235k854K116M90
277b236j134K480J696K67P02J100J506j708q2J343k940j441L34k081p84L38L71
$$ y = [2281, 4884, 109, 3089, 7545, 1677, 1494, 5816, 2852, -718, -102, -226, -5133, -7561, -2775, -4623, -7504, -1371, -738, -3878, -719, 2348, 1501, 993, 4295, 5616, 673, 1644, 4491, -67, 119, 3957, 2287, 914, 2241, 3652, 1441, 133, 4136, 2573, -1455, 1423, 240, -4286, -3415, -2386, -3692, -4823, -2734, -1027, -4177, -2423, 1540, -1382, -704, 2805, 1093, -755, 140, 765, -1122, -2092, 1188, 567, -2077, 1596, 1963, -227, 1939, 3402, 2383, 1231, 1639, 1559, -2410, -2803, -1014, -4329, -4765, -2691, -3834, -4028, -2493, -582, -21, 70, 3411, 3408, 694, 2939, 2737, -264, 141, 300, -864, -2002, -1515, -210, -1798, -539, 3202, 1656, 2087, 4777, 3404, 2233, 2358, 2204, 698, -1627, -753, -1988, -4842, -2726, -2236, -3370, -890, 806, 1073, 1775, 2875, 4381, 2673, 2591, 3934, 994, -447, -113, -2194, -2978, -2640, -2269]
294b269L31k73K507Q90j332K555Q62j668O10m87j533j410p64K75j736j95K209
311a428j436M49K734j68O33J248N69oj413M30p44k583Q47o68k107Q46J62j79O22
330b192P52J921j43L46K109j276n00J044j440m27j34o49k24q93J085Q27j054J871
348A023R71r00J034m6m32k69r55K85j400r77R17j493m78J905m83M15J047M44O03
367A211m14R05M07j391Q05N4j665O53Q0m29L35J2R24r9l81J197r88o65P93j468
387a24o43l62j185K1r78L88Q96r07J359J083n75J347M44k3N23n54K20o70r87R54
407B27q09n27J471l95L42Q29J89P32m02K47J56j785j53n37k148j42o11p76K53
426c839j16J046P83M94K034M31N90J569n71l6J67j061j32j094m59L42j004N52
$$ y = [-2269, -1938, -2211, 296, 1186, -146, 2409, 3271, 1603, 2213, 1726, 193, -1217, -1981, -1706, -3442, -3637, -1428, -2864, -2415, 319, 151, 784, 2032, 2601, 2595, 1182, 1612, 868, -1715, -868, -1536, -3643, -2797, -2635, -2814, -2192, -1440, 481, 338, 684, 2793, 1517, 1017, 2061, 621, 194, 60, -589, -813, -1706, -621, 206, -848, 1023, 1994, 1094, 2128, 2082, 1650, 1381, 426, 711, -689, -1666, -749, -2242, -2720, -815, -1298, -883, 164, 608, 1211, 797, 1702, 2109, 718, 1523, 1577, -88, 565, 645, 216, 551, 563, 1487, 1388, 1007, 2204, 1216, 551, 1344, -124, -767, -1129, -2314, -2293, -3271, -2883, -1987, -2894, -1535, -452, -1027, 320, 764, 741, 1264, 710, 930, 260, -727, 227, -582, -1109, 362, -33, 309, 1138, 1327, 2059, 1657, 1904, 2060, 275, 122, -415, -2563, -2705, -3316, -4092, -3839, -3955, -2909, -2126, -1632, 402, 833, 1423, 2992, 2421, 2385, 2552, 1491, 1359, 265, -194, 148, -856, -304]
444c04R77l42J403P27J52N75m16k9p76j780j38j671j670J37j242k12O84L79J318
463b228J003J259J870J55J206R14r74J77n58j399m19j375l51l16o41J181M8J62
481b86J728N4L63N59p43j87j074j442n30j886p84j41j147P46N34N72J684J123
499h57J694J496J49J364R0o50K63j348j101l61j457l07l73l16R28l19R08J261
517A064l20Q80J54q16k7j010p46r36j398n8m58p02J153M07R57J668Q02J549J181
536C344K82J043o54j79L1j699n15p41j179k08p42O1N61l74Q84L83k00Q03k32m11
556B58J8r52n34o13q49K69n84J45J077J0J267R96M71J413L67K77N41p42M6o25
576B256j287j9r91q36O9r75J67L28l63P89j79J62N23n65J8K3p31K66m61p2L90
$$ y = [-304, 673, 331, 1734, 2461, 2613, 3188, 2772, 2743, 1967, 187, 49, -1622, -3292, -3155, -4397, -4609, -3925, -3546, -2228, -1225, 34, 1904, 2059, 3265, 4179, 3205, 3382, 2824, 1425, 1006, -369, -720, -1036, -1677, -496, -448, -286, 1442, 1496, 1859, 2418, 1675, 1488, 414, -1028, -1558, -3444, -4228, -4369, -5516, -4770, -4236, -3664, -1980, -857, 837, 2333, 2482, 3846, 3936, 3286, 3549, 2201, 1100, 739, -718, -1025, -1398, -1714, -786, -1105, -197, 1064, 744, 1624, 1778, 962, 935, -75, -821, -1757, -3155, -3213, -3671, -4373, -3220, -2813, -1856, -188, 614, 2163, 3344, 3626, 4669, 4015, 3836, 3867, 2168, 1653, 912, -267, -475, -1217, -1156, -595, -969, -85, 298, 98, 901, 669, 258, 276, -676, -1210, -1823, -2672, -2403, -2987, -2842, -1765, -1755, -488, 508, 979, 2392, 2759, 3036, 3577, 2835, 2881, 2256, 969, 950, -41, -877, -808, -1783, -1616, -1288, -1651, -862, -1041, -879, -356, -921, -903, -880, -1611, -1345, -1806, -1878, -1488]
597a488l56P64N27J3J240L53K26R97j38L30j13n61L99r70n64J20r45j35n8p69
617a128M76k54j02L59n05M51J20n51N98j35k22O36n23M16M99j28P93M2J32P89
637A763k94J49L67n44L29m05m41J51o08j28m7p17K84k64l93L23m30P2o0m30M50
658h73m66o2N52l40K41O61l27P96L01j09Q22k91K40L2n95L62l82m42K10o35O4
679b41K9m49K82q0k74O43n17R2K15n55K26j11l51M00l23r7N11m20P77K67J11P22
701H57J8J61M55l30J54j83n54K59o04k83K02o75K54L9k51N50k33L39L37m60L71
722D23j37m92M01m38j86K46n78L74J22pN76m3K16N37m24M36J65m67J93m30m38
743D9K88q88L3pm70M94j71O3N34k42N02J58l97M71l72j36J31o45K29Lm60M11j87
$$ y = [-1488, -1844, -1080, -553, -540, 700, 1053, 1279, 2276, 2138, 2468, 2355, 1794, 2193, 1223, 659, 779, -166, -301, -359, -1128, -652, -906, -1008, -649, -1154, -703, -583, -1134, -536, -671, -893, -257, -780, -364, 135, 7, 800, 842, 974, 1763, 1469, 1618, 1985, 1441, 1770, 1365, 924, 1075, 467, 339, 292, -425, -141, -405, -798, -475, -905, -833, -893, -1323, -873, -1339, -1401, -849, -1189, -948, -287, -614, 182, 483, 374, 1196, 905, 1145, 1177, 582, 944, 562, 120, 330, -305, -241, -212, -661, -379, -459, -733, -90, -607, -515, -300, -855, -629, -740, -1091, -691, -1014, -1111, -600, -1020, -243, 24, 135, 857, 875, 1036, 1491, 1161, 1315, 1132, 578, 837, 233, -50, 152, -523, -269, -230, -481, 69, -164, 175, 512, 52, 423, 286, -206, 195, -243, -429, -183, -761, -387, -265, -272, 304, 261, 477, 1014, 590, 1026, 1191, 724, 917, 487, 49, 337, -551, -518, -525, -995, -501, -672, -609, -75, -317, 185, 343, -54, 417, 45, -91, 40, -605, -376, -373, -833, -422, -609]
766f09J34N40m22M85J65k39K67k26q2K07o72J60j18l33L74l29J54M63m30M27L07
787B23j63O26j85j39L93m68m6N4m78L17k21j50L56l95L01Q8k58M53j37k37L98
808C32n19R8K49m10K86k07k2L70k17L42L32l81M18o5o1L87l64QJ07m55J95l75
830D8j13P2l19m7K52m20M06k97j97L98m13J25J35l83M22k00k6M84k63K30L90l05
852b1N65Oj94M98m61J56P5n59J76j99k77K12n66J17J49l87K19p4k41L86l72J05
874f87L14m41L42o8O6L18j76J99M30j71N62K26j36N75l75J44Q6n85K45j95n13
895A60K51m92o2K8l92K09j11l31M64k84O7J96l76L28j06j23M97k10K6M47j91M66
917D61J66n1M85p5nK82l55J66k39l74j6m49k51qo21J99j50k53K19j97j9L80l76
$$ y = [-609, -475, 65, -357, 128, 293, 54, 321, 95, 13, 220, -452, -292, -410, -743, -369, -698, -544, -81, -511, -84, 223, 60, 686, 501, 362, 755, 287, 241, 295, -183, 134, -87, -237, 119, -276, 25, 113, -145, 308, 171, -66, 332, -187, -89, 160, -250, 36, -171, -193, 177, -40, 302, 634, 253, 671, 606, 545, 932, 568, 576, 683, 228, 423, 48, -65, 7, -312, -359, -107, -527, -121, -418, -615, -217, -630, -505, -370, -753, -331, -531, -557, -73, -336, -106, 284, -21, 544, 550, 356, 854, 393, 549, 624, 65, 241, 42, -235, -23, -589, -472, -323, -710, -491, -565, -806, -420, -792, -687, -373, -814, -472, -540, -474, -156, -332, -133, 297, 126, 688, 914, 778, 1353, 978, 1122, 1208, 623, 868, 673, 160, 411, -81, -143, -115, -507, -298, -409, -740, -276, -560, -493, -297, -673, -345, -451, -574, -77, -287, -261, 186, -5, 461, 627, 576, 1061, 986, 981, 1263, 908, 1074, 835, 461, 445, -4, -255, -263, -884, -685, -835, -1088, -869, -1066, -1085, -705, -1081]
940a081L01J86j57K44j19J46L04k58M70J54r0O62j93O6M00j95K23p1m26K63m95
961C34o3j12n44l8k06m93M47l35j76M54k40K81K46k19M40m9kM96k65K40K47j97
983B46N52o2J1M39j29Q0J36j84K67m16k49J32o90nj80n60J51l75k23K02k19J82
1005h94K19k63N64l0J16L94j52J63L51l69L08n7L0L23k80K78K23k40K42k87r6
1026E43K12n31j41j59m29J0l04l20K03m86R6O1l7N66j42J31N17j36L69K43k81
1047a5N30j85r6L81k62J48K05m95N36j38O6J90m07P9J84n78n7l43j66M0n23o2
1069i68O3k85K81Q0L4O15r8L69K75j33N81j8j10K02k22j0m4l33K41k8j67L64l05
1092C84R8K36n33L06k51k67J83n94j78Q0m76l3j0k8K40q0L60M27o2L96K87J7L78
$$ y = [-1081, -780, -594, -751, -507, -626, -480, -176, -434, 36, 190, 100, 762, 569, 635, 1035, 840, 1063, 992, 566, 829, 334, 271, 159, -385, -423, -629, -1122, -675, -1010, -1186, -732, -972, -691, -445, -664, -224, -273, -275, 221, -44, 196, 443, 246, 798, 736, 747, 1186, 1057, 1137, 1273, 1089, 1356, 940, 691, 823, 133, 128, -52, -612, -461, -836, -1059, -857, -1076, -894, -675, -938, -374, -404, -288, 106, -46, 117, 468, 99, 407, 350, 380, 703, 423, 701, 924, 684, 926, 639, 543, 755, 224, 83, -76, -505, -495, -799, -1119, -916, -1402, -1306, -1245, -1282, -716, -858, -727, -210, -346, 23, 266, -15, 515, 330, 234, 615, 353, 501, 706, 211, 747, 609, 675, 865, 458, 537, 721, 143, 86, -257, -423, -383, -906, -968, -905, -1190, -909, -829, -795, -180, -278, 91, 366, 233, 814, 796, 686, 888, 666, 656, 612, 279, 520, 492, 325, 689, 384, 482, 718, 185, 491, 240, -27, 156, -438, -616, -536, -1012, -1045, -1055, -1083, -843, -923, -563, -136, -198, 198, 485, 502, 880]
1115H80k89jN0l62J9j70l11J59k13K20M1j82K11N5j96L10k85j23j5m56K18m47
1137h87j16K08j85L9M99j65M79J58J22N53j03J13K15l90K61k77k84J65l77j01
1157g3J26k96K42J5QK02k1o5K67l66J68j28l85K00k74j39J17j41K47J20OM63r7
1180A96K54M02k39K25pm53J20j86l01J13m77NL6k59N38k10P3L07k85K72J18m57
1202b15L38l59j3J43m62J30lj83M15L5%L13p0J60J36k27K11k38p1J02m76j13J22
1225c25k96L47o8K6L52j89K33K2q1L62k49k39K19k61M1nk53L70q1pL08N0N2n4
1249B74q1K70k04j75J76l91K3l3k70L81j23p1M25o5O5K55j20K41j86k30L54l58
1271A57j37L1k75J05n2j02K52O4j3K42k38L16j32k67J73k65L4k42l09J39m4j36
$$ y = [880, 591, 590, 640, 278, 297, 127, -184, -25, -238, -18, 23, -159, 52, 107, -89, 221, -64, -187, -202, -658, -440, -887, -1003, -795, -980, -941, -442, -607, -128, 30, 152, 705, 602, 715, 930, 540, 801, 524, 240, 405, 28, -73, 53, -243, -1, 14, 22, 224, 203, 138, 405, 39, 207, 79, -306, -106, -380, -519, -402, -543, -296, -176, -170, 293, 196, 450, 852, 613, 838, 831, 378, 498, 312, 11, 124, -353, -348, -312, -571, -33, -243, -170, 137, -148, 124, 242, -215, 123, -236, -249, -106, -568, -438, -441, -624, -209, -174, -174, 139, 69, 229, 365, 138, 349, 111, 40, 142, -334, -447, -325, -621, -274, -342, -316, 36, -153, 80, 102, 21, 383, 134, -105, 114, -147, -106, -111, -364, 6, -75, -82, 226, 276, 328, 274, 193, 463, 259, 84, 260, -131, -108, -141, -411, -30, -153, -224, 201, 136, 201, 456, 336, 577, 391, 161, 515, 157, 20, 51, -224, -119, -171, -273, -21, 43, 30, 272, 34, 350, 218, -49, 124, -141, -107, -349, -658, -519, -563, -699]
1293f99L17m2L41K65m9L07Q1j45L07l88K6p7m14M8k29k29K51k06R0K09rL12q3
1316a6M9K74k65Nj37l18J07j41l17J76m6J24K41qN46K17J55K93p0r6R3k58O1k83
1340C86m77J70n48R2nj39K98J47o5M20j87J63R8k73R2j87l42J91l36O1J59k67
1362e49L96K59L2M58m4K33L30l22R9j02l87j1l56k10j10m44J68K3k01L06j22J29
1384d25L61k48J52R8j71J19j99K0J06l82J61J00j03L30K28PL25k7K35J28j49j
1406F65k69j93N8m17j36K7m20J6R6r8K23j64K55J01p8K75k8Q8R9j07O1J02j21
1429C5J32R9J2K41l06L11Q4j90K96j74mJ75m14N5j96k26Q2k62p2Lk44M8J27l14
1453g02L47p7n0M28l30L28J64K1K83q4K4J86k44J03J01j51J33k62j75J20k14N9
$$ y = [-699, -382, -424, -83, 182, 133, 440, 521, 376, 683, 295, 321, 244, -170, -122, -351, -580, -329, -535, -445, -236, -245, 67, -16, 33, 307, 42, 47, -90, -408, -301, -442, -759, -583, -629, -505, -264, -272, 274, 491, 646, 939, 869, 773, 866, 608, 669, 386, -91, 79, -469, -377, -382, -521, -223, -76, -141, 279, 92, 255, 353, 80, 172, -15, -357, -166, -502, -441, -282, -549, -153, 106, 138, 596, 552, 785, 1115, 793, 892, 790, 403, 392, 36, -174, -284, -728, -560, -537, -738, -432, -554, -425, -64, -312, -160, -62, -233, -114, -313, -293, -187, -569, -408, -308, -411, -81, 147, 154, 479, 452, 687, 815, 666, 665, 396, 203, 261, -156, -292, -265, -685, -669, -573, -671, -448, -612, -357, -256, -334, -59, -87, 1, 100, -7, 54, 156, 35, 167, 266, 278, 519, 213, 524, 608, 418, 714, 540, 536, 711, 297, 352, 156, -70, 12, -250, -322, -319, -563, -515, -388, -702, -355, -432, -482, -54, -384, -56, 108, 129, 412, 328, 352, 538, 294, 397, 498, 347, 480, 218, 43, 163, -51, 8]
1475Hj6k03K19j59o5K32l48J8L3k99Q0j54j45J48j24N5K71J9M55J22J70K30Q5
1498F32J99M6j83l5m3k87j05l34j45J49l83J13Q1k2K21nJ36J40j64R9n0j75nk70
1522c90l9L7k67L12Q9O8L46R4M32K34k1J98J2j42M3m98j11k45m72k1k77j78K63
1545e33J8j1L04K9K21K42O0Q7j58j55r5m73O6k50j47J88R1K11J96J12N38J60J29
1568H30J82oj59k07n18j12l11k73j75j85J2Q1n7M48K32O4M05O3Q8j0k18k6j26
1591B2k54nl32j8K50K9K22J78J30M05J55r6K35j44j01p9m58j4l99k94j1k33J20
1614f92O6J64K40J65J93L18l3K17L3l10N5k58k67k5k81J36N4k4K53O4J54L11j3
1637E20J23l2k14J8k72l00M3l91q4K1k02J97M6K14K08R3Q4K27j14J82k48M9O7
$$ y = [8, -8, -211, 8, -151, -216, 16, -332, -314, -281, -580, -500, -654, -799, -651, -775, -720, -449, -430, 25, 147, 317, 547, 632, 831, 877, 694, 659, 616, 329, 224, -110, -255, -106, -489, -376, -295, -317, -96, -101, 35, 175, 11, 110, 60, -115, -120, -390, -429, -392, -659, -347, -258, -190, 156, 250, 682, 916, 895, 1093, 1105, 963, 1006, 508, 397, 152, -320, -341, -618, -796, -533, -515, -526, -222, -193, 28, 270, 330, 417, 259, 104, 9, -464, -398, -648, -795, -607, -516, -305, -109, 3, 541, 701, 830, 1012, 1006, 847, 640, 122, 10, -301, -574, -749, -934, -922, -841, -898, -450, -218, -154, 251, 314, 402, 392, 174, 148, 22, -232, -237, -569, -587, -337, -308, -86, 92, 222, 627, 782, 686, 921, 777, 676, 597, 139, 125, -274, -568, -579, -812, -692, -626, -462, -222, -57, 136, 454, 421, 638, 671, 361, 416, 158, -109, -134, -415, -279, -225, -249, 4, 68, 222, 533, 520, 643, 611, 397, 415, 143, -157, -114, -505, -589, -568, -770, -573, -527, -313, -105, -12, 72, 299, 185, 367, 119, 168, 235]
1660B35l99kp4j25K10m0K9K39j45J88K28q0J00j84n3j14l27J62j52j36O6M3p2
1683d03K17P4M0L15m3J60j38J4pj84l7l1k37K04j26k6L13o6P6J48M3j9J4j37J97
1708C61l96N5K8k86R7j01j09L71l7J87J01l3K23p4p6J5k34n7r2k63J55j79j10
1731d54J64O6J43J58j19K46O8m2M0k09p4K9l06n0J00l03L25j87K42K01N2K26O2
1754C78m2J59j57j29l5l94r3o9k36R5m9m6J92K11R0K69o8K69Q5j47O7l41L1j42
1778a02k20J46j28K6J60%J43J80J25K20jo1J01q5j41j77k96j20j56k23J74j50
1800e85K18K17p3M29p8J79J78j93K11j52q2q2j54j58k3j15J94N7j8J35J02J06
1822C13J69k35rQ4j87m1l16j05qk64P5M0j55K41M5m3N31n1J22J71j78R2j3n0M9
$$ y = [235, -164, -166, -240, -365, -155, -195, -166, 73, -72, 116, 344, 264, 364, 180, 127, 13, -314, -152, -304, -440, -374, -331, -403, -186, -112, -72, 243, 200, 360, 222, 236, 229, 45, 8, -23, -260, -56, -182, -208, 105, 39, 115, 263, 306, 287, 301, 164, 361, -35, 20, 48, -238, -141, -242, -351, 20, -17, 170, 271, 238, 461, 387, 311, 326, 92, 35, -57, -320, -165, -344, -454, -290, -224, -81, 77, -42, 204, 272, 230, 270, 61, -13, 16, -290, -340, -240, -543, -218, -405, -163, 38, 90, 316, 378, 336, 495, 338, 209, 174, -220, -313, -382, -618, -523, -572, -618, -426, -215, -125, 144, 76, 345, 430, 283, 350, 9, 40, -102, -322, -176, -304, -278, -118, -118, 25, 205, 330, 550, 549, 488, 589, 504, 363, 186, -110, -230, -386, -609, -435, -585, -367, -150, -223, 206, 128, 307, 485, 292, 503, 351, 269, 187, 33, -125, -148, -263, -69, -12, -30, 105, 207, 313, 482, 247, 238, 322, 135, 94, -222, -327, -335, -599, -524, -484, -639, -398, -353, -396, 135, 84, 206, 377, 199, 291, 278, 228, 277]
1847B77j80r2k4p7O7j58J37P8o7J38P1j99J58r8r4J9k25pJ20j68N4m5o4K27n2
1872b04J43J75L6J4N3k7J63m4R6N5j51J65r6l05J32p4j94J53k24l9O1j28N4k8
1896b14k5K29j59M2L3O0J05j77J23nk20K84j97P8J93j08k5K07k1J93K2r9J16n2
1920C83j90qj39p9j42j93lk37P2L0lJ43J53P7K15q8J15J92k32J02o7k33k3l3j9
1945b07O4k6J33R4J17J23J25P5k6m6N5j57l71L1l10k56K8j79L4J82k4K59J92K09
1969A19J06J13J69m7n8J5j40j92L8k36k1J10j62J83NJ27L21o5J58j6j01J2j90
1992B48k18q2l69l3j65j32J98q9J53K31J25L96L1J05J48p5L3p2l36R3k30k71J40
2015a71k91R8R0mK31K47j28L22p5L1q4j86j43j62k36p7n7j43K22j9J32K93n9M55
$$ y = [277, 97, 5, -19, -96, -29, -187, -50, 28, -39, 99, 170, -29, 129, 31, -63, -44, -269, -276, -156, -324, -270, -315, -379, -152, -204, -61, 114, 150, 164, 217, 190, 353, 309, 405, 460, 309, 474, 378, 73, 205, 131, -63, 90, -134, -173, -112, -240, -186, -214, -239, -10, -169, -127, -94, -34, 71, -106, 17, 12, -208, 76, -121, -43, 150, 42, 17, 224, 203, 396, 418, 319, 435, 383, 193, 185, 46, -33, -175, -368, -371, -608, -536, -506, -509, -366, -213, -136, 79, -9, 106, 298, 66, 168, 101, -132, -155, -188, -207, -143, -169, -36, 58, 175, 298, 423, 498, 472, 426, 481, 324, -47, -16, -326, -582, -554, -733, -699, -517, -541, -282, -90, 119, 225, 338, 507, 460, 402, 417, 277, 85, 123, -113, -134, -24, -186, -3, 2, 129, 450, 385, 543, 527, 426, 438, 248, 30, -52, -421, -454, -619, -751, -553, -642, -489, -258, -133, 263, 294, 399, 547, 472, 505, 433, 97, 190, -40, -311, -171, -462, -364, -274, -278, -47, 200, 72, 394, 319, 350, 266, 80, -63, -225, -461, -538, -595, -738, -516, -535, -403, -110, -169, 286]
2039B86K3L6K27j48J52j23k98q7j40k26J52j56R9P1l6J75K03l8J91n0oj17j04
2062H6j28n9j78K1j46J46q0J19P8P2P2L13R6P5O4j39o7j88k0m7j56K8j0j20J8
2087a50K1O1J25j2j0J51j08O1j17k20J95k18r6J42k39K45r5J4L15q5M6K95j27
2110A94R2j16j89K16j02j84L4j16J9njJ42q7P7L2m6N9k0m3jj05K0N8j60J01P2
2136e9KJ81j14J79o0o8J59p6j55J70n5j14Mp8J68j08k8R1m2R9R4j6Q5j36j02J19
2162A40j44lN1k00N8l4l2J70k1J28l3QK22j37rm1K8k65J27j54R4j2j59J14q9j7
2188b10K24N0K6Q6q6J01k1k16P5l45J33Q6r1K6rK6J48r4K0J10K6L6%Oj43k3QN5
2216Dj52n2r0P8Q3P1Q2L9J4K50o4k5M4j81k1O0j56L6j50n4J46o0k8J72m4J19L8
$$ y = [286, 309, 345, 572, 424, 576, 453, 155, 68, -72, -298, -146, -302, -203, -132, -168, 7, 210, 172, 363, 313, 307, 190, 86, -42, -101, -279, -258, -404, -258, -338, -219, -141, -69, 3, 316, 412, 487, 551, 412, 345, 157, 137, 90, -66, -38, -48, -168, -150, -129, -68, 57, 45, 35, 186, 78, 139, 22, -198, -3, -221, -317, -175, -414, -169, -264, -250, 65, -20, 26, 321, 194, 286, 170, -19, 197, 95, -89, -55, -171, -152, -157, -158, -16, -103, -26, 6, -40, 19, -1, -44, -45, -150, -130, -72, -232, -131, -59, -57, 124, 10, 189, 129, 61, 220, 144, -11, 159, 104, -10, -6, -84, 84, -24, -52, 39, -3, 96, 190, 174, 259, 123, 21, 140, -4, -7, 44, -156, -98, -132, -164, 6, -15, 113, 80, 88, 310, 173, 164, 123, 151, -114, 13, -141, -47, -59, -218, -104, -193, -210, 14, 64, 90, 176, 90, 191, 170, -46, 29, -316, -183, -97, -188, -162, -171, -145, 3, -91, -71, 39, 65, 101, 101, 107, -36, -59, -51, 4, -148, -200, -290, -212, -129, -58, 24, 63, 77, 327, 263, 238, 282, 101, 80, 140, -16, 20, -130, -184, -38, -98, -126, 46, 2, 121, 159]
2243A59j69K13j59P5l9j19P3j18r0Q3o7P9N1p4K60j98K78J8o8R0r8j10J55k09
2267A6k0j06p0R3R3j39O5p5j18J73J07q7O6q8K04j46o5J34o6q7L2o8R8M4m2K80
2293B28k81R6J37j22K4Jj01Q7n3m3R9j93R7n1j32J89j95l3J57n1R7p9j8J14l4
2318f0J98K8k29J55k7K8j7K2K6q4Q4j2L3j59J76k2Qlq5M3q9j17J74j04Kl1j61
2345b23J00M3n6J30n3o4O1R7J57q4J2O1m7J73q2k05N8lj91P2p7K7J11j15K05j20
2371a3j5O3o6K5J6j73Q8k03N6m4K7J8K6k0J02J35r0J94L4P8n3R9J4j60j13Jp3
2398d7kL6k19J44p3P1J49p4M3P2j50J10J3k03J22n7j21M1q9Q3Q9j19K16l2L8K19
2424B60j0k0R8Nj11K4j23J40l18R8j12j09J16p0L8N3qN0M1l0J46k35J8P3r9N7
$$ y = [159, -10, 203, 44, 119, 80, -39, 34, -84, -174, -91, -158, -79, -28, -102, 158, -40, 238, 256, 188, 278, 180, 70, 225, 16, -4, -110, -180, -87, 6, -133, -68, -143, -261, -88, 19, -68, -2, -90, 114, -32, -97, 37, -29, -116, -84, -152, -54, -10, -52, 228, -53, 43, 180, 58, 82, 83, -18, 69, 16, -27, 72, -121, -24, -75, -207, -18, -213, -246, -89, -140, -43, -122, -140, -26, -60, 138, 166, -63, 92, 65, 93, 76, 98, 124, 40, 124, 112, 145, -14, 162, 140, 148, 145, 60, 103, 14, -103, 71, -33, -31, -62, -223, -123, -80, -136, -6, -59, -123, -62, 35, 192, 108, 120, 181, 134, 307, 225, 20, 78, 75, -116, -44, -121, -94, 17, -98, 107, -13, -28, 35, -31, -6, 10, -163, -75, -278, -222, -266, -239, -221, -195, -215, -113, 22, -68, 126, 160, 238, 185, 284, 298, 138, 25, 26, -47, -49, -13, -232, -88, -161, -90, 59, -15, 28, 100, -50, 60, 73, -130, -8, -65, -186, -145, -234, -151, -62, -181, 35, 3, 41, 260, 250, 230, 328, 333, 222, 246, 123, 263, -55, 43, -69, -178, -62, -132, -94, -41, -49, 1, 42, 12, 158, -77, -59, 14, -85, -28]
2450b8j45J7lOO6M8R1j5J94q8R9j39J89j10j80N0o9r2M9j50O4o2N6n0J55j78J96
2477b9O2j38J59r2Q4q2r7J9O0j58J94j53R5J9J54P6j05J16%r0K8l7r7O5l2j46
2503a25O3q7n3J48j61R1j2n9J71J4J52%j77O5k7q5M1l6R5K4p2P6k1N2P1k6N1j3
2531A60j15L3o7j4J41q8j98j4o8K45j06N9J01k77J01J88j17P9o3j9P0p4L0Q0j85
2556a18J26Pj65J97k3pJ8OQ0l5j35Pk8L1l0o7J18o3j26J74j0M4Pln7R0p8kn2Q1
2586a3J54k60J66m5j1J09o3M2J61j98n5J16j16J83r7k9J7p7O4Q7j04K5M3j14N2
2611C7k6K6O9k3j8K7q4r3P5J22j59l2J40o8OO7j00J11J7j73J75j12K5P9j48OR7
2638D3r4J15Lj38O1o7J80j29k4P0O0j44N8o2K4o7J6R3K6j84J48p5j0J63o4M1m3
$$ y = [-28, -173, -156, -159, -153, -87, -39, 52, 37, 231, 143, 242, 103, 292, 182, 2, 52, -17, -109, -60, -210, -146, -208, -152, -202, -47, -225, -29, 33, -105, 54, -38, 46, -36, -133, -114, -54, -212, -18, -171, -76, -57, 97, 173, 68, 184, 184, 94, 122, 85, -12, 53, 21, -125, -62, -149, -202, -54, -215, -124, -136, -195, -24, -10, 142, 142, -35, 30, 3, -82, -41, -77, 18, 42, -30, 46, 25, 77, 148, 122, 173, 160, 45, 78, 11, -3, 138, 50, -148, -162, -230, 15, -91, -32, 69, -208, -107, 81, -36, 43, -20, -39, 31, -43, -13, 67, -118, 8, 15, -150, 47, 24, 17, 35, 41, 121, 86, -49, -42, -70, -39, -69, -136, -18, -81, -207, -33, -43, 1, 8, 5, -52, 38, -40, -42, -94, -13, 141, -119, 47, 2, -9, 100, 37, 79, 240, 42, -13, 103, -13, 170, 73, 44, 61, -16, 48, 135, 31, 56, 99, -15, 37, 11, 37, 106, 83, 65, 92, 8, -85, -10, 112, -47, -79, 61, -7, -1, 66, -34, 77, 94, -79, 96, -16, 9, 88, -60, -54, 43, -51, 64, 67, -71, -10, -77, 103, -26, -50, 20, 80, -64, -6, -68, -44, -111, -95, -2, 24, -160, -12, -87, -97, 66, 2, 43, 0]
2665@K9J5j66P9pn0J3J59r4P6j11J2J00r3J62j34j1J41j09O6R5k45J37l2j18J42
2691E6q8L1P9k10K13j3l9O2j33qJ15o2N6J0j20R5J1J2%j2J74k28N9j4j03K22n0
2718A15k28J51k0p8K0ln2J26j38m9J20o1J16o9N9J8K1q6L7p4J75j72P5n5j3M5
2744b0L8n4j0J01j22J28r6J27j45l7n6j0K19q5M4j02P6r2K8J4M1R5k5L0n9p4J03
2771E7M7r0J18n0m7j23J39R2j66N0k4p6K07p4j04N2K8L3j5j24r4L7Q1jR7k45J80
2798a5mL1l4J61n9K3k5o0J14j64M4p4Q0n2MJ28k35R6M5o2J11j76J4N2R6j02Mj4
2826g3Om3O1Nj25R2mJ69j21M7J02r9p7R0J35l1j67N1j6J7p7l2J10j52L9K7r9K01
2854C6j22R9p3o9J12O5k2O5j68O9qj05J38O6n5J19j30J40l9m4Q0k5j10R5K4j61
$$ y = [0, 29, 44, -122, -43, -50, -100, -87, 72, -22, 54, -57, -45, 55, -38, 124, -10, -21, 120, 11, 77, 172, -73, 64, 32, -86, 56, -32, -1, 78, -132, 81, 68, 29, 91, -42, -50, 65, 3, 59, 69, -51, 44, 55, 67, 67, 55, 229, 1, 60, 46, -57, 165, 115, -113, 38, 18, -60, -40, -43, -95, 31, -107, -156, -36, -97, 19, -50, 9, 27, 48, -38, -1, -75, 100, -72, 3, -52, -65, -20, 18, -36, -46, 55, -67, 61, -35, 92, -53, -90, -146, -156, 63, -22, 22, -80, -4, -96, -68, -54, -13, 82, 57, 87, 28, -46, 57, 104, 14, 132, 82, 35, -88, 51, 143, -23, 27, 3, -73, 134, 60, -44, 8, 36, 69, 54, -70, -164, -127, -46, -47, 50, -195, -15, -19, 12, -22, 139, 80, 103, 78, 18, 132, -32, 12, -62, 18, -34, -30, 98, -137, -41, 4, -58, 53, -123, -109, -57, 39, -63, -59, -73, -67, -110, -49, -44, -169, -77, -81, 88, -33, 14, 116, 17, -60, 30, 165, 134, -33, 18, 2, 19, -58, -90, 20, -132, -93, -66, -165, 36, -86, 13, -60, -129, -17, 48, 26, 91, -77, -8, -16, -121, 17, 83, 28, 147, 17, 157, 118, 74, 154, 129, 19, 114, 138, -23]
2880b3J4q1R5q7J3jn9J16P3p7O0o4j41K12j15J09p9J13p5n2M5K0K2Pj22J35o0
2907bK47l5j27r9L4K7q8K6L9r6L3K9j25Q0q8N8j08J14M6k4R8r3j45J52P7n6J22
2934I6j65K1PK9J04Lj65J54l5L7l6p0J29l5k4j62O0pJ2r7M8P6m6j7J11j29J14
2961A3j9J3qP6P5j25JM1j00J40j18l9J30p3L2O5q8N6j0p4J33o6k7K9n8O2l3j32
2989a04J23j53O2o1Q3j4O9j02J34p0J43J14k18N4n3J33m4j11kk1o8J4JK1%O8j17
3016a19J25o9K1Q9j73Q5O9k9o2j6p2K05j60J08R4j03J6q4J50j35K5J03j28Q8M2
3041G0r4j1P7k1ln9P0Mo3k3J13j24K06j75N7K3j57R3n8j6J96j27n7R8j0q1J30
3068E8o2J97j52K9P8m3o0l7L3r4j3Q4k4kj63J67n6M2N9j18J81k9o8O3j67L0Q3
$$ y = [-23, -9, -90, 5, -82, -69, -70, -129, -13, 60, -17, 43, -21, -162, 50, -65, 44, -35, 78, 3, -49, -4, 16, 38, 45, -77, 58, -2, 245, 210, 83, -16, 18, 45, -43, -17, 22, -74, -41, -12, -137, -57, -145, -87, -195, -81, -35, -59, 39, -54, -199, -47, 30, -26, 96, -69, -48, -41, -12, 92, 95, -70, 84, 49, 86, 50, -20, 109, 74, 50, -112, -52, -59, -47, -144, -96, -20, -66, -83, 28, -101, 13, -6, 7, -1, 75, 150, 25, 26, 67, -33, 107, -11, -50, 80, 7, 39, 104, 16, 72, 62, -12, 121, 55, 28, 57, -1, 61, 28, -104, 19, -134, -72, -133, -50, -64, 5, -97, 37, -33, 110, 224, 6, 60, 7, 140, 96, -15, -17, -38, -106, -92, -91, -70, -70, -2, -119, 6, -63, -42, 47, -126, -41, 28, -1, -63, -79, -151, 54, -106, 2, 96, -7, 9, -75, 75, -60, -35, 68, -60, 28, 70, -24, -35, 42, 21, 18, -41, 29, 33, -30, -53, 60, -64, 142, -33, 24, 47, -110, -17, -75, -91, 105, -22, -79, 19, 9, -72, 58, -4, 193, 41, 70, 148, 105, 45, 8, 41, -53, -66, 18, -6, -8, -171, -4, -60, -18, 41, -77, 104, 75, 7, 70, -97, -67, 16]
3095A6r8P8k5j4J4J19j76Q9n7P9jo1L1m5M4l0J3K5q7P3pm3L6J10m5j20J11j0m9
3124c0M0O6n9m5R3j15K9l4J64k12J15P9l5j00P7O0j19Kq2J33j9J0n1P3r4J24p6
3151fJ7O2j12n1J14j25O2R9m4K3M2m6J4Mm5M6n6M7j8J1n9j6R6Oj68R4NK5j39R6
3181b2P3n8l5L0Q7p1L9Q8j24J3m6ol1P2j3j49L2J41k14J88l6oJ76j49n1R9m9M9
3209B7o0l5j0J06r3l5oJ08j05J16R1j62L9J52j20O0j10Q2Ok08J04J17o4k1p0R1
3235@l1K6KN8j2N7K6q6L5j1Pr4O4j07Om7J19l1o6J55k3R6j06Q9j4m5n9P7q5j40
3265a40O6%l0rkN6R3N5K7j38J72j59J29m9j55P7n8J12o4r4K4K0o2J24m6J9J38
3292A06LM8L4p9j71K0rj3j48O5jK3j1Q7l5J11q4J09k6N3L8j1m7k1q6R9j84L6k4
$$ y = [16, -82, -4, -29, -43, -29, 90, -86, 3, -54, 25, 24, -37, -6, -51, -7, -37, -24, 1, -86, -13, -20, -63, -27, 83, 38, -82, 29, 19, -30, 10, 76, 17, -28, 65, -50, -21, -55, 109, -103, 12, 91, 56, -44, 33, 93, -26, -24, -106, 27, 8, 18, -33, 40, -54, 70, -6, 11, 73, -39, -90, 24, -101, -39, 60, 16, 39, 81, 35, 49, 53, 8, 54, -2, 45, 27, 38, -21, -37, 59, 65, -103, -9, -4, 21, -118, -22, 51, -7, -42, -12, 75, 4, 43, 131, 7, 20, -26, -32, -63, 9, -4, -153, -121, 20, -194, -6, -42, -48, 128, -21, -72, 27, -22, 27, -33, -68, -78, 28, -65, -100, -106, 2, -103, 13, 104, -58, -19, 133, 13, 73, -37, 45, 51, -157, -53, 64, 0, -21, -91, 0, -31, -5, -3, 55, 43, 100, 126, 40, 75, 64, 71, -23, 41, -66, -60, -107, 12, -19, -85, 70, 47, 143, 37, 126, 112, 67, 8, 85, 0, -140, -74, -74, -104, -113, -115, -59, 34, 89, 116, -22, 150, -9, 120, 71, -84, -7, -65, 47, -17, -111, -87, -67, -129, -5, -51, -32, 106, 109, 157, 191, 112, -59, -39, -48, -61, -209, -144, -145, -122, -133, -46, -81, 30, -54, 55, 29, 82, 120, 109, 62, 41, -45, 54, -130, -94, -118]
3321a18J14m3j2J11M5M1n8P5p0n2J09j67Q4m6j52R0o2K1N3Q7r1R2p9L1K3P2L1
3348A29j19O9R8j82p6J09j49N9o4R0j2l2J64j18J12o2Q8o8J62k78J07p1j12J02
3372e4j66Q7OK5Q0m4R5M8j21R7J39j93M2%r4P2K0l8n2o0lJ43j57K43Qj82K47j55
3400C3Q6o1k4R1K3j54k9j3J11j11p5Q7k5M9j7m3N3J30l1K5J8o7K6p9n8J04j11
3427f2j0K2p2O4m5J35QK2N7k8m5P9po3k4l3m1j1L2r1O7M7j9j03J40n5N4M8n9J70
3457A77j30l7J8r3N7l6J6j68J38kL0L0L3j5P1p6J25j36n0O4n2M1n1k0N4nM8K9
3485F0j29M4R7lL2j26J80r3m9K9j86J27L1j06J46r3n4M2R9m8K57j72Q1Qm4j9j71
3512f0J01Qj12Kj5q2J63K4p0K61k09O3J30k71K13p2p3M5m8q1J38j09r3J28O6r5
$$ y = [-118, -4, -47, -59, 52, 97, 138, 80, 155, 85, 33, 142, -25, 59, 13, -139, -49, -111, -90, -37, 50, -41, 51, -28, 3, 26, 98, 129, 10, 79, 177, -5, -81, 28, -121, -62, -126, -36, -48, -80, 84, -34, 78, 16, 104, 36, 198, -80, 27, -44, -156, -54, -220, -133, -127, -102, -22, -66, 29, 77, -44, 53, 192, -1, 41, 41, -53, 19, 39, 1, -51, -111, -114, 29, -128, 115, 123, -59, 188, 33, 119, 58, 34, 125, 148, -6, -35, -48, 63, -48, -123, -36, -61, -12, -29, -72, -19, 111, 80, 105, 123, 56, 82, 3, -55, 49, -62, -72, -50, -122, -58, -103, 32, 40, 62, 119, 91, 46, 125, 118, 55, 31, -2, -43, -54, -22, -113, -46, 1, -18, -121, 19, -36, 18, 66, 7, 177, 47, 10, 28, -65, -8, -44, -28, -196, -58, -60, -30, 0, 33, 18, 89, 13, 138, 2, -48, 16, -36, 5, -46, -66, -12, -17, 31, 60, -69, -25, 72, 69, 101, -25, 155, 62, 13, 42, -144, -17, 14, -92, 54, -39, -93, -51, 48, 0, 257, 85, 166, 174, 130, 111, -60, 41, 49, -63, -61, -76, -158, 5, 29, -41, 220, 11, 74, 204, -67, 146, 74, 1, 46, -2, -83, 55, -54, -147, -19, 47, -48]
3538d8l5k4J43NJ7j55O5J66j93R0j28J71j20O1j06P2o7J11r3n1R1K5k4N7o7K9
3564hnk6M5O5%j09KM6j18J19K6k0o8J14j18N9O4j04J21j28N9K0n9N8kj54K39j70
3592e2J17j36J24qL9J7r7P3j1ML1p3M6p8L6J7JR0k26Q4Jj2m7k3j0J33q4k3J32
3621F5m9LJ13j71N9j05L4J6q3P4R6k27J22j7kj8N1j3M8Rl9RmM4j71J71n7K3n5
3650g4K6qN8p3M0N5m4J01l2pJ5q8N7j30R8Q3q1p1MJ67j82j7J83J9q8n7J12M5n7
3679E4k2L1j0j24P6j6L9m6p2M5J30j26K1J20k0N1m7M7j30l2qm0N8M3o5J2M3p6
3707f4q6O3J24J3r7J96j58J2J01j27j9J01k1k5n2m3P8J0j09q9K72j23L4J9N2l8
3733B4m3j5P7J3q3l3k9k8l3J12q2J22M0l5R3o7R1l9j9j50J5P9j08J4P5q4O1q6
$$ y = [-48, -83, -107, 36, 41, 58, -97, -32, 134, -59, 31, -97, 74, -46, 15, -91, -19, -86, 25, -68, -119, -28, -3, -27, 30, -37, -8, -13, -39, 6, 71, 71, -38, -36, 10, -108, 11, 37, 17, -51, 63, -55, 4, 68, -36, 85, -43, 16, 36, -23, 35, 33, -121, 118, -52, 65, -71, 53, 45, 84, 101, 4, 77, 66, 70, 101, 28, 74, -4, 32, 49, 50, 140, -86, -2, -1, -13, -60, -83, -93, 40, -44, -67, 65, 16, 19, 132, -39, 20, -85, -51, -35, -118, -44, 52, -175, -53, -70, -72, -90, -39, -52, -4, 5, -34, -25, -29, 15, -156, 15, -42, -19, -74, -48, -56, 2, -71, -31, 24, -20, 81, 49, 42, 57, -31, 26, -104, -6, 77, -4, -75, -71, 96, -86, -103, 80, 99, 11, -46, 66, 111, 54, 32, 63, 53, -71, 5, -11, 28, -18, -90, -45, 85, -41, -20, 100, 80, 131, 84, 131, 1, -31, -39, -79, -21, 22, -43, -31, 12, -64, -150, -87, 37, 50, -47, 149, -9, 3, 104, -23, -42, 59, 38, 13, -39, -82, -4, 6, -103, -192, 80, -43, -9, 10, 62, 24, -19, -34, 43, 56, -27, -60, -89, -117, -150, -38, -120, 2, 42, 7, 100, 33, 124, 85, 66, -84, -69, 10, -98, -84, -9, -93, -32, -118]
3761a18J13P0r5J02L6pj24P4M7o3N7j05j3K3q2j4K2J02q3J40j72J58N8r3P8l8
3787G3M4j09K7j04M3j03l0R3o6P7Q9p2R3j2J17j31jP8r3O2n6j50N1p3M9P3nn7
3815i3O0k8J32m0O8M9j22k4K0k1o7Pq6N4m1k1J07o5J00J4k2M6nQO0o0P0j46N5
3844Ip6J0M4j26Q9J25j61L0J07j2J06q7J35j66M0j3Mj68P4kp9K3N2o2J15p4J02
3871C9O5n5M6n8N8K7j18l0pJ2J2k9m9J06o4pJ44k7o4M8k1J4M0q7R7k26J62j12
3899h4p0O6N2j19J48J5l4O2n4Q5J7j7J0m5k1no7j6K4k0N3o6J49Jn2mR1j40N2Q7
3929I8K5rj04mj27L4J9J20j20M3L0l8M0J31j14J9P9K4j96J01k0p3J26l4j45J33
3955C8r8J36j01QN2JJ53p4l5k6j7kJ8m6R4nj49J99o2j08Q9j62R6m3J24j10K0L7
$$ y = [-118, -5, 65, -30, 72, 108, 101, -23, 51, 98, 35, 92, -13, -26, -3, -85, -99, -77, 25, -58, 82, -90, 68, 126, 33, 111, 73, 117, 8, 35, -69, -26, -129, -159, -66, -132, -55, 34, -38, 55, 43, 160, 29, 28, 106, 13, 75, 19, -131, -80, -153, -104, -31, -36, -93, -33, -61, 71, 31, 99, 148, 26, 2, 22, 1, -66, -59, -145, -91, -132, -153, -46, -111, -11, 3, -19, 27, 22, 30, 90, 30, 100, -46, 9, -67, -57, -13, -139, -50, 75, -86, -56, 51, 39, 145, 58, 193, 27, 67, 54, 58, -110, -36, -38, -117, -94, -42, -104, 11, -63, 39, 104, 49, 95, 37, 95, 122, 4, -26, -33, -21, -9, -38, -87, 19, -45, -52, 92, 65, 1, 49, 28, 42, 82, -5, 92, -134, 28, -84, -154, -88, -36, -155, -7, 8, -26, 36, -18, 67, 84, 67, 77, 32, 11, 6, -61, -77, -53, -73, -20, -86, 63, 64, 12, 8, 99, -41, 11, 98, 123, 114, 10, 6, -121, -87, -68, 52, -68, -25, 5, -33, 7, 138, 24, 43, 122, 146, -50, 51, 31, -42, 84, 50, -95, 38, -60, 76, -25, -17, 35, 36, 189, 115, 80, 54, 37, 35, 53, 7, 101, 96, -53, 146, 84, -24, 65, -97, -1, -44, 80, -30, -10, 27]
3983B7k8jnP8p8Pk2p0K2k4Q2m5L1K5pj0K3L6r7J17q1m3n6R6J53j34n0P6p8L7J
4014a8j20K31j36K1N8n7N9j59J19j8j08J93%l6q0K6q1J24n5K5P6o8O5m8LN3l9
4041C0j3R7o3K0p2k0K40k18j12P7n4J08l1K6N3m9N4o1MM0Pm1O8n6J8q2Jj4K2M0
4071A9l3PO0r4K8J3nn2M3L4j20J68q2m8RMO3L1jo6OKo4Q9M4N4j25M9k2M5r0P5
4103D1j3j80K06n7M7KK6j62P9Q0j39J5j4P1p3N9j27K48j32N7o6j5M9J12j11K8
4129C1P6j1j63J12O5j41K7QM7M4j48J7o3O3P8j36J52Rj8Qp5M6J36l00J37o9J55
4156H7j49K0P1l0l6J09o1r5L2L6N1P0n0m8P5q8N9k3k9k0j00L6j5Q6o8M7K9L7q2
4185d9Q6K9jr5L4l8JN4kL3o6o8O6J7jQ0p2KK7n%jp5l2K5O2o9Rj4QL3l7n6J08n9
$$ y = [27, -1, -2, -7, 71, -7, 0, -22, -92, -70, -94, -12, -57, -26, -1, -8, -18, 5, 41, -56, 61, -20, -63, -119, -23, 130, -4, -54, 22, -56, -19, -18, -138, 93, -43, -22, 36, -21, 38, -121, -2, -20, -128, 65, 65, 29, -51, -25, -106, 18, -37, -12, 64, -4, 61, 13, 16, 69, 30, 17, 114, 51, 71, -1, -21, 219, 1, -111, -34, -88, 20, -11, 15, 68, 19, 73, 12, 16, 56, 63, 22, 90, 34, 52, -30, -29, -43, -21, 19, -14, -7, 53, -41, -13, 0, -5, -57, -14, 20, -100, 68, -14, -62, -53, -49, 14, 45, 44, -22, -16, -14, -78, 11, 55, 109, -16, 33, 11, 56, -34, 41, 28, -152, 54, -3, 44, 46, 72, -90, -11, 69, -70, -55, -69, 2, -71, -12, -139, 109, -23, 34, -32, -47, 2, 114, 3, 31, 107, 96, -67, 45, 110, -31, -4, 4, 51, 95, -53, -36, -99, -36, 42, -94, 58, 67, 49, 57, -18, 28, 164, -136, 1, -68, 87, -62, -42, 29, -1, -37, 72, 11, -84, -52, -16, 35, 105, 55, 7, 82, -6, 53, 30, 1, -19, -119, -83, -98, -12, -80, -33, -4, 33, -49, 37, 66, 65, -30, 4, -34, -33, 21, 19, 52, -14, -82, -16, 1, 0, 80, 8, 10, 37, 32, 32, 31, -44, -76, -51, 11, -58, -49, -63, -55, -22, -59, -115, -7, -66]
4220f6J25M2l4j9J14q4j51J39m9O6j95J77m9k8R7j86J02Q7j51J23j4J8J8n6j41
4245a15pR3r0R3k4L4N5j96R4N2R2l5K7j32P0J47n3J1Qj33o9N9l6j29J36Jr3K20
4273H0n3k1m5m9R3nr5Q1l9L3r1M9J08j07R8p7M5K8j1k6P1o6M6k3J02j08Q5j81
4301g8M2M5j3n3M7K4l2L0k1o8J0K4n1K33j68J18j20k7m7J44r5J2L5%J52j44J14
4328A13r4m6O6R5q3j17N7K6l3o8J15N7j53L6J6Qj4l8J23l7o6J30j62K2M9J1n1
4355c8K2J03k0p2J3J58j11j7N9r6j3P2Pk1j07R0n2N3K7j22l2LJ43j37O7J70j07
4382D2L1j13R2k3J1q4j6N6L4n4Q0k5q0J57r6L0n2J02j09P0o6p5K6P1m0MO4q7Q9
4411C9M9k24M9J18l3%j8Q9p2p3J56J9q5L6Ql0K3r2M6k0J38o8l3L4j29R5M8p0J6
$$ y = [-66, 59, 101, 67, 48, 162, 78, -73, 66, 17, 83, -112, 65, 16, -12, 85, -101, 1, 88, -63, 60, 46, 64, 82, 26, -115, -122, -29, -119, -26, -50, -16, 39, -157, -63, -11, 81, 46, 73, -59, 11, 158, 105, 116, 124, -9, -78, -19, -55, -184, -48, -47, -140, 80, 27, 6, -39, -88, 5, 0, -95, -14, -53, -20, -111, -62, 46, -61, 37, -40, 5, 33, 22, -4, 67, 1, 47, 24, 126, 18, 103, -78, -36, 9, -4, -57, -10, 14, -18, 12, -9, -77, -67, -43, -94, 139, -29, 89, -31, -58, -105, 39, -56, -44, -9, -9, 143, -1, 113, 19, -27, 39, 134, 51, -66, -9, 17, -16, -84, 31, 88, -65, -29, -13, -5, -19, -57, 66, 29, -37, 93, -69, -47, 2, 13, -38, -16, 87, 67, -5, 8, 166, 55, 38, 97, 1, -12, 60, 67, 46, -61, 29, -23, 30, 57, -65, -97, -94, 49, -88, -21, 149, 42, 73, -40, 52, 29, 40, -44, -60, -4, 30, -24, 56, 31, -49, 108, 12, 42, -10, 92, -17, 53, -13, -88, -62, 9, -31, -27, 37, -50, 39, 88, -136, -87, 31, -2, -2, -20, 69, -3, -76, 80, 99, 14, 50, 58, 28, 51, -41, 5, -15, 123, 55, 22, 56, -73, 22, 70, 0, 16]
4440A6q4p3J45N3m2j35KN7J16j12J46p6j29K2N5n6J07K0p0j02K00j12P2J0jk0
4466Ij56J86j10M1J17j18J28j28N4p9N1J2k1jk2M0%o3m9J03L2j63J07M9k9J74
4492A64j29m3j29K05J2j48J49p1o9J06ML1j40J65o2j48kJ82q3j6M2j2p4L3j00
4517a33K1J96j06j9J11p2k9r3J59k9p4Q4O2j22J38m6j11J7R4J49l21J65p5L8j00
4542i6Q7n7N8p9K11j10j15J65o4o1N2j5kqol7k4k8NJ48r1Q2o2N3JJ9ro6J75j72
4572d6J10o4Pj2L5q5R0Kp0L0j18O1P7o6P1m4K4rp0J5oJ2J22q4k6J47k08P0n3P9
4602i%m3NJ32j01o9O1M5j7jO4L8n4O4j78Q8j6o9%J6O1l4n9L1oj8N6Ll7j9P8r8
4634h6J68Lj80J45o0K5M6p7p5P4j6P3m2O9m7r3J4M1K6Mq4P5J0Pn9j1m5P6q1K3
$$ y = [16, -68, -141, 4, 57, 15, -120, -118, -61, 55, -57, 89, 13, -116, -94, -39, -95, 12, 32, -38, -140, 60, -52, 20, 30, 29, 9, -147, 39, -71, -30, 87, -31, 97, -31, 23, -56, -5, 7, -14, -15, -37, 3, 3, -60, -109, -6, 26, -137, -30, 19, -10, 164, 35, -8, -137, 68, 80, -68, 81, 10, -59, 47, 51, 82, -58, 107, 45, -103, -105, 77, -6, -22, 20, 8, -66, -33, -133, -112, 84, -22, -41, 70, -2, -31, -124, 35, 6, -68, 16, 78, -44, 94, 48, -63, -46, 48, 197, -124, 41, -34, 4, -96, -9, -66, -8, -87, 124, 14, -101, 64, 0, -61, -9, -24, -26, -34, -40, -77, -101, -129, -124, 24, -67, 15, -47, 6, 7, 26, 17, -49, 126, -46, 64, 0, 7, -5, 30, -55, 35, 37, -33, -3, -121, -60, 17, -49, 22, -22, 2, -7, -77, -62, -68, -56, 66, -18, -44, 103, -105, -35, -88, -9, -9, -52, -47, 85, -16, -85, -24, 21, 4, 3, 67, 105, 51, 115, -63, 25, 9, -60, -60, -44, 17, -17, -76, -45, -51, -69, -13, -10, -47, -66, 12, -86, 82, 85, -95, 50, -10, 15, 61, -16, -91, -17, -33, 40, -2, 67, 20, -73, -59, -18, 8, 12, -72, 3, 13, 20, -39, -50, -95, -19, -100, -77]
4664g7R6o7N8j5M4o9J10m0K17k61L5q4J25j38J52j10R1mp0J76k51P1J34j74O7
4689A6m0M4k2j7P3p1l2M6m0j01Q4Q7k7J19p8O7j8NO6j34k9O1j16k6P1j3M4j26
4717a07P4L4j7M9k0r1J32l8o4k6N1p1P5r9O0o8N3Q6r4Q1PM9j56P9L7OJ1m4%O3
4747E2k27J22l4O1j57J85o8Q7M1j67Q5O3m9rm9J29k8j29J22M3kj9k08J26J13q1
4773BK1J67q0km0n8LK0p7n5J01r2oJ7Q3q8J6p1R2J05n3mK8J9q0q6J29m4PJ01j11
4804c6KL0K2r2R3j13J36rk6O5k4n8JO6o7j29O0Q6p5m1K1j9K7J8Q8o6M3N4o9J4
4834BL0P6r2P7k7k17J05J10q7j3Ml4J36Ok8p1K7L1om5J23j36J9l2l7O8j04O3M0
4863a2m4P0j0j8L6l7J96j00j9K9j62J14or4p2N0p2O0J58j62M2JO3K1l8m2k9O9
$$ y = [-77, 19, -48, 10, -5, 39, -30, 80, 40, 257, -4, 31, -53, 72, -66, 86, -24, 67, 63, -7, 169, -82, -11, 123, -51, 16, -24, 20, -2, -19, 54, -17, -49, -3, -43, -144, -60, 27, 0, 119, 41, 108, 90, 95, 161, 27, -2, 59, -57, -83, -12, -25, 19, -107, -33, 1, -16, 33, 13, -78, 54, 16, -48, -74, -23, -94, -19, -118, -58, -126, -73, 13, -81, 0, 7, 56, -100, -21, 16, 22, 33, -11, -11, 52, -175, -53, -87, -26, -183, 2, -66, 21, 62, -105, -20, 43, -6, -15, -64, 65, 37, -92, 30, 73, 71, 52, -156, -30, 83, 2, 23, 190, 110, 108, 68, 10, 13, 33, -44, -99, 2, -90, -96, -79, 4, -84, -68, -139, -47, 58, 5, 1, 29, 48, -32, -118, 11, -33, -26, 75, -36, -34, -4, 18, -74, 19, -94, 42, 33, 7, 72, 48, -10, -9, 57, -10, -139, -79, 7, -68, -109, -88, -107, -80, -62, 26, -40, 3, 57, -12, 2, 32, 108, 16, 93, 66, -151, -46, 64, -23, -36, -32, -66, 70, 76, 48, -23, 4, 35, 29, -16, 107, -29, -10, -42, -79, -11, -115, -52, -12, -56, 14, 4, -14, 22, -15, 181, 81, 62, 91, -71, 43, 37, -57, -129, -79, -151, -91, 67, -95, -53, -52, 11, 32, -6, -48, -77, -8]
4891hL6m6m1J2j30N3K4j6J37p1R9kj1P1P1j78o3J05n9k9n5K6K1J4Q6Qj36M5J3
4920b4m7N7K6o3N8o6J04q8nP2j64R1O7n5Q5n4m9J49p3K00r9L6j69n9J7l2q0J71
4948FO8m0m2mJ0K2M6J2m9j23J35j0J4j24nP8L9N1j68jR1K4l5J10r2o0M8Q1j63
4977h1J78j03M5j52N9M5O6J1l0q0J30k8p8J9K8K0K1n8mo2p9Q6j4J0J57p2Nm3K5
5006B1j1l8K8M4r3L2qo8O5J0N5o0J64o7J7j40K20j86O1k9j7oj12R7q3J4R3l4N1
5035B0l0O4r1P5J10k51J03k6M7j19J17n8J28m0P8j28nO8J4L4n0l3O0q2P0r7p2
5062i4J32L7j89J54r0N5lrq5L48l23R0r2OL5j17N9k2K5k7P5r9J41NpP1n5OL9j6
5092E0Jq4Q4k35Q5J09j34LP3j0KJ0JJ25j7j1Lj4j1o6L9M4m0q3K6M8M0O0r0J49
$$ y = [-8, 28, -18, -59, -47, -177, -124, -100, -116, 21, -50, 49, 47, 36, 107, 178, 0, -63, 42, -17, -46, -101, -75, -54, -40, 46, 54, -82, -37, -24, -71, -14, 12, -51, 7, -59, 45, -43, -48, 24, -140, -49, 18, -37, 48, -6, -55, 94, 21, 221, 122, 158, -11, -70, -53, -85, -165, 6, 74, 34, -8, -12, -2, 20, 66, 78, 29, -94, 41, 31, 45, -79, -84, -6, 33, 84, -84, -85, 6, 30, -5, 105, 13, -47, 1, 82, -81, 97, -6, 39, -113, -54, -9, 57, 68, 38, -42, 88, 60, -18, 1, 29, 49, 70, 12, 8, -54, -133, -47, -61, -51, 106, 34, 39, -4, 21, 10, -28, 0, 44, -49, -17, -25, -93, -28, -18, 37, -23, 141, 74, 91, -49, 171, -15, 46, 17, 0, -6, -118, -21, -104, -90, 3, -31, 20, -10, 54, -37, 38, 148, -103, 0, -26, 21, -98, 19, -39, 89, 49, 127, -1, -6, 62, 76, 110, 60, 27, 87, 5, 75, -22, -94, 38, 75, -114, 40, -50, 5, 2, -7, -92, 256, -67, 23, -69, -63, -28, -145, -86, -108, -83, -110, -35, -134, 7, 12, 5, 76, 21, 27, 66, 50, 51, -33, 51, -184, -99, 10, -124, -121, -48, -58, -56, -46, -45, 80, 63, 52, 55, 41, 30, -36, 3, 47, 7, -76, -50, -2, 38, 98, 8, 157]
5122A57m7R3k8j09N2j05P4Nj29M0q6M7n4MKP7J5j57J88l9R4J7J0j12j51J80J1
5149D9j19n9J77n0p4J33p0J05j17J82j12j14Q1J21j04n1j21J24q2P7r5m4J38k02
5173b27O4J79l6j3J83j47L0M1l6o9Mj51K30j36J22K9m1J4M4L0n4R0j89N8K1o3
5199b3M6Nj07m1M0r0K6J63o2J6J05j35L8J09n8M5j2o0J1Q4l7qpp8P4R7q9l4%L5
5229E3r7k2J46j66J29l7n9N7m1k3mm4J29o4o0J07n7N0M4j1m5KN9k3K5O2j20J03
5257I3o9l8p0m6J01q1J0oP8k9K0j20R0J99j43m9K10k01m1k0NJ32m4qL9q4J22l1
5285A9lJ53K6j12q0J72p0j6j9p2n2Pln7J1L5m2N7J50r8J07j9j15P9p2J37j35p1
5313h3N3q9O3J17j05M8Q0Pj18J79p7j8oj2O0j32L3n9k9J1r3J22K2o0J2N9L9oL1
$$ y = [157, 110, 203, 175, 66, 118, 13, 87, 92, -37, 3, -83, -36, -90, -86, -84, -7, 8, -149, 39, 0, 94, 111, 121, 9, -142, 38, 49, -70, -129, 48, -2, -76, 57, -13, 92, -25, 157, 45, -69, 12, 133, 29, -22, -143, -19, -101, -24, -119, -163, -25, -227, -163, 16, -20, -33, 150, 3, 33, 74, 38, -31, -27, -178, 52, -84, 38, 67, 26, 40, 84, 114, 60, 150, -39, 19, 40, -23, 23, 28, -79, -120, -80, -170, -144, 19, -43, -27, 78, -57, -19, 90, 32, 77, 65, 5, 16, 100, 63, 55, 48, -30, 44, 141, 52, 18, 18, 53, -44, -66, 80, -86, 43, 6, -53, 4, -37, -60, -64, -108, 21, -43, -103, 4, -53, -3, 41, 30, -15, -13, 46, 23, 48, 110, -10, 93, 24, -14, -84, -130, -29, -110, -100, -106, -28, -57, -37, -157, -67, 132, -11, -60, 150, -51, -92, -112, -107, 25, -19, -27, 12, -72, 50, 19, 16, 169, 195, 83, 3, 175, 105, 89, 70, -2, -54, -47, -50, -107, -96, -61, -103, -46, 104, 6, 113, 94, -21, 58, -14, 123, -12, -83, -30, -119, -56, 61, -44, 4, 84, 91, -27, 152, 75, 57, 51, 39, 99, -33, 0, -59, -88, -77, -170, -48, -26, -86, -74, -15, 24, 18, 49]
5342D9l6J32j26mq1MP6j8qj11O8P9m3O2P9m1k5Qo3J8k6k5j08J2%l3J37j03J6J94
5372H3j09l2P8p0L5N1k7m4L3J3p7L6K3o5j8J41lO1j37J91r8k2JJ6o7j21J60q0
5400d8l3L1j9M9P7p9QJ44j10N5p6K4N8J3q9n6J5Q7j86R7L0J5l2n0O2O0K8p4Q9
5429I0j41J07o0km9P1o8J18j64rQ8m8J37n5q5R5P3l9j1l9n2O1q9K31j70o8Q0N9
5457F1j27P3l6J7L4K7j8pK0J9q9k9K8O3j08J52K0k3k7O6n9j9j2r1R3o5joM9o9
5487f4J6J07p4j38K15m6Q4k9o0K4o4N0rK3j63O5l8N1O2o8J47q3rN3l7J0N5k9o3
5516a2L9j52J09k5j53J25P9j9P1k3j0L7Oo3M0ol4N8j86J04j2K4q7J43j9rN4j11
5544c2O1m2mN8j08K4l8N3j11J08p7NpJ46m9m4R7K5p1Q5j5P9q6m8J9L3q8J3K1m9
$$ y = [49, 13, 145, 19, 15, -66, -62, 14, -4, -12, -123, -55, 24, -19, 43, 122, 81, 56, 64, 1, 19, -7, -32, -140, -128, -128, -161, -24, -127, -111, 83, -26, -58, 20, -50, -15, 36, 9, -35, -2, 11, -66, -30, -7, -72, -90, 51, 48, 109, -28, 163, 65, 43, 44, 60, -7, -128, 32, -48, -81, -50, -69, -20, 57, -22, -14, 130, 20, 75, -1, 23, 81, 94, 5, -51, -36, 51, -135, -38, -8, 7, -25, -75, -13, 47, 75, 1, 90, -51, 56, -4, -6, -55, 16, -52, 66, -98, -107, -19, -67, 70, 15, -70, 25, 98, 59, 48, 9, -43, 18, -71, 160, -10, -78, 2, 61, -66, 7, -29, -12, 22, 49, 31, 24, 44, 63, -26, -55, -27, 36, -72, 80, 100, 77, 50, 116, 57, 38, 26, -65, 28, -37, -38, -44, 5, -64, -48, 59, -15, -153, 62, 16, 100, 71, 11, 35, -29, 21, 12, 35, -128, -63, -101, -50, 12, -56, 91, 8, -1, 52, 15, 25, 80, 51, -12, 27, -125, -16, -41, -194, -69, 10, -9, 62, 39, 29, 66, 72, 9, 49, 43, 9, 67, -119, -15, -27, -3, -90, 53, 34, 25, 79, -32, 29, -13, -17, 41, -67, -43, -81, -28, -139, -31, -108, -103, -110, 36, -13, -57, 40, 65, -6, 79, 64, 143, 57, 9, 28, 61, -27, -14, 7, -42]
5574d2J05O0j32pK1j2P5n0n3J32j33o0P5J21k12J4R4p5K14j70K1KM3o7J64k6j13
5601a1qL1ol5r0J88j37L9p2P4r2K10j14j7O2k7k9j3r1P1n1P2k0m4m0J52R6k07
5629a09J48j17J49j0M7k3j03K5n6n4J52n4l8L4L4o0n8N1N3J3q4K19j65k2J1Nm9
5656f1l1L9N1r2J34j6J1n0N4j1J05l3Pp9L8r2J81j80Q3p2J8k3j3K3P0j38m6J32
5684Iq0QRR1j49J55k2PP8o8k8K8q2k2R0j4k4P9m8K9j80K01j5j09O4J2j21J44j28
5713h6o9J29m4Jm8j22K07q8O7L5n0o4J74j2K5J1j62N3n8K28j08m1N1m5m8N9L0
5740B5k8J7m1J45K2n4j57J61j24J5n4MM5j20J78o6n3M9J59k5ll0J02q8kM1p9K1
5768F0jj02J06p6lL9kk7q6P0O7j00M4Qj9j4j27NjJ45O3j51r6J61k0O5q7J77o0
$$ y = [-42, 63, 123, -9, -16, 5, -7, 68, 18, -35, 97, -36, -96, -21, 100, -112, -98, -4, -79, 135, -35, -14, -12, 31, -36, 128, 102, -11, -19, 12, 6, -29, -119, 69, -68, -29, -101, -27, -119, 91, -23, -40, 22, -5, -34, -47, -138, -67, -118, -46, -66, -110, -150, 2, 98, -109, 39, -78, 71, 61, 108, 85, -18, 7, -49, -103, 49, -5, -43, -9, 25, -35, -93, -42, 11, 24, -60, 159, -6, -28, -17, -12, -61, -92, -53, -2, -94, 40, 24, 35, -15, 39, 28, 133, 100, 107, 28, 66, -26, 155, -25, 58, -14, 4, -19, -32, -9, 61, -77, -123, 9, -71, -63, -54, 37, -112, 43, 21, 28, 106, 38, 10, 38, -44, -66, 24, 10, -14, 65, 17, 46, -134, 67, 52, -57, 7, 19, -102, 42, -86, -155, -26, -70, -69, -117, -239, -32, -120, -53, -18, -68, -132, 42, 30, 55, 66, -96, -43, -101, 127, 19, -22, 29, -16, -64, -5, 25, -3, 14, -27, 118, 140, 86, -71, 90, -34, -19, -73, -69, -24, -144, 34, -32, -85, -36, 123, 98, 95, 65, 167, 79, 77, 118, 39, 60, 59, -43, 63, -13, -16, 23, 21, -6, -92, -22, 45, -55, -11, -3, -22, -36, -163, -158, -159, -14, 49, -102, -198, -37, -57, 8, -79, 98, 38]
5797C8m7J48j23P3J09k28o9K2M4k9J6J3l4K1JOj9K5Lj11J12J47k40R7J1n5pN9
5825a7j20K22j33R7n5j1J97n1p2j7K8L2q2J6rm7r9J11Q2m5r0M1P4lr2J41j06n7
5853f5O6m0m5N3R7n4K1q5J16k0k0kM9L5q4M1K2j51K5Qk6M1Rr5K2M2J71j33J3N3
5883F4k20J05P7j94P8Q4m3j9K0k7J46R1k30J64j2Lp6J8m6r0Q6M4r6P5l6J6j28
5910a46M7J17n4M0ol6R0p4P4Jl1j9l0k8O4o9j03P7J43j6k0j05O9Q7k4j38R6l5
5938b9J02L1j81J30j11R7J4n2J22j13l4M1J06j13M8q7m5J15j91J78j35L6K2o2
5962a11O7J37j17N7n0P0n1L1m2j29J22M8L0j06M9O0r8K7nO4K6o5K1q4J15j59J84
5989I1j30l3q1J82L1j57J18k6P9k8m6k3k6l6J03L0q8mr9R0M5J1L1n5J13j19K0
$$ y = [38, -9, 139, 16, 89, 198, -30, -99, -77, -33, -62, -46, -33, -67, -46, -45, -39, -58, -33, -30, -141, -29, 118, -122, -25, -14, -69, -76, -17, -137, 85, -48, 49, -6, -17, 180, 129, 57, 40, 68, 100, 18, 34, 25, -22, -121, -10, 72, 27, -63, -22, 52, 49, -43, 98, -8, -65, 1, -39, -84, -31, 66, 12, 33, -52, 64, 44, 24, 22, 71, 106, 22, 63, 85, -66, -41, -33, -59, -18, -9, -104, -82, -40, 131, -2, 11, 64, -156, -51, 26, -168, -90, -6, -49, -68, -48, -75, 71, 162, -68, 96, 84, 87, 11, 29, -17, -107, -21, 23, -73, 2, -34, -18, -146, -99, 18, -36, 4, -2, -38, 52, -22, 52, 53, 22, 3, -27, -55, 9, -60, -163, -86, 57, 41, 21, -84, -15, 72, 48, -90, 6, -29, 73, 104, -77, 53, -58, 39, 53, 1, 123, 10, -24, 17, 123, 10, 58, -29, -74, 41, -150, 28, -107, -71, -49, -111, -44, 93, -24, 33, -17, 53, 2, 33, -9, -138, -16, 32, 62, -44, 5, 65, -33, -6, -11, 53, 79, 14, 35, -49, 66, -93, 91, -39, -72, -153, 29, 60, -97, 21, -5, 74, 46, 0, -23, -49, -85, 18, 48, -40, -44, -143, -53, -8, 3, 34, -21, 92, -27, -7]
6016gJ17k21J39L5j03j3N7n8RN6q0L0j0K1N9j25J33k3J2L6j57N2L0L8j5K4j39
6043a03P6K9K4N3j13J11l7K5M4r0O0j79J30M8k9j23O6m4LR1j77J11r0j6J58o3
6069c5Q0l4K3r5M7L4n3n8Q5l1N3j0M9j16P9J21j12R6k10P6m2Q3j28N0J48n3j08
6096f1J1J06j20Qk9J17p7k9J1O1m0O4LmN4PO5j98R6N2q9j4K6j03J58J4l8j73J84
6125F2k26Q2mJ25k9m9j9n5J32L5j78Q9K6l4M2j09J12J05q0Kj1k5Pm5J89j29k3
6152hM4j8k4M9m2kM6n1L9r7J37j18pm9R0K4l6n6K2L6p4N6N7L0o9nN9J00j07K8
6182E4q3J44j06o3M4l8L4J2J31j67pn8O9j1K3q3rJ10k2l2lm3K4n5J05Q2RKj2Q
6212E9m5NN4J1M0j04R8k6pj30K0j2N9n0j19N6oO1j13J80Pq7j5L9J04j78J22q8
$$ y = [-7, 110, -111, 28, 63, -40, -53, 4, -54, -45, 11, -69, -39, -49, -28, 31, -94, 39, 16, 28, 64, -93, -41, -11, 27, 12, 36, -103, -27, 2, 26, 79, -34, 77, 40, 65, 109, 19, 79, -100, 30, 78, 49, -74, -8, -52, -49, 42, -135, -24, -114, -130, 28, -35, 45, 11, 34, -61, -14, 20, -33, -91, -6, -37, 16, 6, 55, -61, 18, 139, 27, 123, -87, -11, -53, 30, -98, -48, 100, 47, -61, -50, 56, -64, -56, -85, 32, -45, -74, -63, -2, -42, 22, 25, 21, 75, 82, 147, -51, 45, 97, 8, -6, 20, -83, 75, 89, 51, -122, 62, -164, -82, -86, 39, 10, -39, -58, -113, 19, 54, -124, -35, -9, -43, -1, -110, 2, 107, 27, 29, 18, -7, 0, -45, 144, 15, -8, 36, 18, -6, 43, 1, -1, 45, -6, 33, -64, 73, -45, -52, -101, -11, 13, -23, -79, -57, -21, -95, -39, 18, 48, -21, -26, 33, 133, 26, 54, -29, 115, 9, -54, -10, -48, -14, -2, 129, -38, -45, -103, -34, -45, -22, -105, -114, -4, -26, -58, -61, -104, -80, -135, -30, 52, 61, 63, 51, 59, 14, 19, 73, 84, 124, 20, 118, 92, 85, -45, -25, -37, 22, -28, -147, -91, -97, -36, -149, 31, 38, -49, -64, -25, 79, -99, 23, -65]
6240f5K0N7L6P1k24J72j9m8m3Q6N1m1n0j0P7r8k3k4k0N2l2J40j61jP2m5K8L7J33
6269A28k33oJ40R0j44J45j99J25J3P6j02M2k2q3K26j92J0M0J8o0R3p9l3Pm3l8
6295h1M4J02j96Q8J55q8j6l7KQk9QJ20Rp2LL9j46J55o3Nk3K1L0o4R9p1L5m0j18
6325a21Q5P7o5q8O5m6L0l8J32p2N6M8j27P8m8N0l3R8j63N1j7N2N6r5ML8J09l5
6353H1j35k8l3J45m5P4n3L6o1j9RPM4p4O6M9L9j76J00j68K49n9j05Q0O4r6O1r5
6381d3J67r9j11P0l0R3m4N2o5l7Q8q4K6j52J83j05Q9M8j35L8N0O9j04j1J25n8
6407B0j9K7K7p0Mk1j5P9l4L1pj59J17RjL8k4R2j93K59j38o0J3P8l4q6jQ5L4j57
6437a06J53j07N6KM9l0o7L4%q2J75j40JJ4R2j02M1J10j14J30j53M0m0q4Q5N5O9
$$ y = [-65, -45, 12, 48, 119, -105, 67, 48, 0, -43, 43, 94, 53, 3, -7, 70, -28, -51, -75, -95, -43, -75, 65, -96, -97, -25, -70, -42, -5, 128, -105, -111, 29, 119, -25, 120, -79, 46, 59, 135, 33, 75, 53, -30, 196, 4, 14, 54, 72, 12, 105, 26, -7, 0, -43, -81, -37, 65, -131, -43, 112, 24, 8, -29, -27, -19, -48, -40, 80, 89, 17, 20, 59, -87, 68, 5, 10, -13, 8, 38, -26, 73, 2, 37, -3, -121, -36, 41, -24, -112, -47, -93, -63, -101, 31, -41, 15, 63, -64, 14, -34, 16, -17, 81, -82, -31, -48, 4, 60, -35, -31, 7, 116, 81, -54, -82, -115, 30, -15, 59, 6, 42, -19, -38, -29, -22, 22, -52, 14, 63, 102, -74, 26, -142, 107, 48, -57, 23, 87, -9, 52, -43, 124, 25, -86, -16, -46, 47, 3, 55, -10, -47, 41, -43, -17, -169, 14, -91, -2, 46, -89, -51, -1, 68, -36, -47, 78, 20, 1, 28, 55, -15, -11, -32, -47, 32, -2, 29, 22, -137, -20, -11, -12, 26, 2, 94, -99, 160, 22, -38, -25, 53, 19, -67, -68, 17, 51, -106, 47, -60, -4, -2, 47, 17, -50, -16, -16, -98, 77, -63, -62, -48, 44, -58, -17, 93, -21, 109, -44, -4, -44, -128, -43, 12, 81]
6464H1j05J43j13r8J00Q4q7j25J39j42m0R9K8K1o4M3O0K4p2p9R2no5j09L34l5
6490A09j01M8p4L6K1j65O7P1p4n4J18p6J25m7l5m3Q4Q1j43K14k33nK4%Q2q0J10
6517F0j16O5p6P5N9j46J91j10N0o0J13n8LJ0m2n0m4N9J14j27O9j6Q5j17j76K28
6543D3n1k6P7rj12R2Plr4k0P9RO1p9P9j5M8Np2qJ2NNo8J33m3l2n7q6L6Q9L1M4
6576H0j77R3L1n0J46l8k16Q3k4J09k2p3m3J01ol7J07j13J00p9J47j52J51j75J16
6601E9m8n6Q4j61j4PJ48M7pk06J05J44j80J10q8J14mn0r8Mn8K08j00R8J4r8O6
6628D0M5R2j54pm6K9k1L5k3j34R9Q0j43P0J5J04j21k7P9R7j68P6k5O0m4k8k1L
6656c8m3J13j8O1m1Q0k8j8m8l0M8Kr7m3K01j75Q4l1r4Q3N7p5l5P2KL0J41p0r5
$$ y = [81, -24, 119, 6, -92, 8, 92, 5, -120, 19, -123, -163, -64, -36, -15, -79, -36, 24, 48, -24, -103, -11, -16, -81, -190, 144, 109, 8, 56, -18, 18, 39, -126, -59, 12, -62, -116, 2, -74, 51, 4, -31, -74, 10, 91, -52, 162, -71, -76, -52, -52, 30, -50, 60, -56, 9, -67, 8, 67, -79, 112, 2, 52, -8, 105, 47, 50, 60, 18, -32, -76, -17, 97, -30, 39, 23, 108, -9, -185, 43, -8, -34, 43, 34, -78, 14, 21, 18, -76, -96, -17, -8, 53, -26, 53, 38, 86, 91, 19, 11, 23, 28, 33, -35, 98, 55, 23, -34, -120, -84, 5, 36, 80, -97, -4, 27, -23, 123, 85, -131, -48, -72, 37, 15, -58, -101, 0, -6, -43, 64, -49, 51, -28, 119, -33, 118, -57, 59, 11, -45, 39, -122, -136, -129, 19, 66, 59, -147, -42, 102, -78, 32, -56, 58, 54, 4, -94, -90, -148, 60, -40, 58, 72, -26, 40, 85, 177, 23, 16, -30, -1, -22, 13, -10, -144, -45, 35, -108, -38, -23, 81, -40, -67, 12, 109, -59, 17, -8, 52, 8, -20, -41, -38, -81, 32, 14, 75, 34, 114, 86, 68, 20, -10, 38, 40, -57, -100, 101, -74, 10, -21, -115, -32, 25, -50, -85, -13, -11, 19, 160, 90, -5]
6685eN1j49Q1j16J94j26J16m8k1K7O1J38j38j1L5p1N7j59J01o4J3q6O5J7j9O6
6711Il2p1K2J02m8L2j4J5n3M6n8J22n9n1l5O8q6R8K8m4J46j21J1o3P0J5n7n9l
6740g0j2Q5j20P3N3k1l5L8M7r5M1J8m0O2j6L6l6M5oO0N1j10j9k3L2p8K3J4l0Q7
6770E4o0J5Nk4l1n6M5NR7o7O2lk9J5r2k5L1N1Jo6kQ5j4M6O8j01m2Q8p7L6j31J52
6802C6j31P1j5J3k9K4q4R6K0L7k7L5j5M7o5J5o9P5o9N2o4K9j4N4n3P0J4q6J23
6831I0m7n5j5K8k1L3l2J2L1o6L3l3L9N1k4p5J30j2k5j60R2J1n7K2m8R4J45j09
6859C2q9N3pP7l5N7n5m8rJ2l7q0R9n7O5N4o1J71j27JM4j33K06q6l3rjl0n2P5J4
6890A1K2Kk4m8k2J56k5K0k14J44O3j07P4o8j1P5j35R3l9j1R6k1J0%P1M1j52jO
$$ y = [-5, 46, -103, -22, -138, 56, -70, 46, -2, -23, 4, 65, 203, 65, 54, 89, 18, 75, -84, 17, -47, -34, -120, -55, -38, -57, 9, -23, -94, -72, 30, -18, 14, 0, 15, -38, 8, -50, 72, 13, -38, -73, -5, -91, 7, 35, -9, 137, 16, 27, -36, 34, 49, -8, -67, -70, -82, 3, -117, -44, 9, -12, -47, -9, 38, -57, -16, 2, -38, 24, 8, 44, 8, 53, 47, 107, 158, 48, 29, 6, 38, -40, -17, -3, -33, 54, -6, 9, 14, -10, -41, -97, -52, -47, 50, -17, 45, 42, 13, 28, -64, -89, -58, -7, -6, -72, -74, 11, -3, 43, 111, 10, -32, 56, -21, 15, -116, 36, -95, -24, -39, -26, -55, -31, -115, -19, 1, 38, 11, 46, 31, 78, 13, 28, -41, 34, -35, 17, -47, -18, -32, 22, -31, 39, 53, -33, 90, 43, -12, -27, 1, -20, 13, -19, -7, 24, -42, -9, -42, -3, 48, 24, -51, 79, 67, 42, -118, -26, -15, -72, -50, -98, -4, 141, 32, -57, -4, -11, 66, 31, 88, 33, -15, -24, -12, -49, -129, -30, -87, -22, 32, -29, 142, 15, 16, 60, -73, 133, 47, 14, 5, 4, -26, -78, -3, 11, 33, 35, 11, -37, -59, 97, 72, 92, -122, 22, 85, -22, 52, -16, -27, 48, -87, 6, -33, -44, 52, 31, 41, 41, 112, 153, 1, 0, 6]
6919Fk9MM1j51J41Pj36J71m9m3J0J8k0O0n2lpO7Nj18K3MJ49o9L5p7R3r2R6k3j05
6950d4N6k1Oj8JlK5j63J14J03k02J94q0R2lQ3j04k9P7o3l5J2M3q8R8o9o6J73L7
6979A26j33P6j60M7J06o1M2k8j26K8k8L6J08q2k2Q6n4KQ8N6J7k2j16Q2q3L7q6
$$ y = [6, -23, -19, 22, -129, 12, 19, -117, 54, 5, -38, -28, -10, -30, 30, -22, -25, -32, 35, 40, -78, -55, -51, 98, 29, 64, -13, 80, -12, 84, 61, -44, 12, -9, -3, -21, -20, -23, 2, -161, -47, 56, -146, 48, -32, 60, 57, 140, 36, 7, 84, 21, -14, -2, 41, -47, 51, -18, -84, 89, 126, -7, 69, -91, -44, 62, 1, 43, 15, -111, -83, -111, -75, 33, -49, -71, 15, -39, -37, 51, 107, 124, 102, -14, 68, -15, 22, -64]
$$ [...]
8191D9
##END NTUPLES=NMR FID
##END=
