##TITLE=1H_SA-61.242
 DMSO-d6, 8 sc, 
 8.06.2021
##JCAMPDX= 6.0         $$ Bruker NMR JCAMP-DX V2.0
##DATA TYPE= NMR FID
##DATA CLASS= NTUPLES
##ORIGIN= UXNMR, Bruker Analytische Messtechnik GmbH
##OWNER= root
$$ XWIN-NMR		Version 3.5
$$ Tue Jun  8 13:30:49 2021 Russian Standard Time (UT+4h)  she@DPX200
##.OBSERVE FREQUENCY= 200.131506
##.OBSERVE NUCLEUS= ^1H
##.DELAY= (6, 6)
##.ACQUISITION MODE= SIMULTANEOUS
##.ACQUISITION SCHEME= undefined
##.AVERAGES= 2
##.DIGITISER RES= 18
##SPECTROMETER/DATA SYSTEM= spect
##.PULSE SEQUENCE= zg30
##.SOLVENT NAME= DMSO
##.SHIFT REFERENCE= (INTERNAL, DMSO, 0, 15.7039)
##AUDIT TRAIL= $$ (NUMBER, WHEN, WHO, WHERE, WHAT)
$$ ##TITLE= Audit trail, XWIN-NMR		Version 3.5
$$ ##JCAMPDX= 5.01
$$ ##ORIGIN= Bruker BioSpin GmbH
$$ ##OWNER= she
$$ F:/spectra/data/she/nmr/H-F/1/audita.txt
$$ ##AUDIT TRAIL=  $$ (NUMBER, WHEN, WHO, WHERE, WHAT)
(   1,<2021-06-08 13:29:52.70 +0400>,<she>,<DPX200>,
      <created by zg, POWCHK disabled, PULCHK disabled
       configuration hash MD5:
       00 E9 B6 7A A2 85 ED C7 34 08 36 98 17 FE 4E 26
       data hash MD5: 16K
       47 56 76 EB 21 BA 93 9B 8E 6F B5 FE 88 1E 25 64>)
$$ ##END=
$$ 
$$ hash MD5
$$ D6 7F D9 6A 9B 76 A8 8E 42 9E 14 8D 62 04 83 CD
##$RELAX= 
##$RELAX= 
##$RELAX= 
##$RELAX= 
##$RELAX= 
##$RELAX= 
$$ Bruker specific parameters
$$ --------------------------
##$DU= <F:/spectra>
##$EXPNO= 1
##$NAME= <H-F>
##$PROCNO= 1
##$TYPE= <nmr>
##$USER= <she>
##$AMP= (0..31)
100 100 100 100 100 100 100 100 100 100 100 100 100 100 100 100 100 100 
100 100 100 100 100 100 100 100 100 100 100 100 100 100 
##$AQSEQ= 0
##$AQ_mod= 1
##$AUNM= <au_zg>
##$AUTOPOS= <>
##$BF1= 200.13
##$BF2= 200.13
##$BF3= 200.13
##$BF4= 200.13
##$BF5= 200.13
##$BF6= 200.13
##$BF7= 200.13
##$BF8= 200.13
##$BYTORDA= 1
##$CFDGTYP= 0
##$CFRGTYP= 5
##$CHEMSTR= <none>
##$CNST= (0..31)
1 1 145 1 1 1 1 1 1 1 1 1 1 1 1 1 1 1 1 1 1 1 1 1 1 1 1 1 1 1 1 1 
##$CPDPRG= <>
##$CPDPRG1= <>
##$CPDPRG2= <>
##$CPDPRG3= <>
##$CPDPRG4= <mlev>
##$CPDPRG5= <mlev>
##$CPDPRG6= <mlev>
##$CPDPRG7= <mlev>
##$CPDPRG8= <mlev>
##$CPDPRGB= <>
##$CPDPRGT= <>
##$D= (0..31)
0 1.2 0 0 0 0 0 0 0 0.06 0 0.03 0 0 0 0 0.0002 0 0 0 0 0 0 0 0 0 0 0 0 
0 0 0 
##$DATE= 1623144592
##$DBL= (0..7)
120 120 120 120 120 120 120 120 
##$DBP= (0..7)
150 150 150 150 150 150 150 150 
##$DBP07= 0
##$DBPNAM0= <>
##$DBPNAM1= <>
##$DBPNAM2= <>
##$DBPNAM3= <>
##$DBPNAM4= <>
##$DBPNAM5= <>
##$DBPNAM6= <>
##$DBPNAM7= <>
##$DBPOAL= (0..7)
0.5 0.5 0.5 0.5 0.5 0.5 0.5 0.5 
##$DBPOFFS= (0..7)
0 0 0 0 0 0 0 0 
##$DE= 6
##$DECBNUC= <off>
##$DECIM= 32
##$DECNUC= <off>
##$DECSTAT= 4
##$DIGMOD= 1
##$DIGTYP= 9
##$DL= (0..7)
0 120 120 120 120 120 120 120 
##$DP= (0..7)
150 150 150 150 150 150 150 150 
##$DP07= 0
##$DPNAME0= <>
##$DPNAME1= <>
##$DPNAME2= <>
##$DPNAME3= <>
##$DPNAME4= <>
##$DPNAME5= <>
##$DPNAME6= <>
##$DPNAME7= <>
##$DPOAL= (0..7)
0.5 0.5 0.5 0.5 0.5 0.5 0.5 0.5 
##$DPOFFS= (0..7)
0 0 0 0 0 0 0 0 
##$DQDMODE= 0
##$DR= 18
##$DS= 0
##$DSLIST= <SSSSSSSSSSSSSSS>
$$ [...]
##$SUBNAM2= <"">
##$SUBNAM3= <"">
##$SUBNAM4= <"">
##$SUBNAM5= <"">
##$SUBNAM6= <"">
##$SUBNAM7= <"">
##$SUBNAM8= <"">
##$SUBNAM9= <"">
##$SW= 20.0188882624521
##$SWIBOX= (0..15)
0 0 2 0 0 0 0 0 0 0 0 0 0 0 0 0 
##$SW_h= 4006.41025641026
##$TD= 16384
##$TD0= 1
##$TE= 0
##$TE2= 300
##$TE3= 300
##$TEG= 300
##$TL= (0..7)
0 120 120 120 120 120 120 120 
##$TP= (0..7)
150 150 150 150 150 150 150 150 
##$TP07= 0
##$TPNAME0= <>
##$TPNAME1= <>
##$TPNAME2= <>
##$TPNAME3= <>
##$TPNAME4= <>
##$TPNAME5= <>
##$TPNAME6= <>
##$TPNAME7= <>
##$TPOAL= (0..7)
0.5 0.5 0.5 0.5 0.5 0.5 0.5 0.5 
##$TPOFFS= (0..7)
0 0 0 0 0 0 0 0 
##$TUNHIN= 0
##$TUNHOUT= 0
##$TUNXOUT= 0
##$USERA1= <user>
##$USERA2= <user>
##$USERA3= <user>
##$USERA4= <user>
##$USERA5= <user>
##$V9= 5
##$VALIST= <valist>
##$VCLIST= <CCCCCCCCCCCCCCC>
##$VD= 0
##$VDLIST= <DDDDDDDDDDDDDDD>
##$VPLIST= <PPPPPPPPPPPPPPP>
##$VTLIST= <TTTTTTTTTTTTTTT>
##$WBST= 1024
##$WBSW= 4
##$XGAIN= (0..3)
0 0 0 0 
##$XL= 0
##$YL= 0
##$YMAX_a= 20192
##$YMIN_a= -15182
##$ZGOPTNS= <>
##$ZL1= 120
##$ZL2= 120
##$ZL3= 120
##$ZL4= 120
##$ABSF1= 10
##$ABSF2= 0
##$ABSG= 5
##$ABSL= 3
##$ALPHA= 0
##$AQORDER= 0
##$ASSFAC= 0
##$ASSFACI= 0
##$ASSFACX= 0
##$ASSWID= 0
##$AUNMP= <proc_1d>
##$AZFE= 0.1
##$AZFW= 0.1
##$BCFW= 1
##$BC_mod= 2
##$BYTORDP= 1
##$COROFFS= 0
##$CY= 11.3945322036743
##$DATMOD= 1
##$DC= 2
##$DFILT= <>
##$DTYPP= 0
##$F1P= 15.9154993809931
##$F2P= -4.1035820241983
##$FCOR= 0.5
##$FTSIZE= 0
##$FT_mod= 4
##$GAMMA= 1
##$GB= 0.15
##$INTBC= 1
##$INTSCL= 1
##$ISEN= 128
##$LB= 0.24
##$LEV0= 0
##$LPBIN= 0
##$MAXI= 10000
##$MC2= 0
##$MEAN= 0
##$ME_mod= 0
##$MI= 1.114404
##$NCOEF= 0
##$NC_proc= 0
##$NLEV= 6
##$NOISF1= 3.799351
##$NOISF2= 2.8
##$NSP= 1
##$NTH_PI= 0
##$NZP= 0
##$OFFSET= 15.70392
##$PC= 1
##$PHC0= -11492.54
##$PHC1= 17.40101
##$PH_mod= 1
##$PKNL= yes
##$PPARMOD= 0
##$PSCAL= 0
##$PSIGN= 0
##$REVERSE= no
##$SF= 200.130013532006
##$SI= 16384
##$SIGF1= 3
##$SIGF2= 2
##$SINO= 400
##$SIOLD= 16384
##$SREGLST= <1H.CDCl3>
##$SSB= 0
##$STSI= 0
##$STSR= 0
##$SW_p= 3612.71676300578
##$SYMM= 0
##$S_DEV= 0
##$TDeff= 0
##$TDoff= 0
##$TI= <>
##$TILT= no
##$TM1= 0
##$TM2= 0
##$TOPLEV= 0
##$USERP1= <user>
##$USERP2= <user>
##$USERP3= <user>
##$USERP4= <user>
##$USERP5= <user>
##$WDW= 1
##$XDIM= 8192
##$YMAX_p= 0
##$YMIN_p= 0
$$ End of Bruker specific parameters
$$ ---------------------------------
##NTUPLES= NMR FID
##VAR_NAME=  TIME,          FID/REAL,        FID/IMAG
##SYMBOL=    X,             R,               I
##VAR_TYPE=  INDEPENDENT,   DEPENDENT,       DEPENDENT
##VAR_FORM=  AFFN,          ASDF,            ASDF
##VAR_DIM=   8192,          8192,            8192
##UNITS=     SECONDS,       ARBITRARY UNITS, ARBITRARY UNITS
##FACTOR=    0.0002496,     1,               1
##FIRST=     0,             0,               0
##LAST=      2.0444736,     0,               0
##MIN=       0,             -15182,          0
##MAX=       2.0444736,     20192,           0
$$ Real data points
##PAGE= N=1
##DATA TABLE= (X++(R..R)), XYDATA
$$ [...]
1113f25L55P59j20o87j89O26K92k64m35J0M47L31m55n25M18L01R3l81l18K53M02
1134B88Nn57j48M50L90k59n10q1O58J71l22m11J34L80K21m22l67K56M30j01n11
1155c06k5K75N63j30p20J7M71K53k22o07L9P30J21m41m08K50M05M8l26l40J65
1176a88M57r8l38j02K06L22j58l12%M73K9l18k87L70K92k20l46j64L92M24k07
1197B27n23o0M52M55j32q36J04M15K76l41l78N3L87K76k98n18K97L32R3l34k04
1218b57K76L13j51m03j7N32L4l25l51K40K31K16l32l68P7M93J40n22k18K84L79
1239B71k30l41k3L09M07k45m79J19L55J90l19k63J69K95P3l21m15L70L74j15m15
1260b34m6L65J69l3m01j11M46K23l61j98J42K85j03k21j10J21L54j06m51j6L21
$$ y = [-625, -270, 489, 369, -318, -507, 119, 411, 147, -288, -278, 169, 500, 45, -480, -62, 239, 332, -49, -367, -114, 288, 293, -264, -412, 38, 428, 169, -341, -422, 236, 407, 85, -326, -192, 188, 409, -13, -380, -124, 306, 205, -306, -331, -56, 507, 377, -343, -326, 145, 398, 176, -431, -392, 338, 459, 18, -390, -140, 265, 313, -13, -353, -188, 269, 171, -167, -269, -63, 259, 101, -211, -211, 262, 291, -27, -314, 56, 348, 128, -218, -382, 10, 434, 227, -296, -356, 96, 551, 419, -417, -313, 102, 378, 37, -341, -288, 99, 375, 77, -441, -144, 188, 281, -53, -257, 19, 332, 181, -222, -239, 293, 327, 2, -349, -109, 122, 338, 6, -362, -285, 208, 348, -174, -392, -108, 271, 41, -300, -323, -14, 393, 148, -331, -212, 143, 333, 14, -249, -80, 215, 288, -33, -448, -78, 296, 181, -234, -280, 85, 254, 221, -180, -291, 155, 378, 17, -181, -39, 246, 143, -78, -188, -67, 287, 181, -270, -286, 35]
1281C5K14j60k98k2M08op2l96K3N36J43l84m65L25K76P2k56l28L22K23j31j17
1303e8j68J04M85k86j59j48K87J78k86k21J54L44n7l43n7L45J17n9m49m3N46K34
1325D60l53l81K6L80J80k38l06O8M65O6m58j95J29L29J3j16k88J55J70P6l18m7
1347a83L61R1l20j03k4K92J69m10q7Q3L64k8l78K7L1L46Q0n77L5K90J45j83l10
1370b89o5N22J72m54k52J99L43K3k62j54K32K31k7k85j86L03J91o8n49J54K16
1391eJ66j79k11JM76j32r7k25K94J61j00k93n6L85J76j72m46l6N43O3k57l41%
1414b85L74J43q9l49J59J87K0j69j70N5L15j17j01k55K52K39m0j95j02K14K3l53
1436b44N7J35K43j48k28M6L1L12j78l13l8K72K75j97k09p4L18J41n2l36R1K09
$$ y = [35, 249, 89, -209, -231, 177, 171, 99, -297, -274, 262, 405, 21, -444, -119, 157, 229, -27, -355, -33, 190, 59, -58, -226, -122, 363, 77, -82, -230, 57, 235, -51, -272, -118, 226, 169, -174, -231, 114, 231, 172, -277, -320, 226, 460, 107, -274, -248, 132, 312, 74, -232, -164, 301, 367, -91, -286, -157, 172, 185, 69, -219, -64, 106, 182, -136, -183, 178, 269, -51, -154, -178, 114, 283, -127, -214, -131, 233, 205, -173, -146, -115, 231, 311, -266, -231, 59, 204, 21, -289, -354, 168, 340, -114, -366, -167, 176, 199, -63, -217, 15, 246, 219, -66, -252, 51, 242, 174, -375, -221, -5, 161, -18, -229, -228, 248, 116, 19, -206, 88, 249, 149, -144, -200, 185, 361, 189, -257, -293, 250, 313, 56, -285, -285, 89, 232, 143, -206, -47, 140, 160, -9, -179, -124, 191, 74, -27, -282, -30, 209, 169, -26, -128, 86, 109, -244, -187, -52, 191, 43, -185, -139, -108, 204, 26, -287, -325, -53, 222, 25, -184, -258, 60, 201, 149, -187, -96, 113]
1458A13L5j23k83L06J4Q1j06j22J50K15k45j93J6L12R8j65k99J15K96k4k42p0
1480a21J05J88J15k26k81L03J23N5l95L0O6K75j46k76J3K64J65l50j12J34J80
1501A09J28l67j73J75K61r7j18l1J19J15j35j60J55Q3R9j65or9J51Q4l45L1K37
1524E1P3l4j57j90M49%n0k12j53L74M5j37k63J38K38Ko0l24J74J27J35k82j61
1547b17K82J0L5j25j56J44K06q1l31J88J15J4k13n9K06J01k7k31m4O3K28j50j42
1570a84nK87m0J12j26k05J66L8n0j99O5K16M4k08l2J07J73r9j82K8J9K92n0k36
1594f9Q9K8O6jl27K03M9J51j94o7P3J1K10k96j30K38N8j03k28k3L70J72k69k02
1618a91J15QJ38j30o4q2L95r0j43r4K2J85K2k07L6M9K96j70j63k0J65J35k06j
$$ y = [113, 148, 25, -258, 48, 62, 143, 37, -85, 65, 280, 35, -158, -142, 170, 268, 103, -196, -81, 215, 191, -51, -121, -16, 172, 287, 61, -220, 83, 206, 261, -134, -104, -38, 237, 91, -185, -172, 92, 257, -93, -205, -71, 109, 237, -130, -303, -128, 133, 36, -82, -113, 6, 121, -14, -174, -19, 64, 163, -2, -8, -107, 44, 128, -217, -186, 51, 124, 90, -67, -257, 192, 192, 142, -70, -223, 151, 196, 59, -204, -66, 172, 174, 114, -210, -36, 91, 226, -56, -217, 65, 75, 110, -15, -171, -27, 179, 98, -233, -45, 70, 84, -129, -188, 18, 119, 92, -139, -183, -120, 108, -42, -184, -189, 98, 58, 170, 44, -161, 5, 43, -7, -206, -141, 75, 119, -89, -121, -14, 159, 60, -122, -94, -75, 217, 167, -69, 20, 48, 114, 113, -214, -11, 38, 189, -5, -72, 1, 12, 222, -74, -204, 34, 92, -11, -239, -262, 108, 280, 11, -191, -76, -68, 70, -60, -124, -206, 189, 99, -44, -138, -116, 69, 91, -116, -80, -31, 265, 95, -68, -88, 77, 212, 6, 5]
1642Ej5M0M7j79m7J67M2n3j18LM4O5J75l61J99J22J36k95k51J95K10N0k20k77
1666c16K80K54j02k24k5J18K05j42J4j39P0R1Q6l16k0K86q8m9j88N9K61N2j32
1689C5r6J0J13J2k16p4J85L47k12k09Q7j9J36j70j15J25J90k8J5k77K39l5k1o4
1713d2LJ22J00k52M2J12k2P7j03l1J8J4J14j04j55RJ17n7j7p7L1K64k62J48k37
1738a88L74R8l88LJ57k5R3k52o6J93o4O0K8j74J17J43kK8k94J96j6j0j28K42j22
1763CJLj89L6K92j17q1M7L9kJ8n9m5J50N0p0o9pkJ76j39j60J09O9J48k08j36K28
1791H5mj0r1K3J06n2K7jj44N4N5L2j4j07Q3J21j50j55L1K53j5p1k29J76K32k82
1817d7j35J47On0J08qk9J50r5J66k28k7Q7L4j3j82l5K71l1m9j96N4K30j24m8j8
$$ y = [5, -10, 30, 77, -102, -149, 18, 60, 7, -111, -108, -64, 1, 176, -185, 14, 136, 272, -23, -274, -79, 131, 181, -39, -316, -36, 218, 116, -108, -133, -15, 190, 48, 62, -77, -7, 84, 170, -146, -166, 120, 32, -17, -205, -146, 115, 167, 35, -61, -51, 62, 74, -142, -216, -31, 316, 104, -105, -18, -37, 99, -71, -186, -61, 129, 101, 116, -161, 78, 43, 22, -42, -39, 83, 183, -69, -27, 85, 63, 140, 37, 6, 24, 38, 152, 48, -107, -98, 19, -38, -55, -132, -101, 163, -99, 49, -188, 186, 284, -104, -101, 56, 31, 124, -128, -194, -1, -65, -5, 23, -151, -34, 109, 107, 135, -159, 37, 21, 11, -117, 125, 3, 4, 7, -182, -146, 146, 29, -52, -5, 34, 32, 50, -9, -54, 96, 146, 76, 7, 0, -2, 174, 35, -125, -16, 53, 201, -7, -143, 85, 81, 71, -20, 3, 109, 57, 84, 83, -61, -7, 48, 80, 66, -41, 42, 163, 13, -142, -111, 142, 127, 56, -173, 3, 235, -47, -182, -35, -29, -79, 29, 21, -8, 142, 47, 213, -15, -42, 45, 79, 66, -116, -151, 120, 89, 40, -156, -102, 128, 4, -44, -62]
1843f2J61r3l8o8J73q2K6R4j14PL2oM8j59K1K64o0k37jJ19J86l42J2J22J11o1
1869E3j44L6N4J34n1j33j64K43K6M3j4j24M0R1lj76N4n0J24j62j09K96K4k61K
1894a71J59m5o9J74j24O8J6q5J42j55m0J57J64o1l59J56K41j19rj35J24J21j51
1917aj82K52j1j27K1L1j26K00pJ61k79N1k2J87p6k01j2K41Oq9j42J28J93k45p8
1942a27J15K00k97J54j89K36j29R0r5J7j21J35K02j64n6R0LK2k54rL20J5k05m5
1966i2J8J72j93M6K9Nn7K9Q8K0j00N6J25j78Qo5J66l2j39q5K45J09l62J92l3J74
1992A46j12j28K02r3J16j27J5Q4q2o2J58n4j33r2K74m4k23O7K27K1j75k38K59
2015FJ87j95l0K4Q7n7K1j23k8J09qR1m9r8J03P1p5p0j16K08J69k62j34K51J0j81
$$ y = [-62, 99, 6, -32, -100, 73, -9, 17, 111, -3, 4, 36, 30, 78, -81, -60, 204, 144, -93, -94, 25, 211, -131, -119, 3, 114, 53, -91, -55, -1, 133, 82, -51, -215, 28, 54, 97, 83, -41, -1, 90, 87, -89, -35, -85, 39, -123, -232, 64, 88, -173, -171, -12, -57, -126, 48, -76, -8, 8, -77, 65, -90, -130, 27, 191, 130, -229, -73, 168, 49, 40, -95, 29, 150, -1, -183, 69, 58, -69, -48, -17, -143, 57, 50, 211, -68, -17, -39, 148, 72, -129, -141, 100, 106, 17, -125, 3, 196, -49, -127, -12, 188, -109, 45, -144, 92, -37, 53, -42, -25, -146, -11, 191, 27, -29, 61, 64, 86, -168, -177, 143, 158, -47, -92, -74, 98, -95, -49, -20, -15, -72, -43, 45, 65, -35, 21, 146, -32, -24, -89, 77, 45, -94, -179, 66, 175, -187, 5, -28, 146, 34, -94, 108, 15, 131, 4, 19, 103, 21, -41, 117, 63, -70, -162, 112, 68, -155, -88, 139, 160, -15, -253, 6, 193, -2, -32, -8, 79, 22, 43, -80, -108, 1, -7, 84, 35, -63, 40, 111, 36, -34, -150, 58, 227, -35, -169, 82, 92, -89]
2041h9l1J73k3r9Q8j9O6j8m1j1J3j52O7J67L1k91K11R0J0k39PQ5N1J0k10K23k2
2068D7mp3O7j33J11j41L53j94p9P6P2Mj60J06P2Pj83j21K26k2j15m1R7j5J12k08
2094a39J00P9j2j36K03j34p9Q1J20Kj92O5J67j6k07L0J42m4j05k9Q2J62k85P4
2118g1PP1j8O3j08Q6j38L5J90j19k20P6J80J6k2j76K42k6j5j66Q4P8j21j16J59
2143b9J25j27lQ8k2j45O3J57j15k4j9J13P4l10Q8J79Ok48J08jM4MO6m5M5j8Rj59
2171i6NO5R7q5N1P1j23J88n8l25K03lQ6j41p8J34K23j37j44K7R3K7p3r6K28q7
2197E2j04Ro1J27R9j03K0j52j07L47L9l2k80J22K39k59j8O6O1p8j31J00l3m2M5
2222g4K40j72l8J81k9m0j07NJ96j84n3N6O1j5k53O3J41K36j52r2JJ02j19N8p4
$$ y = [-89, -120, 53, 30, -69, 19, 0, 66, 48, 7, -4, 9, -143, -76, 91, 122, -169, 42, 132, 142, -97, -90, -5, 46, 56, -154, 69, 47, 43, -30, 37, -96, 15, -126, 227, 33, -46, 30, 102, 106, -54, 52, 124, 131, -52, -173, 53, 31, -84, -125, -28, -43, 69, -139, -39, 40, 28, -108, 95, -39, -118, -37, 83, 85, -107, -42, 125, 109, -98, -68, 74, 30, -75, -104, -22, 140, -145, -71, -64, 7, -11, 52, -56, 30, -108, -73, 117, -2, -222, -146, 34, 50, 28, -148, 94, 68, 53, -113, -29, 49, -72, -188, -29, 96, -31, -34, 54, 32, -113, -50, 107, -8, -32, -51, 62, 136, -174, -86, 93, 99, -149, -41, -42, 2, 6, 72, 27, 72, 54, 63, -96, -91, -26, 71, -14, 37, 108, -15, 173, 115, -210, -7, -10, 76, -65, -143, -9, 214, 77, -67, -40, 53, 80, 7, -89, 139, 52, -52, -43, -104, 23, 122, 19, 39, -113, -220, 127, 166, 134, -146, -24, 215, -44, -62, 4, 65, -13, -144, -44, -77, -119, -74, 166, -6, -44, 137, 108, 68, -39, -34, 162, -22, -75, -19, 42, 27, -226, -163, -22, 214, 62, -30, -29, 73, -46, 12, -62]
2247f2Q7j68J37R7q2o3o2J94M1j23j36K96j31r1o9J72o8K0p3R3L8r8n3j0P1o0
2273a03J46m4l2j14L2Q5j1mlJ62j24n0p3K63%k11m5J47L2n3j49J28j30O5O4K0
2299bP2j31N9J4R5j21l1J61l7n3j18J48jpn3P4j52J37m5q8J72k5q2k3K1k1P1K2
2327E6j37j33K45M4oj30k1N4J21o3n3LQ1K0k10J35N0j24J23r0j00J80p6O1n9j04
2353a33P2L0K6r9O9Q2O0j95N2n1R2om3P1o8l9P8J53j28p2J7Q6o6k9O7R4rp4M3
2382H0K9j34p3K8N5K8RL6o0Nk0o6KK1Q3mJ53j67m3N2Q6k2r8K4L8n1j40J89j0J21
2412A51j57j74J30J37j24j6R8p6N2j13J27j4j21J25P1p4r7j6J38L3j1j88J22L7
2436D0K3j8l8K6n9L5l3N8K5Mj71P4P2j03K16k56o8K45J43j86N9k33J77k1O5r9
$$ y = [-62, 25, -143, -6, 91, 9, -54, -116, 78, 119, -4, -140, 156, 25, -66, -135, 37, -31, -11, -84, 9, 47, -51, -104, -114, -43, -103, 43, -1, -33, -147, -115, -30, -41, -45, -48, 114, -10, -60, -133, 130, 130, -81, -126, 21, 53, 0, -149, -21, -151, -86, -22, -2, 70, -61, -2, 12, 107, -14, -45, 116, 79, 26, -92, 56, 55, 48, -5, 69, -83, 54, 9, -79, 93, 68, -14, -37, -16, -37, 34, 56, -81, -214, 31, 75, 69, -61, -82, -28, 93, 30, -23, -20, 61, 81, -129, 6, 56, -68, 55, -35, -135, 45, -31, 30, -29, -133, -61, -31, -5, -104, -35, 47, 107, -88, -36, -87, 5, -1, -44, 27, -41, -80, -2, 151, 23, -49, -32, 54, -12, -41, 26, 120, 111, 37, 80, 109, -25, -98, -70, -15, 13, 22, 58, -2, 3, -17, -83, -81, -60, 23, 19, 172, 5, -38, 14, 100, 78, -20, 4, 42, -9, -149, 40, 30, 151, -6, -180, -50, 87, -37, -53, 45, -31, 21, -92, 35, 21, -100, 25, 96, 22, -75, -91, 47, 80, 69, -119, 3, 40, 63, 45, 7, 33, -26, 9, -24, 34, 59, 63, -108, -34, 38, -65, 151, -105, -173, 72, 215, 29, 88, -145, 32, 11, 76, -23]
2462b3NJ03Rj51P6j31K33k13pJ40m3pJ10j06m0N5J08Lj58R0K6o1k43R6J00J63
2488A34j03n3k6k2m6J76j04jk0J02Jj69Q8l2N8m0L0qQK08j99q3nK13l55K77k6
2515Ck8K54j28j06QKJ54l9p7M9pj27O6j14N1J40rp1k08J64J66q4M2j00Q9r2ll1
2543c6l2J03R8k11p8O7J69o3q5O2q4J38J2j17L0J34k38J53J57k44J28p5O5n6J5
2568A2J7j68J17P4j37J42P4k14N9P0Q2k14P1kP6k6n3j03R8L8N1r4L5j01J0%P3
2595a3m2J33l9J14j18j96J55M4J3m9j47J35Q5j60O2K7p3R2j37k3P5R1O2j50J03
2620D4j02J02N6j01OJ80j4o3o2M5l3o0Q3j33L1K0k9J1PR5q2J13j44j99K08L5r5
2647h1k6J56%r3pJ28k5n9l2P1r2O6Qo2J7J18j70Q1J93j52R7j51K7m8p2R9n0QQ6
$$ y = [-23, -18, 85, 94, -57, 19, -112, 121, -92, -99, 41, -2, -9, 101, -5, -45, 10, 118, 121, -37, 53, 79, 18, -225, -129, -29, 134, 31, -22, -48, -70, -116, 60, -44, -45, -65, 37, 38, -131, -43, -75, -17, -57, -27, -35, -27, 181, -18, -101, -106, 107, -248, 29, 3, -25, 229, 101, -5, 3, 5, 159, 120, 43, 92, 85, -42, 24, -90, -39, 101, 92, 21, -187, -23, 143, 59, 101, 1, 90, -2, -5, -36, -68, 35, 133, -78, -156, -89, 80, 17, -68, -6, -90, 48, 60, -57, -27, 107, -131, 22, 179, -65, 63, -12, 53, -3, 12, 29, -139, -22, 52, -85, 57, 131, -83, -24, 46, 128, -86, -15, -17, 59, 33, -20, -123, -25, 13, 64, -30, 5, -96, -86, -86, -13, -55, 78, 39, 153, 35, -161, -6, 38, 51, 2, -145, -10, 75, -85, -23, 4, -69, 23, -114, -137, -62, 29, 91, -59, 44, -58, 44, 100, -1, 5, 185, 171, 108, 46, 91, 58, -2, 81, -52, -21, -1, -30, -19, -12, 83, 1, 114, -30, -229, -21, 14, -81, -107, 49, 49, -44, -51, 77, 52, -7, -39, 32, -60, 6, 14, -48, -31, 87, -83, -2, 191, 39, 136, -15, 12, -36, -108, -9, -59, -51, 35]
2676C5N9k2rN2j19m1J67k5m7r6j9K9K6o5N8N9j26k3J09l6LM4J9oNq1K5k7J15r4
2706c1K1pOJ2k6J5J06j85J42l8j5J61k07L3k2q5J01j5NJ26m2p6j32O5J90j64P0
2733HlK8L3l0q9N2mMr1Q1M6o4P8j1j4j70K71j15r2M7P4n3J77k27Q7n3J05M8j29
2762fL9m4q0K9P9n3J22q3r3Q9k81K84q4n4J83P1j53J36j29n5J31k7R9k06J62p6
2788@l1K1p1R7Kj8M1Nk29L30k14O9p8J12j0k7O5j23Q6mj59Q7L8r4L27j84j80J74
2816C2L5k2Pm0m8L8J31j03k2j9l2r1P6J12QOp0l3Q1Kr8P6l0o4P2nj0j8O5j26Q0
2847a0J18j07Q4J5j28M5p8J0K9l0K5M2J08j40m2N0l6J64j06n8j05J53J4K7r1R9
2873E2j01J18k3l2m6L9q2M2L6R2n2K4pj26N6k9O3L4j36o2J71J3j11k9M6N6r7O1
$$ y = [35, 94, 72, 63, 115, -4, -45, 122, 97, 50, -46, -65, -36, -10, -75, -17, 42, -84, -107, 2, -34, -31, 13, 32, 26, 31, -50, -25, -52, 63, -31, -10, -17, -11, 1, -25, -10, 96, -89, 53, 15, 0, 161, -46, -13, -35, -120, -19, -34, -29, 97, 55, -21, -153, -88, 102, -62, 8, 5, 33, 66, 36, -53, -1, -5, -1, -92, -11, 35, -29, 49, 38, 24, -146, 125, 10, -82, -35, 39, -14, 163, -64, 23, -30, 75, 123, -6, 33, -11, -91, -62, 17, -36, 86, 3, -90, -1, -282, 2, -82, -136, 47, 118, -35, 101, -28, -83, 48, 21, 120, -86, 76, 0, -31, -10, -81, 16, 18, 0, 41, 46, -183, 147, -67, 2, -76, 36, 26, -1, 64, -59, 27, 23, -136, -49, -11, -105, 222, 38, -142, 32, 67, 45, 52, 12, -36, 2, 133, 30, 8, -11, -43, -134, -58, 54, 62, 68, -2, -35, 46, 48, -50, 26, -4, -68, 4, -1, -11, -29, 36, -90, -10, 108, 1, 85, 100, -28, 17, -61, -51, -22, -52, -27, 15, 123, -17, -59, -9, -45, 119, 13, -45, -150, 3, 17, 44, -47, 52, -49, 69, 46, 14, -32, 7, -75, -33, 3, 95, 43, 67, 60, -66, -10, -39, 24, 58, -78, -140, 31, 44, -67, -96, -50, 6, -91, -30]
2901c0o2NJ45j35Q8p1N9P5p3q8K00o5j89J35n8R8N6Oj12j5O7k3l2J6o8Q6lj66
2929a54J93m1Q3Qj35J24o0m5J7o1p6L48k14%m7J7J09p1K9J4j06Q7m7N2P8rM2o9
2957F6j43J65m6Lj11J30q1J8M7jLL7q3q8K1o7J37N1k4L4q5M7R1j49R3r6J45j41
2985b7j4N2J8L4n1r9J95j04r7K23j63j04J05p3J24q0K6M6p4N4MP1M0j1j73J26
3011D8j05M0K9r3Q5K0N5r2L6M2j94K37j52J1J06o4L7l2k9J5Q2j33lnO4O6j39O2
3039fP5p5j49K21l4p8J15n1k4o0QO3K2j06J18PNj93K38j18P2q1m2P3j02N0j1m7
3067a10J11N8j83J86r7r2J07J63k63n5P5J18qn0J6M6J5j9J1n0l0J98p5o5n2j2
3093e7p3J43J9L5j4m0j15J07k5L4O3jj39J4M6J19p9j10o7J24J25k32J04nn2R4
$$ y = [-30, -92, -87, 58, -77, 11, -60, -1, 74, 1, -87, 113, 48, -141, -6, -64, 34, 90, 96, -16, -31, 36, 13, -19, -3, -71, 15, 12, -154, 39, -2, 81, 89, -46, 78, 18, -27, -10, -71, -147, 201, -13, -13, -60, -43, 66, -5, 24, 38, -68, 19, -28, 24, 102, 93, 135, 66, -77, 88, 42, 45, -66, 64, -17, 1, 48, 47, 50, 87, 4, -84, -63, -130, 7, 58, 34, 68, -17, 30, 121, -28, 65, -31, 114, -27, -41, 11, 29, 63, 12, -87, 108, 4, -93, 130, -33, -137, -32, -105, 19, -61, -35, 11, -63, -9, -5, 66, 106, 95, -78, 48, -57, -17, 12, -81, 4, 24, 79, -13, 23, 65, -129, 108, -44, -33, 73, 9, 46, 14, -15, 0, 82, -51, -54, -59, 5, 71, -68, -6, 69, -6, -155, 66, 32, -46, 69, 18, -6, -66, -58, 5, 27, -79, 39, 46, 51, -142, 96, -22, 50, -31, -73, 0, -102, -52, -63, -110, 1, 59, -124, 62, -35, -127, -20, 143, -120, -175, -100, 18, 10, -40, -24, 22, 37, 18, 29, -21, -51, 147, 72, 7, -45, -57, -130, 13, 32, 67, 53, 13, -102, 5, -20, 14, 77, 76, -63, -49, -3, 116, 37, -73, -140, -16, 109, -123, -19, -24, -76, 18]
3119A8l9K5n1j21J68L3o8J57r3J2j00Q3r3R8j8q5J32Jj25P8oo9J90j24m0nJ63
3146A21j20p5K2J10K0o8k4j85K77l5j21M0M0k7K41j59Q7k34N9K08j20j57K8P0
3170bO4j08l1jN0J51j56r8Q0R0j55J77j10o1Q1K0o1Q8J4n0K9l6p5K60k18J9qO7
3198B0M2o2O0j32Q1J86j48m8oL5l4M6j85R4M5O2j23p8J77k5MKr2j4J66j13J0r7
3226a27J25o6J07r5J3mO9j6NL8Oo0nn9o4J82jRN5j48RJ88k24N8N5O1j13r0J36
3255D4k9J0Lj39J49K8L4k39J24K1J18j35j05J23pL2p4m7J81q3J09j90M8L7P6J6
3281A05m8j08p7J94j35P9j28R7L4N1k0n7Rm6J10rr7Q5r8J03M7k7o2Po9K8k7J32
3309G3n7j80M2J27N8k3j35L4J27o2L7n3J7J8K8l4M8j31O5J07j39J70j23L6k5q5
$$ y = [18, -21, 4, -47, -168, 0, 33, -35, 122, 29, 41, -59, 24, -69, 29, 11, -74, 58, 59, -66, 12, 6, -63, 127, 3, -37, -42, 121, 1, -74, -52, 58, 78, 10, -14, -199, 78, 43, -78, -38, 2, -25, 216, 57, 144, -90, -31, 177, 57, -100, -72, -2, 62, -46, -77, -78, -28, 123, -33, -131, -51, 39, -116, 61, -49, -110, -29, -9, -70, 18, 32, -18, 11, -25, -100, 160, -58, -39, -47, 20, 62, 0, 60, -72, 9, 195, 47, -1, -7, 28, -6, 40, -145, -51, -6, 56, -67, -145, 32, 7, 11, 13, -79, -93, 73, -40, -30, -127, -2, -68, 39, -56, -43, -47, 22, 6, 11, 49, 55, -5, -10, -69, -133, 49, 48, 57, 112, -36, -27, 161, -63, -5, 50, 111, -2, -92, 44, 15, 25, 28, -111, 38, 66, 100, -139, -15, 6, 124, -11, -116, 7, 0, 32, -42, -89, 92, 9, 118, -72, -24, 13, 89, 105, 57, -51, -128, 66, -69, 10, -118, -21, 13, 64, 44, -13, -4, -50, 60, 51, -46, 39, -59, 44, 91, 64, 2, 9, -60, -32, -59, 73, 16, -164, -122, 5, 63, 40, -95, -61, 66, 4, 41, -12, 5, 23, 51, 17, 65, -66, -1, 106, -33, 137, 14, 50, 25, -60]
3335f0J87o6r7J17j36p1J60Kk6MJ08j31O9j1p2RN4o2N4M1j67J41m7k3L0K6k27
3362a94K30p0M0N0j17M6P5j02PQ6j63K31p2qM4n5N6q1j14rM0J23m5rK7J05j37
3389a6J71k01lL1N1O6l3p8J3j04J18L0J0l0j05Q2O9J05k72OK25j15j9k2k1Q1J0
3416D9J3l8K7j03j0J55n1j0p1m3k3N4M2NM0k06K17Q7j62LJ4k8j8J1j9K18j29p
3444A7j17J42lm5J9j19O6Q1q6Mn3J26N0Q7j74k7jj20K21j9j6n2P7K4o5j56J35
3471dMLL8M8J5j35J21j48jj5M1p8K4J13j05M9k8J76j22M8j26Q8l7n7J75K0j91
3498h4N3M2K2K9q0K4L8j09k8O4M8J03k05Q1R0j26KJ37q1Q2L2j37J39p5j0o2O4
3525E3n2l6J10n7J7q1J02Q3m3j31J50o1j36M3L9J25k47J38o7K15o8j61L6m4R1
$$ y = [-60, 127, 61, -36, 81, -55, -126, 34, 36, 10, 14, 122, -9, 60, 49, -23, -14, 40, -22, 32, 73, -94, 47, 0, -23, 7, 33, -194, 36, -34, 6, 56, -61, -15, 60, -42, -35, 51, -112, 119, 47, 39, 83, 28, 84, 3, -111, -120, -80, 43, -2, -11, 16, 121, -16, 155, -46, -49, -18, 33, 99, 66, -12, 1, -103, 15, 45, 55, 25, -80, 2, 71, 176, -96, -90, 135, 20, 1, -21, -42, 39, 49, 62, 24, 51, -52, -62, 93, 42, 32, -39, -82, -105, -51, -9, -4, 36, -170, 47, 134, -28, -25, -11, -39, -57, -46, -65, 153, 24, 17, -100, 42, 39, -6, 13, -106, -40, 41, -45, -41, -94, 32, 82, 169, -5, -32, -33, -153, 68, 49, 33, -19, 58, 82, 17, -139, -4, 0, 3, 41, 89, 104, -31, 90, -58, -59, -74, -33, -111, -87, 26, -79, -30, -58, 118, -4, 44, -82, 6, -31, -88, 87, 107, -84, -31, 11, 33, 62, -18, 6, 44, -65, -93, -29, 19, 122, -83, -2, 88, -38, -36, 101, 20, 102, 134, -3, 136, 61, 51, -11, 53, 1, -35, 75, 18, 35, -46, 56, 139, 96, -35, 115, 54, -82, -39, 0, 125, -122, 16, -51, 164, 96, -65, -29, -73, 18]
3550A8R5j12J40j11j2j96K03K3r8M0L3O3K0Q8j70p3j2J09k06K47j33O6j16O6m
3575c2L0N7r6L8K5Pl3lO5R3j44p3j8O9R4m3j86J39O5j10O7N7q1n5Q2m3M0%oO7
3605G2l2k8q0R5ML1j20j24J35J9M8j01P9Q3o4L1j04P9nm7J9K5J57k55JoP3J13
3633I8j9m8JPN2q0m0M5p3R0l2K3k8J40k1j59L1M0j25J41n3P3o8Lp9L7J12p5Q1
3662G4j58J49q7K0k7o3L15l36jJ53J02k83K49j20p6J44p8J08j25mK4m9L3R3j47
3687i0J46j4n8K0k9j2P9n3j15K53k19M9r0J5J86o5J56j87Q3q2J79j82J1K9j6j2
3713a8J14j41L3J55k06o8l1R2R0r9r5K55Kl6qj17j9J58K0L2j10M9p4J09q8j3j74
3740a88J61K8l0J61j03O7j43m4K25j17N2q5P8O2j48M3n1J68j25q6QkL4N3qOp1
$$ y = [18, 113, 1, 141, 30, 18, -178, 25, 48, -50, -10, 23, 86, 106, 194, 24, -49, -61, 48, -158, 89, -44, 22, -94, -28, -32, -2, 55, -41, -3, 22, 29, -4, -7, 58, 151, 7, -66, -84, -15, 79, 36, -150, -11, 54, -56, 11, 68, -13, -68, 14, -29, 11, 11, 5, 72, 40, 12, -68, 27, 31, 62, -58, -182, -47, -28, 20, -81, -2, 81, 17, 48, -56, 23, 18, -29, -10, 15, 172, -83, -82, -88, -15, 98, 79, 31, 32, 39, 91, 11, -29, 16, -57, 33, 1, 24, -4, 136, 115, -44, -13, 27, -98, 43, -10, 63, -5, -2, -81, -44, 68, -7, 74, -84, 65, -22, -2, -29, -92, 223, -113, -114, 39, 141, -142, 107, -13, -89, 55, -23, 85, -40, -44, -20, -69, -36, 57, -90, 56, 42, -16, 4, -25, -37, 42, -11, -126, 127, -92, -43, -133, -118, 68, 3, 159, -28, 55, -27, 152, -30, -19, 10, -6, -18, 96, -45, -12, 143, -63, -131, -162, -70, 20, -79, -174, 81, 83, 47, 39, -78, -97, 61, 81, 113, 3, 52, -22, 87, -1, -14, -188, -27, 1, -29, 132, 29, 96, -47, -91, 134, 17, 69, -16, 62, 124, -24, 19, -32, 136, 11, -75, -67, -69, -35, 18, 10, 16, -55]
3767e5J11Qj8nj03R3j5q2R8J59k24L7j6P8r0m9N7o1Q2o4R6n0q4J37p9O5K1p8J01
3796G0j03kj4J23p8j28J59R1j9j69J13M0j51N8O7K8j9q0N5n7J30n1j77J04L2m5
3822b3kl5J85n9k2p5P3k0n3O9J3j22J06r5R3j00K23q7j03J83o4l5l9n0p1j5Q0
3849d5P4m9K4K9O4j2n8MO6k18N4P5o6L1oK8q8K02J1j02j4P1j08PrR6j31m2K22
3878A10j58O4O2k3q1qLJ34j35K3N6l3K4j98O9P7J54j15Q7j54O7L2q2J82j68O4
3904E3k9OR0k52J27j08K2J15RJ7o5N5r9Q6k7k6K48k27N7J3p1L6p8j5J1NL3RJ33
3933A28r2l8J70j59m7Ln1N5MK5l7J29r0Jj08Q6N2r7J14j8m6j7M5l6J28p5L4o8
3961ekj55J32Jn1N4m6j26L63j72LJ21k06J33p5R4j12N5j05R6q6L6J65mn6n3N4
$$ y = [-55, 56, 64, 46, 41, -62, 31, 16, -66, 32, 191, -33, 4, -12, 66, -24, -73, -16, -77, 5, -59, 37, -13, -97, 40, -39, 26, 47, -31, 70, -33, -35, -49, 74, -4, -132, 27, 118, 99, -70, 43, 83, -68, -10, 57, 85, 66, -14, 41, -16, 114, 63, -114, -10, 22, -23, -25, -60, 125, 66, 44, -31, 42, 22, -31, 38, 51, -71, 35, -60, 33, -67, 156, 69, -34, 149, 85, 50, 11, -39, -110, -125, -45, 29, -20, 4, 33, 97, 85, 27, 31, 97, -121, -67, 8, -58, -27, -33, -5, -93, 109, 120, 18, 4, 75, -33, -26, -35, 61, -70, -112, 110, -48, 16, 78, 55, -26, -34, -31, 103, -32, -9, 47, 14, 38, -160, -91, -14, 140, 25, 112, -42, 25, 57, -25, 157, -11, 53, 24, 30, 120, -132, -5, -113, -91, 24, 33, 50, -15, 40, -59, 27, 0, -26, 222, -5, 52, 65, -6, 30, -48, -63, -52, -47, -14, -5, 128, 36, -2, 168, 9, -38, -35, -86, -31, -27, -2, -39, 90, 0, 1, -107, -21, 31, -66, 48, 30, -16, -33, 12, -24, 104, 29, 63, -5, -7, -162, -30, -29, -80, -26, -72, -198, 165, -7, -4, 117, -89, 44, -31, 63, -49, 6, -99, -3, -89, -53, 112, 108, 52, -1, 53]
3988E3km4J5j00J00o9JL8j3J09n9o5J04p4o3K8J3M5l4J14j18K21j97l4j7k5J22
4015D9n3o9RO3Q2j3j79P5J38k31J71Qj46J86r7p5nK4R4j34J19PK6l7N9p9K00j63
4043B9m9K2l3R8j52J71K9p6K2j28J42q8O3o9p6Q2J2PJ2M5k3J3j23O4j8Q4j8K4
4071F6j3j10M9l2J03n2q0P9j0Lj9J04O3p5q6N2J6n1K5KM0r1o0J49n0N1j89P9k1
4100e8m0Pk9J38O4j21l5Q8j7J09j39n6P3l0M8N6L3m4j25Q9L8q6L5l6o0J61n2r
4128BP9n6j91K70j43Q6k9m0o3M0L1L4R2j66K14j48l6O7j52J98k7r7J01k3K7k6
4154D4RQ5j26L2j97J43QLLpJ24j31Q4L8r1%j42J71M1p6l3M3R5j47J4J41j49l6
4182e7j3L3%n4J3M6J6L1l3J44j04l3q5J58j93Q9N8j0l4J03j32O1j17J64j2k1l1
$$ y = [53, 51, 7, 22, -78, 22, -47, -46, -8, -21, 88, 29, -36, 68, -6, -69, -41, -28, 17, -17, 97, -21, 200, 3, -31, -48, -73, 49, -4, -73, -64, -1, 81, 68, -111, -36, 102, -129, 42, 50, -96, 90, -7, -82, -87, -63, 31, -103, 16, 23, 49, 12, 71, -8, 192, 29, -20, 2, -31, 67, -85, 86, 115, 39, 61, -67, 75, -13, 50, -19, -95, -13, -1, 6, 18, 63, 40, 53, -70, -6, -24, 60, 42, 66, 53, -57, -8, -40, 63, 11, -69, 10, 0, 3, -16, 88, 151, 76, -10, 42, 58, 7, 32, 34, 74, -17, -77, 72, 22, 73, -116, -37, -58, -98, -91, -120, 18, 82, -39, -74, 14, -3, 106, -33, -89, -16, -46, 2, 58, 91, 47, -78, 11, 49, -37, -2, -38, -98, 63, 11, 2, 81, 25, -166, 104, -39, 47, 18, -22, -85, -45, -14, 20, 112, -54, 160, 12, -24, 43, -109, 89, 62, -35, 66, 43, 70, 44, 53, 138, 12, 44, -153, -10, -2, 1, 4, -3, 121, -10, 74, 112, 21, 21, -121, 50, 91, 15, -18, 25, 120, -27, -13, 128, -21, -57, -70, -37, -37, -91, -78, -32, -16, 15, -18, 126, 22, -11, -96, 62, -131, -42, 16, 6, -28, 75, -57, 4, -113, 51, 39, 18, -13]
4209a3j98K54j65L01k60R2n9J07k52J86J4j14J69N8j50R6r7P7k0J4oK1j26N3m0
4234e8N6R8n6k6j3J20j46J24j54P0R2j24j5L1N2m1m6K2K4J01p8j37J75l4m4j97
4260b04J10O4j8K3Mkl2N2o1J26k6L0r0K9J56k17K2L7L9l3o4K7J25N9k44K8J37
4287G7p2J8o2Jl8K3oP3J13j1k18M3L5J67j76O2j7J10j18j39J83o7J02j03J05j77
4313i2R0J2L1O0l9kj0l9o4L4k5K3J0RR8j11J02r4L4J8j41K6J54j2q5N7j38P7R7
4342H0j76J30K4j58J13m8N0J8J2j01J36r2ol5J20l9n7R0l1k1o1J17j08L0P4k2
4368C9j23q7J96m3L7q7K8J2k1Q7l3L3PL8j00q6N9K0l4N8k6M0j7O5j88J47N3%n7
4397A7m6M6n5O6j43R1j13O5J68p9QK7R2j51O4K1j11N6%J39j70r5J09J46n0j85
$$ y = [-13, -211, 43, -122, 179, -81, 11, -48, 59, -193, -7, 7, -107, 62, 120, -30, 66, -31, 46, 26, 40, 34, 55, -71, -18, -58, -2, 96, 40, 14, 1, 121, -25, 99, -55, 15, 107, -17, -32, -1, 51, 10, -36, -14, 10, 111, 33, -104, 71, 37, -7, -204, -94, -30, -48, -25, -21, -23, -55, -3, -64, 62, 36, 66, -24, 5, 161, -56, -34, 3, 42, 9, -55, -28, 97, 156, -88, -60, 77, 5, 23, -39, -38, -76, -53, -59, 14, 127, 116, -102, -59, -24, 143, -33, 29, 12, 122, 4, -135, 48, -19, 83, -20, 85, -92, -2, 10, 41, 101, 62, 60, 50, 11, -53, -19, -44, -21, -11, -2, 96, -15, 87, -7, 27, 45, -96, -70, 84, 72, -13, 44, -94, -17, 80, -96, 34, 58, -100, 13, -35, 15, 33, 45, -56, 80, -12, -18, -53, 67, 28, -29, 61, 30, 9, -52, 65, -43, -13, 61, 39, -84, -171, 25, -18, 19, -68, -40, -28, -49, 38, 5, 38, 45, 83, -17, -103, -44, -24, -58, 0, -26, 14, -3, 62, -126, 21, 74, 74, 17, -29, 17, -38, 28, -115, -24, -137, -72, 96, 17, 25, 52, 144, -7, 57, 78, -33, 23, 23, 162, -8, -103, 6, 152, 102, -83]
4423h3J84o7j24J17K3q7n9J48n3j3p2N2J21j16j1Q6n4J00jo2Mm7R5r1lO8j74J45
4451B6l3N1K7Mj00Q0p8R3q9jK1j56J22R4jn1kM6j45R2RN3q2J3J4l5J76j41k5j3
4481c1J8j33J22N2L4l0J3r2L3K7l5K5j1l1K12j52l0J6N3j40L5k9J67j96P2MJ35
4508A08j90J59n1q6Mj20R5Q7r4p1J90J1l0j65K38m9Qjj33J33%K5j27J70j26l4
4534d9K9O6lm4N1Kj40J08O0n7K0m1L1k9J2k5M0l8p4R5o8kJ44j51R0O0j55K58j80
4563A0O6n8j05O7j34J44J08m2J1J3n7l5K2J06m0j10k1J65n7o7%K6n2J20j66K7
4589e9K5J02m0P7m9k5k0qo5K09j67qk1o6J22m3Qm4Q1O2j52J72l1l5%j0N7o0j20
4618a08M0j2O3KQ5n2o2j0j29K05M0j30J48j05j5J54n2m7j1N6j02N6k11K46p1M1
$$ y = [-83, 101, 34, -90, 27, 50, -37, -96, 52, -1, -14, -86, -34, 87, -29, -40, 46, -8, 92, 91, 29, 33, -14, 81, -10, -13, 55, -119, 26, -7, 44, 71, 75, -25, 55, -23, 70, -19, -20, 1, -155, -33, 61, 60, 9, 7, 53, -92, 0, 9, 62, -20, -7, 7, -28, 148, 7, -18, -31, -13, -146, -24, 28, 62, 32, 45, -47, -14, 13, -22, 3, -8, -39, 173, 21, -9, 7, 60, -80, -45, -74, 93, -103, -31, -27, 108, -82, 77, 26, -60, -56, -176, -81, 6, -88, -159, 31, 42, 12, -153, 85, 36, 44, 43, -90, 43, 43, 68, -59, 111, -15, -49, -20, 46, 43, -1, 50, 52, -88, 20, 80, 23, 43, 2, 33, 4, 16, -9, 31, -7, -81, 14, -54, -56, 88, -63, 27, 87, -68, 190, 10, 76, 18, -87, -20, -154, -10, 98, 56, 67, 80, 23, -12, 10, 116, 76, -34, -55, 110, 53, -14, -14, 12, -40, 80, -86, -59, -34, 68, 28, 105, 56, 31, 11, 3, -62, 147, -20, -28, -49, -115, 7, -36, -28, -72, 9, 71, -81, 91, 60, 25, 25, 15, 72, 12, -108, -68, -80, -17, -15, 70, 18, -44, -54, -183, 22, 62, -68, 80, -25, -40, 114, 62, 15, 4, 60, -42, 14, -197, 49, -22, 19]
4644A9J6j21J30k5L5j33J9m7M7K0JP1R4j41j2J41p1j23K19kj01O2r2k6m8q3K13
4671F2oj67m3K9J65O5j89J57r3N0l8Q3j32N9O1q2J47j48kK7LP8n4O4p1j4k1m8
4699e8J55r6k3j5J08Kr9M2J2m4r2M1K05j02q7Q1k5P7m2K2n7J8o5J19J1n6J1J3
4727E6k7J07j34Qk0O2K0k2p1JR5ML1k1o0K0q4P7R8q0L6n2K0q1mP6n3m6J50j57
4757e1J06j22K2j39J47qJ23k0oO0j73M5J23j16N8K4k25R6j8J12j54J00P6l4r6
4782g0O7j63J70j09J55o4J42j16m8l7J68q2l6J46p3j15J38r4J32k06NJ84o1k1
4806A2rp3P5o2J16P9j39J09k21K54q0n4LJ3j2K5j8%O3p3N6k00J00J20m9o5J25
4833I5j7j68pJ06J8m0J4j03O7k7J6J43j28p5K75n5j40l7L5l2J69j60L1Nk7L4K
$$ y = [19, 35, -86, 44, 19, 54, -79, -60, -107, -60, -40, -39, 32, 126, -15, -27, 114, 43, -80, 139, 137, 36, 98, 6, -20, -68, -151, 62, 56, -111, -154, -125, 40, 105, -84, 73, -20, 30, -8, 75, -57, 2, 63, -19, 128, -20, -22, 5, 8, 86, 32, 96, 25, 11, -10, -58, 97, 1, -22, -37, 71, 73, -26, 16, 28, -16, -108, -67, 138, 36, -51, 30, 5, 82, 40, 62, 5, 23, -42, 77, 88, 32, 43, 56, 29, 136, 2, 10, -10, 52, 72, 50, -21, -20, 75, 79, 110, 89, 29, 49, -35, 42, 140, 60, 96, 44, 64, -17, -21, 55, 2, -44, 106, -51, 55, -67, -45, -184, -37, -45, 78, 58, 52, 112, -61, -16, 107, -9, 49, 73, -152, -56, -74, 38, -116, -16, 60, 26, -70, -3, -166, 4, -105, 50, -14, 128, 12, -36, -73, 95, 13, -23, 123, 50, -65, 73, -21, 111, -95, -90, 94, 33, 12, 3, -70, 5, -57, 59, 138, -1, 108, -113, 141, 61, 7, 10, 23, 11, 36, 18, 18, 81, 8, 64, -136, -36, 84, 35, -30, 95, 78, -90, -97, 9, 27, -13, 1, -102, -35, -62, -46, 97, -31, -106, 169, 114, -26, -63, -28, -60, 109, -51, -20, -15, -42, -8, -6]
4860fO5j60O1J7m5R6K0j43J20j42K56k91J52k9q2J25J06jj67M9m3J02Rl9Pj12
4886g5P4Q2o5J3j35J69q5r3J44m9Q5j47L5l1P1q1O9J09K2j42P7q8k2K05q3n0p1
4913f2P5m3J5P3p3KPN5nm0L7K1n4N5j62J29k0P4o4O6j23M1r7Q3Q6j46P5k6P4j04
4943e1K1M6R4j25pO3j01N2K7j18P3O9n0l6K9j8j9R5L7o9K0p9j0L5Q4L7j35K01
4971A65m1l5j8j29O9k8R8j54Q1j20J15j1QJ56j99Q7L6j38oO3J03q3q2Q1q4L1M8
4998A3m9l2M9k5J56j64JR8k2J0l3P6m3o9P4p0L3k9R0r1N1m5N5q2Lj1k0R2K4l8
5028Bo2J09j08J20j04k4O6l0J23n8qoj26Nl3J27M0j05J31j35R8J2n5O3j11M7N3
5055C1j5om4l2R3P8j87j7J10N8q8r8J24L9j46J51qj6p8O6J9lL3j37J4R9L8j31
$$ y = [-6, 59, -101, -40, -23, -68, 28, 48, -95, 25, -117, 139, -152, 0, -29, -111, 14, 120, 119, -48, 1, -42, 60, 69, 30, 37, -75, -1, 81, 16, 29, -106, 63, -22, -115, 29, -20, 65, -82, -47, -78, -7, -88, -19, 90, 112, -30, 47, -41, -63, 142, 59, 9, -62, 13, -30, -15, 58, -15, -13, -6, 49, 44, 4, 41, 62, 8, 63, -99, 30, 10, 84, 20, 86, -37, 4, -93, -10, 76, -70, 5, -21, 53, -51, -30, 16, 110, -15, -22, 41, -60, -8, 19, -99, -26, 43, -7, -43, -14, -32, -51, 44, 81, 12, 32, -47, -57, -22, 62, 99, -36, 165, 124, 89, 71, -58, 11, -17, 81, -73, 8, -112, 3, -8, 0, 156, -43, 44, 80, -58, -64, -1, 102, 19, -63, 18, -66, -35, 13, -36, -68, -19, -44, 112, -52, -51, 47, 25, 35, 2, 78, 35, -34, 40, -30, 3, -26, 64, -27, 24, -21, 34, -48, -45, -56, -76, 16, 40, 2, -60, 49, -59, 61, -43, -67, -1, -31, 92, 34, 26, 20, -106, -101, -134, -7, 33, -72, 59, -76, 22, 34, -21, 42, -69, -22, 31, 16, 10, -34, -66, 27, 105, -82, -99, 11, 69, -19, -117, 7, 46, -100, 51, 43, 27, -51, 15, 34, 31, 64, -73, -59, 40, 78, -53]
5083e3J18P6k28J29q2L3J44q5k8L1l0M3o4q3J14m7L2L1m2oJ9N7o2l3l5K7l9K3
5111d0j0L0jk7l7J33q0J52l2j02pm6J29j62P6K3j9M4j41Q0p3R0J7K2k0m5K05k10
5139e1O8m1o3M5kL4qJ6m6Q0j76K07q7p2P4J41n0p8m2Oj2MR7J6k5L1k9p8J58j46
5169b9r4O3M6j22L8J35n0K0q3K04j81o2J59n3J15l6j26kJ47p5J7k02K01m7R0J4
5195H7r5j1R1p3m6k5R6N0j01Nl8M5K7NJ8o9L4k3rP2j45M3R8j09o2J6J72L2q1o
5225bK1M8k11k2J68P3l5j12K4p7K60j05Pm0k6O7Lm8Kj1M7N9j36J78k63J13j74
5252a92J92N3n1O9q4j02J02N8pK4j34J22j08lP6j8L8o6Q5j84K41m2j05QJ76j58
5278a0L1P5Mk44J23q9J35J74j80K6J2j04J13j05K1N1n9J26o4O2k24R1qm4J43%
$$ y = [-53, 65, 141, -87, 42, -40, -7, 137, 52, 24, 55, 25, 68, 4, -79, 35, -12, 20, 51, 9, 3, 22, 79, 17, -16, -51, -24, -63, -40, -50, -20, -21, -48, -85, 48, -32, 120, 88, -14, -21, -67, 62, -100, -24, -1, -20, 24, -117, -37, -110, -20, -3, 19, -1, -46, 159, -51, 17, -24, -87, -42, -44, -10, -18, -2, -48, 32, -144, 63, -24, -96, -22, 119, 69, -9, -51, -45, -57, -53, 44, 60, 35, 66, 37, -41, 117, -29, -123, -60, -14, -136, -98, 37, -13, 7, -76, 128, -53, -115, 44, -9, 106, 70, -56, -58, 89, 14, 31, -171, 30, -17, 73, 87, -8, -19, 72, -1, -47, -72, 24, 74, -27, -22, -60, -15, 12, 17, 35, -34, 0, -23, -32, 40, -105, -62, 36, -73, -135, -119, 53, 85, 4, -2, 19, 67, -144, -166, 2, 75, 40, -72, -48, -125, 135, 30, 37, -3, -29, 38, 41, -7, -5, -16, 31, 90, -46, 132, -131, -18, -192, 0, 53, 2, 71, -13, -115, -13, 45, 38, 62, -72, 50, -58, -61, 15, -3, 35, -31, 54, -130, 111, 69, -36, -28, 148, -10, 21, 96, 100, -144, -21, -110, 25, 199, 19, 45, 57, -47, 66, -39, -18, 33, -26, 100, 36, 98, -126, -35, -43, -87, 56, 56]
5304E6l2K0R6ol01K12J09k39N0J29p7j99J41j04J02J00j35L8n4J75j2j8mr2NJ05
5330F5OPj06p0J55L2l8j79n4J31Q2j34J25j4j32J73m7Q1j71J71l4K7j04k4p6L2
5356i6J97o2Nl4m8k0J6L5p9J33R1k28R8j20k5K41q1k3N7j29J81j34K7J29j00m9
5382a8L2m9NN6l3k4R5q4k4M7j7R1pn2ko3k1J17m4N6L5j23J7Q7m9L5L1j24J05o7
5412Hj9j19J88o3J5j8rQ6n5r5J07j9m8q7K79j82o1R4m2N3J2k3p4J3L6O1m5L6J22
5441A51j53r9K00j25RJ30j20J18j43OO1p4r0J54k6j67J87R0j89J1K54k10L4Qk0
5466co2J32q9P6Q1j45j1k5L3J0O7q4N9l8Lpp3J08m2j14K61j22jm5n0J20j11J31
5494E9n9N7r6P9r9j1m9J55J08j06p4Qj6o2K05k14L5K11j70N6O3k06KQ4O7j45J54
$$ y = [56, 24, 44, 140, 134, -167, 45, 154, -85, -35, 94, 17, -182, -41, -145, -43, 57, -78, -40, -94, 81, 69, 51, 47, -45, -40, 65, 71, 78, -28, -98, 57, 89, 51, -128, -182, -51, 31, -103, 22, 8, -124, 49, 2, 83, -88, 83, 49, 76, -28, -52, -128, -96, 101, 39, 44, 10, -38, -58, -42, -7, -86, 47, 138, -90, 8, -112, -137, 104, 23, 0, 57, -72, 109, -25, 2, 131, 31, -18, 14, -35, -30, 26, -7, -31, 64, -20, -44, 3, -14, 77, 70, 18, 16, -47, -68, 49, 5, 61, 96, -27, -10, 77, 28, 63, 94, -30, 75, 8, -11, -130, 58, -5, 10, -8, -17, 69, 14, -81, 26, 7, -41, -128, 151, -31, -92, 2, -40, 13, 25, 2, -72, -59, -23, 38, -7, 29, 151, -2, -101, 99, -26, -17, 113, -7, 111, -32, -26, 35, -39, -129, 25, -1, -168, 19, 109, -80, -69, 185, -25, 9, 17, -3, -65, 67, -22, 54, 135, -10, -21, -46, -13, -3, 64, -20, 39, 1, 4, -3, -76, 32, -10, -124, 137, 15, 14, -31, -81, 39, -72, 59, 0, 57, -39, 40, -59, -70, -119, 36, 144, 38, -36, -28, -44, -106, 99, -115, -80, 131, -39, 17, 80, -126, -124, -40, 27, -118, 36]
5521C6M7k90K37j40P7P1mj52J62K8l4J10k30J39Lr6L4qM9m3k8kJ17j11k8kK3N2
5549A7j5j12Q4n1Q7J7j19J60k4m8Qk1M7L4o1K5m7j3J24j26R2ql7M0K1lj28J0o9
5578a16mJ33o3K3k2L0K4M4k4mJ5K8lj13J67k65K04o9o9J62j3k42J76r2M3J22r1
5605a9r2kJ92O8j43r9J43j15l1J69k4N1p4r2O2OM7j74o8J7J60j1%P1k6O7K1j34
5633c0K5P0o7q8O8o6N2J54r4J1Q0j44N0N7j22N5q9J98n8p3k3j3J9n0J18n0L3l7
5661a4l5N2L4jj32J47nl0M7j41lL1qO4M1n2M2Mn0Q2J2k35J99j7K3m5R4j60Q9P4
5691A07l2j07j2pNjJ3R2p0L5l0N9j09J37m7n9n9Q0O8Lj79J30j41J36K4j8j23J31
5719B6K8j16J21j06L2j46Q3J59r9M3P2j3j53o4K10k4p2O7q4p3Q5P5j09L6l5J8
$$ y = [36, 83, -207, 30, -110, -33, 38, 34, -118, 44, 72, 38, 148, -82, 57, 60, -36, -2, -10, 39, -4, -32, -34, 83, -28, -56, -58, -35, 17, 2, -110, -26, -77, 10, 27, -92, 68, 44, -4, 4, -17, 30, 64, 3, 28, -19, -32, 92, -34, 58, 50, 13, 53, 74, 71, -57, -47, -116, -120, 13, -50, -27, -49, -19, 5, 49, 25, 21, 36, 64, 61, -52, 115, -150, 54, -15, -84, 78, 65, -177, -1, -93, -50, 72, -19, -111, -113, 79, 147, 4, -95, 48, -67, -98, 71, 47, 98, 24, -68, -6, 0, 47, -127, -195, -178, -18, -29, -29, 42, 16, 83, 104, -30, -5, 65, -2, -90, -22, -88, -36, 118, 24, 35, 115, -29, 21, 78, -44, 11, -78, 120, 62, -11, -34, -47, -28, -78, 40, -10, 23, -14, -49, 3, 37, 36, -96, 51, 46, 16, 63, -78, -81, -50, -58, 6, 47, -5, 37, 41, -9, 73, 85, -150, 49, 32, 55, 10, 104, -56, 33, 107, 75, -32, -44, -51, -46, -47, -34, 58, -12, 23, -7, 52, -57, 80, 33, -26, -85, -5, 63, 66, -113, 17, -124, 12, 36, 18, -105, 26, 54, -62, 59, -47, -15, -161, -78, 81, -18, 25, 97, 84, -69, -133, 77, 53, -19, 48, -36, -109, -24, 51, -58, -22, -57, -39]
5745c9Q4k3m4m3K0J30o4J2Q4q3j18N7J3m9qO7RN9r2M1n6j08J38k5N5m2J29j40
5773c6Q2p1Kj79Q5J60j30K62k25j7R7p3k6P4l4klJ14o7j8N2nl6l3PO1K1o2o9Q
5803f1J18m2J36k31O5rJJ14j12qL2m0N4n9N8N0r5N1j23Q4k0k7J80j30L9n5J25
5830I5o0j33J59R4j64Q4n1m4N7k31J14R0j48J63qr2J34k8l1M7n8lq0M4QP0p7J15
5858F6q8O0l9k5J18k00J99n2n9P8l9P3j07O6o3K8n1J17j30O6m6Q3k0j7N3j65K14
5885A20j98R2m7J26j20N2k1P1j9q8K4n3k0J13m5O9J1p5pL9J27k03O9j1Q4n4Q8
5912A24k6l5j55L7J58j90K40j96n2N5Q5j2n5n5OJ3n0J33j24J2o5J82j24J26J5
5937D7q0J09Jn0n8K5J17rk15J21J4L9m4KJ2p5j09M9O9R1l2o0P1K6j46K3M0k3o8
$$ y = [-39, 45, 22, -22, -65, -45, 85, 21, 33, 117, 34, -84, -27, -14, -63, -71, -4, 5, 64, -28, 13, -43, -151, -13, -38, 17, -25, 104, -36, 46, -25, -23, -202, -117, 43, -87, 175, -50, -67, 30, -43, -69, 5, -29, -31, -34, 80, 13, -5, 47, 42, 6, -27, -20, 41, 62, 0, -69, -61, 57, 15, 151, -80, -15, -24, -23, 91, -21, -29, 3, -37, 17, -42, 16, 66, -29, 22, -101, -17, -37, -64, 116, -14, 25, -30, 95, 35, -98, 61, 155, -9, 75, 24, -20, 37, -194, -80, 10, -138, 25, 17, -75, 59, 31, 0, 47, -11, -14, -94, -50, -42, 28, -49, 66, -22, 38, -1, -26, 92, -108, 91, 39, -20, 58, 19, 92, -15, 51, -12, 16, -35, 82, -48, 18, -28, 55, 35, 18, 71, -94, 120, -78, 14, -33, 93, -27, 25, 4, 75, 56, -32, -8, -61, -81, 32, -13, 56, 67, -8, -15, 24, 151, -52, 17, 6, 90, 36, 124, 98, 63, -92, -55, 103, -87, 153, -43, -95, -40, 45, 33, -22, -77, -71, -58, -108, 25, -99, -87, -152, 30, -94, 32, 47, -33, 76, 77, 27, -31, -6, 111, 102, -113, 8, 22, 61, 17, 19, 31, -44, -153, -104, -35, 56, 24, -36, 35, 61, -85, -62, -22, -45, -113]
5966a13M1M0Q6OK4j34n9J10N3oj63J24k4N9j3l4J6mj63J31n0MM6M1M4Lj1n7n6
5995e9Q0n6J24J1j34K0J01o4j84K34j46K66o3k07J85j80q8J73R0p1M6l8n1o3J75
6020A01q5j12Q5L9j9J48j65l9POj2N3K6o0R9r7OP0j24N7ML3r7J17k8Lq7J28n5
6049Bk7Q7j03L5P9j03Q4M3l3j38Q2kJ04j32o5J2p2K49p0J5o0K6K0RPL2p3Rp6J01
6079D2k5j68J97j32J96j52o8R3O5p0Q7m7j6K3n8P1O3j58J30o8o3M7p9K8J3J8j1
6106d2R8j70O9L6L7p0j1J22m0r7J23o9k6N0M8or1q8L0M1L4%pn9L9j4O7q4M3qN9
6137A4l6N1M5q0J68k71O1P4p9J65o3p9k3R8m8k0r2J01n0P7j06O1J33j33M6l1m5
6164f2K4J22r1m5L6j2p2%N2J10o2O8m8r8M8rq6J44P4r4Lr7J37j11J43p0m4J08
$$ y = [-113, -72, -32, 54, 60, 84, -50, -109, 1, 54, 48, -115, 9, -15, 44, 31, -3, 13, 9, -154, -23, -73, -69, -23, 18, 62, 65, 54, -3, -59, 21, -35, 89, 100, -34, -14, 87, 23, -161, 73, -73, 193, 130, -77, 108, -72, -160, 13, 103, 32, 78, 40, -11, -74, 101, 16, -96, -11, 28, 9, 157, -8, -47, -40, -34, -46, 7, 33, -27, 72, -25, -19, 51, -73, -16, -12, 21, -76, 41, 13, 16, -71, 57, 2, -25, 62, -41, -6, 73, -30, 54, 97, 64, -74, 8, 6, 110, -22, -87, -75, -147, 102, 32, 47, -13, 13, 33, 42, 49, 81, 8, 17, -59, 42, 17, -151, 46, -86, 110, -42, -110, -17, 48, -22, 65, 18, 2, 25, -33, 38, 101, -57, 73, 5, -58, -11, -90, -62, -49, -31, -42, 56, -114, -45, -9, 28, -42, -53, 69, 29, -68, 55, -14, -40, 10, 58, 52, -39, -127, -97, -56, -22, -22, -29, -88, -49, -63, 4, -80, -37, -45, 14, -22, 29, 74, -6, 162, -109, -48, 26, -53, 112, 49, -30, -53, 45, -3, -23, -115, -14, -64, 13, -93, -32, 101, -32, 14, -17, -62, -38, 84, -7, -52, -16, -28, -100, -100, -48, 62, 0, 68, 20, -78, -30, -39, -125, 19, 93, -1, 2, -95, 42, -69, 74, 4, -40, 68]
6192F8o7N8P7j25o6PK2o5Q3Jn4P6J62j97O6r5o3%J22J8R6n8n4p9J06k7q2J69k16
6221a17K09k11K8J11Q7j63k8M0R8P7k24j9N3R0m3M1l5k9n5N1R8r3l6N9J2N2l9
6248A4J1J7k9l2J33j67M1M4p0O6j63J44J6J09j08N7j91J25K0%l9R1o2M9N0j75
6274d9J14p1Jj01P6J60J0j54P0K7O0j47n3O3P3j2L5j5k03K39j63o9K30r2o0l2
6300f3k8J32m5l0Q8r6nM8J39k80J81o9M3J39j07l8p9N5K2n8lp9K09o5j7l4J30
6327I0r2J06j27p3J9J12L3j56J53q5j03J05J01j25L1J04j11J39j09N9m1J9r4J18
6351G3j48O9L0N4n6N5p8jpk1k4j11J05O8m4L3ln3R4l5QM1q3O8p0J7Mj38R9Q2k8
6382@M6KOLj51J78r0nM3j2Q3o9LJ5L4Rl3j74N7M9J00j59J02j35J23pK3p5k7M4
$$ y = [68, 1, 59, 136, 11, -55, -48, -26, -91, -8, -7, -61, 15, 177, -20, 46, -49, -112, -112, 10, 28, 124, 66, 12, -67, 39, 12, -70, 99, -117, 92, -119, -91, 20, 107, -56, -84, -44, 54, 131, -93, -112, -59, 31, -12, 29, -6, -35, -90, -39, 59, -34, -70, -11, 1, 53, 14, 25, 42, 13, -19, 114, -53, -12, 32, -38, 28, -135, 9, 25, 134, 26, 83, -108, 17, 37, 37, -2, 89, 27, 76, 126, -49, 65, -6, -5, -106, -30, 130, 140, -14, 56, 83, 143, -4, -57, 6, 79, 67, 102, 87, -116, 123, -40, -109, 121, 29, -31, -63, -91, 41, -4, -34, 54, -42, -47, 1, 140, -140, 41, -28, 15, 154, 47, 9, -70, -15, 7, -51, -54, -133, 76, 11, -6, -40, 90, -2, 104, -23, -96, -77, 35, 68, -88, 65, -20, -123, -18, 83, -42, -11, 93, -18, 121, 12, 71, 30, 49, -45, 73, -75, -6, 24, 78, 22, 77, -1, -2, -9, -30, -54, -165, -60, 8, -36, -3, -6, -59, 35, 0, 8, 49, -34, 34, -36, -19, -15, -153, -54, 28, 0, 46, 48, 54, 57, -94, 84, -6, -11, 32, 20, 103, 34, 37, 52, 86, 95, 62, -112, -55, -6, 94, -65, 37, -98, 25, 18, 41, -34, -61, -17]
6412a7m7O1j0j8L8npk7L3Q6p4K7o5O6r9M5k9J06j12j5K9O5r3j5L01j82j14O9J
6441bK9R3k81J74m6O1m6J01q1r5J39J05j80L0jl7L2K4j64J63J08k44Q3J23j36
6466d8K8Q3k02J66N3j71N7P8j03M0P6l1j2p9Q4R0j50rJ17o1j3p5k0P2Q2M0j59
6493f7J4J4J01o4j14J24mKR7j65N8k8K6n3J57l6j6L5j26O5m0J18l6j12P8j13n
6520i0P0J62k73K5J90j29N8r3J37r2r5O9P9N5kq3J7K0K1K30j86l2j04j3J13l2
6546B2k8K7PK1q3J75j38O6j44Qo4K0J17k2MR4j16J46j39j14M9N1M5R0j62l3P0
6573c1j2O5P1l3M6j60J10j05M9Rm0J44j61J06j15m9J50L0n2Q1j26j6M4J2r3J23
6599D7K2o3k0J9o4RJ8Q2l6oN6k1o2R1JN9j27P8r2O3k2O3m6m0m0p%j8M7Q6j28r
$$ y = [-17, -64, -3, -13, -31, 7, 2, -5, -32, 1, 87, 13, 40, -25, 41, -58, -13, -42, 64, -48, -63, -34, 31, -62, -77, 224, 42, -72, -3, -2, 27, 120, -161, 13, -33, 28, -18, 83, 2, -93, 46, 151, -29, 1, 0, -37, -5, 19, -145, 18, 126, -118, -35, 88, -48, -20, 63, -139, 27, 80, -91, -34, 44, -59, -19, 57, 26, 14, -65, 19, 109, -41, -50, 67, 6, -7, -82, -102, -30, 52, 92, -67, -53, -39, 62, -2, -116, 8, 4, 6, 103, -62, -4, -32, -6, -59, 98, 62, 46, 81, -45, 20, -20, 98, 62, -50, 28, -85, -90, -20, 142, -131, -106, 84, -45, 13, -80, 57, -35, -130, -61, 18, 73, 71, -12, 5, 25, 46, 276, 90, 58, -46, -59, 54, 22, -6, 21, 28, 49, -34, 141, 3, 69, -75, -67, -131, -111, 6, -16, -12, 82, -34, 112, -27, -141, -92, -41, 4, 94, -68, -101, -31, -43, 22, 93, 60, 106, -54, 56, -49, 0, 9, -31, 113, -48, 58, -57, -106, 44, 74, 22, 103, -23, -39, 5, 17, -76, 47, 69, 6, -14, 5, -59, -50, -32, 50, 14, 8, 64, 43, -19, 72, 73, 132, 5, 83, -9, 54, 32, 95, 49, 9, -31, -38, -38, -56, -9, 77, -51, -60]
6631f0Q4K0R9r4j41J5K01j75J30j71J30J9j33P2p0K35j77QK7n8j1Q2n8P4j24J11
6657C5l4N9p4N5q3K13j17N6j87JM4J04l3Kj23L2rN4L5j14J3J07J5m5K0m5J48j85
6685e6J46r6j0k5J56j51J5m5R6Oj04P5QJo9R4K4j9j74J27N0K4J1o6j5Pm0o1J09
6714A8o0J32o2n3P1m3N0j81J57p0J43j08K3j0%R9m8j01J4J00l5q1O7j08K9J18
6740F1j6RJ7j43K7J0Q2j0M8j01n6m2J36P8o6l1m3J53j16j8N6j20p3M1J50j20K2
6767f5L6L6O5p2P7j53L7M4p2J19qj23O9jO9p9J7L2L1p9N2M6j55J79K8k1j37N0
6795B2Q3Qjm9n8K6p0L8R3j41L7N5Q2j69RJ00J19k32O2j06n4J58qJ7l1j6N6J30
6823A60k13M3O5n2K2j74J94l2m3O0j7J0o2q4J91l3L3j14J08q6O2j66PJ12R0j9
$$ y = [-60, 24, 44, 143, 49, -92, -77, 124, -51, 79, -92, 38, 57, -76, -4, -74, 161, -16, -8, 19, -39, -50, 32, -26, 48, -76, 35, 1, 60, -14, 41, -42, 171, 54, 110, -77, -76, -32, 72, 39, 41, -82, -50, -59, -5, 30, -84, -71, 36, 51, 6, 26, -19, 129, -56, 90, -6, -16, -41, 115, -36, -21, -66, 30, 36, -68, 7, 15, 16, -53, 41, 65, 46, -128, -1, 49, 73, 84, 18, 3, 10, -30, -91, 18, -42, 90, 28, -25, 46, 3, 53, -128, 29, -41, 102, -6, 17, 7, 7, 106, 58, -43, -29, 71, 36, -45, 22, -86, -57, 61, 45, 54, 71, -72, -45, -35, 47, 37, 85, -16, -72, -114, 22, 100, 34, 3, -40, 113, -3, -21, 35, -85, -158, -117, 33, -87, -65, -29, 7, 72, 0, 77, -76, -39, 5, -67, 52, 44, -79, -10, -11, 58, -21, -4, 28, 59, -20, 32, 78, -77, 102, 130, 109, -28, 22, 105, 113, 112, 63, 5, 31, -39, -1, 92, -49, -12, 43, 125, -44, -35, 65, 184, -48, 14, -92, -146, 12, 4, 21, -10, -26, 30, 160, -53, -10, 55, 3, 25, -149, 45, 13, -30, 30, 13, 23, -39, -123, 68, 35, 68, -46, 62, -24, 38, -128, -121, -9, 81, 62]
6849F2P6n0j24P8J7k3k5J07j78J11j58m1J32N7j39K28l9n0k4k6r4Q6rQ0r4q5J26
6876AJ5n0O1j04mJ32N4j17PQR0j27J03j42J04PJ6L8j35L4o7Q0k9o2qR9J46j95
6904d5P0j59J20l4O4l1k32L09j03j7Q2n1O2j40n6J05Rn9k3J83J9j44K7P7j16J88
6930A05lj12N2J9j39Q7k5NJ7p0o8O5O5K1pN4J05j80kK5J25k27rQ8n5K6J09j33
6958f2Q9n6r3K45j16R4p2N3j07L1R%q3j9N0J07Mj22K0L9R7r1M8j22m3K28q2M7
6986I3m0j65J65j30P7J01j25M0N1m6L2pK9r1K2n2J12j09J00q0L5o0P3q0l5N1k2
7013f1k2J03n0O7j21J68j47K25k40L7J13n5j34J31k2J88j00l9OqP0j83O5m1k4
7038g4J3J5L2j00J49M9Ok02J35N5k06R5K4n6J39J6j53K1Q8Ko6J47j77L6j2k9J01
$$ y = [62, 138, 88, -36, 42, 59, 36, 11, 118, -60, 51, -107, -148, -16, 41, -98, 130, 91, 41, 17, -9, -103, -17, -26, 54, -40, -125, 1, 16, -34, 27, -77, -81, 51, 105, -12, -5, 3, 93, -34, 69, -73, 31, 38, 54, 92, -43, -9, -76, 4, -25, -87, -95, 4, 150, -45, 25, -134, -14, -48, 16, -15, -247, 62, -41, -58, 24, -27, 35, -105, -161, -56, -47, -106, -129, 54, 73, -71, -44, 33, -83, 105, 102, -10, 42, 61, -78, 9, -16, -11, 6, -64, -132, -67, -2, 19, 12, 66, 171, -9, -11, 14, 139, -88, -97, -9, -64, -38, 71, -62, 27, -29, -122, 123, 7, 101, 29, 82, -25, 6, 15, 15, -68, -87, -37, 70, 74, -48, -28, 11, 108, 17, 65, -57, -100, 128, 46, 93, 53, -112, 53, -77, 0, 101, -24, 16, 67, 21, 53, 46, 75, -16, 6, -46, 66, -43, 57, -23, 12, -48, 25, -55, -90, -39, -61, -83, 20, -30, 37, -84, 84, -63, 162, -78, -41, 72, 17, -117, 14, -8, 180, 80, 41, 47, 39, 109, -74, -9, -50, -74, -61, -46, -14, -114, 35, 84, 90, -112, 23, 78, -128, -33, -9, -65, 74, 90, -63, -42, 46, 48, -18, 129, -48, -12, -24, -53, 48]
7065D8o1r6J2J48r6J0P8k8l6Q7r5O0m3L5PJ12j80j46Q5P3J17m4Pl4R6j46R5r3
7093b8LO3n6l5J36l0n0N3j0j31J47l0l7P0J2j85M2Q1l8%O8q6QK9K4M2j35J00j62
7122a35J53j2JJ61k29O7P4n2p9N7P4k6K2q2J4%kk9K6Lq9O5L2oj5n7L5J21j55m6
7152a09J88j23m0N9P8m0j17J47j17K09j56Q8j23J16n0l1P1n8J01j06m5J11q6P7
7176D4J20k07MN2M3J3o4m6J53j46N6j35Q7j3k9J34j33P6l8n5M1J30l5o8OL1j07
7203h6N5J03j38K9n4N0J47o8j6n8j5o6J89q5p7J02r9J32k6k3m9p7K63k26R8K8
7229C3P1p4j1N5j32J15m6jj41R1J64r4j50J3P9J00p7K8j47J58oK6Ok8n0q1J61
7256F2K4rp7Q4n2J9Kl0l0l0JJ44j03L2pQK8j47L9L6J6L1j18K3J30jK0j03N7Q7
$$ y = [48, -13, -109, -97, 51, -45, -35, 43, 15, -21, 66, -29, 31, -12, 23, 30, 142, -38, -184, -99, -26, 91, 47, 54, 20, 116, -30, 65, -28, -25, 38, -18, -53, 83, 53, 3, 56, 46, -85, 62, 32, -5, 65, 77, -108, -66, 15, -23, -23, 45, -41, -33, -4, 20, 62, -73, 27, -135, 18, 6, 7, 168, -61, 6, 80, 28, -51, 6, 80, 54, 76, -6, 8, 8, 6, -23, 3, 6, -83, -18, 14, 8, -7, -64, -29, 92, -63, -109, 79, -44, -84, -25, 53, 13, -104, 43, -74, 135, -21, 67, -56, 60, 10, -21, 50, -8, 93, -13, -58, 53, -33, 44, 164, -43, -39, 13, 56, 69, 5, -41, 112, -34, 22, -113, -26, -39, -68, 66, -67, 9, -29, -84, -43, 87, 52, -16, -10, 21, -86, -31, 72, -66, -37, -91, -41, 106, 38, 22, -36, -51, -117, 72, -13, -90, 12, -87, 45, 19, -4, -53, -130, 133, -93, 5, 33, 104, 30, 19, 74, -58, 57, 11, 10, -131, -40, 124, 30, -120, -107, -28, 72, -5, 23, -124, 34, 28, 54, 60, 32, -18, -99, 62, 86, 77, 0, 84, 32, 51, 53, 23, -7, -37, -36, 108, 5, 37, 30, 38, 66, -81, -42, -6, 10, 41, -77, -54, 76, 75, 95, -8, 49, 136]
7286A36r4no9j7k5j4J85r8N0K4j05p5O1M4j01P9J34r9o6P4P2q7L4M4q9Q3k17P7
7314f4O8J22j95N4LN0j7M6j9j14J25j54Q7J04m1L6j02O1r3j26K65q9l1M2j57%
7340a39J59j11P7m7K21p8p8l2N5m8%j1o7Q3k2M9%p9J07mn7M3Q0j21N0j47K11r4
7368@k5R8j8K8n6j32K55j80m3n7K6J27n1M4k4J50mp3o9K1M6j38J42Q2n9k10R1
7395b9M3j14O1M5N8o5L9n3P7j03N0J00j64J05k7r1J39j07j5j1J51j11N2o5J22
7420H7j1m7m1k0J42j04L3J9j24J70j72O6Qj06J69j14j0Q4k5Q9j32O7l8KR7p0O5
7447H4j59Q6o0N3P8Kj2k16O2J81r8p9N5J15l6Nj01M2P7j33M6Kk6K6kM6Opp3L6
7477@l1K5O5j91J8J20Q8j38j0O3n8M9R9j07R3j96J0R0P8n7j43J23k2j17N6J78
$$ y = [136, 42, 37, -32, -49, -74, -88, 97, -1, 49, 73, -32, -107, -46, -2, -103, -24, 110, 11, -55, 19, 91, 4, 38, 82, -7, 76, -141, -64, 4, 126, -69, -15, -12, 38, 21, 67, 48, -66, 59, -95, -8, 96, 55, 91, -11, 50, -43, -169, 96, 7, -24, 18, -139, -139, 20, -91, -14, -61, 160, 82, 4, -28, 27, -21, -21, -32, -99, -16, -38, 11, 11, -68, 39, 35, -22, 21, 101, -20, 30, -117, 94, 0, -25, 73, 55, 83, 27, -105, 150, -30, -73, -130, -104, 23, -28, 16, -8, 142, 138, 65, -4, 17, 63, -75, 67, 149, 90, -120, -29, 14, -100, -39, 6, 64, -1, 38, -15, 62, -41, 9, 109, -55, 50, 23, -68, 71, -36, -51, -62, 89, -22, 30, -35, 87, 76, 29, -12, -32, 110, 6, 39, 58, -66, 104, -68, -2, 6, -100, 69, -45, -55, 29, 4, 93, -39, 28, -10, -8, 89, 19, 84, -75, 11, -49, 4, 82, 84, 72, -144, -82, 99, 1, -78, -23, 92, 56, 61, -40, 2, 79, -54, -8, -6, -32, -6, -8, 38, 44, 37, -36, 0, -31, -6, 59, -132, -114, 6, 94, -44, -54, 9, -49, 0, 99, -8, 85, -111, -101, -11, 67, 10, -133, -10, -32, -149, -93, 85]
7503H5j60M7p1O1p7R1r1Q9J12k7j89J30K5J02J0j07P4k04P7J6n5L0K5p8L1K4Q
7530b2Ol6J22p4lj12J14n0J0m4R1l0j09O8J28n5p2q6J70l0J6j00M8P4J3Pm4K5
7558B5l0j1j35J54o9k1K18j19p0K34k60k3L7J17j27K0%J00O7j18j00J27P4j43
7582e3J1Q2j06m9J33n5K4m4p0J7N8J38k7M0j15K0k5Kk1k9P7J23j73j7R6q5J3P8
7610D3j16r4J56k2J9n1N7mm6J07k7K8l3l0l4m5P1K9O0n5J6q9jJ9J6P2q6K6N9P4
7640A19j36M7q3J03p5N6q6J16Q7k74J32j22O0k6N6R8K7j55J42j58L0K4L3j51J64
7665B8k7r6P2L2M2N5j36jL3q3M8J0R5j49R0J8j17r4L07j58k0J8j08Q9M9O4j48
7692h7N7P8L3j11N9p8N9m2Q2KkJ02j23o0J21m0m4L1M3N0n2j27jM3j44J35O6n8
$$ y = [85, -75, -28, -99, -38, -115, -24, -115, -26, 86, 59, -130, 0, 25, 127, 137, 30, 104, -100, -23, -7, -62, -32, -7, -85, -54, -30, -22, -16, -52, 70, -4, -7, -119, -5, -55, -45, -89, 2, -28, -137, -69, 59, 4, -68, -154, 16, -14, 2, -98, -50, 24, 37, 44, 0, 25, -5, -16, -151, 3, -66, -87, 131, 12, -58, 176, -84, -107, -70, 47, -80, -60, -60, 40, 107, -11, -111, 16, 90, -53, -42, 40, -66, -115, 18, -37, -13, -57, -127, -110, -52, 86, 59, 99, -16, 4, -21, -19, -40, -69, 8, 131, -42, -59, 37, -48, -35, 43, -73, -167, -11, -33, -14, -65, -8, -12, -58, 49, 22, 50, 17, -13, -47, -92, -21, 8, 68, 13, 29, -60, -61, -42, -26, 46, -40, -14, 45, 119, -17, 30, -53, 50, -25, 31, -55, 61, 148, -126, 6, -116, -56, -82, -26, 72, 99, -56, 86, -72, -42, -18, 15, -136, 28, 1, -95, -23, 9, 51, 106, -30, -31, 2, -81, -33, -23, 72, -77, 13, 31, -86, -180, 127, -31, -51, -33, -141, -52, -3, 61, -87, -30, 48, 81, -30, 29, -49, 10, -32, 50, 52, 50, 152, 29, -31, 90, 50, 6, 37, 80, 130, 78, -49, -50, -7, -151, -16, 50, -8]
7720hO7n7j15L4J20k3r7J07l0J3r8J30j35N6Q5j8j09q8J8J17J01N4j34m1R9l7
7746A1j14N2Q8nj17K9J85j16n2L3k8j0J37q3K0J11k41J44r0N1o4pP4m8mN5Rm9
7774b9O1q7k9J08j35J06M2mJ0r8Q3j9K8N3j45n3Q2R1q2jL2J0L4O0o5j03l6P9L1
7803B4Rj15J51j21J28j57J76l0r9J09k40K32q3P4j46J13j26J87k1p2mKj32J59
7827A8l8PP7q8n7M6M7p8R3q6n8O1n6K7Q0K1O5n1M0j42k7O6k7N8k7j6jm4J19m9
7857b0K5k6O0j16P0j08J41j4l5On2P7R6r8k6J31j47rm2K38q3j74J08kL3Rj36J40
7885D6o8j1j6l1J57moo8q4J02N4n2M8p7N5k3J0M4M9j79O3j6Jk1L9O0m6o3Q7r5
7915d5j07J87r8J46q6J25j32K9J1J45j33O8j13nJ24j69J07j73K45k28K13j30J4
$$ y = [-8, 59, 2, -113, -79, 41, 18, -79, 28, -2, 11, -87, 43, -92, -36, 49, 31, -78, -166, -148, -31, 70, 124, -10, -51, 48, 11, -103, -51, 37, 32, -85, -56, 129, 13, -39, -6, -34, -44, 93, 10, 30, 141, -100, 44, -46, 5, -59, -66, 8, -40, -44, 11, 20, -29, 32, -55, -84, 24, -111, -5, 37, 33, 43, -55, 28, 9, 37, 90, -55, -108, -26, 65, -17, -18, 14, 24, 58, 118, 53, -50, -86, -7, 24, 33, -82, 69, -52, 76, -81, 95, 65, -34, 75, -165, 67, -16, 58, -88, 25, -101, 86, 65, -7, -11, -9, -141, 18, -20, -13, 64, -24, -81, -35, 12, -66, 27, -59, -117, -56, -112, -85, -5, 16, 81, 30, 70, -72, -99, -33, -60, -2, -29, -45, -46, -90, 29, -20, 5, -21, 39, -77, -7, -115, 26, 12, -23, -17, -69, 8, 104, 6, -20, 111, -36, -45, -87, 151, 68, -106, 2, 0, 33, 42, -94, 46, -22, -33, -49, -80, 77, 73, 67, -1, -85, 17, 71, 19, 67, -10, 45, 22, 32, 76, 125, -54, 9, -7, -6, -27, 12, 72, 26, -37, 50, -45, -152, 35, -63, 83, -3, 122, -10, 19, 30, 175, 42, 110, -3, -8, 116, -53, 54, -119, 126, -102, 111, -19, -5]
7938eK3j30J86j46k5P0n2Q0p3P8kj48J17J0j9N6j06K00j60J36r7n7m9J9J35n0
7964ip4J21m5%K6m2K6M7M0j62L5M7N6l4k2K4j68J12J03j30R1J6r4j8Q4O9m5j45
7992i1K18k8k25K32q3r2P7K2p7O5J9n5O6j17J05j27J05J25j28J29j08j42J24l3
8016a9k9R9j62K6J7Q6P2k29J90O8m8K1r9j21N4J34L4j67O0j1L7M8j25m5O4l6O4
8043a7l3m6O6J30k0p3J0O9j41P0P3Kk10J14R2m9RQ4jj74R3j39N2J1L2p9J45j77
8071a07j0Q0jJ83k00j2J25k02J62Q0j16k2J30PO1l18K57j5p6n6q1J34P6p7Mj08
8097a02R8q3K1P4n4N4L4q5J59j49L6J9l2p1kJ03q4J66k91J04K20j39J3J5j90R6
8123g0RN0l6j8RJ86j15J9j37J04K0j20N8N9J00j43J80j78J49k23J03k4j1J1jP3
$$ y = [-5, 18, -112, 74, -72, -97, -27, -79, 1, -72, 6, 4, -144, -27, -17, -36, 20, -86, 114, -46, 90, -7, -64, -113, -94, 41, -9, -83, 38, -7, -7, 19, -23, 3, 50, 90, -72, -37, 10, 66, 32, 10, 34, -134, -22, 81, -49, 42, 58, -36, -54, 30, 99, 54, -91, 127, 99, -126, 106, 23, -69, 8, 30, -47, 18, 37, -18, 48, -69, 36, -91, 14, 139, 11, 140, 32, -110, 14, -19, -48, 51, -111, -85, -68, 18, 90, -139, 51, 119, 71, 92, -7, -128, -74, 60, 94, -73, -13, -24, 13, 61, -64, -109, -45, -81, -17, -50, -96, -30, 100, 80, 7, 17, 86, -55, 15, 88, 90, -120, -6, 86, 37, 46, 130, 129, -45, 48, -91, -39, -28, 4, -75, 70, -107, -117, -37, -38, 145, -55, -67, 58, -144, 18, 98, -18, -40, 90, 97, 158, -160, 97, 82, 6, -50, -131, 3, 79, 2, 6, -102, -4, -87, -66, 8, -46, 8, 42, -43, 116, -33, 3, 22, -10, -81, -83, 20, -64, 102, -189, -85, 135, -4, 9, 24, -166, -70, -61, -11, -47, -65, -56, 130, 15, 34, -103, 1, 21, -99, -41, 18, 118, -25, 155, -23, 126, -97, 6, -18, -29, -18, -19, 54]
8149E4m5Nj10k4O5lN8Qj0k6J02m2r6J45j95K17j98J29j31O6j01J34m0J4P4j0j4
8176B6m6j3P6l5n2J01m2L2o7j24M6R8N3j52O2
$$ y = [54, 9, 14, -96, -120, -55, -58, 0, 8, -2, -28, 74, 32, -64, 81, -114, 103, -95, 34, -97, -31, -132, 2, -38, -24, 50, 40, 26, -20, -33, 43, 8, -44, 57, 15, 47, -20, -144, -98, 0, 53, -99, -37]
8191c7
$$ Imaginary data points
##PAGE= N=2
##DATA TABLE= (X++(I..I)), XYDATA
0@%%%%%%%%%%%%%%%%%%kMmMmMoQqRj1J3j5J7j9K2k5K8l2L6m0M4m9N5o1O8p6Q4
46D4r2J01j12J23j35J49j64J81k00K21k45K72l03L39l82M34m97N78o85Q34j055
67e94J423k189O852j4188o486K3390P140j2052j2811N401R964N18p423k197J187
82b065J213K549J899p707m337R739P073j0530j0307Q564J4602n513j7657K35J8166
97E924N176j5807j0256J1507J1328n398q758n1M196L627J354k848n664Q5R061
112C476N222r143j0002P640J4861n002j7107J737J6370K926j3575p372J0019R711
126I761n461q941J529O056J182j399j389l024l54P228K845q683o695P452J0443
141A0550n586j3417K288J4161J517j3816n438J1758P917q109q467L318O814R03
$$ y = [0, 0, 0, 0, 0, 0, 0, 0, 0, 0, 0, 0, 0, 0, 0, 0, 0, 0, 0, -2, 2, -2, 2, -2, 2, -4, 4, -4, 5, -6, 7, -8, 9, -10, 12, -13, 15, -17, 19, -21, 23, -26, 29, -32, 36, -40, 44, -48, 53, -59, 64, -71, 78, -86, 95, -105, 116, -129, 143, -160, 179, -203, 231, -266, 312, -373, 461, -594, 829, -1360, 5492, -8696, -15182, 8208, 15348, 3296, -9515, -4114, 5850, 6368, -1055, -3252, -2065, -852, 1697, 3596, -4111, -8448, 1291, 8364, -2166, -12473, -3909, 10693, 5180, -12477, -12242, 5924, 11100, -4707, -14963, -3456, 7872, 2474, -6284, -6335, -2139, 1488, 2842, -6, -5670, -5585, 3476, 8698, -445, -10447, -2807, 12054, 7052, -10055, -8318, 8052, 10978, -2597, -9969, 50, 9761, 4300, -4641, -3112, 2944, 4126, 2727, 1338, -1686, -2040, 5188, 8033, -650, -7345, 107, 10550, 4964, -8453, -6165, 7996, 9513, -4303, -9741, 2017, 9934, 1825, -6642, -3324, 3490, 4393]
155D393l604l342j113K316N305N13q076n718P697J0150n895j2939K407J2978J659
170F731j1394m588R294O192o694o385M293N896j800m355P8J887R07J955q36n143
186c962j028O981N633p078r613M925J2935o09j3137l912J1622O814p633p527L388
201b201O322j59m053j301J067J011J778j46l583k015M805M612n071p271M397R248
217G440k245j0223j411J0163M426q480o686N218P047k018n954m40L053J401L87
232A678j247l221j65M595K961n044o198M448Q181k133r778r52J0055L534q592
247a878n475N735O158k172n856j32L669J549p14j446j732K97L462K140m204m518
263e117M114O399k895p494O68Q463J709q056l963O647N523m030o188J340N349
$$ y = [4393, 789, -2553, -3666, -1350, 3955, 4468, -3608, -9326, -1629, 8521, 2626, -10313, -7906, 5072, 6731, -4663, -9251, 43, 6235, -459, -6844, -2551, 3345, 1545, -2810, -2732, -845, 62, 2017, 1181, -3962, -4990, 1991, 7624, 546, -9067, -4142, 8793, 8184, -4953, -8865, 2757, 9571, 1938, -5589, -2201, 4121, 3962, -91, -1392, -325, 686, 2464, 2318, -1265, -3280, 1525, 6137, 1066, -6205, -1808, 7440, 5195, -5028, -6439, 3724, 8150, -330, -7016, -1798, 5249, 3231, -2723, -3163, -110, 1291, 1678, 431, -2790, -2955, 1640, 4601, -443, -6641, -2193, 5988, 3855, -5923, -6875, 3180, 6714, -1878, -7353, -1618, 4540, 2368, -3488, -3620, 49, 1598, 884, -562, -2294, -1997, 1465, 3605, -599, -5117, -1003, 5396, 2501, -4993, -4325, 4138, 5847, -2209, -6172, 475, 5998, 1968, -4220, -2880, 2469]
278B469R43k268k505q05K076L361L15m779l635M718O294k865p926L49P962K056
294E760p213l455N322M302l547m561J832M056l69k975q24J176J321P91q05l093
310b282j101M531L338m349n983K436P744M09q027l106O605M923m067n532J687
325b774M545M25k836j521Q85J809P83q90k105r09L332K732l389m266K232N999
341D052n39o747j295O070L562m509m860K665M931m84l904j018K059J807j39j324
357C27j772R0L239J341l437l317K789N172j219o406p43O243K730m949m509L149
373a272M637p02l883j296K191J977n26j460j325M25K287J145k817k456K246L825
389B996j562m680K04N214J285m843k975L630M500k319m500M6L501J898j895k351
$$ y = [2469, 3412, 1144, -1361, -2166, -90, 3271, 3586, -1193, -4828, -110, 6184, 3319, -4607, -4258, 3704, 5760, -1453, -4908, 414, 4716, 1169, -3392, -1560, 2496, 2127, -848, -1672, -496, 825, 1616, 811, -2282, -3383, 1148, 4486, 137, -5846, -3410, 4334, 4743, -3284, -6390, 215, 5138, 1071, -4461, -2774, 1771, 2196, -640, -2161, -1276, 533, 1316, 426, -1679, -2588, 744, 3476, 87, -4179, -1947, 4052, 3513, -3234, -4529, 1541, 5103, 594, -4266, -1601, 3330, 2846, -1058, -2076, -17, 1790, 1651, 327, -1445, -1355, 1884, 3225, -212, -3529, -740, 4432, 3213, -3193, -3936, 2307, 5037, 88, -4421, -1272, 3365, 2663, -1220, -2516, -325, 1652, 1126, -334, -1659, -1234, 1053, 2198, -619, -3075, -829, 2996, 1434, -3246, -3042, 2172, 3457, -1386, -4361, -731, 3769, 1450, -3050, -3004, 497, 2395, 500, -1851]
405a851m75J822K674k02l512j696K944M019j693n176J39M947J609m079k810K954
421c86L506j793l411M43K955P68k088j503Q85J615Q41j117k392n5L054K071k744
438F49l912J386M758M19m585k516L614L703k120l875M54L192J035k013j713M56
454a068J898P29j139j985J85K447J372k378k958J624L784j75m083j491L549K757
470C068k385l383R36L248R16k782j544J379J681J02j711j312Q31K069M76k473
486h84j991K288L119j100l672p51L870K401k884l297J389L455L84k625j698J355
502f41J908L10j729j465J090J779K64j830j482J669K388r46k980J21L224R19k958
519c59k055K053K849p42l187q44K627J789j082k442n74J872J986n34k658r34K343
$$ y = [-1851, -2326, -504, 2170, 1968, -1544, -3240, -296, 3723, 2030, -3146, -3007, 1940, 3549, -530, -3340, -386, 3120, 1327, -2084, -1641, 1314, 2082, -6, -1509, -624, 991, 1832, 715, -1677, -1732, 1322, 3393, 649, -3263, -1877, 2881, 3300, -1285, -3801, -187, 3516, 1396, -2479, -2025, 1167, 2202, 189, -1524, -1068, 830, 1559, 420, -1565, -1380, 1067, 2439, 61, -2897, -1273, 2511, 2336, -1747, -3238, 311, 3068, 683, -2700, -1764, 1484, 2400, -382, -1926, -547, 1134, 1236, -475, -1787, -956, 1113, 1589, -884, -2875, -587, 2532, 1432, -2240, -2991, 879, 3280, 396, -2901, -1512, 1943, 2327, -298, -1996, -641, 1267, 1577, -152, -1617, -527, 1252, 1516, -314, -1796, -127, 2261, 1315, -1665, -1544, 1680, 2599, -359, -2414, -361, 2488, 1746, -1441, -2285, 342, 2131, 1049, -1393, -1967, -95, 1891, 1357, -1301, -2235, 108]
536A08K408j486k776j53K920J438k723j951J618K219n69k315n18J989J025j093
552A41j764J84J973P60j030j909R2K300J123j882k354R55L057J23l015j143J885
569e04K337p24k706k26K500J078j226j805K99J886P33j316j661N21K196N54k043
586a07j532R96K433K5k497j299K082J830r89k198L3K241O63j590j313O08J708
603A094P2j648r72Q51J802k18j948j017J758J934r01k473k80K529J524j598k380
620a871L78K467R26j894j592O05J808N08j663j161Q41J595j06j544n10J237J185
637A209o69j746J86J963N41j616j565J283J870j37k054r23J426J824n29j937p07
654a581J531J612n09j953m41J716J403j035k037L03J904N53j392j295N62J766
$$ y = [108, 2516, 1030, -1746, -1899, 1021, 2459, -264, -2215, -597, 1622, 1053, -1262, -1780, 209, 1234, 141, -1623, -1439, 534, 1294, 264, -1645, -1553, 747, 1870, -12, -2366, -1411, 1646, 1769, -1246, -2389, -504, 1833, 1109, -1597, -1823, 677, 1755, 529, -1276, -977, 909, 1642, 326, -1335, -814, 1382, 1936, -107, -1639, -643, 1790, 1815, -682, -1981, 101, 1931, 942, -1256, -1223, 1018, 1681, 91, -1222, -614, 1094, 1166, -482, -1454, -603, 1199, 981, -967, -1984, -226, 1708, 807, -1666, -1946, 583, 2107, 509, -1871, -1493, 974, 1900, 6, -1586, -981, 827, 1335, -328, -1489, -648, 947, 841, -703, -1213, 24, 1209, 540, -1206, -1020, 943, 1484, -132, -1697, -414, 1456, 1319, -735, -1658, -232, 1592, 1063, -874, -1581, -50, 1562, 1053, -900, -1341, 375, 1778, 743, -1294, -991, 913, 1466, 74, -1221, -659, 1107]
670A107j23j642n43J120J374o49j737j17J609Q01q85j563J64J752O79j226j448
687a327O45J738J69j638r47R83J523l25j758l36J363J161q55j527K50J438Q59
704A416j308j268K31J954L59j559j070O18J539O5j448q12J055J269m13j453j29
721i54J116J028r17j266N44J048L28j140j000R65J125N4j471q18J394J369o90
738G15j714j76J459J167q81j653j4J645J090j209j289K00J420L95j201q47N94
755b99J134r3j165m71Q32R11n09j073M4J234N58j143j047O16J294P0j325q83J137
774a78J207k03j432p07J238J103m77j363m53J251J078p48j227J22J187N85j056
791g3r09M93J074K28j185n51P99R43j73j127m82J189P84o66j065j65J458L98q75
$$ y = [1107, 984, -658, -1201, -81, 1293, 644, -1093, -1210, 399, 1200, 315, -1248, -1084, 668, 1347, 121, -1327, -682, 1056, 1225, -413, -1360, -377, 1146, 821, -937, -1273, 90, 1251, 396, -1131, -881, 557, 1416, 108, -1160, -929, 1025, 1384, -175, -1245, -627, 912, 977, -471, -1283, -228, 1041, 628, -825, -954, 162, 1190, 273, -993, -449, 599, 927, -213, -1213, -248, 877, 931, -540, -1358, 36, 1405, 715, -999, -1175, 284, 1451, 570, -1083, -1097, 548, 1638, 429, -860, -660, 760, 1155, -46, -893, -299, 835, 742, -423, -894, -62, 849, 340, -733, -689, 545, 1103, -40, -1087, -471, 823, 893, -432, -1315, -178, 1029, 826, -606, -1313, -75, 1028, 551, -812, -1265, -14, 1064, 316, -911, -789, 398, 983, -73, -982, -489, 585, 813, -372, -923, -124, 819, 646, -481, -963, 226, 1010, 344, -721, -886, 572, 970, 95]
810I5r80L92J108L03j050q01P06R45j5j108m56R44R32p19j062m3J278N80r82j024
830i57K49J452L78j258p63L81J231J82j200n84O00R97j20j195k3Q36M75o19n50
849d88L9R30J78q80o39N55R57k03j025l23Q34J109n76j223l36J128Q11m31j183
868g66j79J193O80n79j256J98J291K68r50o71L81R61Q3r41m49P16O15k50r12j37
888g04J061L95o23p25J25J007K89r31o72M94R68q8j037l06M89J176n11p89l29
907g11Q82O35n62q55J10R35J84n86p46K33R65J0q48m18M91J016j53r93k27O51
927A3N98l48q90J06P52K34m33n74J36P05J50n45n40N29R37m78q62k16Q91M87l83
948B69q89n3Q64O28p97q06J76J056K61p17p91L06J057K7o43o58N65P15j5r37j93
$$ y = [95, -885, -493, 615, 918, -132, -933, -227, 718, 703, -405, -861, 83, 1015, 296, -766, -809, 469, 1049, 67, -957, -708, 744, 1122, -136, -899, -518, 713, 895, -305, -889, -289, 708, 588, -607, -630, 206, 681, 62, -488, -449, 481, 659, -221, -860, -305, 652, 449, -576, -899, -65, 1044, 468, -755, -1091, 37, 848, 417, -766, -945, 248, 928, 349, -907, -709, 582, 850, -100, -771, -390, 571, 654, -287, -736, -20, 595, 345, -567, -704, 357, 752, 129, -596, -471, 536, 825, -106, -778, -284, 684, 596, -441, -747, -258, 918, 407, -382, -711, 171, 806, 244, -611, -501, 434, 618, 32, -714, -481, 484, 494, -354, -772, -281, 735, 582, -411, -638, 13, 611, 263, -627, -521, 231, 465, 32, -542, -406, 299, 449, -96, -636, -107, 830, 352, -510, -726, 165, 652, 269, -620, -673, 191, 819, 22, -784, -608, 448, 709, -8, -799, -493, 564, 591, -52, -710, -145, 570, 555, -382, -575]
969e75N57O27l69o23J69O17O2n77l56L41O76K7p58k85N13O99k59r06k14P77O96
990H39m84j054KQ62M26n59p71K46P94J57n28m28J90O72p7l93n46M73O48o5o98
1011b94j60O15M05n80o02J76R51K4p56m58M20R32k57o56k97M87M88j18o28q3M24
1032C3M36l24p30J38P05K84m23p29L80O76On51n17N25O74k73n19j99M86M75l01
1053B52n58j26O36K51k31n48K9O47K09o56l89M87M76k09o45j75O46N30n47n16
1073d37o9O98K39l78o64K19N67N02o62o41J94P48J78o10l43K66N34m5m59j63M28
1094A02L12l57m07K65L89N4m21l07K89N26k00l58l76L30P58j91o36l94P06M25
1114E09l65o27n0P25K28l13o79K28N18K26m83j37R0L11O2l59k60L43M20j70m73
$$ y = [-575, -18, 609, 240, -383, -214, 403, 465, -112, -468, -127, 549, 576, -182, -467, 46, 745, 486, -420, -634, 143, 839, 355, -699, -697, 165, 591, 32, -739, -493, 301, 458, -70, -498, -308, 364, 287, -106, -652, -179, 469, 404, -294, -454, 161, 566, -14, -616, -440, 511, 535, -221, -679, -259, 673, 416, -240, -537, -50, 438, 320, -308, -391, 33, 469, 145, -585, -447, 258, 542, 119, -610, -230, 446, 452, -99, -616, -91, 583, 310, -209, -408, 78, 553, 252, -306, -432, 204, 455, 224, -324, -295, 352, 561, -95, -484, 3, 479, 270, -375, -550, 96, 626, 79, -437, -506, 192, 431, 53, -611, -392, 175, 677, 15, -626, -432, 316, 494, -116, -459, -193, 341, 296, -163, -326, 102, 414, 57, -350, -85, 304, 358, -63, -370, -81, 445, 245, -113, -489, -159, 599, 408, -228, -622, 84, 509, 144, -483, -533, 192, 420, 107, -572, -344, 174, 400, -83, -220, -130, 181, 243, -116, -376, -33, 387, 217, -256]
1135b56o6L11L95m17m66K56N53J36n44l43M59M02r0n20j33L22M16k17m50m2L78
1156H4L28l72m80R5N77J69m07m77J61O35R1o40k47L83N43j32n47j29L95L46p4
1177C02m37j92L06K51n6m96L5N00L9l94j49K37M56j68n08p4M24K97k91m10pM64
1199A29K48k72o13J89N78M5m11l94K96M45J80l60m38J83N30p9m29k8L02J86j78
1220A09l07J50J84N4k95k74L04K87m3m35j00K48M85m7o07j29L61N28k70m70L5
1241b32L34J46k35l56J31L87j2k42k50K36K89m3k74k25L50K96k18k96J3K08M15
1262D22l99l53Q7L50L45n45j48J76L25j68l09J3K89K32j03l45j52L79K14k20l07
1283b17j12M91J50m26l90M30L32kl29l58L96K33j0l06j40K49K68j31k79J8J19
$$ y = [-256, -322, -11, 384, -33, -499, -243, 310, 446, -98, -441, 18, 420, 330, -190, -323, -1, 415, 198, -252, -294, 84, 412, 40, -440, -345, 232, 401, -6, -483, -322, 313, 404, -236, -483, -100, 443, 311, -236, -365, 30, 376, 302, -135, -327, -21, 230, 174, -322, -287, 213, 252, -142, -291, -54, 402, 234, -274, -348, 76, 373, 82, -328, -335, 129, 377, 105, -508, -319, 259, 304, -107, -501, -205, 240, 420, 60, -378, -195, 335, 256, -173, -201, 101, 287, 109, -198, -48, 136, 190, -105, -379, -75, 212, 169, -266, -366, -118, 367, 320, -287, -416, -55, 473, 203, -267, -232, 102, 248, 13, -343, -212, 175, 163, -79, -329, -93, 196, 153, -121, -346, 4, 300, 82, -214, -201, 7, 422, 23, -330, -243, 107, 452, -93, -241, -65, 260, 92, -217, -204, 85, 317, 214, -131, -283, 96, 310, 90, -217, -329, 162, 312, -114, -504, -74, 258, 256, -73, -431, -35, 198, 188, -118, -258, -9, 259, 128, -151, -133, -14]
1304a4J12j88Qo6K98P1k51j87L06R4l8k90o3K78K20j17n55J04M38K27l88l63J63
1327b01L66K25l47l34L0M57M2l19k29J94K00J2l45j12N77J15l39r0p4K04K35k43
1349B4j25M8K15R6l68j47K11K82j4m17j17L26L60k98l83M9L90R3k28k66J21L41
1371A93J02l42j21J28L28j48l74J00P1L23j82k25KK06J98k32l02P0L40J00l48
1392a13l2J2K40O9k29k23L26K34j37l08L8J63j7J25l92K53K33Jl26k28J09M66
1414B64k2l23j62N2L36l7j36k74L28K74j54l11p0J61L04j99k74J40J33P5l04k6
1436b25J67K25j49j69l9J88K33k34k37LK89J24r6k71RL10O8l10r8l3M36J5l19
1459a13k26M98J31k93kj73J33J65j42q0j6J49K33k82k80K32L50r3k94p0J68K98
$$ y = [-14, 98, -90, -82, -148, 150, 221, -30, -217, 89, 183, 145, -145, -208, 70, 290, 173, -382, -278, 160, 387, -1, -364, -201, 165, 390, 43, -291, -261, 196, 238, -81, -310, -116, 84, 96, -249, -361, 216, 331, -8, -98, -172, 32, 267, 24, -101, -53, 162, 258, -110, -257, -46, 236, 222, -195, -312, 14, 374, 76, -307, -258, 132, 225, -3, -269, -148, 193, 295, -47, -168, -40, 288, 140, -234, -134, -63, 260, 78, -147, -145, 61, 259, 27, -275, -205, 135, 235, -113, -145, -133, 107, 176, -53, -276, 50, 284, 147, -161, -123, 40, 23, 148, -244, 9, 242, 243, -83, -311, -202, 264, 242, -81, -243, -191, 145, 108, -28, -302, 26, 300, 146, -165, -235, -74, 230, 31, -243, -103, 30, 105, -199, -225, -58, 167, 18, -151, -190, -2, 231, -3, -240, -237, 52, 176, 80, -191, -182, 128, 196, -114, -212, -245, 191, 206, -113, -339, 159, 290, -3, -5, -178, -45, 120, -22, -102, -118, 31, 264, -18, -298, -66, 284, 191, -103, -173, -5, 293]
1481B93k15k18j68L52L02k45j66LK25q7J0k21R7L17j75j53k92L57K12j63k34k3
1503a92K10K06n8l06j1J27L03l48l3R5R9R0k58l9J60N8j71N0q9J73J10m1k67J0
1527a22K13J00k16o4J18Q0J64j10l36K15O9J64l10j76J48J64J4j79j22K17l1k
1549bo2L7o0J77q2j0lJ71j8k82P5j0K29j09k07lJ47J71n8l09R3J07J82j85j86
1574a97J1J89K31j94j56o4L25k5l47M6J48N0m3j71J7J74R4o9j28p5K16R9j94N2
1598a1q7L53j06k58K9K4K78j48j70J10O1P1j13j42N3K01pj00n3j24K53J40l10
1621e6j58K58J04j6k37j22K33KO6k27r8J09M29k94j30J0J52p7M4j36J42%N5k37
1645a84KK69p1o0j35M3K52k7l5j65K0R5J21j47k16P9K86Kk82j22K20K2J22p5k68
$$ y = [293, 78, -140, -308, 44, 346, 101, -65, -62, 163, 76, 86, -135, -38, 279, 104, -49, -341, 16, 228, 65, -169, -192, 18, 224, 166, -140, -151, -24, 279, -69, -102, -7, 92, 182, -76, -115, 45, 103, -68, -18, -107, 66, 176, 135, -132, -122, 91, 191, -25, -89, 29, 109, 273, 163, -173, 42, 111, 275, -35, -211, -63, 101, 115, -64, -186, 31, 0, -2, -64, -27, -87, 90, 8, -2, -5, 166, 148, -134, -59, -69, 160, 51, -156, -159, -12, 159, 101, -208, -115, -8, 174, -11, -197, -186, 3, 234, 40, -116, -180, 145, 120, -227, -181, -33, 17, -26, -197, -180, -6, 88, 19, -109, -184, 32, 131, -63, -11, -98, 255, 149, -109, -80, -56, 222, 74, -96, 14, 75, 146, 33, -109, -56, 145, 138, 38, -15, -139, 114, 254, -56, -214, 44, 148, 132, -105, -227, 6, 8, 74, -153, -251, -142, 287, -7, -137, -127, 25, -52, -8, -144, -2, -2, 53, -184, -182, 87, 16, -44, -179, -136, 116, 89, 54, -111, -91, 4, 125, -22, -238, -159, 127, 129, -153, -275, -55, -33, 89, 14, -254]
1670b54K27J78m2j65NP1l9J97j02j62J19Q6j22j84J98L5m9q2lK05q4%k19M0K03
1695E7j1n3k61K71O9J9j07o8KK00o7k62K9O7P7J63k09lJ33P1n1l41K96M4J30k74
1721g9J35l4o5O1q7j08J78K7J4M6k60J38R1qk00j08N22j21q1q5J59M4k05P0k00
1746a56J25K09q1k13n7J49J50Pk09j14J98J45p7k69Q2R7K48k19j07J12L9o6%K6
1770A9O1j29o0M6R8k36L78k23j0n3J69J01j10j67M7K78j32j03k47J98R8L3j84
1793a28O4J97L2j91rM5o2l1R9o2j7L2Q4j37J85j96J47j34k9p9J68Q1r9l7nP5R5
1820H8j0n6k0M5L2j77K07k25K02p3O4j80P7K09j33j90l7L22R4l11p8J86J36p7
1844I5j72P7P2q6K5L7j08J31j2N0j34j44J88K2n6j43J48J7O4j86kj9J90n4j00
$$ y = [-254, -27, 151, 109, -56, -51, 20, -19, 178, 76, -86, 33, 119, -3, -187, 11, 46, -3, -85, -88, 117, 33, 33, -186, -146, 57, 46, -7, -268, 3, 72, 91, -16, -84, -82, 118, 51, -211, -182, -115, -38, 125, -84, -87, 46, 117, 66, -275, 21, 65, 195, -79, 56, 22, -43, 18, -69, -177, 1, 28, 42, 88, -172, -34, 57, 49, -151, -259, 263, 142, 61, -24, 135, 179, -26, 44, -156, -31, 178, 97, -116, -173, -24, 126, 133, -76, -190, 8, 153, 76, -193, -111, -14, 234, 15, -92, 20, 59, -7, -7, 19, 80, -49, -109, -63, 35, -201, 177, -46, -56, -109, 60, 161, 51, -116, -69, 209, 77, -26, -273, -75, 23, 56, -128, -64, 133, 165, -26, -35, 10, -52, -83, 16, -46, -63, -31, 53, -84, 101, -95, 52, -82, -111, -190, -22, 59, -40, -77, -82, -7, 88, 78, 22, 2, 47, 79, -98, 109, -116, 86, 13, 77, -103, -26, 183, 50, -140, -177, 145, 239, -72, -150, 36, 172, 95, -77, 0, 72, -14, 11, 48, -60, 71, 59, 109, -25, -169, 19, 41, -15, -158, -10, 7, 71, -115, -117, -136, 54, 0, -100]
1869a00O4R8l8k4q5R1K9q8J12n4J4p1K20o2q3j89L04n4o2r6J0J79p1j50J60J07
1895A61k29N2J02L6j19k8J09j74M7O1J38j15p5r4K88m2k17M0K7K73k41o1J33J8
1919I0p2n7L6P6l5O2j3o6q2K8J59r6q8j3K06q6j22L3N1J20k1l06L6J92J3J0l9
1946A6M0o8J6o1L6l5m1J16l3j11J96J21Rj54j45R1Q8j61j35K31J34j64j23mK13
1971G2m1j38J81o2j72J02J34N3l07J21O0O8j75J09PP4j42l0O9P2Q9k38Q0O6k3
1996B9K3k8LN1o4j3r0j22J90J11j35j34N9K59R1l48%J36J4o3j32J76J03k00j1
2021i5rJ58lp6L9L4j10o3K36o4k63J36P4J05k61J93l3J28j54j12Q6J55l0j09M8
2046A0KlJ9Q1r4p4J0Q5L0j06r4K14P5l06J08J34jj8j90J48J08q1j59J46q1L3P2
$$ y = [-100, -36, 62, 24, 0, -85, 6, 35, -53, 59, 5, 19, -52, 168, 106, 23, -166, 138, 84, 22, -74, -64, 115, 44, -106, 54, 161, -68, -16, 86, 122, 3, -25, 84, -90, -43, 18, 156, 41, -34, -128, 160, 118, -99, -59, -32, 241, 0, -61, 72, 90, 18, -39, -3, 73, 38, 100, 87, 21, -61, -33, 126, 30, -58, -71, 135, 49, -73, -40, 11, 131, 110, -196, -160, 32, 45, 55, 16, 56, -12, 4, -57, -21, -56, -97, 19, -14, -125, 71, 192, 201, 47, -98, -7, 81, -80, -215, 16, 150, -14, -137, -141, 72, 31, -107, 74, 12, -160, -58, 76, 129, -178, -57, 3, 71, -104, 5, 12, 86, -56, -86, -17, 55, 144, -94, -14, 52, 29, 52, 24, 27, 78, 14, 1, -89, -211, -21, 90, -45, -179, -120, 139, 230, -118, -118, 18, 32, -31, -163, 13, 116, -84, -95, -104, 54, 51, -25, 14, 48, -62, -125, 111, 47, -216, -80, -6, 99, -162, 31, -2, 126, -28, -140, -54, 101, 71, -38, 10, 12, 9, 28, 109, 15, -59, -49, 36, 66, -40, -134, 80, 155, -151, -43, 91, 90, 72, -118, 30, 138, 57, -102, 44, -37, -4, 68]
2073F8L1k16m9J89K07k30j37J42J3P6j39p0K92j04q7j08M1J31jk0q6p3K5J74K0
2098H9n8p9L3lJ1n0k0K18o8k37Q5J06J42k77J2J35K1n4m7M5R5j05J18j40R9j11
2124d0J11r7R4k29J07O4N7k36K5L41j26j20j25K60R3j78r1J52J19j84n8J55p1
2147B3o5J02L8n3k9m3J50p4j01M0J89j07j13lJ78Ok87J12J01K3Mk02J92pj85P2
2173c9J72r7J1q5k3R1j43O9J52l6j54n2J76Mr9j2J82p4j11O2k6K2P2%r2l8o5M
2201a29K46o8j66O9K62r0m02J53J85M4k8j23J39K3o7n5kl8rQ7L4N9j42r4N7R0
2227C5r8M2J64j72m9l6P8K04l75J1J94J19j53j15K63n4pn3j6R0or6K3N1r7Q4J00
2254A31j16m1j07J08O8l4j05R1J12p3k0J2n9M1o2J25M7M0j00q2Q0j67J11M6m5
$$ y = [68, 99, -117, -166, 23, 230, 0, -137, 5, 18, 94, -45, -115, 177, 73, -14, -122, -81, 50, 49, 29, -57, -130, -105, 69, 89, 31, -48, -15, -18, -7, -57, -77, 141, 73, -164, -79, 27, 169, -108, -96, 39, 60, 6, -41, 4, 99, -6, 112, -28, 71, -40, 71, -26, 68, -161, -54, 10, 67, -169, -144, 197, 71, -49, -174, 86, 179, 1, -90, 62, 181, -3, -61, 94, 23, -42, 60, 98, 45, 16, -27, 123, 49, -52, -12, 177, 70, -43, -46, 132, 138, -149, -37, 64, 87, 91, -111, 81, 74, -111, -39, 133, 36, 47, -38, -61, 30, -113, -44, 108, 72, -82, -134, 42, 46, -53, -65, 117, 43, -68, -6, -32, -10, 62, 62, -30, -68, -133, -129, 117, 49, -117, -48, 214, 124, -278, -125, 60, 104, 76, -47, 92, 115, 48, -7, -9, -47, -56, 31, 65, 124, -18, -112, -55, 35, -63, -21, 143, -29, -78, -114, -36, 168, -207, -196, -2, 117, -36, -151, 112, 58, 51, -2, -18, 72, 66, -30, -7, 44, -53, 31, 131, 15, -26, -133, -25, 43, 9, -96, -5, 107, 34, 14, 26, -33, 8, -54, 71, 118, 158, 58, -24, 56, -111, 0, 46, 1]
2279Aj15n5J60O6j37Q2RM5rk25J78N7K8p7KK3k4n0mN6L0K1oK3j50QL6J76j65j01
2309a17J32J47j54p9J35J9j00j5ll9J34j89O7NR8qm8J17j98Q3l0j1M3j28K4J80
2335F5o9j51P4J44j23O6K4m9k2l1O4N3o1j1m2R8j59N9J43jj01j64K45j22M8j55
2361a78K29p1lm4J12K9q3rlR5q4M5o0J4Jj2P4O1j92O4L0l0j37J55l7k5Q3k53J77
2390e2N0J20j97M3kM5j02J16K6j49J1J37r3j18J40J98j26r3O3L3P9k08oQ8j21
2415a18R7j46K09q6Q7k3L4j26J33j39J05J01j56N9K2j3k40J99N3k5J9n1j6J05
2439H4O6k29j2J6OJ06q0J74j41j71K64o3L1Lj14KQ2k1O5k7m5M2pl0N8q4j5J00
2467F0q5M7M9l7L5m6kp2JO9%J1j8j3L1J2l1j24K39m4j99J81k71K11p3P1R4j00
$$ y = [1, -114, -169, -9, 57, -80, 2, 11, 56, 47, -178, 0, 57, 85, 8, 10, 33, 9, -41, -45, 11, 41, 62, 56, 79, -71, -63, -27, 149, -16, -117, 15, 162, 8, -71, 64, 83, -17, -32, -35, -74, 60, -129, -62, -57, 41, 33, -15, 102, -96, -13, -43, -54, -11, -139, -115, 65, -4, -155, -81, 63, -60, 6, 30, -19, -41, -72, -8, 45, -16, -27, -69, 29, -130, -71, 72, 71, -30, -194, 51, -71, -23, -178, 51, -20, -23, -67, 45, 74, -9, -18, -21, 74, -10, 35, -25, -11, -10, -22, 52, 113, -79, -15, 15, -15, -152, 3, -34, -59, 24, -229, -52, -2, 118, -79, -36, -38, 7, -95, 21, 47, -102, -91, 46, -47, -165, -25, 173, 47, -46, 17, 50, 129, -79, -85, 3, -118, -21, -167, 42, -44, 43, 20, 54, -72, 61, -78, 27, 128, -28, 31, 53, 40, -200, -1, 52, 27, 46, -5, -21, 84, 150, -79, -91, -75, -69, 37, -43, 131, -10, -181, 83, 20, 51, 54, -60, -58, 24, 3, 68, 41, -4, 38, 31, 1, 59, -25, -40, 60, -25, 22, 71, 34, 69, 23, 21, -51, -50, 19, 19, 30, 12, -1, 30, 42, 11, -113, 126, 82, -117, 64, -207, 4, -69, 2, 96, -4]
2495dl5L0n3k8R7q1N0K0K8j06J06O9j30J0M0J04j51p8Q2l2J56j51M4r5J14m0o
2522d0j5O2j06J98k10J80n5J4j12k2R6J04j13K4L4k1R2j81nqN9pJ48j61k8J22
2548D9n3J80j25K6j79K5O2k2K8n4J0J03r3mJ50m9j4Kk8J42m2r8k6N9N6n7j38K0
2576g0J76j8jj50M3J72j07o7j27K04m0J06k07J01J5J0r0j6P7Q8M3q6q8P5m9k1
2602b7J46n3o7N2O4k36J25q2K59k13p0P0L7k5N2n7j7P0l5j03J30K9L5l2j49Q2
2628a5J75j53o3J66j44J18j12k2J19m8P6j82J14mr5J86ml5o1k1j52K64j12K8k4
2653aJ6l9LJ9l4Ror0o1K79k1P4k26K9P2o4Q0j7J5L9N8j62N9NO9j32n2J6Q6P9p5
2684B7K0N5j27K4K7j45P0Q3n3NM1l5J51j93L1P1K2n8q7J31n1Q2j52PQ6l3L8o6
$$ y = [-4, -39, -9, -62, -90, 7, -74, -24, -4, 24, -82, 24, 93, -37, -27, 13, 117, -34, -112, -30, -62, 94, -57, -13, -108, 6, -34, -40, -55, 7, -99, 99, -111, 69, 14, 28, -84, -106, -10, 94, -19, 5, 39, 18, 110, -71, -76, -84, -25, -32, 116, -45, -73, 49, -4, 176, 51, 77, -102, -77, -15, -37, -9, -63, -53, 50, -43, -47, 103, 54, 40, 42, 14, 156, 114, 16, -10, 49, 105, 48, -90, -70, 106, 88, 87, -63, -20, 152, 45, -22, -149, 55, 15, 121, -86, 15, 30, 40, -50, -66, 11, 99, 142, 56, -32, 43, -6, -27, 119, 66, -1, 51, 115, -121, 4, -78, 181, -32, -102, -32, 5, -20, 32, -25, -42, 28, -7, -110, 20, 49, 84, 52, -97, -15, 160, 7, -56, 110, -34, 84, -28, -50, 69, 21, 97, -85, 29, 25, -70, 116, 112, 77, 16, -5, -157, 107, -5, 23, -1, 15, -24, -21, -2, -36, -27, -33, -123, -184, 95, 74, 148, -78, -49, 23, -41, 39, 22, 37, 76, 134, -28, 31, 36, 105, -27, -79, -63, 23, 102, 27, 47, 102, -25, -1, 26, -119, -49, 34, -19, -14, 27, -8, 143, -50, -19, 52, 74, 16, -71, 60, 9, 91, -61, -54, 32, -1, 37, -29]
2712b9j71K79j01m6O1M1O3o4Rjo3rJJ66q9j0pKL1r9q9nJ05n3Q3K1p8M4K4j02P9
2743gL8j7r3L6L9p4M4MoM3K1O4q4j56P8J16K9J0NL3l9j3lk1j7o5M6j11J37o0o9
2774i2P7n0O5R7r0j1K4j2N2l1q7L1L5L6j87MK01N4k19J17L1Q1r7J6j74J18k2N8
2802B5J63j39p7jQ5j21J06N5j15J7L5lj96J4J83j58K15o1pK1m7J03j89m4J82p
2828C9j75K04j28J8l4R5J7k4km5j53K28n8rQ7l7K15k92j6M7k8K9P6j74J02K09
2854A91j80j32P4nJ71j7j35m6J23N8j12P2m4O3J17k74J4O8J7P7k72K34j48N2Q5
2879E1k11K26j51N7J8J7l6Po5R1qO4o4o5%J42J2j51J60j21J61k10J13k8j3q4n0
2906a38J79R3j73J27n0m1R2j08L8n3Q3M5p7M4k3p6k1j2R4j04J10Rj19P8R8j62
$$ y = [-29, -200, 79, -22, -68, -7, 34, 97, 33, 42, 41, -22, -31, -30, 136, 47, 37, 30, 32, 63, -36, -125, -130, -25, -78, 5, 26, -52, -8, 16, -86, -7, 31, 14, -79, -43, -4, -78, -34, -30, -36, 7, 28, 92, 8, -148, -70, 46, 75, 85, 90, 123, 84, 71, 68, 47, 30, -35, 11, -100, 37, -23, -92, -15, -65, 0, 97, 7, -4, 20, 8, 60, 29, -58, -27, 8, 44, -143, -139, 62, 116, -103, 14, 45, 126, 29, 45, -129, -11, -33, 25, 188, 49, -28, -29, 56, -65, 41, 96, -19, -2, 33, 30, -166, -152, 31, -127, 88, 27, 20, 41, -6, 97, -92, -136, 46, 39, -136, 68, -60, -42, -76, 19, 36, 12, 10, -35, -188, 40, -18, -27, 60, 23, 238, -54, -70, -23, -51, -22, 54, -120, -18, 191, 11, -121, -47, -52, 119, 102, -33, -79, 44, 102, -10, 62, 18, 81, 198, -76, -62, 6, 23, 100, -172, 62, -86, -34, 51, -160, 66, -85, -28, -10, 7, -29, -22, -87, 4, -4, 60, -4, -69, -69, 73, 85, -66, 94, -27, 134, -76, 37, 9, -4, -88, -138, 41, 134, -39, 88, 38, -3, 89, -19, 19, -34, 49, 94, 17, 61, 38, -38, -59, -71, 23, -81, 29, 38, -81, -3, 95, -67]
2932f7Q3QO6Pj76O6r0K27j44L5lj12K23r1j50N6K9J13j30O8m5J02L3j01j43J80
2958D4j3J22r3Lk6j62J20R0k02J78jj26P6j07J44j28P4k4J22L2j34L1q7M6p0J65
2984G4l7r2K22k66K52j92j30J97L6j99J63l8jo8N2Q9j45J26l7N6j18K21j82j1
3008b8q3J17j72K23K3P3k28J01k4N7j84J30oOJj35R2J04j35J56j75rQ7l9Q9q6
3034d5l2J48j33O8J7kk2k9J03j72J23Q4j14p8J87plj84J55k5q7J30n0m9M2n8o8
3061a01J69j53k8M9qJ24j24O4rP6r9J33j42L0p8Q1pL2j13L6J28q3k3O6r1Q7ko5
3089e1O1L2p9J23j55J18L2p7n6J2N1J17p4l4m5j36K62j12j0M1j37J81j08O8n8
3114c4kk6J55j00j83J67n3J05r9Mo0J73j45J02L2j2j50P2N7l7N7n8J78j93m6J3
$$ y = [-67, 16, 24, 90, 97, -79, -13, -103, 124, -20, 15, 12, -100, 123, 32, -118, -62, -33, 80, -50, 18, -27, 75, 108, 7, -136, 44, 31, 153, 60, 63, 37, -125, -5, 85, -117, 61, 60, -66, 10, -97, 47, -81, -7, -31, 91, 123, -11, 20, -67, -21, -91, 74, 37, -55, 167, -99, 153, -39, -169, 28, 64, -135, 28, -10, -11, -79, -27, 62, -83, 43, 6, 62, -56, 165, -17, -28, -111, 6, -166, 57, 80, 153, -75, 26, 2, 59, -125, 5, -1, 5, 6, -129, -37, 67, -68, 88, -87, -96, -9, -48, 41, -45, -77, 71, -62, 6, 23, 21, -1, -30, 73, -99, 24, 108, -6, -84, 103, 96, 93, -91, 64, 39, -48, 82, 32, -17, 25, -33, -101, 68, -85, -113, -64, -72, 52, -72, -8, -17, 59, -40, 93, -49, -19, -97, -16, -23, 9, -104, -68, 60, -23, -46, 20, -71, 16, 14, -51, 10, 42, -37, 86, -69, 49, 81, 4, -52, -40, 11, 128, 54, 20, -25, -161, 101, -11, -21, 20, -117, 64, -44, 24, -34, -36, -62, 93, -7, -190, -23, -76, 29, -70, -66, -126, 47, -98, 4, 36, 24, -126, -54, 3, -34, 23, -35, 143, -50, -96, -83]
3140h3J70p9K3R2m3j72k2j41L86j14J46k33N2j13K25k16J88r3N0l5P8n6m1J63
3164A32k06r5J70o3J21m4J04k02j1J12N2j56J60m3r8J58j56j2o7P3J07j1M5j57
3188h7J41Qj16J12r7M0j67mO6J79jj1%ko0O0j00n8R8K04j63q2J4l5j3L8pK08k03
3217c8N7J64k90Q0o4K26r2n7J4P3p4ln6j7J54K1j00q6J64Rj24O7P5p2k2p9J95
3244A25k02J41j09N6mj90K75j72M0NK6NJ18r8M7j0K3J3j26J70m0j17R2p1n1J12
3270E8o7K6m0P0p0J8RP3k1k2j02P7P9p9q6m7j2J02L0j21J41j4m%J59j8j26l0J31
3299A14j39q1J80L5j19j27J70om2N6QRl0j6M6Nj3LM0j25l8J96m9r9q3J71j04K09
3327A71j82M3j61J49K6J14k38J70k4j82J66L1j1j39P8q5L8RJ44j27l3J2OLOM9
$$ y = [-83, 87, 8, 31, 123, 80, -92, -114, -255, 131, 17, 163, -70, -18, -131, 94, -122, 66, -27, 23, -12, 66, 10, -31, 132, -74, -169, 1, -62, 59, 15, 119, -83, -94, 18, 70, -86, 74, 31, -67, 91, -65, -77, -144, -71, 36, 25, 70, -87, 54, 62, -54, 58, -39, 1, -166, -170, -104, 75, 74, 63, 63, 61, 1, 61, -39, -97, 1, 205, 42, -40, -26, -61, -74, -36, -43, 165, -38, 19, 183, -107, -27, -91, 135, 43, -14, 0, 73, -1, -4, -60, -77, 77, 98, -2, -88, 76, 85, -39, 28, 103, 31, 9, -70, 125, -77, 64, -45, 11, 7, -183, 92, -80, -40, -35, -9, -4, 114, 16, 63, 53, 76, 89, -37, 133, 93, -24, 68, -3, -54, 58, -9, 17, -23, 47, -23, -5, 4, 77, 56, 34, -68, 9, 88, 9, -77, -124, -136, -34, -4, -125, 16, 2, -2, -2, 157, 139, 13, -17, 114, -25, -106, 74, 109, -10, -137, 33, 27, -15, 41, 49, 58, 28, 12, 58, 63, 50, 53, 93, -32, -70, 126, 77, -22, -105, 66, -38, 171, -11, 32, -129, 20, 46, 160, -78, 92, 68, -114, 52, 83, 72, -67, 11, -74, -36, -27, 117, -10, -43, -31, -25, -22, -16, 33]
3353C3j5J12j43j24K03j6m0Q7k1M9j01rk5k6k9N9L4o3j03J79o0O8j71K19j25k1
3379d9L9N2n9oL6j01J2J44l3O5j38K7Q3j57J91j88n4J74p9QK24j33n0pL3R4Lk00
3407f9J80N4j68L8Pj29J0o2J49o0q1nJ7J04MJ20q3l4M7l0m1L0O5n9N5p1P8k07
3435a41K41j06Q3r3m9L9j8m7%R5n8l1L7M3j29J66l5O1pk8K7p8N2j0Q9l17K99j19
3463c4O8mo5K02j88P4k9MM4o7M9MPl4J73p0j25Jl1l7O8Q5j26n4J82j73J44k5m1
3492Bj5Q4j63K15k8Jj13N6l3m9M2o5J45l2q3n6K01p3P7q4N9Nj74J34j83O2O8L
3520CN6j45N8J51k62R2P9k1n5Q0o6rJ3J58k00P2pJ8m1M1N8o5q0l8J81n0J00j08
3548A3p1P3o4P2rn7l8J9J09j23Q9j37J13k8K11k41J01N3o9p9J16N2r8J01p3j57
$$ y = [33, 18, 130, -13, -137, 66, 50, 10, 97, 76, 125, 24, 15, -10, -36, -65, -6, 28, -35, -138, 41, -19, 49, -122, 97, -28, -49, -10, 42, -17, -23, 13, -88, -76, 68, 35, 100, -38, -11, 72, -85, 106, -82, -136, 38, -41, -33, 191, 58, 8, 1, 34, 128, 131, -69, 111, 165, -3, 35, 42, -87, -77, -139, 10, -50, -131, -136, -119, -15, -11, 109, 26, -8, 39, 9, -32, -2, 63, 4, 59, -12, 66, -141, 100, -6, 77, -16, -65, -26, -44, -91, -91, 4, -54, -85, -48, -5, -134, 32, -3, 58, 51, 23, 50, -28, 24, 14, 103, -214, 85, -34, 34, 30, -35, 167, -21, 53, 24, 28, 72, 5, 54, 58, 65, 31, 204, 134, 9, 10, -21, -58, 10, 95, -31, -85, 97, -76, 68, 43, 2, -13, 71, -92, 123, 95, 96, -17, 39, 6, -43, -1, -66, 79, 47, -36, -92, 109, 36, 113, 29, 88, 93, -81, 53, -130, -68, 0, 3, 59, -86, -28, 123, -139, -47, 32, 11, -44, 36, -30, -39, -26, 132, -68, 4, -3, 15, -26, 15, 73, 8, -72, -110, 71, 21, 121, 13, -58, 15, -49, 23, 14, -43, -81, -62, 47, -76, 13, -124, -11, -39, 172, -69, 32, 85, 16, -63, 53, 105, 7, 108, 35, -122]
3574a22K2J88Qj37O2O8J6k66K02%q0R1N0j01q7J55Mj76P0O8j62K05j79J20q6J18
3600E1N8l3j06m3J30o2o6j5K47Ok35N2o8J66j56J70J49k17p7q1J00J24o5M6j49
3625g4O7J31j33j2j5nML9M8r8RJ22j24R2j58J62j11L7K9K8m5L7n0O9K5n4N3p8
3653eJ7j8m1N6rn2M7R7j15r9J6J26K8n6r9K13J4n8m4m8J64q2N2j44J55j44L4r0
3681h5J32m3J06j06JJ7j5j3L4l6j01K0J79m6j06kL0J34o2K1L6p2JQ9p4q7K04p2
3709H4j42j11J07P8J21j60J2P6J3j2J7j13R7J6K3k45K94j03j04k2M6J78j60P1
3733F1m3l2j3Q3r5P1m6l8M0k0O1o7J0R3r7k5J24j4l7q3o4O4n3J71r0J6qJ22j02
3762a1j5Qq7K42j28J17l80L43m1j75K75j07l9r7J86j54kR8m1N5L7j29k8P0O9p7
$$ y = [-122, -100, 88, 96, -41, 21, 89, 105, -161, 41, 41, -39, 52, 102, 1, -86, 69, 73, -103, -33, 35, -127, 78, -101, 19, -67, 51, 109, 76, -30, -73, 57, -5, -71, -86, 161, 167, -68, -16, -84, 82, -74, 96, 245, 28, -49, -130, -30, 94, 29, 75, -74, -7, 124, -9, -21, -36, -41, -37, 2, 50, -48, -39, 83, -41, 51, -107, 55, -56, -19, 10, 38, -7, 30, -20, 49, 74, 20, 73, -5, 12, -6, -47, 9, 0, -52, -5, 92, -23, -122, -106, 20, 48, -8, -107, 106, 120, 62, 18, -30, 134, 52, 104, -40, 115, -29, 5, -85, 47, 4, 110, 4, 5, 22, 7, -6, 28, -8, -109, -89, 90, 44, -62, -64, -34, 100, 38, 59, 95, 23, 24, 113, 39, -48, 156, 84, -58, -169, -62, 16, 137, -23, -11, 65, 78, 66, 83, -30, 67, 83, 106, -139, 155, 52, -52, -74, -28, 150, -10, 61, 18, -14, -27, 56, -39, 32, -14, -52, -12, -32, 29, -38, -28, 65, -32, -57, 67, 53, 16, -67, -131, -67, -120, 51, -39, -23, -31, 91, -11, -26, -18, -105, 137, 9, 126, -254, 89, 48, -127, 148, 41, 2, -95, 91, -63, -65, 33, -8, 47, 84, -45, -73, -3, 66, -11]
3788a1Q0j38J51p1K9n5M1m4m3p6J34j00O0o5K06j10L8l2n3n8J98n5j27J38r7J09
3814D9L9j38J09J7j30J28L7j41J09k5j31L3Q1L3j20p5N7J30j40N7Q4o5L7K0k7
3839B8m1o9L5O4q5rJ29N0j39o3O3J78j58m0J49J8j28J6m9M3L5K5j18J9o3J73m7
3866A6o4P4N5o6P5n4ROk2q0K13k88j4K45j94P7O9m5j01J86j43N9Jn6N3J1m9J39
3894A12k77J89K2j45J58L9K3k23N6mj1Q1kK5Nj07P1J6J1K4J1j42%R5p9q6R1J85
3922A38j92J66l9j20k2N3j68Q7K06k63J41J04J6j24J0l5Q5j24j18P1J65q6K4J31
3946A06n9m4O5n6M2n1L0Nm0PNJ13j25J2O8q6J4P6j17J58k17J14q0Q4P5K7K9j88
3974c3L7L6j60k3J75K3j48J22J3K3j8q1l7J6LKP1J4j45N7J06p5K12j35j50K93
$$ y = [-11, 69, -69, 82, 11, 40, -15, 26, -18, -61, -137, -3, -103, -43, -108, 98, -12, 26, -6, -59, -117, 81, 26, -101, 37, -60, 49, 88, -50, 59, 76, -54, 74, 111, -30, 79, 54, -77, -44, 37, 70, -50, -125, -68, 62, -78, -21, 63, -2, 35, 55, 28, -13, -82, -47, 17, -68, -77, 52, 102, -37, -100, -37, 141, -17, -57, 92, 110, -18, -2, -51, -8, 27, 52, -66, -47, -110, 63, 16, -48, 26, 81, 15, 90, 36, 45, 51, 29, -51, 162, -126, -140, 105, -89, -12, 57, 12, -89, 97, -46, 13, 14, -42, 11, 22, -27, 112, -165, 24, 46, -99, 59, 98, 121, -102, -46, -50, -61, 20, 18, 43, 48, -59, 12, 28, 39, 63, 74, -68, -68, 27, -52, -138, -47, 138, -54, 112, 73, -47, -69, -16, -184, -97, 109, -154, -13, 91, 107, -17, -7, -42, 43, -81, -199, -128, 37, -49, -25, 106, 47, 3, 68, 12, 54, 3, 33, 38, -2, 5, 10, 123, -2, 10, 78, -8, 6, 82, -35, 123, -94, 20, -60, 24, 99, 126, 155, -33, 4, 40, -120, -143, 32, 55, -93, 29, 42, 65, 47, -34, -71, -55, -52, -50, 21, 35, -110, -53, 53, -22, 190, 55, -95, 198]
4000A98k24m8RO4l8jO1l8j9j13P6J27K8m0n6k3M7J12j3O1k17J8J1N1kq6K8J39
4028A12j91J24p0n0ML0Q1Pj3r7J04J0m8n3R9J9J75j60Qj3p0O9pj21J96k18J40
4055F7n4m0R0m8j6j05J61j39M3M4N2Ll3j57R1J41n5k55L79l20J69K3j36R9K1m5
4081b0K3l0O9J2o7j7Q9J16k34p4J59j2M5n7L5L7j85J26j04O0M8j06J09K9q6Q3
4107D8m6l0M9j08K5l7J84j02Lq7K10o9l%j27qJ27p8Q2J04j60M7L5mJ1q6NN0j02
4136f7J47j77J31K3j03o0J15j5kP5qr2J35j74J43r4J10j69O6j4j3P6N6j17J10
4161H2p9J1j35M5J60pq9M6J15j38Q6n0m8k1k8j12K26l1m7L1L7o8LMJ57l5o5p3
4189b3L2k9j53K08N1r9m6J3Q8j60N7K6rOL5M4m4J16j27O7l3l6oO6o8J0p6J28L3
$$ y = [198, -26, -74, -65, -1, -39, -40, 21, -17, -36, -149, -73, 54, 82, 42, -14, -37, 10, 122, 109, 170, -47, -29, -18, 33, 31, -55, -27, 112, -79, 45, -25, -75, -71, -41, 40, 47, 34, -63, 41, 51, 3, -50, 49, 68, 243, 83, 91, 78, 8, 77, 70, -51, 145, -73, 67, 13, -27, 63, 15, -1, -106, 55, -84, -41, 3, 55, 58, 25, -132, -41, 100, 45, -210, 169, -151, 18, 41, -95, 4, 25, -20, 3, -27, 42, 54, -13, -30, 59, 175, -59, -133, 26, 14, 59, 2, 37, 74, -111, 15, -89, -29, 19, -87, 22, 51, -35, 48, 2, -28, 21, -87, -62, -99, 85, -17, -14, -101, 109, 40, 37, 37, -90, -98, 29, -49, 33, 137, -23, 24, 59, 55, 66, -20, -15, 35, -67, 80, -97, 34, 57, -46, -106, 9, -6, -8, 67, 59, -33, 102, -72, 71, -23, 87, -82, -16, -30, -43, 33, 89, -28, 82, 3, 14, -121, -76, 84, 77, -12, 34, 149, 11, 97, 47, -1, -22, -50, -162, 64, 33, -14, 17, 54, -14, -11, -7, 150, 115, 50, -23, 9, -20, -173, 35, 86, -13, -59, -46, 42, -118, -61, -35, -44, -38, -3, 41, -3, 113, -14, 53, 20, -16, -22, 44, -24, -14, -90, 38, 71]
4218G1k1jj69J20m3J66j76rl2P8J6J6%j07K75j24M5k56J20J39j37J9l9p5J68M8
4244I2N3j86R6j12M7M3R8r7pJ4Ql1q3M5m4L5J08j40J56r0J7L4N2J9j21N0r0K8
4272fl9p2J18R6k04R2P7p6J08j02k7J09k05Q7J54j74Q6K1j47J11QK3j2K5r7O6
4298B0N4j55Q0O4k8k2J3j34j6K01lj20L6q4J17L4n4M7R3j75J59r9p9L3J06l8Q2
4325A32p4r1J21JJ3j79L6L6L4L5p2J08m3k6l0n9L0j7M5k7N3k2L2J7j18J65j29
4352b9j5l1O3L5J1K4mj15p5M1K0J17o9J43m6j88J3J59M4j99O8m4j07J04J20l0
4378A0j12J31pMk2j44J07L4kj56J3K99n8j17p3Rq4K22J2r5o3J86k30J02n5J27
4404C8q8P3M5n0j0K9Np4R2n9lo9nJ10J35j59k8j01N6O7j0m5M1P9n0m4O1N5Lj04
$$ y = [71, 50, 49, -120, 0, -43, 123, -53, -62, -94, -16, 0, 16, 16, -91, 184, 60, 105, -151, -31, 108, -29, -10, -49, -124, 44, 92, 145, -41, 55, -57, -10, 33, 131, 34, 27, 41, 49, 18, -65, -20, -64, -29, 79, -61, 95, 5, 22, 56, 108, 127, 6, 56, -34, -6, -45, -117, 1, 97, -107, -15, 62, -14, 94, -8, -35, 74, -131, -44, 110, -64, 22, 43, -104, 7, 15, 38, 26, 51, -46, 20, 74, -81, -1, 63, 35, 13, 26, -108, -124, 77, 74, -46, -10, -94, 23, 57, 3, 50, 143, -32, 127, 28, -51, -18, 88, 50, 132, 58, -33, 88, 89, 102, -77, -41, -5, 29, 64, -8, 100, 57, 31, 1, -58, -28, -45, 0, -27, 26, 4, 36, 53, -65, 100, -29, -44, -75, -12, 23, 34, 58, 54, -61, -136, -95, -75, 42, -27, 116, 70, -118, -105, 54, 98, -101, -33, -77, -184, -80, 40, 10, -102, 29, 22, 26, 4, -140, -33, 1, -1, -157, -144, 155, 97, -20, -93, -84, -168, 54, 66, -29, -92, 94, -136, -34, -89, 38, -50, 23, 68, 18, 8, 37, 42, -32, 60, 1, -2, -71, -76, 34, 169, 10, -18, -119, -63, 4, -6, -51, -10, 69, 19, -25, 36, 91, 94, -10]
4434a0M5p2o0J41j00Q9o5N5j8j34P0J03N3r1k00K63o6O2q4M1l0j01N1K03o6J0
4460H9J7k09J00l5Q2K0j4k0p9MON9j60K16j99J08MJ8K5Qp3L6O9L8o7r2J49k8q8
4489a6N0j05J43r4J16l9o5Q9j52N2M9J11p5q9J28o5OK1j34l4J64j53N0l9J57p3
4515Cj06J60j93J25J13j39P9r3J41p6o7P8r8o3J20J80j24N4k14J31O2j7R1j91
4539d4lN5J4m3K2L5j06M7J73j59Q9j24mo6Q9L0n8J6Mj02J34Kl3K1N9j04J8k8P
4568e9P0O3m4m8PJ60j19jq2Q0M0m2o3rkM4Kn5J97p0n8R3j03OM6K3R8j96K9p4J01
4599C4q9K4M0M3M2j33j6J03L4o2l4N8o5M1l0OK5m7J8K7k3pj7J6j51K74r6k5J24
4628A14j3r2j3O8j41j1J23k7m9O9M1q7N2O6l7J02j41j65K10n9j16O5j0M4n2J52
$$ y = [-10, 35, -37, -97, 44, -56, 33, -32, 23, 5, -129, -59, 44, 97, 6, -194, 69, 3, 65, -19, 22, -8, -109, -58, 145, 79, 89, 106, -103, -3, -38, 44, 64, 50, 30, -49, -45, -39, 20, -140, 76, -123, -15, -11, 7, 32, 40, -33, 3, 72, 110, 43, -49, 100, 72, -16, 34, -71, 72, -22, 94, 55, -10, 79, -73, -21, 28, 139, 64, -25, 103, 38, 44, 65, -69, -103, 61, -92, -42, -81, 76, 3, -103, 57, -136, -11, 102, -37, 42, -51, 90, 14, -53, 25, -73, -136, -16, 164, 40, 94, -120, 11, 73, 56, 147, -44, -47, 8, 22, -21, 1, 36, -70, -23, 150, -9, 80, -44, -48, -114, -25, 5, -53, -37, -33, -135, -1, 1, -32, -11, 48, -56, -38, -66, -59, 11, 74, 30, -18, -11, 149, 30, 29, -53, 27, 67, 25, -38, -47, -49, -5, -3, -58, 139, 69, 11, 104, 1, 7, 53, 76, 174, -22, 7, -67, 34, -55, -31, 9, 52, 94, -39, -55, 48, 82, 20, -14, 44, -21, 20, -10, -4, 21, -26, -8, 19, -4, -11, -28, -12, -163, 111, 15, -10, 114, 101, 9, -4, 64, -77, -88, 35, 8, -41, 28, 69, -18, 34, 100, 63, 165, 24, -141, 69, 10, -106, -41, -51, -7, -59, 93]
4654I3q2P3j68J39m7Q9j30k4J21k5o3N3K2jj29Q5M6j17J14N1j44O2Rn7m3J02n0
4681b1J7M2Qj30L5J60n4j11P5Mj39J36m6L7j3L1J4k9j1M8k8K3O1p5j36J00J46
4708A44o3j70nJ53q3L8R9j66j9R8r7P9k9O8q8J20j63J49n6K7o0L6m9m2J15j60
4734a24J42J0K9q0l2K1M7k6j8o8Q9q2rK58r2k2j14Q8m0p0J23qr2K3J23j40N8K5
4762A9K6q2M8N5r6N2J2j7j47K11k7k3O5p3P3L7j58R4j6j07R7L7J7j26%J9m8j7
4790g5M2J2k2l9R8J5Ql8JR6j59L8L3L1q6J19j73Q6n8R5p5J26l1j5Q2j47rK3J37
4819A15j33k8J05n4Qo2J37r9p4O6l3O3rJ48k40K0K8l8l3N8m2J27j9kp4rR5r8J63
4848H6j11J2J4nQ1j20J50m7j44J27m4N6p0J5J60j71M2m3q5J17K8j78R4n4L5R9
$$ y = [93, 11, 84, -84, 55, 8, 97, -33, -57, 64, 39, -24, 29, 51, 50, -79, 6, 52, -65, 49, 100, -44, 18, 27, -30, -73, 29, -21, -4, 38, 46, -84, -49, 111, 57, -54, 21, 25, -114, 22, -24, 13, 0, 31, 45, 16, 5, 53, 25, 48, 109, 34, -102, -2, 144, 81, -89, -94, 59, -24, 14, 113, -53, -72, 26, -71, 8, -21, 47, -41, 79, -84, 65, 9, 36, -24, 12, -37, -79, 36, -124, 18, 28, 57, -23, -55, -34, 13, -13, -31, -99, -10, -92, -101, 157, 65, 43, -71, 17, -23, -93, 30, 22, -70, -47, 76, -64, -6, 19, 45, -37, 11, 66, -30, 22, 34, 17, -130, 81, 54, 31, 96, 23, 96, 133, -25, 69, 53, -54, 43, 80, 97, -29, -29, -10, -58, -75, -33, -21, -43, -82, 16, 31, 39, 1, 2, 98, -61, -23, 10, 41, -45, 74, -99, -13, -71, 24, -51, 75, 44, 29, 111, -36, -45, -22, 115, -18, -46, 59, 5, 13, -49, 88, -11, -85, -19, -52, 11, 2, 150, -90, -70, -42, -80, -113, -55, -97, 30, 11, 9, -65, -74, 21, -77, 86, -25, -13, 1, -4, 77, -43, 107, 60, -84, 43, -1, 55, -15, 0, 160, -11, 31, -12, -97, 20, 48, -130, -36, -90, -55, 44]
4874D4r5O7P1j34J03K8l13K66L6o5N9Ok5j23RN2j11J38l8J5O3q0J0L7n9J10o4
4901GJ04q5k8j28P3J34J4j31l8J51j04J1kp5J07Mq2O4j33J86m3k1k6L5j10M5K5
4928d6O8N1o8j25J88L1n3po2J23j04q9j31K97N4j82J88j66k6J2K%J07j11J55j59
4954e3Q8J7j70K66p5J3N8q6LqMn7N1R9k5k80J42mJ7P1k33P7J04n1m4K02k8k08
4982a10J36o5o7J05J6m5J31r4p6J03q7K7P5j49L1K6P2n0J64k03M7mk6K0N6j37
5008a04J09J30k08P9j3O5r5R6j48M6N6m9m1J24k0p5J1M6j14P9N4j01N8N9o5J3
5034hnP6l9j15J05m2r6K33j70M8Ko9J98j80k6J32p0J06q0%j15N6J5R9j21J2N2
5061bPL2L1l2M7j14n9K45k54N0pJ38q8p5J80m9J1R1k06R7R5j21J15k55J96j22
$$ y = [44, -51, 16, 87, -47, 56, 84, -229, 37, 73, 8, 67, 73, 48, -75, -66, -14, -125, 13, -25, -10, 53, -27, -17, 20, -39, 71, 7, 111, 26, -2, -130, -57, 77, 91, -40, -78, 73, -31, -20, -22, -97, 10, 14, -68, -4, -137, 49, 6, -15, -41, -6, -116, -71, -46, 22, 73, 5, -120, 68, 99, 46, 39, -23, 100, -4, -93, -224, 73, 127, -55, 133, -33, -59, -47, -45, -45, 62, -49, 106, -53, 35, 52, -118, 148, 73, 86, 144, 58, 61, 53, 57, 0, 51, 150, 125, -155, -13, -17, 0, 71, -162, -85, 19, -32, -76, 126, 98, -110, 26, -39, -106, -1, 15, -30, 101, 7, -69, 34, -53, -26, 49, -100, -69, -43, 29, -21, 143, -60, -13, -17, -43, -23, 33, -104, 5, 135, -73, 6, -7, 58, -37, 59, -89, -43, 13, -36, -77, 47, 27, -48, -37, 9, -105, -26, 28, -73, -15, 44, -21, -8, -13, 63, 24, -91, 14, -28, -124, 109, -61, -13, -11, -80, 118, -62, -88, 44, -26, 80, 0, 0, -115, -59, -44, 55, -66, -54, -2, 5, 37, 68, 36, 83, -31, -90, 155, -99, -49, -56, 82, -6, -81, 99, 50, 61, 152, -54, 43, 138, 17, 132, -123, 73, -49]
5087d9M6m9Q1Lj33O4%K0j6j32PJ58J38j52p7J24j48J05No5M6p1J83j20l0P3J10
5114A21o3l3j1o3M4J64r8R2j57J3j1n0n4Q7k4J72j12J0m6n4K34j88O7o5J41j14
5140BpJ17j28j15K14l7M0j02mk4R4lJ9m9P7j12M2R1Qj76J13k22K11p2j0J19r7
5167a1J32j47L9J7l5n0m1Q3N9J21k92J10j3j5J64n6m7qO8r8Kj06K26k17J26q8
5193g7RN7Kj62J79K3k9Ok0j06J23L2o9N9r5j3J31m5j1n7J47q3n3m3K3pJ02P0r9
5222fo4J12m6m8QR3Nl4k4j5k0O0J6r7p1J41Pn3O6j4j05K9j6J6J25m5j10J0J30
5251E0o7K3K1n3J58l2k31J30K4Q2l31K21K0j16P1N1r5Q7j0j00N9L6O9j33Q1j17
5277a02J13rM8j0M4K4r6N4j68J24Mn6N5l5O4j76M3Q4m8K0l5J22j00R0l6O8m0r4
$$ y = [-49, -3, -52, 29, 32, -101, -37, -37, -17, -33, -165, -158, 0, 138, -14, -91, 33, -115, -10, -5, -70, -24, -95, 88, -32, -62, 11, 121, 58, 25, 14, -49, -5, 159, 61, 153, -4, 9, -2, -52, -106, -19, -43, 129, 17, 27, -19, -73, 161, -27, 40, -25, 116, 2, -5, 112, -16, -131, 83, 46, 86, -16, -20, -44, 50, 47, 66, 17, 94, -18, 24, 115, 123, -53, 60, -162, 49, -23, -33, 86, -11, 121, -26, 13, 30, -5, -55, -96, -13, 46, 167, -125, -15, -28, -43, 121, 65, 18, 10, 78, -20, -18, -124, 102, -115, 11, -77, -68, -11, -9, -171, 8, 31, 2, 8, -12, -118, 5, 37, -32, 27, -68, -81, 50, 5, -6, -63, 84, 1, -52, -95, -72, -79, 23, 93, -6, -70, 42, -4, -52, -44, 49, 54, 20, -4, -19, -39, 21, 37, -60, -131, 10, 17, -36, 30, 16, -89, -60, -76, -60, 65, 20, -90, -80, 50, -17, 6, 27, -26, 132, 100, -131, -1, 23, 105, -226, -5, 15, -101, -30, 21, -74, 13, 3, -97, -38, -2, 67, -66, 15, -102, 11, 2, 50, 40, 84, 108, 12, 66, -102, 22, 26, -30, 25, -10, 54, -122, -79, 5, -43, -23, -58, 64, -36, 54, 18, 86, 46, -48]
5305d8K3J85m0j85P5L3q3LkJ0k8M1qP3j3p8R1j13J18p8l0M5m8k9O6Q8M4q3l7K8
5335B0K2n2M1J0j8r1L0L4O8r1L1j5P3L1j20kN1J67k21J1L0nQ5J0k9k26J49r5J35
5364C3M1k1r0M1j0L8l8p4J2J73O4k08l9J74p0m4P1j41Q9j26M7R2J24k32P3RL1
5391A9l2r1J09M3q0L8O6Nr0J01j32m8J08r5J23m3r9J36J6j83K9R7j13J52j48J34
5417B2k6Q9M0j68R9l8k7k8J98j67K9J17j63L2J23j47P7o2j2q3n0J51p1L1J5n3
5443g2L5L7lP6j7o8NJ31j53l2J70k03K28j99LJ02p1J27r4k4J19j52pk9K06j72
5469e7J14n7R6m7j2m9j35K55q2J3K9K8j50J76l8j44R0N0P3r7n1L3M2j26K9m2m2
5496a01J30p9K7P9p3n0R1j2p5J06j25J55m3p9O3k1j0N3r4J30m1J7r1K5Q1L4k8
$$ y = [-48, -25, 160, 120, -65, 10, 43, -40, -37, -39, -29, -57, -16, -24, 49, 36, -42, 49, -64, 54, -24, -54, -9, -57, -86, -20, 68, 112, 29, -8, 20, 42, -10, 31, 41, 23, -68, -38, -4, 64, -27, 4, -11, 62, 93, -27, -29, 22, 189, -32, -21, 9, 4, 89, 99, 70, -156, -7, -102, 33, 74, 53, -37, 4, -6, 32, -6, -80, -68, 105, 169, -39, -78, 96, 26, -18, 53, -88, 1, -125, -78, 14, 138, -94, -21, -12, 19, -13, -104, 5, 48, -32, 6, 72, 77, -13, 88, -44, -92, 16, -79, 44, 1, -98, 38, 54, -129, -100, -3, -116, 36, -112, 22, -4, 85, 125, -43, 56, 18, -9, -37, 161, -6, 23, 140, -23, 9, 132, -15, 62, 0, -12, -95, -145, 6, -65, -34, -19, -72, -37, 0, -3, 73, 56, -12, -7, 124, -29, -61, 109, -94, 134, -65, -62, 40, -31, 96, 2, -22, 97, -55, -62, -91, 115, -57, 57, 0, 96, 49, 37, -12, -147, 108, 26, 39, 68, 96, -54, 122, 84, -60, 30, 80, 153, 56, 5, 38, 80, -46, -17, -59, -101, 29, -50, -23, 56, -17, -67, 24, 12, -63, 43, -82, 73, 30, -49, 14, -7, -17, 36, -58, 72, 31, 48, -43, -18, 63, 97, 69]
5523F9L7j18J75j24j9J39j49k3K4n8p4J6K9j2K00n9m6l4K0J31r9n6K6n8j3J29
5549E3j8j23M1J31j41P3J4R3j00j49R7p7K66j84M1K5P7j44J11O2j03p5J7Lm5J4
5575d1l3J14r7J01j09N9K6Qj31P9k1n5J74m6j9M3M0o2J3O0j62n9P1k8Q8n5P2n7
5603b7j8M3J3J02O6r2j41J01j8lON6J6j59J07j08L7j9l9O5O9j94J05Q3j17L5P5
5630D4j25L6KJ27n9Kn0n7J19j03K5N2Mn5LJ83k67J17kJ11j54O6J8m4L5J07j13
5657B2N3q8j06J69q9o2J00NJ2J25j38m2P7L4j70J25K1M1m6j8o8O0l8Qr4k7J14
5684b0J04q7j0j61jL41k53J08Q2j93J29j41P5N4n3N2R6j50m0L1p7J43mkK5j81
5710a33J52kn3K3m5J7qN0k5J3o8J55j23Q8j8J47r9j03KK21j93O6N3r7q0j14J51
$$ y = [69, 106, -12, 163, 39, 20, 159, 10, -13, 11, -47, -121, -105, -76, -88, 112, 53, 7, -27, -7, 124, 25, -31, -5, -63, -76, 53, 35, -88, -47, 84, -57, 16, 30, 123, 23, -126, -29, -106, 160, -24, 17, 42, 119, -25, 86, 148, 45, -30, -13, -10, -55, -41, -74, 40, -57, 44, -65, -6, 20, 28, -103, -24, -45, -100, 74, 28, 9, 52, 92, 30, 43, 103, -59, -118, -47, -75, 13, -42, 30, -27, -45, -2, 11, 113, 179, 87, -54, 47, 29, 26, 32, 88, 104, -55, 52, -56, -19, -38, -77, -12, 57, -137, -32, 51, -66, -31, 44, -81, -45, -43, 84, 25, 27, -23, -80, 39, -64, -39, 13, 17, -38, -35, 148, -119, -2, -4, 107, -47, 19, 37, -7, 28, 135, 22, 75, -13, -119, 50, -39, -101, -1, 4, 16, 141, 3, -39, 38, 72, -98, 27, 48, 89, 43, 25, -43, 17, -21, -13, -107, -134, -20, 84, -3, -13, -174, -175, 166, -87, 21, 103, -90, 39, -102, -27, 27, -26, 26, 122, -28, -68, -37, -114, 29, 25, 23, 48, -133, 19, 17, -36, -13, -58, -41, -49, 1, -24, -11, -79, 76, -47, 41, 23, 170, 71, -32, -30, 191, -2, 64, 117, 20, -60, -174, -23]
5737b3J4m4J21p7L4m2J7j9o9K2Q3k8N3J03j71Rj01P3J09p3P4pn6qlO6k0o3n7O3
5767b0L6q3J6K1qQ4Nj46J03r2KJ16j23J4j1J53r2N4nM0j10j0lP5o7q0K48j0j81
5796g4Q3mJ4P4J5m0kj0j24N0R4o3k7Q6j39P8P8j43LJ2k6J05j08M4P1Qn1J5jLK0
5827D1m6k1r8J91K7m7q3LP9O1j79Q5N6l3L8q8q4J57K6j34O3J8p9n7J63o7o4J31
5855E9n6o5K09q9o4Q0J5o0K5n2o9J9J22k5m1P9q3m6P6l8Q1j66J03j5J1j25nM8
5883g2R9q3J13r5Q3j16N2K0k0J06j31o2J13n3J11l7n8O5q7J3pQ7p3O4j3P4m2N4
5911A05j74K00p6O1q0J1K9j29j9J21K4k36K12m6L7K8k8qOK9M0r4p0K6Q0r0K74
5938B33j39j31J48q3K8r6N6m8RP7KL8q8J8J0j0j32J46j31J12o6j23K35o4n6N0
$$ y = [-23, -9, -53, 68, -9, 25, -17, 0, -19, -88, -66, 17, -11, 42, 145, -26, -17, -118, -45, 64, -9, 65, 58, 2, -6, -9, 57, 37, -26, -83, -20, 16, -67, -51, -30, -38, 46, 51, -95, 8, -84, -82, 34, -89, -75, -86, 67, -25, 29, 24, 64, -46, -56, -59, 16, -51, -131, 117, 107, -74, 9, 5, 19, 93, 108, 68, 66, 56, -68, -18, 76, 13, -14, 72, -67, 11, 89, -54, -51, -39, -65, 40, -68, -24, 47, 55, 4, 19, 18, 21, 41, -5, -26, -124, 67, 94, 47, -36, -33, 46, 107, -72, 13, 69, 36, 74, -14, -98, 59, 85, -49, 14, 32, -47, -104, 59, -8, -72, 59, 3, -62, 147, 58, -6, 74, 89, 29, 54, 2, -67, -48, 74, 49, 8, 87, 4, -42, 34, -4, 77, -89, 14, -1, 10, -115, -120, -72, 27, -56, 57, -38, 45, -71, -19, 1, -19, 87, -44, -106, 7, -46, 65, 28, -30, 35, -52, -39, -46, 41, -32, 32, 19, 93, 51, 105, -69, 131, 55, 116, 36, 47, 76, -53, -72, 49, 73, -163, 49, 3, 40, 68, 40, 32, 38, 67, 107, 13, -57, -31, 49, -41, 233, 94, -37, 111, 28, 56, -40, 16, -32, -23, 54, 56, 94, 6, 24, 34, 24, -108, 38, -93, 19, -47, -170, 65, 1, -55, -5]
5964eM6K3j44L7M3Nm9L1Rj7L1j16K1J85j45P5j00L5K3Ql6j49K20J2l4pj5rj08
5993a30MM7O8p4R8nP9q1LK5k6nL8Nk0J6J00k17J26j16R4n9J46p0P8r9m1J59o3
6022H0j13oP8p8rN7oJ00K7m8J2o5n6O7Jq0k6O0j25K05j32n9J12L2L2j13j62J26
6050h9R7j7n9j7K09j15M0j22J97j7j56m4N0K2P2j39K02j02nN1p9n9j0J74n6P1
6076I9j47Q4O3m6q0L5j6P3j5j72Q1J1j2M5K4Q0j10l8O9L0j7m2Mm5J6M8N2k22J24
6105b4kN3j81K39k6J58j36o8Pj01J36q2L9L6k1KPJ5m0jm5jO0k5l2nJ5J1J45q5
6135D8j19J01k0K1j7L7k0O0p8J0Qj58J06K9P1j35P1K5K0j00qJ10p2K7j4k5OrQ0
6164E5o9J4q5NL5O5K8k5n7O1n1n4L1J5L8m4R6j94O3J71j47k6N%P0M8j4j94K23
$$ y = [-5, 41, 64, -80, -43, 0, 5, -44, -13, -4, -21, 10, -106, -85, 100, -45, 30, -70, -35, -12, -4, -40, -189, 31, 43, 9, 2, -13, -22, -130, -126, -79, -11, -85, 13, 8, 87, 6, 9, 34, 8, 3, 41, 46, 26, 42, 142, -75, 51, -65, 29, -30, 116, 46, 124, 25, -16, 143, 80, -33, -39, 39, -39, -48, 9, 3, 103, 130, 82, 94, 29, -27, 40, 41, -39, -65, -5, -130, 75, -57, -116, -4, 28, 60, -53, -215, -89, 8, -9, -68, -85, 124, 9, 49, -73, 124, 107, -49, -93, -43, -21, 51, -88, 114, 12, 7, 58, -21, -80, -90, 84, 28, 99, -48, 36, 99, 53, -27, 8, -8, 65, 50, -122, -41, -30, -42, 3, 27, 107, -3, -41, 28, 58, 41, -1, 3, -42, -26, 22, 74, -148, -24, -26, 27, -154, 85, 59, 217, 81, 13, 20, -81, 55, -27, 12, 48, 27, 29, 36, 51, 11, 10, -35, -36, 24, -1, -33, -38, -23, -12, 133, 48, -71, 30, 10, 31, 14, 51, 31, 91, 13, 23, 31, -127, -21, 8, 79, -56, 15, 40, 60, -40, -48, 62, -10, 17, 3, -22, -16, -25, 55, -14, 0, -85, -80, -45, 20, 48, 23, -34, 27, -24, -78, -47, -32, 6, -38, 58, -136, -73, 98, -49, -75, -70, -70, 0, 48, 34, -160, 63]
6193F3K3O0k27R9k3n0P2o0K3p9J28R0j69j1J19r9N1K9k1j3nJ9O5j69J10M8j21
6220d8R5r2J13K1j70J7J26j05LL2J1j04O7Q2j11L1P3r6M4l8K7J09L1m0O1N0k20
6247c1oJ47L3k01M2L2k1r7J10N8j00L1O9J9K3j60M5N2J23j41m0J07j8j48J54n3
6273B9O9Rj28N2o3j4J06Q7j71r5J25nk6J46j14j02J33j57J58M3r3L9O8p1j71R6
6299e0P3l1J04q5M7nm2P0m2r5r0J35o5J56Kj22J7j6j0Q6m8J15j49J46j16k8J39
6326I6j38J28j54J12j0J8q6k4j0o8J48K1%L7n9K6P8j15R3j20J38j87R4j17J27
6351B8o0J36l6j02p7J40K7k4m4n4J04k4q0K4J46j01M6n6J6k6K4j0J70m6j14L2
6377C9M5j15K4k4p9J15L0n4JQO5j40M1Rj1Ol5K25j92K7j18K8J23M3J7j55Q8Q7
$$ y = [63, 86, 146, -81, 18, -5, -55, 17, -43, -20, -99, 29, 119, -50, -61, 58, -41, 10, 39, 18, 5, 0, 19, 84, -85, 25, 73, -48, 47, -45, 68, 89, -81, -64, 62, -43, -40, -8, 3, -101, -34, 48, -63, -32, 41, -55, -11, -49, -22, 87, 118, 78, 139, 189, -31, -37, 110, 143, -58, -16, 16, -5, -102, 8, 66, -34, -3, 66, 85, 108, -52, -7, 45, 168, 27, -13, 94, 76, -72, 82, 29, 98, 107, -21, 31, -32, -46, 60, 147, -24, -119, 6, 1, -25, 121, 7, -95, 38, -119, 39, 82, -11, 28, 96, 25, -146, -50, 23, -8, 96, 11, 58, 53, 11, 81, 39, -56, -146, -11, -76, 80, 82, -40, -23, -39, -49, 37, -11, 104, -45, 101, -15, -43, 96, -42, 86, -68, 44, 34, 52, -34, -58, -68, -136, 12, 33, 33, 70, 11, 37, 115, 0, 93, -27, 111, -76, 18, -99, 28, -32, 104, 68, -34, -111, 29, 56, 32, -12, -66, 38, 14, -66, -42, 104, 3, 49, -7, 9, -17, 7, -3, 167, 121, 7, 39, 84, -31, -7, -31, -110, 5, 35, -19, -18, -10, 55, -85, -44, -35, -46, -40, -75, 150, -42, -15, -133, -105, 18, 61, 78, -77, 11, 98]
6405I8n3j04K5J21j12L7J1r9J25k0K5m1K4j36k7J73q8R5j48J86j48jN1J24n1j14
6431d7Q%J4QK9K5Q3k07J86j10M2j16J64K1q7o6P6m3J12m4j24L5J06j97J36k7M5
6458B2M3N9j40Q8Mk6n5R1l4k6M5j50Ol4k3J64nj08N1Po5K4J56j13J0L7k4l7o2
6487i5K06j77P8J0o2J17m3l0J04j26r1J79j30R8Kj0j09J88n8k5j4k4Q8j65J18
6512B9N0q4m8P1K1m8Ql2J58j26q7N5p6P2R3j67N0J4l7o7R6J12Pj9o2P2p3J7k2
6541b3Pn8J64k3k7N0j19n8J02J35j88L2k0K8J44j14j57O3J33J0j30KL1Q8P8j06
6567D4j14P4l6l4O0j6K8q6J9K15j41l4P0j41P9O6m4J36j35P4j1j04q6Q6k2j02
6593a55J77n5L9p7K4J22k44J62m5j14J52J86k27J5Q4L9Lm5j0ML8o0K5M1q9N5j21
$$ y = [98, 45, -59, -34, 87, -25, 12, 23, -76, 49, 29, 54, 13, 37, -99, -126, 47, -41, 54, -94, 92, -56, -57, -6, 118, 67, -47, -39, -39, -25, -17, 12, 37, 120, -87, 99, -11, 31, -85, 79, 100, 13, -53, 23, -20, 92, 48, -76, -41, 65, -132, 4, -23, 22, 65, 124, -16, 72, 76, 50, -5, 86, 52, 26, 71, -79, -73, -107, -130, 34, 29, -79, -28, -21, -86, -62, 94, -19, -9, 28, 4, -33, -95, 111, -66, 12, 22, -40, 77, 34, 4, 108, -18, -109, 70, -60, 38, 40, 30, -79, 109, 51, 26, 12, -12, 76, -89, 29, 79, -5, -53, 18, 39, -9, -1, -33, 125, -1, -88, -33, -109, -37, 56, -111, -61, -47, -84, -151, -55, 57, 64, 45, -17, 55, -18, -1, -23, -16, -74, 90, 67, 40, 90, -29, -87, 15, 150, -38, -6, -26, 2, 146, 32, -125, -62, 71, 81, -49, -47, -16, 72, 150, 44, -70, 4, -32, -66, -6, -22, 6, -80, -61, 154, 13, -21, 49, -92, -13, 53, 9, 145, 10, 84, 73, -31, -117, -31, -53, -155, 22, -33, 6, -71, -47, 75, -169, -7, -52, -166, -14, 172, -55, -40, 44, 83, 86, 41, 31, 35, 73, 13, 38, 79, -10, 45, -76]
6620g6J10m7lk6M4jq8Q1J5Q7j83J12m7mQ5k7j2O4M1j15m2K9j22J9R7j4J04j73
6648i2J12k5L1j13M5N1j04P1OjM3rq7J77j01m7m6J22j03J26k5k7L9m6j54J51l4
6675d0M1K2N3j11KN7j09k1Q5J01p1O2o2O6j6Pl7M2O0j75Q8k27K95m3q7j07Q4J68
6703A27j30n1PP3n6J16j9m0pJ28k12J5N0L5j16N8l0N1l0L8Nl6O3P0j31%M7j19
6731i4J53m1m5j2%N6m3N1K9O1p6n9n2R0K7r8K1R2Or6RM2Kj04M1L1L7j53J29N4
6761E8j56RJ30l5l6L2M4o1J06r2l9K4M2l6J31k02J18q0N7M3j92N1O9O9k4o9K4
6788a5r5J12r7R9M1P0r2m6J01j44N8L9J0l1q5L4R2l1l6N3j2r9J94j05j34J79P
6815F7n4Kr2LK93j13j09J35j51K16k02J2PLo8J6j0J82j20m3n4Q5M%kM7N0M3j32
$$ y = [-76, 34, -13, -16, -42, 2, 1, -87, -6, 9, 96, -87, 25, -22, -26, 59, 32, 20, 84, 125, 10, -32, -3, -125, -106, -9, -23, 81, -92, 20, -5, 26, -87, -42, 9, -95, -24, -18, -19, 24, 15, -72, 105, 4, -43, -89, 33, -70, 56, 31, 4, 43, -3, -157, -6, -40, 1, 23, 76, -35, -33, 24, -85, -106, -21, 80, 9, 71, 9, 75, 59, 66, 29, 71, 131, -44, 44, -183, 112, 69, -18, -125, -41, 127, -3, -54, -47, 26, -30, 86, 67, 27, 20, 148, -64, -49, 1, 36, -80, -22, -52, -1, -31, 7, 12, -24, 39, 109, -22, -22, 25, -94, 59, 18, -27, -39, -39, 17, -26, 25, 54, 115, 39, -20, -72, 18, 45, -53, -32, 60, 66, -30, -21, 21, 23, -81, -40, -9, 28, -125, 4, 58, -98, -89, 41, 6, -30, 2, 46, -15, 91, -1, -40, -16, 26, -10, 121, -81, 37, -43, 14, 57, -135, -84, -15, 54, 30, -39, -15, -110, 2, -95, 4, 45, 115, 23, -23, 78, -66, -8, 31, 41, 10, -75, -41, 51, 20, -16, 37, 25, -74, 120, 15, -119, 60, 67, 13, 15, -77, -74, 219, 106, -3, 132, -19, 197, -5, 7, 14, 17, -51, -35, -45, 137, 17, -26, -80, 5, 9, 9, 7, 54, 104, 147, 15]
6844A5J0j34J02K6Q6j65L0P3j50K55j71J87j13m9J51j21M5n7j70K14q3R4MlL1
6869A07j94J01lo9L5R7%p3P3R3j95N1l9l4P2l1n8J20p3J35j24q9J37n9O7J29k64
6896h8K0N2L6J13j93R9n6P1o3j17Q8o%J00j75J10P3p8N8k09J29J09j77J25Jj4
6922Hj27N3L1L8M2l2m8J03K8j14R5l4j07O2Q7o6j31K09j05j38J08Kk6J81p2m7
6948@J1k8n3m8J96j69J35j01P2L9L9r8mL9J3N7j84M4r7J14N7mp1p7N4J70nj04
$$ y = [15, 25, -109, -7, 19, 105, -60, -30, 43, -107, 148, -23, 164, 51, 2, 153, 32, 77, 20, -150, 64, -19, 75, 79, 76, 107, -87, 14, 11, -58, -23, 74, 74, 1, 74, 167, -28, 23, -16, -50, 22, -9, -67, 53, -20, 115, -9, -98, 39, -20, 47, 176, -88, -68, -16, 20, 133, -60, 39, -17, 54, -9, -126, -38, -44, -44, 56, -119, -9, 64, -14, 44, -165, -36, 73, -104, 21, 22, 8, -119, -66, -35, 3, 45, 13, -35, 68, 96, -18, 77, 43, -64, -2, 85, 19, -112, 97, -8, -146, -38, -36, -62, 119, 47, 0, 11, -17, -70, -118, 78, -91, 44, -57, 15, 54, 93, -5, -9, 30, 43, 100, -84, -40, -137, -23, 34, 30, -41, -118, -64, 106, 101, -3]
$$ [...]
8191a8
##END NTUPLES=NMR FID
##END=
