##TITLE=1H_SA-61.242
 DMSO-d6, 8 sc, 
 8.06.2021
##JCAMPDX= 6.0         $$ Bruker NMR JCAMP-DX V2.0
##DATA TYPE= NMR FID
##DATA CLASS= NTUPLES
##ORIGIN= UXNMR, Bruker Analytische Messtechnik GmbH
##OWNER= root
$$ XWIN-NMR		Version 3.5
$$ Tue Jun  8 13:29:19 2021 Russian Standard Time (UT+4h)  she@DPX200
##.OBSERVE FREQUENCY= 200.131506
##.OBSERVE NUCLEUS= ^1H
##.DELAY= (6, 6)
##.ACQUISITION MODE= SIMULTANEOUS
##.ACQUISITION SCHEME= undefined
##.AVERAGES= 2
##.DIGITISER RES= 18
##SPECTROMETER/DATA SYSTEM= spect
##.PULSE SEQUENCE= zg30
##.SOLVENT NAME= DMSO
##.SHIFT REFERENCE= (INTERNAL, DMSO, 0, 15.7039)
##AUDIT TRAIL= $$ (NUMBER, WHEN, WHO, WHERE, WHAT)
$$ ##TITLE= Audit trail, XWIN-NMR		Version 3.5
$$ ##JCAMPDX= 5.01
$$ ##ORIGIN= Bruker BioSpin GmbH
$$ ##OWNER= she
$$ F:/spectra/data/she/nmr/H-F/1/audita.txt
$$ ##AUDIT TRAIL=  $$ (NUMBER, WHEN, WHO, WHERE, WHAT)
(   1,<2021-06-08 13:27:45.15 +0400>,<she>,<DPX200>,
      <created by zg, POWCHK disabled, PULCHK disabled
       configuration hash MD5:
       00 E9 B6 7A A2 85 ED C7 34 08 36 98 17 FE 4E 26
       data hash MD5: 16K
       5E 5E 59 C4 ED E8 22 41 42 3C 85 40 66 95 F7 7D>)
$$ ##END=
$$ 
$$ hash MD5
$$ 8E A1 1E 28 E6 26 D2 55 2B 6D 81 D6 72 10 1E 5C
##$RELAX= 
##$RELAX= 
##$RELAX= 
##$RELAX= 
##$RELAX= 
##$RELAX= 
$$ Bruker specific parameters
$$ --------------------------
##$DU= <F:/spectra>
##$EXPNO= 1
##$NAME= <H-F>
##$PROCNO= 1
##$TYPE= <nmr>
##$USER= <she>
##$AMP= (0..31)
100 100 100 100 100 100 100 100 100 100 100 100 100 100 100 100 100 100 
100 100 100 100 100 100 100 100 100 100 100 100 100 100 
##$AQSEQ= 0
##$AQ_mod= 1
##$AUNM= <au_zg>
##$AUTOPOS= <>
##$BF1= 200.13
##$BF2= 200.13
##$BF3= 200.13
##$BF4= 200.13
##$BF5= 200.13
##$BF6= 200.13
##$BF7= 200.13
##$BF8= 200.13
##$BYTORDA= 1
##$CFDGTYP= 0
##$CFRGTYP= 5
##$CHEMSTR= <none>
##$CNST= (0..31)
1 1 145 1 1 1 1 1 1 1 1 1 1 1 1 1 1 1 1 1 1 1 1 1 1 1 1 1 1 1 1 1 
##$CPDPRG= <>
##$CPDPRG1= <>
##$CPDPRG2= <>
##$CPDPRG3= <>
##$CPDPRG4= <mlev>
##$CPDPRG5= <mlev>
##$CPDPRG6= <mlev>
##$CPDPRG7= <mlev>
##$CPDPRG8= <mlev>
##$CPDPRGB= <>
##$CPDPRGT= <>
##$D= (0..31)
0 1.2 0 0 0 0 0 0 0 0.06 0 0.03 0 0 0 0 0.0002 0 0 0 0 0 0 0 0 0 0 0 0 
0 0 0 
##$DATE= 1623144464
##$DBL= (0..7)
120 120 120 120 120 120 120 120 
##$DBP= (0..7)
150 150 150 150 150 150 150 150 
##$DBP07= 0
##$DBPNAM0= <>
##$DBPNAM1= <>
##$DBPNAM2= <>
##$DBPNAM3= <>
##$DBPNAM4= <>
##$DBPNAM5= <>
##$DBPNAM6= <>
##$DBPNAM7= <>
##$DBPOAL= (0..7)
0.5 0.5 0.5 0.5 0.5 0.5 0.5 0.5 
##$DBPOFFS= (0..7)
0 0 0 0 0 0 0 0 
##$DE= 6
##$DECBNUC= <off>
##$DECIM= 32
##$DECNUC= <off>
##$DECSTAT= 4
##$DIGMOD= 1
##$DIGTYP= 9
##$DL= (0..7)
0 120 120 120 120 120 120 120 
##$DP= (0..7)
150 150 150 150 150 150 150 150 
##$DP07= 0
##$DPNAME0= <>
##$DPNAME1= <>
##$DPNAME2= <>
##$DPNAME3= <>
##$DPNAME4= <>
##$DPNAME5= <>
##$DPNAME6= <>
##$DPNAME7= <>
##$DPOAL= (0..7)
0.5 0.5 0.5 0.5 0.5 0.5 0.5 0.5 
##$DPOFFS= (0..7)
0 0 0 0 0 0 0 0 
##$DQDMODE= 0
##$DR= 18
##$DS= 0
##$DSLIST= <SSSSSSSSSSSSSSS>
$$ [...]
##$SUBNAM2= <"">
##$SUBNAM3= <"">
##$SUBNAM4= <"">
##$SUBNAM5= <"">
##$SUBNAM6= <"">
##$SUBNAM7= <"">
##$SUBNAM8= <"">
##$SUBNAM9= <"">
##$SW= 20.0188882624521
##$SWIBOX= (0..15)
0 0 2 0 0 0 0 0 0 0 0 0 0 0 0 0 
##$SW_h= 4006.41025641026
##$TD= 16384
##$TD0= 1
##$TE= 0
##$TE2= 300
##$TE3= 300
##$TEG= 300
##$TL= (0..7)
0 120 120 120 120 120 120 120 
##$TP= (0..7)
150 150 150 150 150 150 150 150 
##$TP07= 0
##$TPNAME0= <>
##$TPNAME1= <>
##$TPNAME2= <>
##$TPNAME3= <>
##$TPNAME4= <>
##$TPNAME5= <>
##$TPNAME6= <>
##$TPNAME7= <>
##$TPOAL= (0..7)
0.5 0.5 0.5 0.5 0.5 0.5 0.5 0.5 
##$TPOFFS= (0..7)
0 0 0 0 0 0 0 0 
##$TUNHIN= 0
##$TUNHOUT= 0
##$TUNXOUT= 0
##$USERA1= <user>
##$USERA2= <user>
##$USERA3= <user>
##$USERA4= <user>
##$USERA5= <user>
##$V9= 5
##$VALIST= <valist>
##$VCLIST= <CCCCCCCCCCCCCCC>
##$VD= 0
##$VDLIST= <DDDDDDDDDDDDDDD>
##$VPLIST= <PPPPPPPPPPPPPPP>
##$VTLIST= <TTTTTTTTTTTTTTT>
##$WBST= 1024
##$WBSW= 4
##$XGAIN= (0..3)
0 0 0 0 
##$XL= 0
##$YL= 0
##$YMAX_a= 19117
##$YMIN_a= -15009
##$ZGOPTNS= <>
##$ZL1= 120
##$ZL2= 120
##$ZL3= 120
##$ZL4= 120
##$ABSF1= 10
##$ABSF2= 0
##$ABSG= 5
##$ABSL= 3
##$ALPHA= 0
##$AQORDER= 0
##$ASSFAC= 0
##$ASSFACI= 0
##$ASSFACX= 0
##$ASSWID= 0
##$AUNMP= <proc_1d>
##$AZFE= 0.1
##$AZFW= 0.1
##$BCFW= 1
##$BC_mod= 2
##$BYTORDP= 1
##$COROFFS= 0
##$CY= 11.3945322036743
##$DATMOD= 1
##$DC= 2
##$DFILT= <>
##$DTYPP= 0
##$F1P= 15.9154993809931
##$F2P= -4.1035820241983
##$FCOR= 0.5
##$FTSIZE= 0
##$FT_mod= 4
##$GAMMA= 1
##$GB= 0.15
##$INTBC= 1
##$INTSCL= 1
##$ISEN= 128
##$LB= 0.24
##$LEV0= 0
##$LPBIN= 0
##$MAXI= 10000
##$MC2= 0
##$MEAN= 0
##$ME_mod= 0
##$MI= 1.114404
##$NCOEF= 0
##$NC_proc= 0
##$NLEV= 6
##$NOISF1= 3.799351
##$NOISF2= 2.8
##$NSP= 1
##$NTH_PI= 0
##$NZP= 0
##$OFFSET= 15.70392
##$PC= 1
##$PHC0= -11492.54
##$PHC1= 17.40101
##$PH_mod= 1
##$PKNL= yes
##$PPARMOD= 0
##$PSCAL= 0
##$PSIGN= 0
##$REVERSE= no
##$SF= 200.130013532006
##$SI= 16384
##$SIGF1= 3
##$SIGF2= 2
##$SINO= 400
##$SIOLD= 16384
##$SREGLST= <1H.CDCl3>
##$SSB= 0
##$STSI= 0
##$STSR= 0
##$SW_p= 3612.71676300578
##$SYMM= 0
##$S_DEV= 0
##$TDeff= 0
##$TDoff= 0
##$TI= <>
##$TILT= no
##$TM1= 0
##$TM2= 0
##$TOPLEV= 0
##$USERP1= <user>
##$USERP2= <user>
##$USERP3= <user>
##$USERP4= <user>
##$USERP5= <user>
##$WDW= 1
##$XDIM= 8192
##$YMAX_p= 0
##$YMIN_p= 0
$$ End of Bruker specific parameters
$$ ---------------------------------
##NTUPLES= NMR FID
##VAR_NAME=  TIME,          FID/REAL,        FID/IMAG
##SYMBOL=    X,             R,               I
##VAR_TYPE=  INDEPENDENT,   DEPENDENT,       DEPENDENT
##VAR_FORM=  AFFN,          ASDF,            ASDF
##VAR_DIM=   8192,          8192,            8192
##UNITS=     SECONDS,       ARBITRARY UNITS, ARBITRARY UNITS
##FACTOR=    0.0002496,     1,               1
##FIRST=     0,             0,               0
##LAST=      2.0444736,     0,               0
##MIN=       0,             -15009,          0
##MAX=       2.0444736,     19117,           0
$$ Real data points
##PAGE= N=1
##DATA TABLE= (X++(R..R)), XYDATA
$$ plain form
0 0 0 0 0 0 0 0 0 0 0 0 0 0 0 0 0 0 -2 2 -2 2 -2 2 -4 4 -4 6 -6 8 -8 10 -10 12 -14 16 -18 20 -22 25 -28 31 -35 39 -43 48 -53
45 -53 59 -65 71 -79 86 -95 105 -116 128 -140 156 -173 193 -216 244 -276 317 -369 437 -530 668
66 668 -892 1317 -2421 12007 19117 -8305 -11596 3870 14285 4231 -6197 -4139 5490 5544 513
81 513 -1286 143 94 3420 4579 -2133 -5449 4210 8981 -1192 -10654 -1244 12067 5590 -11755
96 -11755 -10335 7359 11914 -4464 -13722 -1178 9120 2671 -6127 -5129 283 2742 1479 -1628
110 -1628 -4883 -3224 2881 4537 -3491 -10158 -1466 9564 1438 -12473 -7100 8269 7490 -7239
124 -7239 -11059 2099 9831 349 -8688 -3045 5495 3357 -2096 -2187 -647 943 3182 2006 -3034
139 -3034 -3755 3190 7590 -256 -8309 -1018 10615 6272 -7787 -7327 7744 11214 -1877 -8646 109
$$ packed form
0@%%%%%%%%%%%%%%%%kMmMmMoQqJ0j2J4j6J8k0K2k6L0l4L8m2M7n3N9o6P4q2R1j01
45e3J12j24J36j50J65j81K00k21K44k68K96l29L66m09M60n20N93o86Q06r67J198
66F68j560K209l738J4428P110k7422l291J5466J0415j0054j0428K058R629N4n031
81E13j799J429m9L326J159o712l316R659M771j0173r462R410J3311o477j7345
96a1755J420J7694M555j6378r258J2544J0298o449q798R98N412K459j263l107
110a628l255J659O105J656q028o667Q692J1030q126j3911N373J5369p79j4729
124g239l820J3158P732r482r037N643Q540k138n453r1J540J590K239j176n040
139c034p21O945M400p846q053P291J1633m343j4059M60J5071L470j3091o769Q755
$$ plain form
154 109 8558 4191 -3713 -3368 1403 3101 1785 -74 -1932 -2207 2238 4779 -912 -5888 435 7144
170 7144 1686 -7025 -3620 7369 6029 -6181 -8207 3294 8845 -711 -8805 -2992 5053 3547
184 3547 -2017 -4426 -2030 1075 2733 1322 -3649 -5200 1135 5987 385 -7773 -3728 6123 3806
199 3806 -6331 -6374 3496 5709 -2941 -7393 2 6010 1271 -5102 -3150 2460 3242 8 -1697 -1990
215 -1990 -406 3344 3520 -2003 -4938 771 6892 2387 -6037 -3696 6116 6599 -3172 -6155 2619 7421
231 7421 813 -4987 -1272 4513 3394 -1272 -2063 173 1683 2106 1031 -1946 -2717 1640 4563 -66
247 -66 -5451 -1526 5607 3274 -4788 -4944 3382 5767 -2228 -6454 -286 5321 1333 -4867 -3250 1583
263 1583 2238 -109 -2419 -2657 -753 2059 1991 -2242 -4898 -326 4911 1540 -5335 -4267 3807 4616
$$ packed form
154A09Q449m367p904L45M771J698j316j859j858k75M445K541n691m976O323O709
170G144n458q711L405J0989j340j2210k026J1501N551r556q094N813Q045j506
184C547n564k409K396L105J658j411m971j551O335M852n602q158M045R851k317
199C806j0137m3R870K213q650m452P395O008m739o373J952N610P82l234j705k93
215a990J584L750J76n523k935N709O121m505q424K341R812M83r771k983Q774M802
231G421o608n800L715N785j119m666p91K236J510M23j075k977p71M357K923m629
247f6n385L925P133k333q062j56Q326K385p995m226O168N607l988o200J617M833
263A583O55k347k310k38J904K812o8m233k656M572N237l371o875J068Q074Q09
$$ plain form
279 4616 -2972 -5232 1006 4635 12 -4423 -1134 3690 1817 -2310 -2253 862 2195 1209 -351 -1806
295 -1806 -1042 2726 3980 -884 -4673 -898 5787 3785 -3950 -4636 2961 5897 -275 -4666 -567 4190
311 4190 1741 -2280 -1698 1519 2082 -90 -1052 -616 282 1363 1072 -1540 -2629 767 3949 452 -4720
328 -4720 -2412 3946 3604 -2886 -5277 852 4666 253 -4396 -2183 2519 2081 -1513 -2296 -285 1165
344 1165 1042 -560 -2065 -1296 1283 2378 -763 -3839 -907 3760 2134 -3570 -3865 2224 4181 -934
360 -934 -4069 -466 3358 1681 -2412 -1803 1561 1932 2 -1280 -526 911 1638 857 -1436 -2020 1377
377 1377 3437 328 -3647 -1888 3684 3749 -2105 -4092 839 4427 1230 -3068 -1607 2326 2153 -410
393 -410 -1700 -229 1122 787 -79 -917 -752 898 1509 -866 -2370 -105 3000 1142 -3294 -2417 2480
$$ packed form
279D616p588k260O238L629m623m435L289M824j873m127N7L115J333r86j560j455
295a806P64L768J254m864l789L775O685k002p735o86P597K936o172m391M099M757
311D190k449m021N82L217N63k172r62M36Q98J081k91k612j089L396L182l497n172
328d720K308O358l42o490k391O129L814m413m649K213M702m38l594p83K011J450
344A165j23j602j505P69K579J095l141l076K932M667j626n704k95O089J957n115
360i34l135L603L824j677m093O09L364L71j930j282P54J437P27p81k293n84L397
377A377K060l109l975J759N572O5n854j987M931L588l197m298J461L933j73k563
393d10j290J471J351l35q66q38J65J650O11k375j504K265L105j858m436Q77M897
$$ plain form
410 2480 3489 -1176 -4271 -746 3546 1682 -2459 -2806 555 2135 288 -1652 -1663 -313 1410 853
426 853 -1223 -1891 189 2161 417 -2592 -1457 2206 2048 -1830 -3034 815 3120 16 -3088 -1382
442 -1382 2135 2186 -911 -2074 -162 1689 1387 -382 -1339 -345 1774 1902 -407 -1948 162 2724 1335
459 1335 -1939 -2094 1769 3139 -585 -2739 -293 2937 1697 -1705 -1899 773 1927 631 -1211 -1218
475 -1218 326 1282 309 -1220 -1490 299 1502 -164 -2278 -1073 1819 1427 -1865 -2387 851 2695
491 2695 210 -2888 -1306 1990 1980 -885 -2165 -580 1561 1202 -723 -1750 -885 1184 1329 -546
507 -546 -1859 -320 1857 1137 -1473 -1516 1064 1837 -563 -2086 25 2023 556 -1729 -1477 1000 1875
524 1875 4 -1659 -880 1107 1880 372 -1465 -957 1349 2248 258 -2018 -687 1898 1775 -772
$$ packed form
410B480J009m665l095L525M292j864m141l47L361J580j847j940j1J350J723n57
426H53k076o68K080J972j744l009J135L663j58l878j204L849K305l104l104J706
442a382L517N1l097j163J912J851l02j769r57R94K119J28k309j541K110K562j389
459A335l274j55L863J370l724k154K446L230j240l402j94K672J154j296j842p
475a218J544R56r73j529k70J789J203j666k114J205K892l92l292n22L238J844
491B695k485l098J582L296j0k865j280J585K141l59j925j027Q65K069J45j875
507e46j313J539K177p20k610m3K580P73k400j523K111J998j467k285K52K477Q75
524A875j871j663P79J987P73j508j837N08K306Q99j990k276J331K585j23k547
$$ plain form
540 -772 -1916 121 2047 501 -1724 -993 888 1351 -533 -1433 -126 1182 848 -865 -1401 57 1093
557 1093 605 -985 -1633 143 1667 454 -1771 -1507 1028 1605 -454 -1801 -263 1613 1022 -1176
573 -1176 -1396 866 1732 270 -1198 -818 862 1355 221 -1500 -946 777 1459 -248 -1769 -758 1331
590 1331 1216 -920 -1411 312 1453 270 -1268 -701 1078 939 -534 -1304 -166 1287 542 -1278 -1369
607 -1369 178 1538 717 -1127 -1406 602 1885 618 -1319 -1013 1063 1671 26 -1329 -474 1217
623 1217 943 -728 -1128 81 987 57 -745 -602 599 882 -169 -991 -137 1056 934 -617 -1409 -82
641 -82 1427 599 -1023 -1469 490 1459 158 -1382 -977 752 1241 -72 -1285 -300 1006 720 -362
658 -362 -988 -70 939 385 -689 -932 228 1006 -163 -1196 -836 842 905 -551 -1238 -195 1061 676
$$ packed form
540g72j144K037J926j546k225P31J881M63j884r00J307J308l34j713n36J458J036
557A093m88j590o48J776J524j213k225K64K535N77k059j347J538J876n91k198
573a176k20K262Q66j462j468L80J680M93j134j721N54J723O82j707j521J011K089
590A331j15k136m91J723J141j183j538N67J779j39j473p70J138J453p45j820r1
607a369J547J360q21j844k79K008J283j267j937L06K076O08j645j355Q55J691
623A217k74j671m00J209R06r30q02J43J201K83j051q22Q54J193j22j551p92J327
641h2J509q28j622m46J959R69j301j540M05J729M89j313j213R85J306k86j082
658c62o26R18J009n54j074k43J160P78j169j033L60J678O3j456o87J043J256l85
$$ plain form
676 676 -596 -1100 364 1124 283 -961 -732 690 1070 -171 -955 -412 939 974 -436 -1100 2 1246
694 1246 897 -871 -937 455 1233 452 -905 -712 757 1133 -14 -1012 -499 808 625 -394 -777 37
712 37 904 133 -777 -617 562 774 -229 -1054 -320 926 739 -593 -1207 18 1054 577 -966 -1223
730 -1223 40 1044 433 -947 -901 253 989 74 -698 -468 504 604 -217 -618 89 564 235 -482 -409
749 -409 415 836 -120 -950 -206 785 751 -372 -1022 -36 872 745 -460 -960 230 920 434 -542 -740 359
769 359 944 191 -817 -396 514 773 -287 -772 -78 538 403 -448 -589 174 662 29 -642 -556 372 519
789 519 -114 -747 -308 638 509 -365 -514 19 464 298 -627 -614 408 758 4 -586 -343 614 680 -491
809 -491 -636 -193 763 446 -484 -663 -82 741 203 -500 -587 193 627 44 -493 -198 321 314 -214 -642 75
$$ packed form
676F76j272n04J464P60q41j244K29J422L80j241p84N43J351L5j410o64J102J244
694A246l49j768o6J392P78p81j357J93J469L76j147r98N13J307j83j019l83Q14
712C7Q67p71r10J60J179K12j003q25P34J246j87j332o14J225J036m77j543k57
730a223J263J004o11j380M6J154P36r15p72K30R72J00q21m01P07M75l29p17P3
749d09Q24M21r56q30P44R91l4j123o50R86R08j27j205n00J190O90m86r76j98J099
769C59N85p53j008M21R10K59j060m85O94O16j35q51j41P63M88o33o71Q6R28J47
789E19o33o33M39R46j29q74j49N33M45j66r25J3J022L50p54n90K43R57O6j171
809d91j45M43R56l17r30j79N81Q23n38p03q7P80M34n83n37K95N19pn28m28P17
$$ plain form
830 75 617 106 -571 -318 455 731 -157 -818 -188 587 727 -162 -909 -95 833 574 -233 -777 2 804 375
851 375 -331 -480 236 610 302 -373 -245 444 416 -76 -387 41 469 58 -509 -351 364 524 -47 -607 -301
872 -301 505 640 -141 -671 -194 539 447 -284 -714 -158 681 235 -545 -573 140 405 117 -501 -331 383 533
893 533 -213 -456 -106 390 388 -304 -475 275 552 272 -453 -399 259 502 -25 -594 -277 487 249 -233 -557
914 -557 53 565 203 -429 -374 316 677 56 -468 -322 362 515 46 -646 -285 430 493 -188 -708 -81 534
935 534 409 -294 -267 149 295 -30 -367 -139 182 99 -266 -280 128 391 22 -474 -396 204 625 55 -436 -341
957 -341 431 648 -44 -646 -286 326 463 -170 -667 -149 411 373 -100 -333 36 341 41 -175 -162 207 237
978 237 -83 -248 57 296 257 -449 -565 169 382 80 -600 -370 237 445 -12 -450 -343 346 323 -75 -460
$$ packed form
830G5N42n11o77K53P73K76q88o61O30P75J40q89p47Q14R28k59q07n44P79Q02m29
851C75p06j49P16L74l08o75J28O89k8m92l11M28M28m11n67J58P15J60n71n60L06
872c01Q06J35p81n30M77P33r2p31m30N56Q39m46p80k8P13K65k88o18J70P14J50
893E33p46k43L50M96ko92j71P50K77k80p25N4O58K43n27n69L17P64k38m82l24
914e57O10N12l62o32N5O90L61o21n24J46O84J53m69o92L61P15O3o81n20O27O15
935E34j25p03K7M16J46l25l37K28L21q3l65j4M08K63l69m96P8O00M21n70m91R5
957c41P72K17o92o02L60O12J37o33m97N18N60l8m73k33L69L05l00k16J3L69L0
978B37l20j65L05K39l9p06j16P34K13l02o80K30O07K08m57m38J07O89k3l98l85
$$ plain form
999 -460 -79 334 269 -265 -283 28 398 121 -400 -375 247 240 -55 -453 -144 327 345 -284 -290 25 376 120 -262
1022 -262 -142 234 285 5 -268 -79 356 226 -183 -435 -143 481 275 -230 -216 208 495 170 -424 -245 238
1043 238 497 -44 -461 -10 243 313 -209 -353 -150 142 154 -101 -166 -83 231 -39 -307 -147 241 162 -350 -417
1065 -417 -52 377 75 -344 -408 116 341 27 -510 -278 136 469 13 -444 -379 92 604 38 -111 18 332
1086 332 393 -95 -166 49 230 7 -146 -76 313 270 -181 -273 -106 383 94 -278 -173 -18 415 102 -372 -282
1108 -282 75 281 172 -256 -317 72 187 -124 -397 -23 259 158 -300 -100 123 506 133 -297 -212 163 145
1129 145 -113 -184 -22 125 163 52 -240 -78 46 105 -224 -256 -27 140 120 -296 -47 272 106 -54 -422 97
1151 97 238 67 -281 -225 32 200 89 -192 -334 105 338 -84 17 -400 28 330 12 -119 9 160 95
$$ packed form
999d60L81M13o5n34j8L11L70k77n21K5O22pk95l98L09M71J8o29oL15L51k56l82
1022b62J20L76N1k80k73J89M35j30m09k52K92O24k06n05J4M24K87l25n94J79M83
1043B38K59n41m17M51K53P0n22j44K03K92J2k55o5Q3L14k70k68J60L88p9n12o7
1065d17L65M29l02m19o4N24K25l14n37K32M14L33m56m57O5M71N12n66j49J29L14
1086C32O1m88p1K15J81k23j53P0L89m3m51r2J67M89k89l72J05J55M33l13m74R0
1108b82L57K06j09m28o1L89J15l11k73L74K82j01m58K00K23L83l73m30Q5L75j8
1129A45k58p1J62J47L8j11k92J62J24N9l29l2K29J67k0m16K49L19j66j60l68N19
1151I7J41j71l48N6K57J68j11k81j42M39K33m22J01m17M28L02l18j31J28J51o5
$$ plain form
1172 95 -110 -217 127 164 -131 -177 -53 112 246 -113 -118 67 221 145 -122 -300 -75 209 211 -163 -306 11 351
1195 351 35 -133 -172 71 200 36 -146 -58 33 139 -144 -40 166 82 -103 -41 154 173 190 78 -202 -238 233
1218 233 161 -119 -208 1 226 155 -123 -144 25 294 56 -53 -239 166 57 -17 -159 23 68 10 -93 -101 -63
1241 -63 221 90 -72 -199 125 314 130 -102 -199 182 160 -19 -115 64 32 29 -3 -17 176 231 -39 -49 2 119
1265 119 222 19 -274 -167 204 173 -17 -305 -40 166 175 18 -313 7 219 -49 -108 -79 106 214 63 -165
1287 -165 -35 69 105 28 -57 49 85 30 -200 -178 79 126 -69 -264 -136 181 127 -74 -193 -32 124 191 -147
1310 -147 -127 -35 152 32 -150 -94 99 4 51 -46 -78 60 115 -52 -188 -24 189 30 -133 -88 239 76 36
1333 36 -141 -18 217 145 36 -137 90 8 49 -58 -142 38 120 13 -230 -75 122 120 -45 -75 -71 102 170 -60
$$ packed form
1172I5k05j07L44L7k95m6J24J65J34l59nJ85J54p6k67j78K25K84Kl74j43L17L40
1195C51l16j68l9K43J29j64j82Q8R1J06k83J04K06q4j85O2J95J9J7j12k80l6M71
1218B33p2k80q9K09K25p1k78k1J69K69k38j09j86M05j09p4j42J82M5n8j03qL8
1241f3K84j31j62j27L24J89j84k32r7L81k2j79r6J79l2ll2j4J93N5k70j0N1J17
1265A19J03k03k93J07L71l1j90k88K65K06Rj57l31L20K12k68n9K9J85J08j51k28
1287a65J30J04L6p7q5J06L6n5k30K2K57M7j95j95J28L17n4k01j19J61J56O7l38
1310a47K0R2J87j20j82N6J93r5M7r7l2J38N5j67j36J64K13j59j63M5L27j63m0
1333C6j77J23K35p2j09j73K27q2M1j07q4J80Q2j07k43J55J97kj65l0MJ73O8k30
$$ plain form
1357 -60 -232 -43 177 166 42 13 -28 149 16 -57 -111 22 169 -7 -6 -33 282 9 1 -79 31 175 -10 -194
1381 -194 -68 -13 232 -76 -274 -139 49 221 15 -104 -110 87 130 -9 -172 57 27 109 -47 -115 -7 -16 6
1404 6 -24 27 69 22 -54 -108 159 217 -18 -108 -38 91 79 116 -160 -19 118 212 87 -106 -115 151 216 -48 -166 -2
1430 -2 -66 108 1 -45 25 -35 83 -41 16 102 16 44 -127 -25 110 28 -118 -56 118 73 38 -111 -180 19 57
1455 57 -130 -166 19 75 69 -214 -212 10 99 -48 27 88 -52 209 -119 -76 -56 78 187 -7 -164 -27 125 165
1479 165 20 -247 98 178 133 -100 -85 154 14 0 29 130 97 89 18 -4 27 67 73 -73 -143 9 -10 6 -192 -154
1505 -154 93 129 -87 -14 -37 6 -25 -56 82 -65 -94 69 -71 -112 -11 -4 -2 -127 130 -5 -45 1 -124 -13 9
1530 9 43 -15 -190 -132 70 -21 -116 23 -16 235 -58 -53 -19 44 58 -2 -91 -69 93 46 -61 24 -20 27 -6 -89 -36 158
$$ packed form
1357f0j72J89K20j1j24k9m1J77j33p3n4J33J47j76Jk7L15k73qq0J10J44j85j84
1381a94J26N5K45l08j98J35J88J72k06j19oJ97M3j39j63K29l0Q2j56o8J08rK2
1404Fl0N1M2m7p6n4K67N8k35r0P0J29j2L7k76J41J37R4j25j93rK66O5k64j18J64
1430bo4J74j07m6P0o0J18j24N7Q6q6K8j71J02J35q2j46O2J74m5l5j49o9J99L8
1455E7j87l6J85N6ok83KK22Q9j47P5O1j40K61l28M3K0J34J09j94j57J37J52M0
1479A65j45k67L45Q0m5k33J5K39j40j4K9J01l3qp1k2L1M0Oj46p0J52j9J6j98L8
1505a54K47L6k16P3k3M3l1l1J38j47k9J63j40m1J01PKj25K57j35m0M6j25J11K2
1530IL4n8j75N8K02r1r5J39l9K51k93NL4O3J4o0q9K2J62m7j07Q5m4M7l3q3N3J94
$$ plain form
1558 158 69 50 -12 -42 -102 -33 -82 -116 -110 22 -8 -102 -49 113 120 76 75 95 135 -66 -45 -116 -9 24 16 -71 -40 65 106
1587 106 60 -10 -20 -37 55 -35 -24 -31 123 121 22 -51 84 -25 19 29 23 -59 26 43 -19 92 75 100 -81 -70 -64 84 49
1616 49 -28 10 -65 156 119 -127 -140 64 47 43 30 -21 134 -73 32 102 -105 -52 77 131 -91 -40 202 -176 -96
1641 -96 41 163 41 -58 -206 8 131 78 87 -81 19 79 50 -85 -110 122 -33 -3 -47 30 -25 -46 -91 -99 -21 13
1667 13 83 63 -28 121 106 -47 -108 -90 -41 141 -7 7 67 -3 -33 15 -96 -118 106 -24 -86 -67 8 10 9 -120 -90
1694 -90 100 67 -36 -112 57 43 -49 -65 23 95 -3 -30 23 -47 63 98 143 75 75 199 -26 43 43 -14 147 167 63
1721 63 -166 147 177 -47 -7 -83 47 184 -63 -71 13 130 4 -44 0 -46 42 -7 13 -73 -72 26 88 -156 -105 -49 35
1748 35 -83 -117 27 40 83 -104 19 67 54 76 47 39 -45 -2 -4 -110 -48 -33 27 93 -22 -91 127 50 -50 -226 27
$$ packed form
1558A58q9j9o2l0o0O9m9l4OJ32l0r4N3J62Pm4jK0M0k01K1p1J07L3qq7L1J05M1
1587A06m6p0j0j7R2r0J1pJ54kr9p3J35j09M4J0oq2Q5J7o2J11j7K5j81J1OJ48l5
1616D9p7L8p5K21l7k46j3K04j7mj3n1J55k07J05P0k07N3J29N4k22N1K42l78Q0
1641i6J37J22j22r9j48K14J23n3Rj68J00O0k9j35k5K32j55L0m4P7n5k1m5qP8L4
1667A3P0k0r1J49j5j53o1J8M9J82j48J4O0p0l0M8j11k2K24j30o2J9P5Kjj29L0
1694i0J90l3j03p6J69j4r2j6Q8P2r8k7N3p0J10L5M5o8%J24k25O9%n7J61K0j04
1721F3k29L13L0k24M0p6J30J37k47qQ4J17j26m8M4m6Q8m9K0q6JR8O2k44N1N6Q4
1748C5j18l4J44J3M3j87J23M8j3K2k9qq4M3kj06O2J5O0O6j15o9K18p7j00j76K53
$$ plain form
1775 27 279 -67 21 -18 46 70 -32 -15 -17 72 72 -57 -77 52 22 -27 18 1 -65 76 62 -53 -55 -50 57 -208 -120 66
1803 66 189 -229 -149 91 78 28 -2 28 97 84 -59 -31 -18 -82 40 62 23 -179 -112 -75 142 -74 -60 16 42 -27
1829 -27 -50 34 -29 -57 -295 47 65 -31 -32 -53 81 105 -41 -30 -36 2 24 25 39 -103 -82 165 25 -80 -21 129 157
1856 157 19 -101 -202 -42 -108 -86 101 -43 -71 -30 -21 -15 -103 23 48 36 -87 38 33 -180 -96 -155 107 19 -96
1881 -96 -158 13 78 54 12 -13 141 12 -26 -27 79 -10 -55 36 49 -117 -97 93 58 -32 -66 192 106 -180 -176 -13 25
1908 25 19 -21 14 235 -52 -96 -13 31 -18 104 1 134 -19 -146 39 31 -58 -32 8 -63 -38 -52 105 20 -37 -12 -30
1935 -30 113 98 -141 -23 -26 7 -102 28 142 47 39 59 124 -62 -98 -33 -26 -136 -38 32 37 -88 -64 31 81 -93 -214
1962 -214 20 78 -89 -101 9 9 -120 -2 3 36 64 -21 -20 24 20 -50 127 54 -14 -102 59 -12 -92 -100 69 45 49 -109
$$ packed form
1775B7K52l46Q8l9O4K4j02J7kQ9%j29k0J29l0m9M5j7o6J41j4j15kNJ07k65Q8J86
1803F6J23m18Q0K40j3n0l0L0O9j3j43K8J3o4J22K2l9k02O7L7K17k16J4P6K6o9
1829b7k3Q4o3k8k38L42J8r6jk1J34K4j46J1oL8K2JJ4j42K1K47j40j05N9J50K8
1856A57j38j20j01J60o6K2J87j44k8M1ROq8J26K5j2j23J25nk13Q4n9K62q8j15
1881i6o2J71O5k4m2k5J54j29l8jJ06q9m5R1J3j66K0J90l5r0l4K58q6k86MJ63L8
1908B5om0L5K21k87m4Q3M4m9J22j03J33j53j27J85qq9K6M0p1K5j4J57q5n7K5j8
1935c0J43j5k39J18lL3j09J30J14r5qK0O5j86l6O5Pj10R8P0Nj25K4R5N0j74j21
1962b14K34N8j67j2J10%j29J18NL3K8q5JM4mp0J77p3o8q8J61p1q0qJ69k4Mj58
$$ plain form
1990 -109 -71 263 95 -68 -69 60 2 -78 -11 -36 -51 -40 27 -58 -93 -10 -62 4 -102 -100 188 156 -236 -96 82 108
2016 108 5 41 -59 138 -97 -178 53 96 -82 30 32 -107 79 -49 -8 20 -171 76 58 78 17 -58 54 158
2040 158 -123 -156 -75 23 40 -101 -30 65 68 -137 5 18 -19 -69 113 -40 -177 -95 -159 91 -193 -147 80 -45 -81
2065 -81 -9 -21 235 23 -164 95 -70 -55 -17 3 -101 -4 -28 -43 -82 60 47 -101 56 -215 -75 78 68 -10
2089 -10 -82 -29 57 51 -89 42 84 -66 -79 146 -85 -2 -12 -30 16 -41 5 10 -37 19 -64 -27 66 -72 -20 21 45 -51
2117 -51 -90 42 32 -27 -122 13 -15 -1 -114 63 -14 63 -136 -72 112 -122 -11 35 -37 -49 -24 114 -63 37 -159
2142 -159 60 -15 -45 -113 -21 141 40 -44 41 123 58 71 33 42 27 96 16 14 25 -50 92 -70 -60 -111 78 79 -157 -33
2170 -33 84 184 31 -159 -2 115 -86 -58 -25 -15 20 -58 42 -36 -145 -11 65 12 -64 51 -71 -43 90 -197
$$ packed form
1990a09L8L34j68j63jJ29n8q0O7k5j5J1O7q5l5Q3n2O6j06KK88l2l92J40J78K6
2016A08j03L6j00J97k35q1K31M3j78J12Kj39J86j28M1K8j91K47j8K0o1p5J12J04
2040A58k81l3Q1R8J7j41P1R5Lk05J42J3l7n0J82j53j37Q2o4K50k84M6K27j25l6
2065h1P2j2K56k12j87K59j65J5L8K0j04R7k4j5l9J42j3j48J57k71J40J53j0p8
2089a0p2N3Q6oj40J31M2j50j3K25k31Q3j0j8M6n7M6Nm7N6q3L7R3j38N2M1K4r6
2117e1l9J32j0n9r5J35k8J4j13J77p7P7j99O4J84k34J11M6p2j2K5J38j77J00j96
2142a59K19p5l0o8R2J62j01q4Q5Q2o5J3l8Rj5O9q0kJ1p5J42j62J0n1J89Jk36J24
2170c3J17J00j53j90J57J17k01K8L3J0L5p8J00p8j09J34P6n3p6J15j22K8J33k87
$$ plain form
2194 -197 -41 247 0 -89 24 27 12 -39 93 -20 -118 -131 -63 48 36 -14 -128 -53 30 -34 13 -68 -82 81 37 -25
2220 -25 23 47 149 93 -15 -258 -23 81 71 -9 20 70 -29 105 60 73 37 -63 67 -27 42 -123 85 2 -44
2245 -44 -65 -33 164 -200 -61 -3 -13 10 -83 11 67 43 -95 45 -34 39 -18 76 21 65 0 80 4 -52 51 104 169
2272 169 17 31 -75 23 -27 -92 -36 96 17 -62 25 -71 78 -86 151 -109 -86 -3 55 -45 -24 34 70 103 -106
2297 -106 -68 -73 98 41 -65 -11 16 65 46 -35 45 120 83 -13 118 10 81 48 -30 58 -19 36 -91 -40 -37 -4 82 5
2325 5 47 37 44 70 13 -22 -59 94 -107 -79 102 95 -63 22 37 -52 53 49 10 -101 -61 21 -125 -108 -29 -42 37 -54 -20
2354 -20 -12 25 142 -33 31 127 -18 -4 -127 125 48 -89 41 -7 46 0 113 13 -48 71 36 -43 -101 95 6
2379 6 77 -35 -9 11 10 37 124 -43 -41 121 84 11 23 90 1 91 19 -63 -67 19 54 -18 59 -102 0 -96 -54 -36 51 58
$$ packed form
2194a97J56K88k47q9J13Lj5n1J32j13r8j3O8J11j2n0j14P5Q3o4M7q1j4J63m4o2
2220b5M8K4J02n6j08k43K35J04j0q0K9N0r9J34m5J3l6j00J30r4O9j65K08q3m6
2245d4k1L2J97l64J39N8j0K3r3R4N6k4j38J40p9P3n7R4n5M4o5Q0p6n6J03N3O5
2272A69j52J4j06R8n0o5N6J32p9p9Q7r6J49j64K37k60K3Q3N8j00K1N8L6L3k09
2297a06L8nJ71n7j06N4K7M9j9q1Q0P5l7r6J31j08P1l3p8Q8p7N5j27N1LL3Q6p7
2325EM2j0PK6n7l5l7J53k01K8J81pj58Q5J5q9J05ml9j11M0Q2j46J7P9j3P9r1L4
2354b0QL7J17j75O4R6j45J4j23K52p7j37J30m8N3m6J13j00o1J19l5p9n8J96q9
2379FP1j12K6K0jK7Q7j67KJ62l7p3J2O7q9R0p2q2mQ6L5p2P7j61J02r6M2J8Q7P
$$ plain form
2409 58 -19 -159 110 3 -21 -96 40 -99 -91 73 37 42 174 11 -102 23 -38 -67 -45 22 -98 -25 57 14 95 76
2435 76 -14 43 -36 11 -27 -66 31 -98 75 -67 -21 95 -46 -33 -77 -63 -86 96 -32 -84 134 -49 -56 28 31 -56 -20
2462 -20 -73 102 -66 72 29 21 12 100 82 37 -48 -79 2 23 71 -16 -27 48 18 -106 60 107 23 67 -24 82 -10 15
2490 15 -68 41 112 31 -23 -92 33 95 -78 78 -81 -35 53 -33 -149 16 63 -53 169 -91 -48 38 43 -111 -2
2515 -2 141 15 -15 72 -56 -55 53 18 -47 -58 10 85 -15 -66 -38 -147 6 5 -3 -37 17 74 100 50 19 -47 -90 -108 11
2544 11 48 -8 -35 -71 15 -45 -1 103 -61 -31 7 52 90 8 -23 70 32 -139 -8 -21 131 -64 -50 -64 104 30 -24
2571 -24 53 -69 52 -99 -55 -10 -61 37 -29 38 82 -12 141 41 17 -16 43 -12 -34 23 31 71 0 35 89 71 -12 6
2599 6 -57 -65 37 -16 -40 -50 -93 73 42 -10 128 -1 64 -22 -46 16 -124 13 -7 59 -16 79 -58 -10 79 41 14 12
$$ packed form
2409E8p7j40K69j07k4p5J36j39QJ64l6NJ32j63j13J25o1k9K2O7j20P3Q2m3Q1j9
2435G6r0N7p9M7l8l9R7j29J73j42M6J16j41J3m4J4k3J82j28n2K18j83pQ4Lq7L6
2462b0n3J75j68J38m3qrQ8j8m5q5l1Q1K1M8q7j1P5l0j24J66M7q4M4r1J06r2K5
2490A5q3J09P1q1n4o9J25O2j73J56j59M6Q8q6j16J65M7j16K22k60M3Q6Nj54J09
2515bJ43j26l0Q7j28JJ08l5o5j1O8P5j00n1K8j09J53jql4N4N7K6n0l1o6m3j8J19
2544A1L7n6k7l6Q6o0M4J04j64L0L8M5L8q2l1R3l8j71J31j3J52j95J4j4J68p4n4
2571b4P7j22J21j51M4M5n1R8o6O7M4r4J53j00k4l3N9n5k2N7QM0p1L5N4j8q3J8
2599Fo3qJ02n3k4j0m3J66l1n2J38j29O5q6k4O2j40J37k0O6p5R5j37M8Q9l8k7k
$$ plain form
2627 12 -87 -71 99 -11 16 -22 14 -13 -38 -33 -9 -35 54 61 -115 3 100 -6 41 -25 -38 -69 45 7 -91 45 78 40
2655 40 -38 198 -18 69 -57 117 37 16 -101 -51 -129 -44 51 46 -98 -170 -122 169 43 -98 22 -105 40 -73
2679 -73 -22 -22 -31 -48 -130 -14 37 31 12 81 -47 26 84 -8 10 -113 113 67 37 33 34 -28 9 63 6 -64 -20 11 -44 7 28
2710 28 30 58 21 -7 -16 26 -59 -60 -88 71 -25 -4 -95 60 55 73 -94 128 94 -48 -15 -32 -2 96 -20 -31 -103 -113 91
2739 91 4 -126 -88 116 -4 -48 -13 -34 -48 -97 -96 -122 -96 30 -21 3 150 -45 13 62 -91 8 43 1 -22 -12 69
2766 69 9 34 -36 -14 2 20 55 8 -56 50 -45 -49 123 -23 -116 1 154 -84 109 53 14 -33 15 -22 56 61 -41
2793 -41 -60 26 92 -38 -45 23 129 87 -10 4 29 46 -67 -90 -130 -112 44 6 -20 -28 11 -130 41 -136 -114 59 10
2820 10 -52 14 -6 9 134 -64 -28 60 -48 92 -15 11 110 -43 -35 9 -8 32 44 -82 -61 -38 -29 -13 32 -4 24 27
$$ packed form
2627A2r9J6J70j10K7l8L6k7k5NK4k6Q9Pj76J18R7j06M7o6j3l1J14l8r8J36L3l8
2655D0p8K36k16Q7j26J74q0k1j17N0p8Q5R5nj44p2M8K91j26j41J20j27J45j13
2679g3N1%rj7q2J16N1oj9O9j28P3N8r2J8j23K26m6l0mJo2L7N4n7p0M4L1n5N1K1
2710B8KK8l7k8rM2q5jk8J59r6K1r1J55nJ8j67K22l4j42L3j7L0R8j16j1p2j0K04
2739I1q7j30L8K04j20m4L5k1j4m9Jk6K6J26n1K4J47j95N8M9j53R9L5m2k3J0Q1
2766F9o0K5p0K2J6J8L5m7o4J06r5mJ72j46r3J17J53k38J93n6l9m7M8l7P8Nj02
2793d1j9Q6O6j30pO8J06m2r7J4K5J7j13k3m0J8J56l8k6qL9j41J71j77K2J73m9
2820A0o2O6k0J5J25j98L6Q8j08J40j07K6R9j53QM4j7M0J2j26K1K3RJ6M5l6K8L
$$ plain form
2848 27 49 -56 -52 -8 69 -18 -116 27 61 -36 -15 -201 29 26 78 -117 -37 39 51 57 -53 -59 -40 -26 -4 -88 11 51 82
2877 82 -62 -70 -24 -86 8 -17 -53 112 -30 4 2 -27 67 -100 -80 2 -32 7 -68 -63 -74 -62 123 8 -72 53 -31 26
2905 26 28 -43 -62 107 32 -33 49 -81 69 75 -6 -108 -17 -10 17 59 60 -63 114 75 -121 -62 24 -46 -93 -7 13 -13 -15
2934 -15 -57 5 67 21 -124 -46 2 86 60 35 46 -32 -58 -93 -45 -133 -8 -26 68 -17 33 59 52 -15 92 19 -79 -38 -23
2963 -23 30 -26 -5 -95 -40 31 128 23 72 28 99 74 -29 50 1 19 -35 -88 88 -18 36 -41 5 31 -48 33 -49 7
2991 7 -2 -3 39 -124 -30 5 -14 127 -4 35 157 2 23 7 -67 5 -6 -1 -78 -1 -6 135 -70 9 9 82 80 74 -61 -21
3021 -21 171 25 -252 8 22 -96 111 19 18 -18 -43 -2 -38 -50 30 10 34 63 -92 -138 13 -52 -83 132 -51 26
3047 26 -91 -63 -83 -25 28 -4 -22 21 -22 -5 89 -69 -29 38 63 -37 119 90 30 -89 57 -63 49 37 -35 -65
$$ packed form
2848B7K2j05MM4P7q7r8J43L4r7K1j86K30lN2j95Q0P6J2Oj10oJ9J4K2q4R9M0L1
2877H2j44qM6o2R4k5l6J65j42L4kk9R4j67K0Q2l4L9p5Nj1J2J85j15q0J25q4N7
2905B6Kp1j9J69p5o5Q2j30J50Oq1j02R1PK7M2Jj23J77l9j96N9Q6p0m7Q6K0k6k
2934a5m2O2O2m6j45P8M8Q4k6k5J1p8k6l5M8q8J25j8R4q5N0K6po7J07p3r8M1J5
2963b3N3n6K1r0N5P1R7j05M9m4P1k5j03P9m9J8n4n3J76j06N4p7M6K6p9Q1q2N6
2991GrjM2j63R4L5j9J41j31L9J22j55K1j6p4P2j1Np7P7nJ41k05P9%P3koj35M0
3021b1J92j46k77K60J4j18K07r2jl6k5M1l6j2Q0k0K4K9j55m6J51o5l1K15j83P7
3047B6j17K8k0N8N3l2j8M3m3J7R4j58M0O7K5j00J56k9o0j19J46j20J12j2p2l0
$$ plain form
3073 -65 -8 111 -1 29 -11 -18 -10 46 -84 -61 -56 -31 -12 2 125 -39 -93 99 -15 105 -104 -57 -8 72 1 47 -12
3100 -12 -65 -151 127 -118 48 -33 25 112 -67 -35 -85 66 -17 -7 -97 64 5 -2 -16 -27 -121 -103 127 -121 50 125
3126 125 -62 77 21 -30 5 15 -51 -60 -100 27 -48 -91 -47 -43 -73 92 -145 29 93 3 -27 2 83 85 112 28 -76 31
3154 31 9 -25 -68 -6 81 -18 -53 19 -105 39 23 115 42 -21 26 36 115 -150 143 68 0 -8 6 -39 -80 56 130 -64
3182 -64 18 129 -18 33 -47 37 32 111 50 56 166 -51 10 22 61 20 -12 81 35 -25 48 -66 6 -55 -23 19 -9 -140
3210 -140 -118 -44 34 -89 -58 -35 -72 18 -30 53 85 36 180 42 -142 -86 -78 -137 -7 144 -74 -70 -17 -2 61 19 -95
3237 -95 5 12 -115 -14 -27 65 65 77 -52 -116 68 74 19 22 -122 -88 -41 10 -39 38 -80 -55 -48 6 -16 -104 -55 172 22
3266 22 6 43 6 -91 -72 40 -35 -1 179 -1 -27 -138 -46 21 21 109 84 -97 -66 17 -114 -45 -139 78 102 18 -84
$$ packed form
3073f5N7J19j12L0m0pQN6j30K3NK5J9J4J23j64n4J92j14J20k09M7M9Q0p1M6n9
3100a2n3q6K78k45J66q1N8Q7j79L2n0J51q3J0r0J61n9pj4j1r4J8K30k48J71P5
3126A25j87J39n6n1L5J0o6rm0J27p5m3M4Ml0J65k37J74O4r0l0K9Q1KK7q4j04J07
3154C1k2l4m3O2Q7r9l5P2j24J44j6R2p3o3M7J0P9k65K93p5o8qJ4m5m1J36P4j94
3182f4Q2J11j47N1q0Q4nP9o1OJ10k17O1J2L9m1l2R3m6o0P3j14P2o1L2M2k8j31
3210a40K2P4P8j23L1K3l7R0m8Q3L2m9J44j38j84N6Qn9J30J51k18MN3J5O3m2j14
3237i5J00Pj27J01j3R2%J2j29o4J84On5Lj44L4M7N1m9P7j18K5PN4k2q8M9K27j50
3266B2j6L7l7r7J9J12p5L4J80j80k6j11R2O7%Q8k5j81L1Q3j31O9r4K17K4q4j02
$$ plain form
3293 -84 -20 -37 -85 8 -94 -8 23 -24 6 55 -43 -54 49 23 -233 -38 48 4 -16 77 -2 125 -108 93 -264 -21
3319 -21 163 37 -72 78 24 -16 40 -81 97 -52 57 -68 46 9 -9 8 64 -24 -58 32 -9 35 46 27 -78
3344 -78 87 67 -42 -33 70 41 45 -45 79 92 7 -53 73 -2 -25 22 -44 -14 -101 -54 59 37 -61 -6 -78 -112 -21 -39
3372 -39 2 -31 77 16 -4 33 -120 40 -98 73 5 90 72 -77 -31 -135 -65 -64 112 18 3 -17 -16 74 6 34 14
3399 14 -94 -42 39 -117 -17 51 -106 -119 85 28 19 -4 8 -9 91 57 133 23 14 -92 56 40 -21 21 30 8 140
3426 140 -62 10 -82 44 -17 -34 -2 23 -13 -43 -2 -11 57 29 -51 -13 29 -80 -2 -65 -168 14 -35 55 -82 17 7
3453 7 86 54 -124 -2 116 25 12 -46 88 96 44 108 -2 13 -52 -41 -37 78 40 59 -33 -55 11 -7 -81 26 -34 -9
3481 -9 -96 6 -61 -1 113 54 -35 64 2 -11 168 -76 73 3 -1 73 9 168 22 10 42 -71 60 89 -13 84
$$ packed form
3293h4O4j7m8R3j02Q6L1m7L0M9r8j1J03k6k56J95Q6m4k0R3p9J27k33K01l57K43
3319b1J84j26j09J50n4m0N6j21J78j49J09j25J14l7j8J7N6q8l4R0m1M4J1j9j05
3344g8J65k0j09RJ03k9Mr0J24J3q5o0J26p5k3M7o6L0q7M7J13k2r8N5p2l4R1j8
3372c9M1l3J08o1k0L7j53J60j38J71o8Q5j8j49M6j04P0JJ76r4j5k0JR0o8K8k0
3399A4j08N2Q1j56J00O8j57j3K04n7rk3J2j7J00l4P6j10rj06J48j6o1M2Rk2J32
3426A40k02P2r2J26o1j7L2K5l6l0M1rO8k8q0L8M2j09P8o3j03J82m9R0j37R9j0
3453GP9l2j78J22J18r1j3n8J34Qn2O4j10J5o5J1MJ15l8J9r2k2O6j8p4J07o0K5
3481iq7J02o7O0J14n9q9R9o2j3J79k44J49p0mP4o4J59j46j2L2j13J31K9j02R7
$$ plain form
3507 84 22 97 38 -65 25 -108 11 67 47 66 7 -60 -6 -96 56 15 37 19 -66 -152 -111 -7 -69 2 -28 25 199
3534 199 21 -41 -48 -48 -73 51 37 24 165 -48 26 44 12 -13 37 23 23 -137 36 44 109 -61 52 53 -66 30 44 65
3562 65 39 17 97 97 -104 89 -11 139 46 -6 -22 29 -68 26 62 -100 -32 -40 162 -62 -35 -58 -144 -69 62 26 -53
3589 -53 40 -4 27 -121 -141 10 -14 22 123 -24 -66 28 -27 -93 45 71 5 -93 -66 -4 -15 -132 -24 -24 -49 -26 3
3616 3 9 182 36 83 -20 -110 2 45 39 -47 -110 -1 -117 59 21 -81 -93 -30 113 -167 -41 -107 -78 -2 48 -43
3642 -43 -53 -65 112 106 64 72 59 57 14 -1 1 -219 -140 115 45 -9 -81 94 -31 -56 14 -153 11 42 92 -47 15 -31
3670 -31 69 87 38 -37 50 -39 -29 -57 -71 14 100 -90 1 43 32 -184 29 18 -79 30 28 55 -19 -88 1 -25 -53 1
3698 1 54 -98 -13 -28 -65 39 -24 134 -92 60 -62 -29 -25 87 41 67 -68 -31 -80 -81 33 -58 -66 -83 21 -1 51
$$ packed form
3507H4o2P5n9j03R0j33J19N6k0J9n9o7N4r0J52m1K2j8q5q6M1J04o2P1l0N3J74
3534A99j78o2p%k5J24j4j3J41k13P4J8l2k5N0j4%j60J73QO5j70J13Jj19R6J4K1
3562F5k6k2Q0%k01J93j00J50r3n2j6N1r7R4L6j62O8qK02k24K7k3q6P5J31l6p9
3589e3R3m4L1j48k0J51k4L6J01j47m2R4n5o6J38K6o6r8K7O2j1j17J08%k5K3K9
3616COJ73j46M7j03r0J12M3oq6o3J09j16J76l8j02j2O3J43k80J26o6K9P6N0r1
3642d3j0j2J77om2Qj3km3j5Kk20P9K55p0n4p2J75j25k5P0j67J64L1N0j39O2m6
3670c1J00J8m9p5Q7q9J0k8j4Q5Q6j90R1M2j1k16K13j1r7J09kK7p4o9Q9k6k8N4
3698AN3j52Q5j5l7J04o3J58k26J52j22L3MJ12m6K6j35L7m9jJ14r1qj7J04k2N2
$$ plain form
3725 51 26 -28 -47 -45 -48 104 122 15 29 8 66 -40 119 0 -100 -24 -167 -91 -37 103 6 -20 -201 38 147 4
3751 4 -81 -67 20 -73 59 13 107 50 -33 -24 44 2 173 82 98 115 -6 -54 75 -72 61 28 14 34 -65 -61 -169 54
3779 54 -61 -78 122 -166 92 81 180 25 107 -42 36 -24 86 68 -81 -77 -58 -56 -37 -30 16 32 44 81 41 -5 -92 35
3807 35 -16 5 -17 55 -97 0 128 163 67 20 24 59 102 -7 86 -14 11 23 44 -69 54 -94 70 34 -52 14 9
3834 9 -47 -23 -38 -117 104 90 -30 -102 -54 -72 -73 63 -46 -61 -32 -87 56 96 -7 21 -86 82 34 95 -17 -58 28
3861 28 11 86 -107 121 32 -193 96 131 -62 -66 -97 59 22 -5 1 36 10 -128 33 -41 161 24 -4 -19 86 58
3887 58 50 24 51 6 -37 95 -32 -64 -10 11 -124 -47 -39 34 -49 8 -68 25 91 -31 -46 32 43 103 41 -8 -63 -87 18
3916 18 -48 -21 -53 29 -9 -3 45 76 32 -42 -50 22 23 80 30 24 0 63 -86 31 -17 -81 0 -17 46 -60 -5 21 -7 -29 -13
$$ packed form
3725E1k5n4j9KlJ52J8j07J4k1N8j06J59j19j00P6j43P6N4J40r7k6j81K39J09j43
3751Dq5J4Q7r3J32m6R4n7q3RO8m2J71r1J6J7j21m8J29j47J33l3j4K0r9Mj08K23
3779E4j15j7K00k88K58j1R9j55Q2j49P8o0J10j8j49MJ9KJ9PM6J6J2L7m0m6q7J27
3807C5n1K1k2P2j52R7J28L5r6m7ML5M3j09R3j00K5J2K1j13J23j48J64l6q6O6n
3834In6K4j5p9K21j4j20p2M8j8jJ36j09j5K9n5J43M0j03K8j07J68m8O1j12m1Q6
3861B8j7P5j93K28q9k25K89L5j93ml1J56l7k7OL5k6j38J61p4K02j37k8j5J05k8
3887E8qk6K7m5m3J32j27l2N4K1j35P7QP3q3N7p6R3O6j22j5P8J1O0o2m9n5k4J05
3916A8o6K7l2Q2l8OM8L1m4p4qP2JN7n0ok4O3j49J17m8o4Q1j7O3j06N5K6k8k2J6
$$ plain form
3947 -13 -83 69 35 -50 117 -18 37 0 -19 70 -62 62 49 -66 -139 83 -22 81 17 35 8 6 20 -11 38 70
3973 70 -34 34 -112 -62 34 62 3 33 -118 31 73 -3 105 -66 -47 -100 6 5 6 4 -91 123 36 -20 -47 -89 43
4000 43 -49 -99 50 -19 3 -71 -83 -45 -65 -69 -55 -43 15 40 121 -9 9 -13 17 55 -100 128 -62 -21 64 -129 124
4027 124 -85 99 -18 14 -14 117 -151 -42 68 -78 -48 4 136 -62 -74 6 86 22 0 -80 -16 -54 151 -11
4051 -11 47 52 -59 42 -133 -1 -123 7 -16 7 -55 -52 69 73 -159 61 -21 -68 -129 62 67 55 -103 -5 128 -5
4077 -5 -112 -13 6 -55 -59 -120 50 -32 -65 151 37 2 90 15 107 -42 -30 -5 -104 -155 -2 -15 1 -23 120 74 71 -111
4105 -111 170 -69 61 -28 52 121 -31 43 19 2 -4 -11 116 -27 37 -39 -16 68 -32 120 37 -63 -66 13 92 5 -7
4132 -7 144 -74 94 30 -94 -17 -165 -21 -174 -41 48 44 -16 -138 132 60 -31 -135 126 -36 38 90 58 -41 45
$$ packed form
3947a3p0J52l4q5J67j35N5l7j9Q9j32J24j3j15p3K22j05J03o4J8k7kJ4l1M9L2
3973G0j04O8j46N0R6K8n9L0j51J49M2p6J08j71J9n3J06jJkr5K14q7n6k7m2J32
4000D3r2n0J49o9K2p4j2L8k0mJ4J2N8K5Q1j30J8k2L0L8j55K28j90M1Q5j93K53
4027A24k09J84j17L2k8J31k68J09J10j46L0N2J32j98j2Q0Q0o4k2q0O4l8K05j62
4051a1N8Nj11J01j75J32j22J30k3K3o2LJ21Mk32K20q2m7o1J91Nj2j58R8J33j33
4077ej07R9J9o1mo1J70q2l3K16j14l5Q8p5R2j49J2K5r9n1J53j3J6k4J43m6lj82
4105a11K81k39J30q9Q0O9j52P4k4j7opJ27j43O4p6K3Q4j00J52q3j00lP9P9q7j2
4132gJ51k18J68o4j24P7j48J44j53J33Q9mo0j22K70p2r1j04K61j62P4N2l2r9Q6
$$ plain form
4157 45 -39 8 41 -14 38 90 -154 -47 94 73 -63 57 34 -52 38 52 -41 73 33 -57 50 -17 -113 5 18 19 163
4184 163 -88 -67 -24 -31 -52 55 -28 156 -48 0 -52 2 -42 -57 -63 -52 133 237 119 6 13 -2 8 74 -20 37 -7
4211 -7 3 18 30 17 132 50 129 -15 73 18 -36 -71 -108 7 33 -37 3 74 24 -65 -2 -48 75 9 -61 38 -58 -70 -69
4240 -69 -45 -54 -54 -3 -45 70 -81 13 -70 23 2 -22 -124 -16 67 52 28 3 75 -17 48 -50 -2 35 78 -82 -37 86
4268 86 -52 10 91 -46 59 73 173 119 -7 3 78 -38 30 -64 -1 172 40 113 -2 -26 74 -30 -21 38 132
4293 132 76 -81 101 -62 -87 119 -43 95 82 11 7 126 22 -35 69 13 41 -41 -71 -46 -119 -11 -62 168 3
4318 3 -130 -254 -92 -76 -27 -9 -16 -9 45 -30 72 35 29 50 42 -19 -124 0 -57 -130 62 -15 -66 2 -19 4 60 14 49
4347 49 -16 -20 -40 61 -92 -53 -24 -97 -23 21 -68 -7 -10 -15 -22 145 -4 -23 53 125 41 83 12 -10 1 -65 -43 -8 24 72
$$ packed form
4157D5q4M7L3n5N2N2k44J07J41k1j36J20k3q6R0J4r3J14m0r0J07o7r6J18J3JJ44
4184A63k51K1M3pk1J07q3J84k04M8n2N4m4j5oJ1J85J04j18j13Pj5J0O6r4N7m4
4211gJ0J5J2j3J15q2P9j44Q8n5n4l5l7J15K6p0M0P1n0q9O3m6J23o6p0R9r6j2J
4240f9K4r%N1m2J15j51R4q3R3k1k4j02J08Q3j5k4k5P2r2O5r8M8L7M3j60M5J23
4268H6j38O2Q1j37J05J4J00n4j26J0P5j16O8r4O3J73j32P3j15k4J00j04RN9R4
4293A32n6j57J82j63k5K06j62J38j3p1mJ19j04n7J04n6K8q2l0K5p3J08n1K30j65
4318Cj33j24J62J6M9J8pPN4p5J02l7oK1qo1j05J24n7p3J92p7n1O8k1K3N6m6L5
4347D9o5mk0J01j53L9K9p3P4M4q9O1lnpJ67j49j9P6P2q4M2p1k2J1o6K2L5L2M8
$$ plain form
4377 72 72 -4 24 -34 122 -113 132 -100 -96 -37 -27 177 -2 -53 41 -20 54 74 45 41 18 -3 130 64 26 67 -71 1
4405 1 21 -21 -53 -73 26 111 4 2 -16 97 103 -11 -83 117 -99 58 -20 -10 112 -174 40 -61 -14 -19 -18 13 -79 -5
4433 -5 -60 75 20 109 -39 31 -62 -87 -64 17 35 -41 -62 55 -106 25 10 -61 -97 -25 33 -195 80 -37 10 -109
4459 -109 -50 14 29 90 20 -92 -3 -36 58 25 87 85 -40 -25 26 34 -56 -25 -34 -124 -86 27 -43 -122 -61 2 60 87 -5 58
4489 58 30 27 -19 -6 -67 -125 -42 28 -13 -10 -43 27 41 7 -3 -9 -26 -140 16 32 -111 -113 66 47 52 -7 -99 50 -117 171
4519 171 -120 -14 25 -16 -98 -19 86 -6 96 121 135 46 -74 50 -42 45 7 79 0 -68 103 -5 42 32 12 27
4545 27 23 -84 13 -16 59 -32 -28 -23 -62 -81 -65 57 16 -11 7 39 21 -14 46 15 -10 7 -70 52 -32 -10 -5 -96 0 -21 51
4576 51 -73 -11 -180 -33 -30 50 80 -48 -62 62 -74 -65 -46 71 7 -23 80 145 65 4 4 -63 -27 -88 -22 -42 16 126
$$ packed form
4377G2%p6K8n8J56k35K45k32MN9J0K04j79n1R4o1P4K0k9mk3k1J33o6l8M1j38P2
4405AK0m2l2k0R9Q5j07kj8J13Oj14p2K00k16J57p8J0J22k86K14j01M7nJL1r2P4
4433en5J35n5Q9j48P0r3k5K3Q1J8p6k1J17j61J31j5p1l6P2N8k28K75j17M7j19
4459a09N9O4J5O1p0j12Q9l3R4l3O2kj25J5N1Qr0L1rr0L8J13p0p9O1O3N8K7r2O3
4489E8k8lm6J3o1n8Q3P0m1Ll3P0J4l4j0oj7j14J56J6j43kJ79j9Nn9r2J49j67K88
4519A71k91J06L9m1q2P9J05r2J02K5J4q9j20J24r2Q7l8P2p9o8J71j08M7j0k0J5
4545B7mj07R7k9P5r1MNl9j9J6J22m1k7J8L2j8l5O0l1k5J7p7J22q4K2Nr1R6k1P2
4576E1j24O2j69J47LQ0L0j28j4J24j36RJ9J17o4l0J03O5q0o1%o7L6o1O6k0N8J10
$$ plain form
4604 126 99 17 78 -154 134 -106 -122 10 32 61 -103 8 90 -52 96 -78 -9 24 6 0 37 -22 17 9 48 -58
4630 -58 -115 102 -17 36 -25 -67 4 37 -32 18 77 31 16 -17 63 -53 27 48 6 -175 19 -64 82 -5 31 46 23
4657 23 -65 -57 90 13 -66 3 49 87 56 39 -61 -72 -98 -25 2 -21 -17 -46 -86 -64 91 -60 44 44 -18 19 -4 -97 -10
4686 -10 24 -55 -57 -55 20 -55 163 -62 -110 -26 -136 111 73 29 32 -6 55 -46 -52 -9 -165 138 -54 112 10 27 -103
4713 -103 67 51 -26 -3 -88 50 -140 -25 -103 -29 -18 -13 40 -49 33 -6 105 -42 25 -48 -61 -68 84 79 6 -16 131
4740 131 82 -44 32 -48 -109 -15 -76 18 -65 -86 -56 -132 76 96 -99 -3 109 -45 -139 11 -95 40 -30 36 -1 41
4766 41 17 -39 42 0 -69 -7 -56 -29 -84 108 -109 21 34 47 19 57 -17 -20 75 48 28 99 50 52 -29 -15 46 55 29 -36
4796 -36 48 71 18 -71 22 -31 4 38 24 -104 -48 21 50 -104 -80 -93 35 1 -24 -151 1 60 -3 7 8 39 -116 140
$$ packed form
4604A26k7q2O1k32K88k40j6J32K2K9j64J11Q2j42J48j74O9L3j8oL7n9L9qL9j06
4630e8n7K17j19N3o1m2P1L3o9N0N9m6j5l3Q0j16Q0K1m2j81J94q3J46q7L6J5k3
4657B3q8QJ47p7p9O9M6L8l1j7j00j1k6P3K7k3Mk9m0K2J55j51J04%o2L7k3r3Q7
4686a0L4p9kKP5p5K18k25m8Q4j10K47l8m4Ll8O1j01oM3j56L03j92J66j02J7j30
4713a03J70j6p7K3q5J38j90J15p8P4J1NN3q9Q2l9J11j47O7p3j3pJ52np3k2J47
4740A31m9j26P6q0o1R4o1R4q3k1L0p6K08K0j95R6J12j54r4J50j06J35p0O6l7M2
4766D1k4n6Q1m2o9O2m9K7n5J92k17J30J3J3k8L8p4lR5k7k0P1m9Kq1J4O1Rk6o5
4796c6Q4K3n3q9R3n3L5L4j4j28N6O9K9j54K4j3J28l4k5j27J52N9o3J0JL1j55K56
$$ plain form
4824 140 -96 14 44 -73 -145 -40 -32 -71 79 28 82 20 -9 1 -80 140 75 74 -15 -183 23 -5 -32 -73 71 -9
4850 -9 89 -36 -8 46 -48 -30 18 -9 -46 -14 -12 -95 -62 74 49 52 -85 -3 -20 -78 57 -29 48 86 -62 37 13 -52 -27
4879 -27 93 56 -16 17 106 67 4 4 -120 -112 67 -5 7 10 -105 -27 132 -25 10 7 31 89 -9 -14 -6 7 54 -107 -18 -76
4909 -76 69 -34 119 -133 -29 -31 72 99 -5 35 -44 60 25 -61 19 35 -95 47 109 -16 16 127 -101 33
4933 33 80 49 -36 -78 38 -183 -56 -96 195 -118 -95 62 -15 115 -10 -34 -43 86 -48 -26 -140 -22 49 47 30
4958 30 -28 75 -5 -32 29 21 49 44 46 -5 12 -4 -140 32 -2 11 167 -8 11 10 121 16 -46 95 22 30 -109 -3
4986 -3 13 -137 -26 36 -68 -43 -9 106 42 -27 49 11 57 105 74 -130 -46 42 94 87 67 137 -2 92 -56 -7 -131
5013 -131 5 44 -17 55 -17 64 91 -69 17 -45 3 -3 25 -43 -91 -72 -59 -36 58 66 0 27 -38 -136 -11 -39 -82 -93 104
$$ packed form
4824A40k36J10L0j17p2J05Ql9J50n1N4o2k9J0q1K20o5jq9j68K06k8k7m1J44q0
4850iR8j25K8N4r4J8M8k7l7L2Kq3L3J36k5Lj37Q2j7n8J35q6P7L8j48R9k4o5K5
4879b7J20l7p2L3Q9l9o3%j24QJ79p2J2Lj15P8J59j57L5lK4N8r8nQJ3M7j61Q9n8
4909g6J45j03J53k52J04kJ03K7j04M0p9J04l5q6Q0J6j30J42O2j25L2J11k28J34
4933C3M7l1q5m2J16k21J27m0K91l13K3J57p7J30j25k4rJ29j34K2j14J18P1kj7
4958C0n8J03q0k7O1qK8nKn1J7j6j36J72l4J3J56j75J9jJ11j05o2J41p3Qj39J06
4986cJ6j50J11O2j04K5L4J15o4o9P6l8M6M8l1k04Q4Q8N2pk0P0j39R4j48M9j24
5013a31J36L9o1P2p2Q1K7j60Q6o2M8oK8o8m8J9J3K3R4Qo6K7o5r8J25k8m3j1J97
$$ plain form
5042 104 1 42 -50 70 -3 19 124 90 51 6 32 140 -12 15 43 51 41 14 -39 -30 50 -19 -170 82 17 -37 -34 64
5070 64 32 129 -24 88 -37 -18 18 -111 -2 36 78 -15 -27 -18 -97 -61 50 -5 5 -32 -73 74 -139 82 -59 0
5096 0 39 -28 167 -3 6 -26 -31 -77 -11 10 10 -207 13 -76 0 -18 -24 -35 128 64 -21 -83 -44 71 -12 16 61 30 27 16
5126 16 -42 19 -110 100 -33 -48 93 85 15 -70 -149 15 -24 -53 -53 -70 93 34 -104 -75 128 22 -8 -66 49 31
5152 31 -20 52 65 90 -72 2 -63 -81 -38 10 41 22 -13 40 -74 107 -40 16 51 51 16 31 75 -3 83 30 38 -12 -106
5181 -106 42 102 12 27 79 -23 -78 69 43 74 56 -7 84 41 54 37 -30 -107 60 54 75 -65 -18 38 61 31 79 -6
5209 -6 134 -41 -134 77 -71 -20 9 -139 32 -19 154 107 3 27 45 110 124 -32 55 -10 140 43 84 -37 -26
5234 -26 -9 -30 62 67 18 185 -3 -54 -87 11 111 3 -22 16 -7 10 103 -21 -38 -30 -39 183 -9 -18 -100 -12 67 -47
$$ packed form
5042A04j03M1r2J20p3K2J05l4l9m5K6J08j52K7K8Qj0k7n3RQ0o9j51K52o5n4LR8
5070F4l2R7j53J12j25J9L6j29J09L8M2r3j2Rp9L6J11n5J0l7m1J47k13K21j41N9
5096@L9o7J95j70Rl2nm6O6K1%k17K20q9P6j8oj1J63o4q5o2L9J15q3K8M5l1lj1
5126A6n8O1j29K10j33j5J41qp0q5p9J64l9k9%j7J63n9j38K9K03j06l0n8J15j8
5152C1n1P2J3K5j62P4o5j8M3M8L1j9l5N3j14J81j47N6L5%l5J5M4p8Q6n3Qn0r4
5181a06J48O0r0J5N2j02n5J47k6L1j8o3R1m3J3j7o7p7J67oK1j40M7N6K3l0M8q5
5209fJ40j75r3K11j48N1K9j48J71n1J73m7j04K4J8O5J4j56Q7o5J50r7M1j21J1
5234b6J7k1R2Nm9J67j88n1l3R8J00j08k5L8k3J7R3j24j7QrK22j92rq2Q8P9j14
$$ plain form
5262 -47 6 -15 205 33 2 61 12 -31 -47 138 -80 179 -50 -100 2 24 52 39 7 30 32 -91 105 5 -37 136
5288 136 -70 14 -19 96 42 -88 54 -117 4 -78 -117 6 164 123 -109 -85 74 31 -5 87 83 -100 39 23
5312 23 -56 -110 -2 -69 41 3 116 3 -22 72 -34 56 -65 7 2 -52 2 18 26 -24 5 126 -43 16 83 71 -43
5339 -43 16 78 -103 -9 29 142 -23 10 20 13 84 48 96 -84 -75 -31 -48 12 -113 -14 12 9 -27 -46 -47 -98 -127 113 -31
5368 -31 -26 30 -36 55 -44 33 -26 4 8 -91 130 19 56 37 232 46 12 -7 -9 24 -25 25 11 12 -27 -6 -117 -209 -108
5397 -108 -14 -157 21 -5 -171 99 9 28 -7 -44 40 19 110 -89 79 -59 -38 -6 23 34 -71 -35 101 -56 40
5422 40 139 -19 3 -29 -41 -25 -123 -73 173 -18 46 -9 -98 118 -31 -29 0 -40 57 88 20 -56 33 96 110 -86 45
5449 45 33 -98 45 98 38 141 -102 89 45 40 -72 -25 -42 -51 69 107 18 -2 0 110 37 55 -5 -15 40 24 -55 -18
$$ packed form
5262d7N3k1K20j72l1N9m9m3j6J85k18K59k29n0J02K2K8j3l2K3Kj23J96j00m2J73
5288A36k06Q4l3J15n4j30J42j71J21q2l9J23J58m1k32K4J59m3l6R2mj83J39j6
5312B3p9n4J08o7J10l8J13j13k5R4j06R0j21P2nn4N4J6Qn0K9J21j69N9O7j2j14
5339d3N9O2j81R4L8J13j65L3J0pP1l6M8j80RM4j7O0j25R9K6ll6j9jn1k9K40j44
5368c1NN6o6R1r9P7n9L0Mr9K21j11L7j9J95j86l4j9kL3m9N0j4Jl9K1j11r2J01
5397a08R4j43J78k6j66K70r0J9l5l7Q4k1R1j99J68j38K1L2K9J1j05L6J36j57R6
5422D0R9j58K2l2j2J6r8N0K46j91O4n5q9K16j49KK9m0R7L1o8p6Q9O3J4j96J31
5449D5j2j31J43N3o0J03k43J91m4nj12M7j7rJ20L8q9k0KJ10p3J8o0j0N5j6p9L7
$$ plain form
5477 -18 -14 -7 -5 50 21 -18 -80 -26 33 93 -56 -39 28 -131 3 -34 12 -82 3 -66 -15 -80 -25 17 2 54 -27 21 -59 53
5507 53 -40 104 9 19 -63 10 -78 45 36 -89 77 156 73 39 -18 -46 15 22 -7 26 -25 -73 116 -55 -41 29 -44 9
5535 9 -94 56 -49 27 -18 -76 72 -26 79 78 49 -26 -89 -24 -45 34 1 75 74 -52 82 66 17 -187 -41 -27 -37
5562 -37 89 -53 -6 -58 11 -7 -58 87 7 13 -29 -54 -11 38 -22 117 52 -59 -87 -99 19 18 -91 -99 16 -25 12 26
5590 26 62 -34 -25 46 -17 13 -4 -4 -45 89 -139 -122 72 74 60 -54 12 90 33 -19 -105 18 -105 -17 -40 -51 -66 58
5618 58 -49 -93 74 -6 140 22 64 -20 146 -75 57 126 26 79 -87 65 95 19 -123 63 50 43 -38 -35 -38 7
5644 7 19 -106 -58 -25 31 36 42 -86 30 7 6 -20 8 -26 142 148 12 -12 102 -24 27 -37 -72 -116 -93 53 9 -27 47
5673 47 134 50 17 -25 14 20 -94 107 -74 -89 -55 -100 10 77 66 -109 115 -2 -67 40 -27 57 88 58 51 -10 42
$$ packed form
5477a8MPKN5k9l9o2N4N9O0j49J7O7j59J34l7M6r4Q5o9N1o5N5M2j5N2q1M8q0J12
5507E3r3J44r5J0q2P3q8J23rj25J66P9q3l4n7k8O1Pk9L3n1m8J89j71J4P0p3N3
5535Ij03J50j05P6m5n8J48r8J05jk9p5o3O5k1P9l3P4jj26J34j6m9k04J46J4j0
5562c7J26j42M7n2O9j8n1J45q0Om2k5M3M9o0J39o5j11k8j2J18jj09qJ15m1L7J4
5590B6L6r6RP1o3L0j7%m1J34k28J7J94Kj4j14O6P8n7n2q6J23j23Q8k3j1j5J24
5618E8j07m4J67q0J46j18M2q4J66k21J32O9j00N3j66J52L0p6j42J86j3pq1LlM5
5644GJ2j25M8L3N6NOj28J16k3jk6K8l4J68Oj36k4J14j26N1o4l5m4K3J46m4l6P4
5673D7Q7q4l3m2L9Oj14K01j81j5L4m5J10O7j1j75K24j17o5J07o7Q4L1l0po1N2
$$ plain form
5700 42 19 -106 -118 2 63 43 -46 -23 127 -29 -9 -7 -43 -54 76 -107 91 26 52 1 -34 50 -51 -94 93 -20
5726 -20 -24 7 -58 12 -85 11 62 -24 11 24 41 -71 19 -65 20 -32 -35 77 14 -28 -38 -54 -14 -17 129 -91 -34 -18 26 -3
5756 -3 -13 102 79 -33 -11 105 -176 -161 -7 -117 -194 64 70 -36 13 24 27 1 -35 60 147 -88 -12 10 31 43 -18
5783 -18 -10 155 -10 68 -25 -15 25 -7 29 -95 52 14 12 35 -14 55 -146 -97 22 41 -46 43 83 100 80 -90 -122 154
5811 154 -53 -15 50 -15 15 79 98 -51 23 -14 -7 33 -110 -16 -5 0 73 -101 30 -35 145 -37 -114 144 -45 -83
5837 -83 32 111 113 -85 77 -55 -138 51 0 28 -25 30 120 -40 -85 58 53 124 51 -31 -194 51 126 -66 187 -39
5863 -39 3 99 13 -5 10 -24 51 -14 -99 49 11 -18 -48 -111 -145 -84 -73 -74 13 -110 45 -84 -42 5 40 -9 14 25 18
5892 18 99 -51 68 -133 35 86 5 -51 -43 71 21 -8 -13 3 20 -38 -79 134 -52 46 -63 1 48 51 -57 -23 174
$$ packed form
5700D2k3j25j2J20O1k0q9K3J50j56K0Kl6j1J30j83J98o5K6n1l5Q4j01m3J87j13
5726b0mL1o5P0r7R6N1q6L5J3J7j12R0q4Q5n2lJ12o3m2j0j6M0lJ46k20N7J6M4k9
5756cj0J15k3j12K2J16k81J5J54j10p7K58Oj06M9J1Lk6l6R5Q7k35P6K2K1J2o1
5783a8QJ65j65P8r3J0M0l2L6j24J47l8kK3m9O9k01M9J19J9q7Q9M0J7k0j70l2K76
5811A54k07L8O5o5L0O4J9j49P4l7PM0j43R4J1NP3j74J31o5J80j82p7K58j89l8
5837h3J15P9Kj98J62j32q3J89n1K8n3N5R0j60m5J43nP1p3q2j63K45P5j92K53k26
5863c9M2R6q6j8J5l4P5o5q5J48l8k9l0o3l4O1J1jQ7j23J55j29M2M7L5m9K3J1p
5892A8Q1j50J19k01J68N1q1n6QJ14n0k9nJ6J7n8m1K13j86R8j09O4M7Lj08L4J97
$$ plain form
5919 174 17 45 -74 -43 88 -50 63 137 -2 -4 39 48 -158 79 -89 106 91 -19 39 -68 -46 -30 -74 -1 -25
5944 -25 85 -44 -27 -32 -33 -24 -92 156 26 39 41 -20 -44 -101 -36 42 39 -94 144 92 -44 -29 -16 73 69 57 7 -24 76
5973 76 -6 121 93 11 -32 -65 47 -31 189 -16 -136 95 115 1 35 -77 -110 -50 31 15 -55 -9 145 95 -30
5998 -30 -35 48 -21 59 -51 -56 -42 3 -7 104 -64 -12 -93 11 -122 -168 62 -68 -69 -38 69 20 37 6 91 -151 -90
6025 -90 68 96 19 57 -49 24 -83 120 89 21 57 -98 -25 9 -87 -166 -43 -44 48 -77 65 96 38 20 -2 -45 -53
6052 -53 -167 16 -148 48 74 40 -53 -82 39 8 -81 23 -62 47 0 77 2 -56 -70 136 117 11 67 -278 -41
6077 -41 -26 56 -25 19 24 23 1 -49 -86 -50 119 7 42 -7 8 -43 48 84 97 -31 67 53 -71 20 27 26 -63 92 83 -58
6107 -58 50 135 -74 -35 -12 30 49 -48 66 9 -97 3 50 110 51 107 -2 -23 28 3 -4 -29 66 -30 48 12 49 23
$$ packed form
5919A74j57K8j19L1J31j38J13P4j39kM3Rk06K37j68J95j5j10N8j07K2J6m4P3k4
5944b5J10j29J7njRo8K48j30J3Ko1k4n7O5P8lj33K38n2j36J5J3Q9mj2n0l1J00
5973G6q2J27k8q2m3l3J12p8K20k05j20K31K0j14L4j12l3O0Q1j6p0M6J54n0j25
5998c0nQ3o9Q0j10nJ4M5j0J11j68N2q1J04j33m6K30j30jL1J07m9J7l1Q5k42O1
6025i0J58K8p7L8j06P3j07K03l1o8L6j55P3L4r6p9J23jR2j25J42L1n8j8k2m3q
6052e3j14J83j64J96K6l4r3k9J21l1q9J04q5J09m7P7p5n8j4K06j9j06N6l45K37
6077d1J5Q2q1M4Njk2n0l7L6J69j12L5m9J5n1R1L6J3j28R8j4j24R1Pjq9J55rj41
6107e8J08Q5k09L9K3M2J9r7J14n7j06J00M7O0n9N6j09k1N1k5pk5R5r6P8l6L7k6
$$ plain form
6135 23 26 97 13 -12 8 31 104 15 55 -163 -40 -85 -193 -111 53 -15 -43 -35 -66 -16 96 -13 -42 -32 -73 -17 -61 -95
6163 -95 38 -99 -4 69 -8 12 -50 -110 -28 33 89 90 -57 52 -20 74 29 -19 -60 55 51 -45 -66 -43 -38 66 -49 -65
6191 -65 -103 -67 43 59 -65 -149 -26 74 105 -60 -135 -65 -7 26 50 65 117 -23 -49 83 -11 -1 16 62 1 -22 37
6218 37 45 0 -79 2 -81 13 -26 11 -24 -111 19 59 5 -150 54 35 -23 3 -26 4 -78 -63 33 32 8 -59 -4 -3 55 -29
6248 -29 7 2 107 -41 15 67 67 -57 -2 104 -118 42 -50 24 109 -113 -14 18 -10 22 -21 68 -9 95 77 43 47 184
6276 184 39 -146 30 -66 32 46 -39 -58 122 -42 -26 -153 -75 -85 97 23 -6 -20 24 21 -159 -35 -16 27 51 -92
6302 -92 11 -15 -43 -72 -4 -57 -26 136 -52 -71 71 19 -58 -10 -54 -65 51 -26 55 -80 7 159 7 -49 69 9
6328 9 -141 -107 -99 23 -115 -160 -45 45 68 -15 6 50 -10 181 154 -67 -64 -23 44 122 86 -150 -169 -52 -87 115 82
$$ packed form
6135B3LP1q4k5K0K3P3q9M0k18J23m5j08Q2J64o8k8Ql1N0J12j09k9J0m1N6m4l4
6163i5J33j37R5P3p7K0o2o0Q2O1N6Jj47J09p2R4m5m8m1J15mr6k1K3NJ04j15j6
6191f5l8L6J10J6j24q4J23J00L1j65p5P0N8L3K4J5N2j40k6J32r4J0J7M6o1k3N9
6218C7Qm5p9Q1q3R4l9L7l5q7J30M0n4j55K04j9n8K6k9L0q2J5R6jk4o7N5JN8q4
6248b9L6nJ05j48N6N2%j24N5J06k22J60r2P4Q5k22R9L2k8L2m3Q9p7J04j8l4MJ37
6276A84j45j85J76r6R8J4q5j9J80j64J6j27P8j0J82p4k9j4M4lj80J24J9M3K4j43
6302i2J03k6k8k9O8n3L1J62j88j9J42n2p7M8m4j1J16p7Q1j35Q7J52j52n6J18o0
6328Ij50L4QJ22j38m5J15R0K3q3K1M4o0J91k7k21LM1O7P8l6k36j9J17l5K02l3
$$ plain form
6355 82 32 -123 -57 84 60 5 -36 1 -8 34 74 47 -145 46 -5 19 -210 -33 -82 45 -123 128 72 -46 -61 73
6381 73 -90 110 2 115 -23 5 167 72 20 37 32 22 78 4 59 -86 -5 -97 -42 -59 25 -77 21 28 -52 81 64
6408 64 87 -116 89 139 73 -23 30 89 55 -65 5 1 -26 -44 56 -71 -37 -38 36 85 -37 -42 -51 -72 -97 -80 -85 65 -90
6437 -90 -95 33 36 -18 -86 -81 104 -114 45 -17 16 96 -93 95 24 38 49 19 -73 50 -101 105 109 -89 -74 24 38
6464 38 -7 -89 88 12 -27 56 95 -3 13 -60 -42 40 -44 -23 -103 -66 10 45 47 -51 -81 2 129 31 53 47 -28 19 51 -49
6494 -49 19 -152 122 33 -30 -53 -72 -12 31 94 4 90 -73 35 -62 -58 49 85 13 -11 43 -86 3 69 36 -40 -13 -5
6522 -5 71 -38 -23 -30 -49 111 -78 25 16 64 -11 -48 35 254 -6 -115 -76 -59 -109 29 117 -88 -56 105 47 89 -29
6549 -29 48 17 87 -39 62 16 8 -134 49 3 38 98 20 -1 -4 -83 25 -18 75 29 60 22 -10 -88 102 43 -59 41
$$ packed form
6355H2n0j55O6J41k4n5m1L7rM2M0k7j92J91n1K4k29J77m9J27j68K51n6j18j5J34
6381G3j63K00j08J13j38K8J62r5n2J7nj0N6p4N5j45Q1r2N5j7Q4j02R8Pq0J33j7
6408F4K3k03K05N0o6r6N3N9l4j20P0mk7j8J00j27L4jP4M9j22nrk1k5J7nJ50j55
6437i0nJ28Ln4o8NJ85k18J59o2L3Q0j89J88p1J4J1l0r2J23j51K06Mj98J5R8J4
6464C8m5q2J77p6l9Q3L9r8J6p3J8Q2q4K1q0L7P6L5Kr8l0Q3J27r8K2op5M7L2j00
6494d9O8j71K74q9o3k3j9O0M3O3r0Q6j63J08r7MJ07L6p2k4N4j29Q9O6l3p6K7Q
6522eP6j09J5pj9J60j89J03rM8p5l7Q3K19k60j09L9J7n0J38Q8k05L2J61n8M2j18
6549b9P7l1P0j26J01m6qj42J83m6L5O0p8k1lp9J08m3R3m6L1l8l2p8J90n9j02J00
$$ plain form
6577 41 -128 57 29 104 -26 28 -5 76 120 87 17 64 37 -56 3 41 -6 9 33 116 -159 23 -127 66 17 -26 28
6604 28 77 140 19 -65 -102 8 1 -80 -28 -50 -15 -81 31 146 -9 4 64 -49 90 -73 -58 -20 -35 -89 92 43
6630 43 -40 -4 -18 -20 39 29 -57 151 74 64 32 -139 69 -47 93 -108 -17 204 -4 115 54 34 -26 87 11 5
6656 5 -22 30 118 -55 -8 52 66 133 -47 29 -86 -18 -39 49 -134 16 63 169 -80 29 -42 -12 13 24 -49 -79 -22
6683 -22 -55 14 51 -116 -158 -65 23 16 -28 68 -6 82 -31 -18 -17 -58 -102 25 -37 90 -26 89 -118 -16 -32 25 89
6710 89 -22 58 26 3 43 0 142 -99 -29 -31 -63 -8 67 -14 30 -76 -75 -7 -86 106 -43 -54 72 65 26 7 -15 55
6738 55 -15 18 49 30 -4 29 -65 64 39 -53 -46 20 -27 22 -49 55 -133 -24 -73 -83 113 49 -29 68 26 43 -23 88
6766 88 22 -29 98 -19 29 -57 69 133 44 -37 62 -57 5 93 29 -31 10 100 -5 -19 -102 60 -81 118 22 63
$$ packed form
6577D1j69J85k8P5j30N4l3Q1M4l3p0M7k7r3N9L8m7J5K4Q3k75J82j50J93m9m3N4
6604B8M9O3j21q4l7J10pq1N2k2L5o6J12J15j55J3O0j13J39j63J5L8j5n4J81m9
6630D3q3L6j4kN9j0q6K08p7j0l2j71K08j16J40k01R1K21k08J19o1k0o0J13p6o
6656Ek7N2Q8j73M7O0J4O7j80P6j15O8k1Q8j83J50M7J06k49J09p1L0K5J1p3l0N7
6683b2l3O9L7j67m2R3Q8pm4R6p4Q8j13J3Jm1m4J27o2J27j16J15k07J02j6N7O4
6710H9j11Q0l2k3M0m3J42k41P0kl2N5P5q1M4j06JO8p9J92j49j1J26pl9j9k2P0
6738E5p0L3L1j9l4L3r4J29k5r2PO6m7M9p1J04j88J09m9j0J96o4p8R7m2J7o6J11
6766H8o6n1J27j17M8q6J26O4q9q1R9j19O2Q8o4o0M1R0j05j4q3J62j41J99r6M1
$$ plain form
6792 63 -112 1 118 -103 -25 -54 25 -56 -72 94 -47 -62 8 38 -125 -116 0 -97 20 -46 -18 -20 -11 31 10 82 20
6819 20 -60 59 174 13 73 -68 -25 62 134 97 0 153 46 -161 22 35 -1 -26 11 -109 89 70 -155 -43
6843 -43 -83 -20 -188 46 23 72 -28 -83 -107 10 0 -160 -93 16 57 -69 36 -25 -83 145 43 -95 -29 -18 -14
6868 -14 -92 -66 93 12 -138 -137 159 -7 30 -47 75 72 18 185 106 16 41 -62 -78 -28 -106 -88 82 34 -65 122 0
6895 0 5 17 -72 -111 118 87 -87 59 94 -19 21 9 139 30 24 -38 -44 -123 -132 87 43 170 3 31 -19 -3 2 -10 86
6924 86 -6 68 -9 -33 100 -27 -28 -14 -48 71 -93 74 31 -77 -22 21 102 -100 -65 -49 87 -74 -22 -36 103 124
6950 124 2 -17 -133 88 76 -28 -68 -94 -56 -117 30 -100 45 -58 31 0 11 54 23 -20 0 -46 17 -72 41
6975 41 -17 14 -131 -47 -17 -11 73 -86 -14 28 26 -68 -12 -95 -26 30 22 -133 69 10 -32 25 -52 66 95 -7 6 6 -58
$$ packed form
6792F3j75J13J17k21P8k9P9q1j6J66j41j5P0L0j63RJ16r7J17o6K8kRM2k1P2o2
6819B0q0J19J15j61O0j41M3Q7P2l7r7J53j07k07J83J3l6k5L7j20J98j9k25J12
6843d3m0O3j68K34k3M9j00n5k4J17j0j60O7J09M1j26J05o1n8K28j02j38O6J1M
6868a4p8K6J59q1j50JK96j66L7p7J22ln4J67p9r0K5j03j6N0p8J8J70m8r9J87j22
6895@NJ2q9l9K29l1j74J46L5j13M0j2J30j09oo2op9rK19m4J27j67K8n0J6Nj2R6
6924H6r2P4p7k4J33j27jJ4l4J19j64J67m3j08N5M3Q1k02L5J6J36j61N2j4J39K1
6950A24j22j9j16K21j2j04m0k6L8o1J47j30J45j03Q9l1J1M3l1m3K0m6O3q9J13
6975D1n8L1j45Q4L0OQ4j59P2M2kr4N6q3O9N6qj55K02n9m2N7p7J18K9j02J3%o4
$$ plain form
7004 -58 97 71 72 46 27 -13 -40 -3 -32 -102 -28 125 10 99 71 -23 -5 8 -78 12 -28 -15 66 -16 -11 -96 -91 66 9 125
7034 125 -71 -48 49 141 -38 -43 -64 94 -39 35 -24 49 -86 -99 164 63 81 -75 -23 -106 -107 -10 32 47 -20 8 -58
7061 -58 -52 -99 24 -58 -32 1 -22 -42 41 -40 -156 -35 0 -32 -30 87 66 -80 227 -84 -13 36 75 64 -5 -43 83
7088 83 -56 -11 -64 4 -63 95 -32 0 0 -86 -12 -78 -24 12 -15 -6 -57 -99 -4 105 -56 13 -65 -1 -21 -118 -34 -6 14
7117 14 -53 16 -50 140 -91 -108 -89 39 5 -133 -69 52 -15 -5 -67 -4 35 -36 -2 60 71 -35 93 -29 -64 -64 -55
7144 -55 16 -26 3 -98 23 126 100 98 10 79 17 -122 22 21 -20 72 -124 125 -37 -56 97 -8 -6 8 13 30 -92
7171 -92 -119 14 68 -10 94 -69 31 8 78 -39 -99 144 46 -60 -130 -46 -8 31 31 62 -82 -65 -70 -53 38 32 84 2
7199 2 56 -20 -78 3 40 -94 8 -151 -63 39 43 79 -28 -94 32 31 98 182 -16 -73 -164 91 23 177 -41 48 -50
$$ packed form
7004e8J55k6Jk6j9m0k7L7k9p0P4J53j15Q9k8r4J8J3q6R0m0J3Q1q2Nq5NJ57n7J16
7034A25j96K3R7R2j79nk1J58j33P4n9P3j35j3K63j01J8j56N2q3jR7M2J5o7K8o6
7061e8Om7J23q2K6L3k3k0Q3q1j16J21L5l2KJ17k1j46L07l11P1M9L9j1o9l8J26
7088H3j39M5n3O8o7J58j27L2%q6P4o6N4L6k7Rn1m2R5J09j61O9p8O4k0r7Q4K8K0
7117A4o7O9o6J90k31j7J9J28l4j38O4J21o7J0o2O3L9p1L4O2J1j06J28j22l5%R
7144e5P1m2K9j01J21J03k6kq8O9o2j39J44jm1R2j96K49j62j9J53j05KJ4NJ7j22
7171i2k7J33N4p8J04j63J00k3P0j17o0K43r8j06p0Q4L8L9%L1j44J7nJ7R1oN2q2
7199BN4p6n8Q1L7j34J02j59Q8J02ML6j07o6J26jO7Q4j98n7r1K55o8J54k18Q9r8
$$ plain form
7226 -50 -82 -112 0 60 -27 -32 10 -14 -60 118 38 11 5 33 25 19 -5 -35 266 -73 47 -24 -71 -13 -60 30 -24 -18 47 5
7256 5 53 -30 -36 19 -27 -51 -1 13 -18 -113 -100 -29 -10 -48 32 109 -6 95 7 73 101 17 40 66 32 -43 -90 14 -83 -63
7286 -63 -91 94 120 27 -95 44 100 19 87 97 76 14 16 -129 3 5 64 54 114 109 75 -49 8 66 -45 2 74 -31
7314 -31 -91 -90 -26 -118 35 31 -61 14 -62 48 -41 -4 -31 86 120 -49 27 82 -15 -15 -125 62 -83 3 -65 95 66 16
7342 16 -81 -178 -6 -13 0 -157 27 -44 33 -143 43 -11 -27 47 10 -142 -37 21 -37 -14 132 18 77 21 -94 -83
7368 -83 34 -64 -55 -82 -19 40 73 80 12 -98 -50 -130 -55 61 -53 92 44 1 -50 -26 -117 46 107 -126 37 64 41
7395 41 60 2 -34 -150 94 90 8 32 107 23 -9 -54 -29 -33 34 -52 -98 -2 -60 48 98 -51 65 3 -70 12 -29 109
7423 109 -66 110 -48 -11 -44 -8 9 53 66 -111 162 -36 37 -205 116 55 -14 80 -91 44 -27 -60 19 62 -17
$$ packed form
7226e0l2l0J12O0q7nM2k4m6J78q0k7oK8qok4l0L01l39J20p1m7N8m7R0n4OO5m2
7256EM8q3oN5m6k4N0J4l1r5J3P1J9l8Q0P7j15J01q8O6K8q4K3K6l4p5m7J04r7K0
7286f3k8J85K6r3j22J39N6q1O8J0k1o2Kj45J32KN9j0O0nl4j24N7N8j11M7P2j05
7314c1o0JO4r2J53mr2P5p6J10q9L7k7J17L4j69P6N5r7%j10J87j45Q6o8J60k9n0
7342A6r7r7J72pJ3j57J84p1P7j76J86n4j6P4l7j52J05N8n8K3J46j14N9n6j15J1
7368h3J17r8Rk7O3N9L3Po8j10M8q0P5J16j14J45m8m3n1K4r1J63O1k33J63K7k3
7395D1J9n8l6j16K44mq2K4P5q4l2m5K5mO7q6m6R6n8J08N0j49J16o2p3Q2m1J38
7423A09j75J76j58L7l3L6J7M4J3j77K73j98P3k42L21o1o9R4j71J35p1l3P9M3p9
$$ plain form
7448 -17 -134 178 10 32 -3 -50 -39 -13 -51 -33 -83 54 23 103 -32 84 5 -127 6 -42 37 54 -32 14 -27 20
7474 20 25 16 46 -19 -25 -61 5 -76 43 0 -138 36 133 -33 -20 40 83 -80 67 -59 -47 56 171 89 -25 -80 42
7501 42 -63 -5 -151 105 58 -149 85 -64 -80 161 58 -126 114 99 -9 46 -10 -41 7 -22 56 35 -111 -24
7525 -24 -74 -134 -105 89 8 -44 28 -15 -133 -62 91 -77 -72 5 40 -29 22 19 -9 19 10 106 125 107 123 2 -11 141 37
7554 37 52 32 -85 -13 -31 -18 -86 44 10 -131 104 68 -2 -47 17 57 12 67 -19 112 -48 -77 34 72 -59 75
7580 75 -5 80 4 -12 25 5 45 183 -98 63 -87 74 71 -22 -34 -158 -37 66 -122 -120 -62 44 116 -95 122
7605 122 26 -12 61 -8 -119 80 99 97 -50 -56 -14 -41 123 -113 73 64 4 -83 -99 -9 -23 120 44 -147 -53 69 -20
7632 -20 0 86 -52 -89 -64 -68 -3 -128 -32 106 -51 -149 -30 43 -30 -104 -9 141 -34 26 -28 2 49 33 -88 36
$$ packed form
7448a7j17L12j68K2l5m7J1K6l8J8n0J37l1Q0j35J16p9j32J33m8P9J7q6M6m1M7
7474B0NrL0o5ol6O6q1J19m3j38J74R7j66J3O0M3j63J47j26J2J03J15q2j14n5J22
7501D2j05N8j46K56m7k07K34j49j6K41j03j84K40j5j08N5n6l1M8k9P8k1j46Q7
7525b4n0o0K9J94q1n2P2m3j18P1J53j68NP7L5o9N1lk8K8rR6J9j8J6j21j3J52j04
7554C7J5k0j17P2j8J3o8J30l4j41K35l6p0m5O4M0m5N5q6J31j60k9J11L8j31J34
7580G5q0Q5p6j6L7k0M0J38k81J61j50J61lr3j2j24J21J03j88KN8J06P2k11K17
7605A22r6l8P3o9j11J99J9kj47oM2k7J64k36J86ro0q7j6R0j4J43p6j91R4J22q9
7632b0K0Q6j38l7K5mO5j25R6J38j57r8J19P3p3p4R5J50j75O0n4L0M7j6j21J24
$$ plain form
7658 36 19 1 80 56 74 40 131 -124 -25 -105 -82 41 -137 70 68 -132 109 -53 135 1 -49 -37 0 -3 27 -28 78
7685 78 -74 40 25 21 -65 -6 4 3 -119 -2 -32 56 -8 -5 -58 -49 49 -6 53 -13 -140 -61 -61 49 77 -17 36 115 113 -27
7715 -27 -86 -102 79 23 28 86 52 -8 45 29 1 6 53 94 77 -83 -18 81 -105 160 111 14 22 -52 -26 -10 13 47 -46 125
7745 125 -27 -154 15 -5 50 4 152 11 -84 94 55 -33 -1 100 3 0 30 -92 68 -12 8 -1 11 -24 71 49
7771 49 -19 11 -147 55 92 49 -2 -72 50 94 61 -6 20 -52 19 142 178 -20 -67 -58 74 43 22 10 -24 -49 118
7798 118 21 -9 -89 64 1 82 -36 28 51 -119 4 -162 46 -64 4 -42 -66 38 -100 83 -14 39 -59 -150 -1
7823 -1 -61 49 -6 -104 12 24 33 -1 1 8 126 -109 46 -5 57 56 -84 71 51 73 -36 69 -23 -11 6 62 22 -38
7851 -38 -41 43 48 -86 68 51 -130 -30 7 43 -23 -25 212 99 0 -78 44 -27 0 12 67 -32 -13 73 -54 -35 119
$$ packed form
7658C6j7j8P9k4J8l4R1k55R9q0K3J23j78K07kk00K41j62J88j34n0J2L7lL0n5J06
7685G8j52J14j5mq6N9J0jj22J17l0Q8o4Ln3RR8n5N9o6j27P9%J10K8r4N3P9kj40
7715b7n9j6J81n6NN8l4o0N3j6k8NM7M1j7j60O5R9j86K65m9r7Qp4K6J6K3L4r3J71
7745A25j52j27J69k0N5m6J48j41r5J78l9q8L2J01r7lL0j22J60q0K0rJ2l5R5k2
7771D9o8L0j58K02L7m3n1p0J22M4l3o7K6p2P1J23L6j98m7RJ32l1k1j2l4k5J67
7798A18r7l0q0J53o3Q1j18O4K3j70J23j66K08j10O8m6k4J04j38J83r7N3r8r1J49
7823ao0J10n5r8J16J2Rl4KPJ18k35J55n1O2jj40J55k0K2j09J05r2J2J7N6m0o0
7851c8lQ4Nj34J54j7j81J00L7L6o6kK37j13r9p8J22p1K7J2N5r9J9Q6j27J9J54
$$ plain form
7878 119 153 -68 62 77 7 -48 -22 41 17 -38 95 -16 -80 52 120 39 123 -83 -48 87 35 42 81 -88 -38 -62
7904 -62 -12 3 -25 37 177 -66 -6 116 -63 18 -81 -67 -31 41 -32 -40 -35 -33 -61 -70 18 -187 -135 -66 -24 32 -67 116 -56
7933 -56 32 -53 -6 -33 82 61 73 -33 -15 26 -70 73 -55 27 -138 -25 20 -52 65 -54 -61 75 39 49 33 -13
7959 -13 23 -46 24 -173 69 21 12 -76 -61 57 -57 -54 -24 -187 -9 11 -54 -63 69 3 -26 0 -92 -11 81 26 -27 83
7987 83 108 -59 16 65 -232 11 -32 -104 66 -78 48 35 59 33 25 -5 -61 93 14 45 54 -121 -10 63 19 12 92
8014 92 37 11 11 95 -69 -69 63 72 -120 -76 53 35 -59 -44 -83 43 -63 45 -59 112 77 14 0 -35 18 30 63
8041 63 -164 21 -24 60 -33 -5 76 -88 -36 -59 141 -35 121 -1 -5 52 -49 -71 5 60 -25 31 -15 47 -34 -33 -28 115
8069 115 -18 18 31 47 60 76 -39 -21 -26 -14 -53 -91 78 -37 2 -80 -105 -52 76 -14 -199 -65 54 -269 89
$$ packed form
7878A19L4k21J30J5p0n5K6O3k4n5J33j11o4J32O8q1Q4k06L5J35n2PL9j69N0k4
7904f2N0J5k8O2J40k43O0J22j79Q1r9J4L6P2p3qNKk8rQ8k05N2O9M2N6r9J83j72
7933e6Q8q5M7k7J15k1J2j06J8M1r6J43j28Q2j65J13M5p2J17j19pJ36l6J0j6m6
7959a3L6o9P0j97K42m8rq8J5J18j14LL0j63J78K0o5rJ32o6k9K6r2Q1R2n5n3J10
7987H3K5j67P5M9k97K43m3p2J70j44J26j3K4k6ql0n6J54p9L1Rj75J11P3m4pQ0
8014I2n5k6%Q4j64%J32Rj92M4J29j8r4J5l9J26j06J08j04J71l5o3j4l5N3J2L3
8041F3k27J85m5Q4r3K8Q1j64N2k3K00j76J56j22mN7j01k2P6N5q5N6m6O2q1JNJ43
8069A15j33L6J3J6J3J6j15J8nJ2l9l8J69j15L9q2k5N3J28r0j85J34J19l23L58
$$ plain form
8094 89 25 9 -92 -2 101 -13 -29 56 4 -78 -23 -26 30 -1 -12 26 75 -103 -53 -56 -66 0 96 27 7 -39 32 -19 -79
8123 -79 22 44 72 -64 52 73 -79 88 -28 103 -52 24 -5 -71 23 -24 110 18 29 5 12 15 -72 -76 9 39 65
8150 65 0 -31 82 -36 -105 -10 -96 39 28 16 -74 102 36 94 28 -52 74 59 58 -41 -34 -9 -45 -134 44 80 -48 -61
8178 -61 60 85 4 -47 -90 -90 -68 47 -43 -89 -129 -16 52
$$ packed form
8094H9o4j6j01R0J03j14j6Q5n2q2N5lN6l1j1L8M9j78N0lj0O6R6o9k0m6P1n1o0
8123g9J01K2K8j36J16K1j52J67j16J31j55P6k9o6R4m7J34r2J1k4PLq7mQ5L0K6
8150F5o5l1J13j18o9R5q6J35j1j2r0J76o6N8o6q0J26j5jr9PK5l6q9J78L6j28j3
8178f1J21K5q1n1m3%K2J15r0m6m0J13O8
8191E2
$$ Imaginary data points
##PAGE= N=2
##DATA TABLE= (X++(I..I)), XYDATA
$$ plain form
0 0 0 0 0 0 0 0 0 0 0 0 0 0 0 0 0 0 0 0 -2 2 -2 2 -2 2 -4 4 -4 6 -6 6 -8 8 -10 12 -13 14 -16 18 -20 23 -25 28 -31 35 -39 43
46 43 -47 51 -57 63 -69 76 -84 92 -102 113 -125 139 -155 174 -196 224 -259 303 -362 447 -575
67 -575 801 -1310 5482 -8784 -14207 8514 14595 2344 -9394 -3342 6397 5838 -2199 -3377 -807
82 -807 342 884 1603 -4087 -6065 2244 6436 -4007 -10923 -1038 10418 2115 -13637 -9503 8352
97 8352 9819 -7791 -15009 -329 9853 216 -9504 -5675 1537 2990 -324 -3143 -4011 -1085 4065
112 4065 4100 -2971 -6916 1637 10518 1998 -10893 -3666 11139 7728 -7443 -9061 5295 11374 -326
127 -326 -8585 -813 8199 4577 -2586 -1612 2146 2881 3455 1877 -2119 -1803 4286 6585 -1073 -7460
143 -7460 296 10104 3935 -9010 -6458 8332 9918 -4440 -9850 1366 8991 2570 -5951 -4004
$$ packed form
0@%%%%%%%%%%%%%%%%%%kMmMmMoQqJ0j2J2j4J6j8K2k5K7l0L4l8M3m8N3n9O6p4Q2
46D3r0R8j08J20j32J45j60J76j94K15k38K64k94L29l70M20m83N62o65Q09j022
67e75J376k111O792j4266n423K2721O081j2251j1738O052R739n59q037j178K570
82h07J149N42P19n690j978Q309M192j0443o916R885J1456q303j5752M134J7855
97H352J467j7610p218J4680J0182r637r720L829P212J453l314k819q68K926N150
112D065L5p071l945Q553Q881q520j2891P227J4805l411j5171j618J4356O079j1700
127c26q259P772R012l622p163R74L758P35N74j578l996L16O089K299p658o387
143g460P756R808o169j2945K552J4790J586j4358n410J1216P625o421q521J947
$$ plain form
157 -4004 2451 3408 68 -2164 -2785 -1837 957 2511 -2878 -6734 -399 5450 -650 -8421 -3581 6338
173 6338 3977 -7732 -7891 4227 8077 -2776 -9764 -1703 6585 2842 -4133 -4723 -635 2450 2451 -153
189 -153 -3468 -3294 2827 6297 -21 -6215 -1254 7604 4539 -5535 -4428 5703 6762 -2733 -6055
204 -6055 2032 7274 1097 -5263 -2038 4275 3694 -740 -2083 -556 1175 3367 2430 -2478 -3891 1974
220 1974 6381 1064 -6462 -3045 6199 5210 -4582 -6668 2788 6663 -1221 -6437 -1147 4707 2254
235 2254 -2986 -3021 454 1842 868 -722 -2385 -2053 1430 3236 -1149 -5719 -1172 5245 1857 -5715
251 -5715 -4554 3992 5050 -3192 -6269 832 5946 688 -5278 -2443 3145 2811 -909 -2497 -1398
266 -1398 887 2546 1481 -2391 -3507 1146 5307 1074 -5112 -2747 4892 4733 -3031 -4606 2228
$$ packed form
157d004O455R57l340k232o21R48K794J554n389l856O335N849o100p771M840R919
173F338k361j1709j59J2118L850j0853o988Q061Q288l743o975n90M088L085Jk604
189a53l315J74O121L470o318o194M961Q858l065j0074J107J0131J059r495l322
204f055Q087N242o177o360L225O313n81m434j343J527J731K192r37m908j413N865
220A974M407n317p526L417R244r89r792k086R456L875p884n216N290N854k453
235B254n240l5L475J388r74j590j663L32L483J806m385m570M547O417l388p572
251e715J161Q546J058q242l077P101N114n258n966K835N588l34l720j588J099
266a398K285J659j065l872j116M653M161m233o186K365P639j59p764j575O834
$$ plain form
281 2228 5174 -60 -4143 -275 4465 1849 -2592 -1640 1751 2683 278 -1089 -1426 -111 2674 2721
297 2721 -1722 -4259 357 5627 2456 -5090 -4299 3809 5543 -1484 -5696 -267 4525 1152 -3373
312 -3373 -1958 1564 1701 -985 -1801 -626 400 737 138 -1889 -2204 986 3179 -425 -4759 -1533
328 -1533 4225 2827 -3815 -4763 1705 4870 -370 -4793 -1282 3356 2079 -2255 -2399 621 1845 680
344 680 -823 -1659 -156 2087 2050 -945 -2909 295 4230 1855 -3514 -2869 3138 4376 -1281 -3840
360 -3840 401 4169 1458 -2748 -1589 2298 2071 -647 -1414 14 1265 1355 157 -1402 -1346 1611 2737
377 2737 -606 -3596 -1074 3635 2659 -3053 -4344 1256 4285 134 -4050 -1667 2388 1683 -1208 -2065
393 -2065 -208 1113 373 -833 -1180 -493 699 919 -1197 -2110 124 2544 301 -3397 -2114 2901
$$ packed form
281B228K946n234m083L868M740k616m441R52L391R32k405j367l37J315K785M7
297B721m443k537M616N270l171p546P91Q108J734p027m212N429M792l373m525
312c373J415L522J37k686q16J175J026L37n99k027l15L190K193l604m334L226
328a533N758j398o642r48O468L165n240m423L511M638j277m334j44L020J224j165
344F80j503q36J503K243l7k995j964L204L935k375n369O45O007J238n657k559
360c840M241L768k711m206J159L887k27k718p67J428J251R0j198j559N6K957J126
377B737l343k990K522M709r76n712j291N600L029m151m184K383M055p05k891q57
393b065J857J321p40j206l47O87J192K20k116r13K234K420k243l698J283N015
$$ plain form
409 2901 2886 -1942 -3880 406 4014 1258 -3074 -2326 1662 2575 22 -1833 -1121 599 1590 606 -1222
426 -1222 -1299 863 2347 488 -2231 -757 2687 1958 -1826 -2307 1530 3284 -443 -2964 -588 2634
442 2634 1714 -1618 -2396 413 1970 705 -1119 -1423 86 1340 1132 -1011 -1997 497 2577 599
458 599 -2365 -1556 1981 2623 -1276 -3086 157 2864 957 -2403 -1861 1215 1961 -105 -1588 -928 933
475 933 1397 137 -1167 -915 737 1562 -373 -2113 -594 1755 1078 -2295 -2128 1157 2328 -564 -3043
492 -3043 -904 2386 1747 -1374 -2163 125 2049 974 -1071 -1609 -181 1514 1245 -926 -1758 53
508 53 1798 836 -1594 -1216 1414 1866 -639 -1701 511 2348 542 -1771 -899 1527 1897 -551 -1930
525 -1930 -410 1401 1274 -411 -1845 -738 1452 1689 -498 -2158 -383 2122 1521 -1310 -1667 666
$$ packed form
409B901j5m828j938M286L608k756m332P48L988R13k553j855P12J720R91r84j828
426a222p7K162J484j859k719J474L444p29l784m81L837J754l727k521K376L222
442B634r20l332p78K809J557j265j824l04J509J254k08k143r86K494K080j978
458E99k964Q09L537O42l899j810L243K707j907l360N42L076P46k066j483O60J861
475I33M64j260j304K52J652Q25j935j740J519K349o77l373J67L285J171k892k479
492c043K139L290o39l121p89K288J924j075k045n38J428J695k69k171q32J811
508E3J745r62k430L78K630M52k505j062K212J837j806k313Q72K426L70k448j379
525a930J520J811j27j685j434J107K190K37k187j660J775K505o01k831l57K333
$$ plain form
541 666 2005 342 -1899 -642 1278 984 -999 -1525 63 1153 222 -1200 -1152 470 1332 153 -1269
558 -1269 -1309 392 1568 -82 -1950 -1135 1115 1384 -1044 -2112 -249 1526 547 -1626 -1409 958 1551
575 1551 -337 -1458 -631 1129 1338 -218 -1227 -326 1421 1534 -390 -1464 -45 1491 1120 -835
591 -835 -1202 574 1774 202 -1279 -339 1417 895 -783 -1035 477 1491 326 -1353 -1049 697 1409
608 1409 -8 -1619 -1247 837 1522 -201 -1964 -839 1318 1320 -556 -1626 -174 1450 613 -865 -1095
625 -1095 348 1009 -166 -1104 -432 635 688 -688 -1195 -4 962 479 -917 -1117 391 1583 319
642 319 -1380 -1059 913 1601 -221 -1538 -587 1135 1198 -561 -1366 -92 1025 660 -549 -953 291
659 291 1144 401 -749 -570 619 1178 -75 -950 -245 1038 943 -744 -1207 124 1269 313 -1092 -900
$$ packed form
541F66J339j663k241J257J920k94j983n26J588J090r31j422M8J622Q62j179j422
558a269m0J701J176j650j868Q15K250K69k428j068J863J775r79k173K17K367N93
575A551j888j121Q27J760K09j556j009R01J747J13j924j074J419J536l71j955
591h35l67J776J200j572j481R40J756n22j678k52J512J014j165j679L04J746P12
608A409j417j611L72K084O85j723j763J125K157Kj876j070J452J624q37j478k30
625a095J443O61j175r38O72J067N3j376n07J191R66m83j396k00J508J192j264
642C19j699L21J972O88j822j317R51J722O3j759q05J274J117l65j209m04J244
659B91Q53p43j150J79J189N59j253q75P05J283r5j687m63J331J145r56j405J92
$$ plain form
677 -900 501 1022 -235 -1016 -443 757 747 -488 -1120 -189 880 568 -832 -1187 96 1147 277 -1204
695 -1204 -905 669 1195 41 -1196 -578 980 1031 -274 -911 -19 1055 589 -493 -699 268 782 66
713 66 -867 -317 632 575 -348 -761 -93 1091 563 -772 -1068 310 1350 295 -1154 -1009 458 1067 159
732 159 -1078 -681 521 851 -63 -808 -425 575 635 -293 -655 208 758 125 -470 -362 537 683 -374
751 -374 -916 -131 902 541 -580 -1019 73 977 560 -751 -783 377 1062 214 -822 -447 638 877
769 877 -117 -882 -142 682 489 -395 -699 111 602 309 -557 -582 422 676 -174 -681 -211 586 612 -410
789 -410 -711 -117 679 409 -564 -652 254 648 -47 -787 -491 537 675 -288 -827 -182 629 430 -388 -709
809 -709 196 751 369 -633 -643 211 741 108 -677 -464 501 648 -128 -566 -260 561 285 -285 -410 228
$$ packed form
677i00J401N21j257p81N73J200j0j235o32R31J069l12j400l55J283J051q70j481
695a204K99J574N26j154j237O18J558N1j305o37Q92J074m66j082k06R67N14p16
713F6r33N50R49n7r23m13O68J184n28j335k96J378J040j055j449J45J467O09r08
732A59j237L97J202L30r14p45L83J000O0r28l62Q63N50o33n95J08Q99J46j057
751c74n42P85J033l61j121m39J092R04m17j311l2J160O85q48j036L75J085K39
769H77r94p65P40Q24j93q84l04Q10M91k93q66k5J004K54q50n07M70P97K6j022
789d10l01N94P96k70r73q8R06L94o95p40K96J028J38r63n39O45Q11j99q18l21
809g09R05N55l82j002j0Q54N30o33p85K13R65J47p76m38L06Q21k76n70j25O38
$$ plain form
829 228 533 52 -485 -76 504 679 -262 -743 -83 820 412 -490 -793 -18 787 295 -749 -716 -108 986
849 986 284 -429 -683 211 642 -133 -459 -133 309 296 -270 -333 292 390 133 -423 -356 479 472 -237 -639 -150
871 -150 638 352 -453 -693 -30 550 453 -425 -724 200 573 254 -518 -593 397 469 -49 -516 -193 359 305 -333
893 -333 -532 -84 479 424 -499 -429 310 541 128 -527 -243 476 437 -108 -527 -179 444 292 -392 -479 270 482
915 482 103 -418 -230 211 295 -13 -479 -108 632 410 -257 -520 -165 538 263 -324 -547 42 565 152 -487
936 -487 -261 215 305 48 -422 -10 299 112 -243 -302 77 314 47 -554 -230 237 316 -199 -632 -245 328
957 328 561 -246 -720 -129 615 436 -363 -530 -26 409 358 -178 -406 130 348 -77 -255 -8 135 205 -156
978 -156 -173 190 515 108 -231 -297 346 615 -134 -319 -230 553 396 -77 -486 -154 351 197 -201 -474 -35
$$ packed form
829B28L05m81n37M09N80J75r41m81O60R03m08r02l03P75Q05m92j044L3O08J094
849I86p02p13k54Q94M31p75l26L26M42j3n66o3O25R8k57n56O7Q35pp09m02M89
871a50P88k86q05k40O63N80r7q78k99R24L73l19p72p5R90P2n18m67L23N52n4o38
893c33j99M48N63n5r23P0P39K31m13o55K84P19l9n45m19L48O23j52o84q7P49K12
915D82l79n21J88M41Q4l08m66L71P40k22o67k63L55P03k75n87k23N89N23m13o39
936d87K26M76R0k57m70M12L09j87l55n9L79K37k67o01L24M67P9n15m33L87N73
957C28K33q07m74N91P44j79p99j67N04M35n1n36k28N36K18m25j78K47J43P0l61
978a56j7L63L25m07l39o6O43K69p49j85Q9P83j57m73m09L32N05j54l98k73M39
$$ plain form
999 -35 354 131 -343 -359 82 396 78 -311 -200 281 212 -92 -534 -57 415 284 -456 -327 209 335 64
1020 64 -248 -97 204 340 -44 -203 -56 242 197 -83 -165 85 500 100 -335 -304 236 469 -118 -626 -187
1041 -187 425 384 -178 -424 -182 491 310 -127 -342 -95 236 74 -71 -165 104 117 2 -331 -30 209 143
1062 143 -257 -259 78 577 45 -280 -168 381 353 -6 -443 -303 233 306 -43 -359 -381 134 382 -121 -470 -221
1084 -221 55 135 -164 -195 149 279 32 -150 -49 217 142 -192 -133 53 510 67 -127 -216 155 321 112 -287
1106 -287 -85 301 264 39 -299 -252 213 190 -73 -335 -12 293 13 -221 -154 -7 186 -17 -309 -168 270
1127 270 104 -37 -331 -109 169 89 -133 -177 -107 134 49 -252 -141 94 238 -90 -310 -81 214 119 -145 -228
1149 -228 137 421 17 -135 -120 88 377 58 -163 -239 118 271 16 -162 -198 190 408 15 -76 -11 298 57
$$ packed form
999c5L89k23m74j6M41L14l18l89J11M81o9l04m42M77M72j31p40J29N36J26k71
1020F4l12J51L01J36l84j59J47K98m5k80q2K50M15m00m35L1N40K33n87n08M39
1041a87O12m1n62k46K42O73j81m37k15K47L31j62j45r4K69J3j15l33L01K39o6
1062A43m00kL37M99n32l25J12N49k8l59m37J40N36P3l49l16k2N15K48n03l49K49
1084b21K76Q0k99l1L44J30k47j82J01K66p5l34N9J86M57m43j94q9L71J66k09l99
1106b87K02L86l7k25l38M7M65k3k63k62L23L05k80k34O7J47J93k03k92J41M38
1127B70j66j41k94K22K78q0k22m4P0K41q5l01J11K35J44l28k20K29K95r5k64q3
1149b28L65K84m04j52J5K08K89l19k21p6L57J53k55j78l6L88K18l93r1O5L09k41
$$ plain form
1171 57 -85 -5 68 185 -66 -64 5 308 59 -167 -119 47 276 108 -292 -334 43 224 9 -151 -245 42 260
1194 260 20 -237 -80 53 284 -108 -174 -52 75 47 -155 -130 109 89 -44 -39 -31 78 84 -34 -171 -48 196
1217 196 131 -218 -309 81 278 113 -146 -184 329 240 45 -211 -40 215 155 -14 -172 43 206 109 -67 -195
1239 -195 91 155 22 -232 -120 88 163 0 -218 -21 231 148 -45 -124 88 163 1 -129 -176 164 199 -53
1261 -53 -102 -13 109 85 -122 -237 45 157 105 -230 -245 60 238 48 -200 -227 -26 235 17 -109 -50 8 101
1284 101 -30 -29 -30 189 -74 -59 -88 22 134 -80 -120 -56 67 247 -100 -204 -27 303 239 -176 -252 138 261
1307 261 141 -58 -219 97 166 135 -122 -101 50 104 -105 -50 3 87 178 -15 -17 27 45 30 -122 -60 160 145 6
1332 6 -125 -76 161 105 -136 -127 -24 205 -64 -142 -124 76 26 -20 -135 -58 -6 -44 -29 -133 -41 106 124 -115 -148 -90
$$ packed form
1171E7j42Q0P3J17k51KO9L03k49k26M8J66K29j68m00m2L77J81k15j60r4K87K18
1194B60k40k57J57J33K31l92o6J22J27k8k02K5K39k0j33NQJ09Oj18j37J23K44
1217A96o5l49r1L90J97j65k59l8N13q9j95k56J71K55o0j69j58K15J63r7j76j28
1239a95K86O4j33k54J12K08P5j63k18J97K52q3j93p9K12P5j62j30m7L40L5k52
1261e3m9Q9J22k4k07j15K82J12n2l35j5L05J78j90k48k7K01K61k18j26N9N8R3
1284A01j31JjK19k63J5k9J10J12k14m0O4J23J80l47j04J77L30o4m15p6L90J23
1307B61j20j99j61L16O9l1k57K1J51N4k09N5N3Q4R1j93kM4J8j5j52O2K20j5j39
1332Fj31M9K37n6k41RJ03K29k69p8J8K00n0m6j15P7N2l8J5j04R2J47J8k39l3N8
$$ plain form
1358 -90 162 11 -110 -78 -9 93 8 -35 -169 37 45 -37 -11 -59 116 -93 -118 -60 134 128 12 -53 -48 59 228 -45
1384 -45 -211 33 106 144 96 -131 24 87 124 13 -12 17 98 125 43 43 36 104 51 -24 77 167 12 -90 27 26 146
1411 146 74 -70 -113 189 141 -75 -257 -266 193 44 -75 -66 -68 55 37 46 -232 -84 -12 -122 -18 -59 -27 17 -27 -99
1437 -99 44 -147 -68 16 -33 117 167 -25 -97 40 79 102 101 -99 -109 82 185 15 -25 -38 114 2 -52 -128 58
1462 58 252 -131 -33 -115 147 71 13 -119 -79 -2 -4 6 -75 20 27 -51 69 -12 -48 67 108 -18 56 -65 134 -8
1488 -8 -44 -66 30 61 -52 -6 102 -23 4 -25 -112 166 181 -1 -179 -159 53 79 -137 -157 -75 26 166 -139 -71
1513 -71 -56 -65 5 -112 -92 46 -19 -43 -28 -33 -19 24 -7 -14 57 -40 49 -135 37 167 60 16 -82 -65 58 94 -8 -93
1541 -93 -16 125 62 60 -17 53 105 77 -88 -28 46 0 -56 -23 -44 105 63 -31 -99 -6 -33 13 -176 -143 137 170 112 -64
$$ packed form
1358i0K52j51j21L2O9J02q5m3j34K06Qq2K6m8J75k09k5N8J94oj16o5NJ07J69k73
1384d5j66K44P3L8m8k27J55O3L7j11k5K9Q1K7q2%pO8n3p5J01R0j55j02J17jJ20
1411A46p2j44m3L02m8k16j82rM59j49j19RkJ23j8Rk78J48P2j10J04m1L2M4m4p2
1437i9J43j91P9Q4m9J50N0j92p2J37L9K3jk00j0J91J03j70m0j3J52j12n4p6J86
1462E8J94l83R8q2K62p6n8j32M0P7kJ0q1R5Pp8J20q1l6J15M1j26P4j21J99j42
1488hl6k2R6L1j13M6J08j25K7k9q7K78J5j82j78K0K12K6k16k0Q2J01J40l05O8
1513g1J5rP0j17K0J38o5k4J5nJ4M3l1pP1r7Q9j84J72J30j07m4r8J7J23L6j02q5
1541i3P7J41o3kp7P0N2k8j65O0P4m6n6L3k1J49m2r4o8R3k7M6j89L3K80L3n8j76
$$ plain form
1569 -64 -15 21 71 -155 -88 -15 118 84 -64 -190 44 -25 -60 -111 -37 66 103 -77 -140 -119 28 9 -33 -111 69 -155
1595 -155 59 -93 -71 33 -4 30 -100 19 80 -50 -13 -56 18 -13 -13 -12 -38 38 -8 -66 -77 22 183 70 -124 -146
1621 -146 -48 -30 118 98 -26 -50 -16 67 -71 -85 -78 -47 33 -36 -105 32 -55 -6 -50 29 84 -3 -195 -201 42 165 -110
1648 -110 -32 -35 81 64 -2 -211 -16 126 71 -2 17 -94 -92 -34 58 -100 -114 29 -14 -64 -97 86 66 -88 -72 -154
1674 -154 5 60 25 128 -4 -35 45 -24 -44 -1 94 121 8 31 151 94 12 -70 40 125 -15 -53 -160 9 154
1699 154 127 -16 -10 27 92 -30 -47 34 40 18 -48 -287 -128 -27 -33 -6 -48 -8 17 96 -48 -68 124 -24 -111 -169 -66
1726 -66 54 80 -117 115 111 -39 44 -99 -55 -109 -41 -55 -67 -18 9 190 126 -31 19 -61 120 -34 -75 25 48 -4
1752 -4 -41 -103 6 -8 -22 -26 72 43 -125 20 7 -29 -10 99 -5 -143 -4 10 -40 35 -2 156 180 -8 -85 83
$$ packed form
1569f4M9L6N0k26O7P3J33l4j48j26K34o9l5n1P4J03L7j80o3K1J47j9m2p8J80k24
1595a55K14j52K2J04l7L4j30J19O1j30L7m3P4l1%Jk6P6m6n8j1R9J61j13j94k2
1621a46R8J8J48k0j24k4L4Q3j38j4PL1Q0o9o9J37q7M9m4P9N5q7j92oK43J23k75
1648a10P8lJ16j7o6k09J95J42n5p3J9j11KN8R2j58j4J43m3n0l3J83k0j54J6q2
1674a54J59N5l5J03j32l1Q0o9k0M3R5K7j13K3J20n7q2q2J10Q5j40l8j07J69J45
1699A54k7j43OL7O5j22j7Q1Ok2o6k39J59J01oK7m2M0K5P9j44k0J92j48q7n8J03
1726f6J20K6j97K32mj50Q3j43M4n4O8j4j2M9K7J81o4j57N0q0J81j54m1J00K3n2
1752dl7o2J09j4j4mR8k9j68J45j3l6J9J09j04j38J39J4n0P5l7J58K4j88p7J68
$$ plain form
1778 83 90 5 -166 -89 134 63 -10 -139 34 23 -46 -8 -58 35 -6 60 -1 -105 -111 -28 100 37 -162 72 120 -118 -163
1805 -163 -111 86 83 -21 66 -8 -52 -23 -103 -20 -115 113 169 -116 -60 -155 152 76 -125 -33 73 16 -3 -10 55 172 -30
1832 -30 -88 -32 104 64 -44 -64 142 -119 -56 -22 -19 19 -59 76 -37 -62 106 208 -8 -178 -113 21 79 -64 -16
1857 -16 55 108 -6 37 212 192 58 -67 7 18 41 -53 52 17 -20 35 -5 55 -95 -54 208 16 -75 -112 87 164
1883 164 -62 -9 -77 143 -14 -97 83 57 -5 -65 -135 72 -119 -34 32 33 -181 37 37 64 -149 -83 169 146 21
1908 21 -6 58 93 22 -23 -53 85 67 -20 44 149 -121 12 -18 69 -29 -57 135 -5 19 -161 161 127 5 -120
1933 -120 300 22 53 -2 -40 -15 5 -5 72 134 -76 -86 151 97 1 -107 -51 85 -169 93 182 39 -99 99
1957 99 83 155 -73 -27 94 -16 83 -12 2 -49 29 -3 -4 121 -136 0 132 33 -203 -159 143 27 -4 -12 107 -5
$$ packed form
1778H3Pq5j71P7K23p1p3j29J73j1o9L8n0R3m1O6o1j04oQ3J28o3j99K34M8k38m5
1805a63N2J97lj04Q7p4m4K9q0Q3r5K28N6k85N6r5L07p6k01R2J06n7j9pO5J17k02
1832c0n8N6J36m0j08k0K06k61O3L4LL8p8J35j13k5J68J02k16j70O5J34N8j43M8
1857a6P1N3j14M3J75k0j34j25P4J1K3r4J05l5l7N5m0O0j50M1K62j92r1l7J99P7
1883A64k26N3o8K20j57q3J80k6o2o0p0K07j91Q5O6Jk14K18%K7k13O6K52k3j25
1908B1k7O4L5p1m5l0J38j8q7O4J05k70J33l0Q7r8k8J92j40K4j80L22l4j22j25
1933a20M20k78L1n5l8K5K0j0P7O2k10j0K37n4r6j08N6J36k54K62Q9j43j38J98
1957I9j6P2k28M6J21j10R9r5J4n1P8l2jJ25k57J36J32r9k36M4L02j16l1qJ19j12
$$ plain form
1983 -5 -26 -140 39 -85 -17 -71 73 111 40 3 12 94 60 19 -32 197 -100 26 -6 81 2 68 91 279 -34 -64 41
2010 41 -1 -37 -87 97 32 -50 -4 3 59 55 59 55 -6 -193 -28 -23 43 -260 -85 32 38 -85 -82 100 -69 -169 28 45
2038 45 102 -5 -119 -127 -6 -58 -75 70 179 -114 -93 -100 28 65 -112 100 133 -52 -10 48 51 -146 -67 137 95 27
2064 27 -88 43 106 -16 -86 -167 -3 43 -86 6 48 -112 -98 58 -20 -23 79 109 64 -72 -75 70 -19 -25 -131 -51
2090 -51 37 -88 -170 -28 122 56 -62 66 53 27 -67 -64 75 -10 -3 -19 102 -109 -118 -52 -50 -109 -69 94 67 -33 -74
2117 -74 -128 75 -26 -259 -24 138 -46 -134 -10 -31 -26 -120 19 -40 130 38 117 10 -10 -30 141 35 -73 -161
2141 -161 89 232 4 -88 -76 171 -99 29 -48 83 -54 -95 19 -52 -22 -147 56 45 -185 43 142 -16 -82
2164 -82 -72 11 78 58 -124 70 94 -3 -243 -6 -35 43 -141 -11 59 -20 -21 -24 -99 -39 36 16 -4 -53 13 92 61 -49
$$ packed form
1983ek1j14J79j24O8n4J44L8p1l7RQ2l4m1n1K29k97J26l2Q7p9O6K3J88l13l0J05
2010D1m2l6n0J84o5q2M6PN6mMmo1j87J65NO6l03J75J17Oj23LJ82j69j00J97J7
2038D5N7j07j14qJ21n2j7J45J09k93K1pJ28L7j77K12L3j85M2N8Lj97P9K04m2o8
2064B7j15J31O3j22p0q1J64M6j29R2M2j60J4J56p8lJ02L0m5j36lJ45q9oj06Q0
2090e1Q8j25q2J42J50o6j18J28j3k6r4LJ39q5Pj6J21k11rO6Kn9M0J63k7j00m1
2117g4n4K03j01k33K35J62j84q8J24k1Nr4J39n9J70r2P9j07k0k0J71j06j08q8
2141a61K50J43k28r2J2K47k70J28p7J31j37m1J14p1L0j25K03j1k30K28R9j58o6
2164h2J0Q3O7k0j82J94K4r7k40K37k9P8j84J30P0p9jlp5O0P5k0k0m9O6P9l1j10
$$ plain form
2192 -49 -55 82 181 12 -19 -83 120 -61 -56 83 161 1 -41 -55 41 -62 -123 -14 196 -81 -32 -52 86 -3 24 -67
2218 -67 -14 9 -108 74 110 -70 -202 26 147 -81 -2 -48 20 165 -59 26 5 -17 -9 47 44 -130 -84 -6 49 -153
2244 -153 -63 33 44 53 -76 -35 46 0 -45 -57 42 106 -29 -43 -30 -18 -76 31 11 -62 57 83 -26 -143 -18 86
2270 86 106 6 -126 -53 -7 -45 -1 -38 50 35 -147 -166 99 69 25 38 108 76 -48 -22 -70 -71 -6 -30 -75 -69 80 -14
2298 -14 80 -53 72 121 125 -48 15 -8 46 28 -13 -121 -46 33 -16 -42 -15 -52 59 -131 -63 -29 -6 10 -50 70 -6
2325 -6 -20 18 -46 -112 1 47 46 26 -87 -46 -117 -54 59 -37 -36 -29 35 -71 82 -21 80 14 -6 -28 69 108 -104 -119
2353 -119 34 13 -26 -97 -20 84 0 116 79 -23 33 28 -15 35 79 98 90 53 -235 -82 27 -59 -99 -92 46 -53 55
2380 55 -39 -152 14 -102 -5 46 -82 -115 43 9 -51 -147 54 14 19 -29 15 143 -27 -11 -187 -1 43 6 23 -21
$$ packed form
2192d9oJ37R9j69l1o4K03j81NJ39P8j60m2j4R6j03o1J09K10k77M9k0J38q9K7r1
2218f7N3K3j17J82L6j80j32K28J21k28P9m6O8J45k24Q5k1k2QN6lj74M6P8N5k02
2244a53R0R6J1Rj29M1Q1m6m5j2R9O4j35j4J3J2n8J07k0p3J19K6j09j17J25J04
2270H6K0j00j32P3M6l8M4l7Q8j5j82j9K65l0m4J3P0l2j24K6m8jO5k4m5OJ49r4
2298a4R4j33J25M9Mj73O3k3N4j8m1j08P5P9m9k6K7l7J11j90O8L4K3J6o0J20p6
2325fj4L8o4o6J13M6jk0j13M1p1O3J13r6JPO4j06J53j03J01o6k0k2R7L9k12j5
2353a19J53k1l9p1P7J04q4J16l7j02N6nm3N0M4J9ql7k88J53J09q6m0PJ38r9J08
2380E5r4j13J66j16R7N1j28l3J58l4o0r6K01m0Nm8M4J28j70J6j76J86M4l7J7m4
$$ plain form
2406 -21 96 -23 20 -8 -26 6 14 -18 -16 -6 18 2 34 -17 -68 -45 25 21 -122 -19 68 -102 27 -87 -88 30 -112 -136
2434 -136 -19 -35 -21 -23 77 69 31 -42 -64 25 -25 29 -12 -29 43 61 116 68 32 -117 98 130 32 -32 55 -36 103 54
2462 54 26 -5 -6 -27 55 117 -153 -34 -107 -6 97 137 19 -83 -43 92 27 -11 -45 -71 -83 31 74 -6 86 98 18
2489 18 2 33 -1 25 38 -54 134 -42 91 40 -51 -85 -65 6 -63 152 180 -20 -64 -114 -43 136 -84 -49 -19 -28 -75
2516 -75 -92 -73 -73 110 45 3 -26 17 45 70 -90 -94 41 7 32 52 8 53 99 136 -127 50 50 -32 -71 1 -14 59 -118
2545 -118 8 125 -59 111 37 48 58 92 -3 32 32 -72 114 -16 -76 95 -37 80 -49 -90 -115 -145 109 99
2569 99 -14 111 33 -19 -69 -5 -40 -51 0 -44 71 34 15 -59 -103 -119 117 -26 10 -18 19 -8 -32 58 -122 4 64
2596 64 -23 -74 -23 -7 34 -36 -174 -107 70 53 9 84 99 213 -29 -20 -4 31 16 -57 -130 0 1 -37 -58 11 -39 19 -5
$$ packed form
2406b1J17j19M3k8j8L2Ql2KJ0K4j6L2n1n1K3P0mj43J03Q7j70J29j14jJ18j42k4
2434a36J17j6J4kJ00ql8p3k2Q9n0N4m1j7P2J8N5m8l6j49K15L2r8o4Q7r1J39m9
2462E4k8l1jk1Q2O2k70J19p3J01J03M0j18j02M0J35o5l8l4k6j2J14M3q0R2J2q0
2489A8j6L1l4K6J3r2J88j76J33n1r1l4K0P1o9K15K8k00m4n0P1J79k20L5L0rm7
2516g5j7J9%J83o5m2k9M3K8K5j60mJ35l4K5K0m4M5M6L7k63J77%q2l9P2j5P3j77
2545a18J26J17j84J70p4J1J0L4r5L5%j04J86j30o0J71j32J17j29m1k5l0K54j0
2569I9j13J25p8n2n0O4l5j1N1m4J15l7j9p4m4j6K36j43L6k8L7k7k4R0j80J26O0
2596F4q7n1N1J6M1p0j38O7J77j7m4P5J5J14k42RJ6L5j5p3p3J30Jl8k1O9n0N8k4
$$ plain form
2625 -5 26 -74 100 34 -125 47 -2 2 -42 40 -120 -84 -18 -13 -33 -143 -41 -68 92 106 61 -44 -128 33 -34 90
2651 90 -20 -79 162 -24 -8 4 55 62 -15 -7 58 -6 23 -79 146 -38 70 -35 -92 -5 -77 49 -138 46 1 -43
2677 -43 -179 -5 63 119 26 50 -46 54 154 -20 -77 33 83 14 -23 -57 -139 53 48 -62 138 67 6 131 -29
2702 -29 -23 -117 2 115 -22 -37 71 138 -35 4 -34 59 7 -56 -120 100 122 -226 -1 97 -124 -9 124 33 60
2727 60 -35 18 -29 -37 -74 29 -116 28 33 41 68 119 -5 117 22 21 34 2 96 64 38 -86 -130 51 -1 41 -9 -39 50
2756 50 -42 42 -23 44 27 120 -18 -39 5 -55 37 -65 17 28 132 55 3 -148 -17 125 15 30 51 20 -4 35 -107
2783 -107 57 7 24 -4 43 26 -17 -53 11 48 114 21 -42 14 -36 -9 -24 -43 -59 -6 61 14 -53 -45 11 93 -85 25 21
2812 21 13 28 15 -8 -46 -29 25 78 -63 -140 119 25 18 -54 60 13 -87 -4 40 106 10 -32 4 105 -3 -29 -6 53
$$ packed form
2625eL1j00J74o6j59J72m9Mm4Q2j60L6O6Nk0j10J02k7J60J4m5j05q4J61o7J24
2651I0j10n9K41j86J6J2N1Pp7QO5o4K9j02K25j84J08j05n7Q7p2J26j87J84m5m4
2677d3j36J74O8N6r3K4r6J00J00j74n7J10N0o9l7l4q2J92nj10K00p1o1J25j60
2702b9Or4J19J13j37j5J08O7j73L9l8R3n2o3o4K20K2l48K25R8k21J15J33r1K7
2727F0r5N3m7ql7J03j45J44NQK7N1j24J22r5jJ3l2R4l2k6j24m4J81n2M2n0l0Q9
2756E0r2Q4o5O7j7R3j38k1M4o0R2j02Q2J1J04p7n2j51J31J42j10J5K1l1k4L9j42
2783a07J64n0J7k8M7j7m3l6O4L7O6r3o3N6n0K7j5j9j6N3O7m7o7QN6Q2j78J10m
2812B1qJ5j3k3l8J7N4N3j41p7K59r4pp2J14m7j00Q3M4O6r6m2L6J01j08k6K3N9
$$ plain form
2840 53 49 112 8 -33 46 17 -114 -58 8 -4 5 10 43 -38 -67 52 109 97 -87 -17 -41 -103 -89 99 44 -35 -171 -155 -89
2869 -89 -85 -27 -91 -29 -5 39 -17 113 -76 38 36 -37 35 14 43 12 -16 -131 -48 87 55 -35 -29 69 61 -21 -19 16 -34 5
2899 5 -1 -30 -34 10 -12 8 42 51 -29 72 -77 -78 -43 -17 -38 -16 -12 39 -2 -78 -97 -32 51 35 -107 14 -131 31 -18 71
2929 71 1 -192 -18 27 -37 78 -17 -26 74 -92 -46 23 -3 -22 -15 96 74 -21 -66 -17 5 85 -13 49 61 76 6 -115
2957 -115 -113 3 -82 -60 -70 16 36 -69 -4 46 -23 47 61 -83 -5 97 -101 -93 -71 19 -40 -64 -64 -46 -54 -15 73 -74 31
2986 31 78 48 -10 54 -33 -20 36 1 18 -65 78 33 -3 -94 -77 -6 -27 51 66 -69 114 20 -27 8 66 36 58 -74
3014 -74 56 -33 -107 -38 -18 -25 114 92 -85 -68 34 45 -55 -15 -8 83 91 -15 -41 -85 -69 -22 -105 -48 -82 4 -7 -45 -160
3043 -160 83 114 20 87 -65 127 29 53 50 13 69 29 -63 -113 13 140 -3 83 -197 9 134 73 11 28 -36 98
$$ packed form
2840E3mO3j04m1P9k9j31N6O6j2RNL3q1k9J19N7j2j84P0k4o2J4J88n5p9j36J6O6
2869h9MN8o4O2K4M4n6J30j89J14kp3P2k1K9l1k8j15Q3J35l2r0OR8qq2KL5n0L9
2899Eok9mM4k2K0L4Rq0J01j49jL5K6k1K2MN1m1p6j9O5Q3j6j42J21j45J62m9Q9
2929G1p0j93J74M5o4J15r5rJ00j66M6O9k6j9PJ11k2r5m5M9K2Q0r8O2J2J5p0j21
2957a15KJ16q5K2j0Q6K0j05O5N0o9P0J4j44P8J02j98QK2R0n9k4%J8qL9Q8j47J05
2986C1M7l0n8O4q7J3N6l5J7q3J43m5l6r1J7P1k1P8J5j35J83r4m7L5N8l0K2j32
3014g4J30q9p4O9K0pJ39k2j77J7J02J1j00M0PR1Qj06k6m4J6M7q3N7l4Q6j1l8j15
3043a60K43L1r4O7j52J92r8K4ll7N6m0r2n0J26J27j43Q6k80K06J25o1o2J7o4J34
$$ plain form
3069 98 -15 -30 83 117 25 29 102 -113 -91 -22 -43 -4 106 -19 -9 -66 -143 39 69 -67 -6 -59 48 30 -94 20
3095 20 -15 57 118 58 178 61 -22 81 18 -34 -37 25 -3 103 14 -11 -169 -81 -26 43 -105 -18 72 -78 54 6 35
3122 35 -57 1 88 39 -87 19 71 -13 -4 -35 30 72 69 53 -30 -122 42 -85 9 -35 -145 43 -58 -96 84 56 -4
3149 -4 -37 97 -20 -67 -59 -33 18 44 83 -81 -26 50 24 -48 94 -66 -95 -72 -106 -9 93 18 -13 14 -50 -20 19 60
3177 60 37 94 -44 85 -98 -125 -32 63 104 27 2 17 129 -8 90 94 -26 56 -9 46 -54 28 -9 25 -71 20 64
3204 64 103 -148 110 28 83 124 27 -18 -120 -40 57 -37 38 -109 49 50 -57 -28 2 114 59 1 -88 -84 16 -8 15
3231 15 -111 79 35 57 142 48 -31 -77 155 59 2 144 56 7 36 -10 -10 -24 -122 33 4 -13 -14 66 -96 -6 130 -101
3259 -101 -62 -140 68 -99 33 -28 24 28 28 17 40 -20 213 70 3 12 56 49 -55 38 37 30 186 -147 -25 88 114 68
$$ packed form
3069I8j13j5J13L4r2MP3k15K2O9k1L9J10j25J0n7p7J82L0j36O1n3J07j8j24J14
3095B0l5P2O1o0J20j17q3J03o3n2lO2k8J06q9k5j58Q8N5O9j48Q7R0j50J32m8K9
3122C5r2N8Q7m9j26J06N2q4Rl1O5M2lj6q3r2J64j27R4m4j10J88j01l8J80k8o0
3149dl3J34j17m7QK6N1K6L9j64N5P6k6p2J42j60k9K3l4R7J02p5l1K7o4L0L9M1
3177F0k3N7j38J29j83k7R3R5M1p7k5J5J12j37R8Mj20Q2o5N5j00Q2l7L4r6R1M4
3204F4L9k51K58q2N5M1r7m5j02Q0R7r4P5j47J58Jj07K9L0J12n5n8q9MJ00k4K3
3231A5j26J90m4K2Q5r4p9m6K32r6n7J42q8m9K9m6%j4r8J55k9j7jQ0j62R0J36k31
3259a01L9p8K08j67J32o1N2M%j1K3o0K33j43o7RM4pj04R3jpJ56l33J22J13K6m6
$$ plain form
3287 68 -83 -30 2 54 87 -83 -26 154 -75 18 35 -59 -9 138 -61 24 9 3 -119 -83 24 115 3 -42 40 -49
3313 -49 13 -8 -63 35 33 89 -141 2 21 90 67 -41 2 -6 112 15 -72 -11 -8 58 72 -13 -97 -144 7 61 -38 41 67
3342 67 66 -145 -111 -46 -93 -12 -56 -59 -6 -50 84 -94 -23 54 -50 62 -160 -25 58 85 42 -73 -52 -65 -15 -8 -3 -158
3370 -158 147 65 -93 -66 -101 -29 -60 45 -145 49 25 42 -3 30 -18 -31 -68 -39 -48 17 29 -36 81 8 -1 -2 -7 -123
3398 -123 26 7 -61 -124 29 -49 -73 6 2 40 21 -43 6 64 -39 -12 -100 -150 -13 -60 54 -46 -47 -28 10 -16 51 9
3426 9 -68 145 25 52 -45 11 138 65 -3 -4 8 34 59 40 62 -79 81 35 -9 122 -3 98 45 11 108 36 7
3453 7 6 6 -142 -16 -53 49 92 42 -55 -79 -135 81 -110 -80 14 44 -23 -58 20 -95 58 12 30 -72 -183 -31 63
3480 63 -147 -3 -72 66 -6 58 -28 91 -50 19 -128 -19 32 10 6 57 39 59 -84 -41 -50 -98 0 -8 -122 -20 -134
$$ packed form
3287F8j51N3L2N2L3j70N7J80k29R3J7r4N0J47j99Q5j5oj22L6J07R1j12m5Q2q9
3313d9O2k1n5R8kN6k30J43J9O9k3j08M3qJ18r7q7O1LO6J4q5q4m7J51N4r9P9K6
3342F7jk11L4O5m7Q1m4lN3m4J34j78P1P7j04J12k22J35Q3K7m3j15K1j3N0PNj55
3370a58L05q2j58K7l5P2l1J05j90J94k4J7m5L3m8j3l7K9rO5J2o5J17p3rjnj16
3398a23J49j9o8o3J53p8k4P9mL8j9o4M9N8j03K7q8n0J37m7J14j00jJ9L8k6O7m2
3426Ip7K13j20K7r7N6J27p3o8jJ2K6K5j9K2j41J60m6m4J31j25J01n3l4R7p2k9
3453Gj%j48J26l7J02M3n0r7k4n6K16j91L0R4L0o7l5P8j15J53m6J8j02j11J52R4
3480F3k10J44o9J38p2O4q6J19j41O9j47J09N1k2mN1j8K0j43M3rm8R8qj14J02j14
$$ plain form
3507 -134 -5 -29 -102 84 -94 17 89 11 -182 29 110 -20 80 -38 -133 57 -75 -21 -11 32 21 2 -111 18
3531 18 -28 21 -16 21 128 27 22 97 35 54 17 -26 -26 -145 57 -13 51 0 -86 -144 -104 34 4 20 39 63 57 -3 22
3560 22 -28 35 -22 30 63 -24 -60 -34 45 -35 13 1 -53 76 96 59 -42 -27 -34 13 23 -20 62 88 -105 -109 37 -25 -78
3589 -78 82 -33 -62 -84 2 -143 31 21 23 -37 -88 28 -44 -102 3 -63 -39 -140 -87 39 15 78 5 48 -25 28 -94
3616 -94 48 37 -29 74 -88 -5 -44 -53 -57 29 105 97 49 -23 87 29 -45 -39 -21 -56 -99 -54 -184 -35 12 -82 123 3
3644 3 -18 -121 -58 -98 6 -111 -126 -204 91 -30 -58 40 -14 -47 -209 -2 -34 14 -28 58 -1 83 -18 -116 -51 -2 6
3671 6 -91 142 -11 66 30 -8 -17 -74 -31 -66 -52 -151 100 87 -81 22 148 -36 -90 -23 36 -106 -39 39 -26 -32 -4 -69
3699 -69 -28 -64 46 11 -40 -23 71 -107 -23 61 124 -39 92 4 36 89 -42 68 -185 45 -52 -101 81 -145 -79
$$ packed form
3507a34J29k4p3J86j78J11P2p8j93K11Q1j30J00j18r5J90j32N4J0M3j1j9j13J29
3531A8m6M9l7L7J07j01nP5o2J9l7m3%j19K02p0O4n1q6n8M0J38l0J6J9K4oo0K5
3560B2n0O3n7N2L3q7l6K6P9q0M8j2n4J29K0l7j01J5pM7J0m3Q2K6j93mJ46o2n3
3589g8J60j15k9k2Q6j45J74j0Ko0n1J16p2n8J05o6K4j01N3J26k4O3p3M3p3N3j22
3616i4J42j1o6J03j62Q3l9rmQ6P6qm8p2J10n8p4OJ8l5m3M5j30J49M7r4K05j20
3644Ck1j03O3m0J04j17j5p8K95j21k8R8n4l3j62K07l2M8m2Q6n9Q4j01r8O5M9Q
3671Fr7K33j53P7l6l8rn7M3l5J4r9K51j3j68J03J26j84n4O7N9j42O7P8o5oK8o5
3699f9M1l6J10l5n1J7R4j78Q4Q4O3j63J31q8L2N3j31J10k53K30r7m9J82k26O6
$$ plain form
3724 -79 146 -7 -30 108 -91 -10 -103 -72 -6 -3 139 104 -17 20 -87 50 -16 -32 -22 81 33 -75 -92 -86 -50 39
3750 39 -4 -43 173 57 18 10 80 -2 -85 25 10 -103 48 -49 -76 21 2 88 -111 -65 -199 73 34 48 -80 -91
3776 -91 49 -25 -11 -31 -58 7 40 -37 -48 66 -5 -37 99 -11 -3 -61 -1 27 75 59 -75 -107 2 -6 -7 40 -10 5 5
3805 5 -101 110 -8 -107 -45 -3 -41 82 -16 -92 -51 37 11 -43 20 160 -31 -49 39 -70 -181 -13 6 9 58 4 8
3832 8 -71 -74 96 -5 -10 42 58 -10 -105 -19 55 -57 45 -9 8 -17 -20 41 -108 49 15 -95 103 33 -28 -12 64 2
3860 2 -15 104 -22 -63 18 -15 88 -27 -12 76 -88 -59 -45 59 -10 44 -76 -80 32 22 67 -116 54 20 -39 -21
3886 -21 -47 61 10 51 -3 -27 75 51 -47 -72 -17 -27 61 -34 67 -12 97 -1 -34 89 14 129 -26 48 -87 -49
3912 -49 61 30 52 -79 -15 25 35 17 -106 -72 -5 -31 16 113 -41 -52 70 -122 -41 28 31 -47 -1 -1 35 -85 -66 -26
$$ packed form
3724g9K25j53k3J38j99Q1r3L1O6LJ42l5j21L7j07J37o6j6J0J03m8j08j7OL6Q9
3750C9m3l9K16j16l9qP0q2q3J10j5j13J51r7k7R7j9Q6j99M6j34K72l9J4j28j1
3776i1J40p4J4k0k7O5L3p7j1J14p1l2J36j10Qn8O0K8M8j6j34l2J09qjM7n0J5%
3805Ej06K11j18r9O2M2l8J23r8p6M1Q8k6n4O3J40j91j8Q8j09j11J68J9LM9n4M
3832Hp9lJ70j01nN2J6o8r5Q6P4j12J02n4J7k5lO1j49J57l4j10J98p0o1J6P6o2
3860Bj7J19j26m1Q1l3J03j15J5Q8j64K9J4J04o9N4j20mJ12j0M5j83J70l4n9J8
3886b1k6J08n1M1n4k4J02k4r8k5N5j0Q8r5J01p9J09r8l3J23p5J15j55P4j35L8
3912d9J10l1K2j31O4M0J0j8j23L4O7k6M7R7j54j1J22j92Q1O9Lp8M6%L6j20J9M0
$$ plain form
3940 -26 9 35 35 -32 5 71 -62 31 -30 27 60 -27 36 -75 53 18 -58 -59 -29 55 -71 -63 -82 -4 38 78 64 -67 17
3969 17 -45 -29 -147 16 -20 70 114 68 53 -80 2 143 -43 -51 66 -96 73 -27 -179 77 14 -23 -16 -116 -51
3994 -51 74 -128 -82 -22 -18 48 -147 -25 101 -80 -101 65 14 -51 67 27 60 65 -43 -10 3 -101 -42 16 -23 -57
4020 -57 31 20 38 100 -52 64 -23 51 -40 42 41 34 -16 129 59 -85 60 -30 -35 -80 2 -9 -9 78 -30 61 24 -70 1
4049 1 -123 10 -10 -112 38 -15 2 -134 -7 14 -62 8 -182 16 -38 110 82 -86 -28 -77 80 50 95 -7 48
4074 48 18 74 23 -152 56 -57 69 136 -72 13 -88 -59 -47 -48 35 45 -11 -47 -70 -111 52 58 -132 -41 99 22 41
4101 41 104 66 -18 -86 -62 -13 3 -169 -9 28 -87 19 -157 8 -10 34 -14 -12 68 89 -60 28 122 -6 -97 145
4127 145 -80 -120 71 59 -49 -83 -82 -36 -154 -14 -14 -14 -5 17 95 39 -31 -47 122 -76 7 -47 101 3 9 16 -6 -18 67
$$ packed form
3940b6L5K6%o7L7O6j33R3o1N7L3q7O3j11J28l5p6jL0Q4j26Qj9P8M2M0j4j31Q4
3969A7o2J6j18J63l6R0M4m6j5j33Q2J41j86qJ17j62J69j00j52K56o3l7Pj00O5
3994e1J25k02M6O0MO6j95J22J26j81k1J66n1o5J18m0L3Nj08L3J3j04N9N8l9l4
4020e7Q8j1J8O2j52J16q7P4r1Q2jpn0J45p0j44J45r0nm5Q2j1%Q7j08R1l7r4P1
4049Aj24J33k0j02J50n3J7j36J27K1p6P0j90J98n4J48k8j68N8m9J57l0M5j02N5
4074D8l0N6n1j75K08j13J26O7k08Q5j01K9J2jQ3J0n6l6k3m1J63Oj90R1J40p7J9
4101D1O3l8q4o8K4M9J6j72J60L7j15J06j76J65j8M4m8KQ0K1j49Q8R4j28r1K42
4127A45k25m0J91j2j08l4JM6j18J40%%RK2P8n6p0j6J69j98Q3n4J48r8OPk2j2Q5
$$ plain form
4156 67 32 10 79 -16 -7 13 26 -40 56 58 38 11 -21 67 -38 106 139 53 3 -6 -16 6 87 14 -58 -26 125 -41 51 -80
4186 -80 -1 118 32 -17 134 -20 -101 -7 -45 -73 -45 -41 -27 -60 8 -2 36 -89 -10 3 -62 -27 -49 -4 78 83 37 152 141
4215 141 116 -81 19 -6 92 -36 51 -46 -10 -75 -48 -53 -41 -39 -45 -36 -3 -92 -182 -43 50 -42 9 -106 67 -42 -123 111
4243 111 9 32 92 53 5 -2 -76 -12 -35 -134 -14 -39 66 -35 47 95 16 -73 7 87 -84 -90 -32 -48 17 -105 98
4270 98 16 -106 -38 -36 -33 10 -27 50 90 -37 -41 -96 93 119 -61 56 89 108 7 -33 58 -19 -107 -89 111 -54 -5 -9
4298 -9 -27 57 -47 106 -43 64 54 17 -143 5 -53 36 -30 70 -126 -57 99 -24 32 -78 -23 57 -148 -81 -40
4323 -40 -33 10 9 -84 -71 -31 60 -33 3 60 7 33 29 48 -223 -17 99 -16 -28 -74 -41 -95 106 18 0 115 76 40 118
4352 118 -67 -3 20 13 -61 -11 66 39 41 -82 111 -39 -54 87 -42 22 -66 -90 -68 -72 -29 -21 71 18 -28 56 -146 -29
$$ packed form
4156F7l5k2O9r5RK0J3o6R6Kk0k7l2Q8j05J44L3q6n0rj0K2Q1p3p2L2J51j66R2j31
4186h0P9J19q6m9J51j54q1R4l8k8K8MJ4l3O8j0L8j25P9J3o5L5k2M5Q2Nm6J15j1
4215A41k5j97J00k5R8j28Q7r7L6o5K7nJ2KoRL3q9r0J39R3r2N1j15J73j09q1K34
4243A11j02K3O0l9m8pp4O4k3r9J20k5J05j01Q2M8p9q9Q0Q0j71oN8j6O5j22K03
4270I8q2j22O8KLM3l7P7M0j27mn5J89K6j80J17L3J9j01m0R1p7q8J8K00j65M9m
4298ij8Q4j04J53j49J07j0l7j60J48n8Q9o6J00j96O9J56j23N6j10N5Q0k05O7M1
4323d0PM3jr3J3M0R1r3L6N7n3K6mJ9k71K06J16j15j2m6L3n4K01q8j8J15l9l6P8
4352A18j85O4K3pp4N0P7k7Kj23J93j50j5J41j29O4q8k4K2mM3QR2n3m6Q4k02J17
$$ plain form
4380 -29 -67 -17 -49 -66 111 -28 64 13 81 45 -24 20 85 -57 28 -2 14 148 25 -44 -37 -174 25 34 -29 36 5 58
4408 58 -75 -16 35 -38 82 -21 64 -13 20 -6 -59 62 41 38 34 26 64 -81 -80 74 58 -1 -4 86 22 -77 19 -29 36 32
4438 32 40 1 -101 -230 -43 -45 13 30 2 -53 -25 -3 18 70 121 45 -47 70 28 -79 -84 33 -146 63 48 21 28 -51
4466 -51 -179 27 -22 63 -4 -20 -70 -27 -54 47 35 20 29 67 -11 -126 -94 -103 -84 -14 -32 53 4 18 -43 -24 109 -19
4494 -19 -4 10 -37 -83 34 56 -2 30 55 -1 -15 -70 -42 -47 -73 149 105 39 85 -29 -71 114 30 -68 75 89 44 10
4522 10 17 10 -5 -13 -64 51 12 38 -18 -10 -110 -23 0 -84 83 -24 53 43 19 -58 -64 43 -69 -36 46 -123 15 76 63
4551 63 90 -25 49 30 148 136 -3 -34 -16 38 -63 -55 54 49 -45 -27 -9 -100 7 31 -52 202 59 -110 84 26
4577 26 -17 -46 143 44 14 -28 -66 -8 -6 71 -39 14 84 -83 20 -81 -10 -61 38 22 -83 23 6 15 62 -26 41 73
$$ packed form
4380b9l8N0l2j7J77j39R2n1O8l6o9M4O5j42Q5l0J6J34j23o9Pj37J99Ro3O5l1N3
4408E8j33N9N1p3J20j03Q5p7L3k6n3J21k1lmqL8j45JJ54j6n9lR0o4r9R6m8O5m
4438C2Ql9j02j29J87kN8J7k8n5K8K2K1N2N1p6r2J17m2j07nJ17j79K09j5k7Pp9
4466e1j28K06m9Q5o7j6n0M3k7J01j2j5RL8p8j15L2rJ9P0j8Q5m9J4o1J9J33j28
4494a9J5J4m7m6J17K2n8L2K5n6j4n5K8nk6K22m4o6M6j14m2J85q4r8J43J4m5l4
4522A0Ppj5qn1J15l9K6n6Qj00Q7K3q4J67j07P7j0k4p7oJ07j12L3Q2j69J38O1j3
4551F3K7j15P4j9J18j2j39l1J8N4j01QJ09nr4J8J8r1J07K4q3K54j43j69J94n8
4577B6m3k9J89r9l0m2l8N8KP7j10N3P0j67J03j01P1n1R9j6j05J06j7RM7q8O7L2
$$ plain form
4605 73 -117 -81 -20 -56 -4 -41 38 14 -21 3 52 -3 -12 48 13 -46 -107 67 -41 1 21 36 -12 -5 -90 37 8 -17 79
4634 79 28 -81 -43 55 -24 31 25 -109 -2 -106 -12 17 -14 19 137 -79 -54 -3 -1 -24 157 -11 6 -62 35 126 -15
4661 -15 57 15 -219 5 -67 -5 -54 36 -8 -7 17 -65 15 5 47 52 -13 11 8 -44 32 -83 -31 49 -58 -112 43 34 1 135
4691 135 83 -104 21 25 -6 61 -8 -20 5 -20 -116 -33 32 -29 -80 40 -86 14 -8 19 -112 -107 -31 -33 13 -36 -98 84
4719 84 -34 -29 -24 -105 -18 -28 125 63 38 65 76 43 129 -9 -29 159 -22 43 111 59 -2 -25 62 49 -12 40 63 35 39
4748 39 -79 -44 -4 -119 -12 75 35 -52 -129 -47 76 -74 62 -37 47 -98 -30 -17 -33 0 4 29 33 -31 102 -24 34
4775 34 19 -1 57 -28 64 126 45 -77 9 23 92 -31 -32 69 150 -33 22 -28 -24 25 107 14 20 4 137 31 -20 0 -29
4804 -29 18 21 -53 164 -66 -96 17 15 0 33 134 5 9 5 113 -60 16 -73 -122 -6 138 -19 82 -138 -32 42
$$ packed form
4605G3j90L6O1l6N2l7P9k4l5K4M9n5rO0l5n9o1J74j08M2K0J5m8Pq5J27k9k5R6
4634G9n1j09L8R8p9N5oj34J07j04R4K9l1L3J18k16K5N1Kk3J81j68J7o8R7R1j41
4661a5P2m2k34K24p2O2m9R0m4JK4q2Q0j0M2No5K4ln2P6j15N2Q0j07n4J55rl3J34
4691A35n2j87J25Ml1O7o9j2K5k5r6Q3O5o1n1J20j26J00k2K7j31NP6kM6m9o2J82
4719H4j18NNq1Q7j0J53o2k5K7J1l3Q6j38k0J88j81O5O8n2o1k3Q7j3o1N2K3k8M
4748C9j18L5M0j15J07Q7m0q7p7Q2J23j50J36r9Q4j45O8J3j6L3MK5Mo4J33j26N8
4775C4j5k0N8q5R2O2q1j22Q6J4O9j23jJ01Q1j83N5n0MM9Q2r3Oj6J33j06n1K0k9
4804b9M7Lp4K17k30l0J13kj5L3J01j29MmJ08j73P6q9m9J16J44j57J01k20J06P4
$$ plain form
4830 42 73 0 -58 22 96 -20 -56 -73 -132 96 -135 -5 -14 -4 -2 99 -88 29 -9 41 19 45 39 -84 70 -108 44
4857 44 40 29 30 20 -28 27 38 18 -38 -126 -33 -70 9 -12 -18 74 3 48 82 -99 76 -91 -130 61 13 -19 88 59 60 35
4887 35 7 -85 -110 -81 -5 -3 -11 30 8 -60 24 -31 48 92 37 -51 -11 -7 65 -90 54 -48 32 68 14 41 -40 24 -19 -133
4917 -133 -134 -30 -49 15 4 15 -103 13 75 -4 23 8 26 -55 27 -8 65 61 -7 91 -78 -21 6 70 -39 127 -110
4944 -110 -147 67 -25 25 19 -27 17 -76 19 14 -75 -76 -78 -24 -11 0 -19 -39 -80 17 -62 112 -29 54 39 -75 -19 33 -59 -49
4974 -49 -3 3 -100 170 24 -62 108 -24 -42 -53 40 -94 47 -103 44 -25 -64 58 -42 -26 58 -16 13 -88 -45
4999 -45 103 -71 -68 97 61 -91 -64 135 60 15 27 -21 -48 -80 61 41 -21 84 -5 -20 -77 -44 41 -17 136 -27
5025 -27 -59 -50 63 -80 46 27 12 42 118 -136 23 98 6 65 -1 -13 39 148 -14 18 -60 12 -61 -56 11 42 130 44
$$ packed form
4830D2L1p3n8Q0P4j16l6j7n9K28k31J30rJ0KJ01j87J17l8N0k2K6oj23J54j78J52
4857D4mj1Jj0m8N5J1k0n6q8R3l7P9k1oR2p1M5L4j81J75j67l9J91m8l2J07k9Jk5
4887C5k8r2k5K9P6KqM1k2o8Q4n5P9M4n5q8M0MP2j55J44j02Q0L6n4K7q1O4m3j14
4917a33jJ04j9O4j1J1j18J16O2p9K7j5J8q1Q2l5P3mo8R8j69N7K7O4j09J66k37
4944a10l7K14r2N0om6M4r3R5nq9jkN4J3J1j9k0m1R7p9J74j41Q3j5j14N6N2r2J0
4974d9M6Oj03K70j46q6J70j32j8j1R3j34J41j50J47o9l9J22j00J6Q4p4K9j01M3
4999d5J48j74LJ65l6j52K7J99p5m5J2m8k7l2J41k0o2J05q9j5n7L3Q5n8J53j63
5025b7l2RJ13j43J26j9j5L0P6k54J59P5r2N9o6j2N2J09j62L2p8P2p3NO7L1Q8q6
$$ plain form
5053 44 122 -117 46 -7 -64 -31 -26 -6 85 38 -27 27 26 69 -7 21 -18 -49 -83 69 -103 -57 -22 -106 -78 53 -48 -48 11
5082 11 44 -53 -37 3 97 -10 30 -120 -122 -26 -70 -84 72 -72 -64 71 -65 -143 -39 -30 -59 56 3 82 -176 -44 44
5109 44 -104 -77 13 0 -62 110 124 -74 -4 -13 -16 -12 -49 50 -36 14 -55 8 59 19 86 -91 -1 -40 -57 -81 -129 -52 -97 7
5139 7 -98 -9 -44 -42 -17 -29 44 63 117 168 -93 35 -24 36 -52 -44 37 -104 120 34 -63 -149 76 41 64 -123 -44 -88
5167 -88 15 143 -4 -67 7 -25 -24 -22 57 -4 -6 76 15 102 52 -76 -49 -28 -86 -23 -93 -116 -10 32 -60 -48 59 15 21
5196 21 144 65 -75 -20 -2 38 -49 -11 -22 82 73 -48 109 10 -62 -37 -21 94 69 38 -120 -85 82 49 -14 7 85
5223 85 -13 -47 24 144 -5 -65 23 59 101 44 35 16 -42 -8 7 -30 6 94 3 -67 -84 -49 -129 55 22 20 -12 46 -97
5252 -97 -55 6 -74 63 37 -50 -98 -42 -78 -8 24 102 -24 62 -17 39 -32 -119 -59 7 -26 74 -55 -113 18 59 30 -164
$$ packed form
5053D4P8k39J63n3n7L3NK0R1m7o5N4jM3p6K8l9l1l4J52j72M6L5q4K8J31j01%N9
5082A1L3r7J6M0R4j07M0j50kR6m4j4J56j44QJ35j36p8J04Rk9J15n3P9k58J32Q8
5109D4j48K7R0j3o2J72J4j98P0rlMl7R9q6N0o9O3N1m0O7j77R0l9j7k4m8P7m5J04
5139Gj05Q9l5KK5j2P3J9N4N1k61J28n9O0q8QQ1j41K24q6r7q6K25l5K3j87P9m4
5167h8J03J28j47o3P4l2JKP9o1kQ2o1Q7n0j28K7K1n8O3p0k3J06M2r2J2J07m4O
5196B1J23p9j40N5J8M0q7L8j1J04rj21J57r9p2K5J6J15k5l1j58L5J67l3o3K1P8
5223H5r8l4P1J20j49o0Q8L6M2n7rj9n8L4J5l7L6Q8r1p0j7L5q0J84l3kl2N8j43
5252i7M2O1q0J37k6q7m8N6l6P0L2P8j26Q6p9N6p1q7O0O6l3J00j29n8J31M1k9j94
$$ plain form
5280 -164 120 -23 121 -130 -95 60 -70 17 -103 -58 59 11 43 -109 -28 6 45 113 -104 -56 -33 -31 11 -51 -104
5305 -104 108 60 129 -94 -12 30 -4 76 123 -64 92 81 -80 60 20 -127 -33 30 -163 -52 -111 45 24 27 63
5330 63 -110 -22 130 -72 1 72 -2 34 -25 -56 41 103 1 -58 -36 -50 38 40 71 73 3 107 -128 -44 -46 -8 26 -110
5358 -110 -66 -10 -111 -36 52 -121 31 20 62 -6 -152 34 14 71 -72 47 74 41 42 40 -55 39 126 -2 -48 -49 4
5385 4 -72 33 1 2 27 73 58 1 23 17 -5 78 -19 -8 28 -6 33 -10 83 -28 28 98 -21 -139 94 -48 -99 68
5413 68 -51 44 38 -4 58 -167 -85 90 79 16 97 -50 80 76 -23 -26 37 192 -62 14 -13 24 -47 -15 1 -12 -44 84
5441 84 29 -81 -11 84 16 36 44 -13 -57 -13 -112 -5 -12 -14 -48 26 35 -16 4 -27 -101 -11 114 -58 27 80 22 1 80 172
5471 172 -25 139 3 71 -98 22 68 16 -9 47 -72 -15 90 -25 -54 -33 37 47 30 36 -36 2 -18 23 125 -83
$$ packed form
5280a64K84j43J44k51L5J55j30Q7j20M5J17m8L2j52Q1L4L9O8k17M8K3KM2o2n3
5305a04K12m8O9k23Q2M2l4Q0M7j87J56j1j61J40m0j47R4O3j93J11n9J56k1LL6
5330F3j73Q8J52k02P3P1p4L6n9l1R7O2j02n9K2j4Q8KL1Kp0J04k35Q4kL8L4j36
5358a10M4N6j01P5Q8j73J52j1M2o8j46J86k0N7j43J19K7l3Jkr5R4Q7j28m6jN3
5385Dp6J05l2JK5M6j5n7K2ok2Q3r7J1L6l4L9m3R3j11N6P0j19j18K33j42n1J67
5413F8j19R5om2O2k25Q2J75j1o3Q1j47J30mr9lO3J55k54P6k7L7p1L2J6j3l2J28
5441H4n5j10P0R5o8K0Qn7m4M4r9J07pkl4P4Rn1K0l1p4R0J25j72Q5N3n8k1P9R2
5471A72j97J64j36O8j69J20M6n2k5N6j19N7J05j15k9K1P0J0j7Op2L8k0M1J02k08
$$ plain form
5497 -83 49 -90 -42 -90 -191 -14 40 31 42 64 -46 -41 -33 140 -21 35 155 7 14 59 46 -88 13 155 34 -80
5523 -80 19 -37 -95 -17 42 41 93 -91 -81 -58 25 -23 49 -104 -76 -66 -3 -35 104 -37 69 -51 -41 69 47 68 -3
5550 -3 -30 12 -49 -51 70 80 -80 -2 67 -91 9 104 -53 -16 -73 69 3 -141 -12 -95 -106 -101 85 64 -98 -108 -33
5577 -33 -123 33 -13 21 -77 59 -54 -64 32 6 -93 94 -79 9 2 -30 75 -78 1 11 -16 37 57 -73 -88 44
$$ packed form
5497h3J32j39M8m8j01J77N4rJ1K2j10NQJ73j61N6J20j48PM5j3j34J01J42j21j14
5523h0R9n6n8P8N9jN2j84J0K3Q3m8P2j53K8J0O3l2J39j41J06j20J0J10k2K1p1
5550ck7M2o1kJ21J0j60P8O9j58J00R5j57L7n7J42o6j44J29q3j1NJ86k1j62j0P5
5577c3r0J56m6L4r8J36j13j0R6k6r9J87j73Q8pl2J05j53P9J0k7N3K0j30j5J32
$$ [...]
8191b25
##END NTUPLES=NMR FID
##END=
