##TITLE=1H_SA-61.242
 DMSO-d6, 8 sc, 
 8.06.2021
##JCAMPDX= 6.0         $$ Bruker NMR JCAMP-DX V2.0
##DATA TYPE= NMR FID
##DATA CLASS= NTUPLES
##ORIGIN= UXNMR, Bruker Analytische Messtechnik GmbH
##OWNER= root
$$ XWIN-NMR		Version 3.5
$$ Tue Jun  8 13:09:35 2021 Russian Standard Time (UT+4h)  she@DPX200
##.OBSERVE FREQUENCY= 200.131506
##.OBSERVE NUCLEUS= ^1H
##.DELAY= (6, 6)
##.ACQUISITION MODE= SIMULTANEOUS
##.ACQUISITION SCHEME= undefined
##.AVERAGES= 8
##.DIGITISER RES= 18
##SPECTROMETER/DATA SYSTEM= spect
##.PULSE SEQUENCE= zg30
##.SOLVENT NAME= DMSO
##.SHIFT REFERENCE= (INTERNAL, DMSO, 0, 15.7039)
##AUDIT TRAIL= $$ (NUMBER, WHEN, WHO, WHERE, WHAT)
$$ ##TITLE= Audit trail, XWIN-NMR		Version 3.5
$$ ##JCAMPDX= 5.01
$$ ##ORIGIN= Bruker BioSpin GmbH
$$ ##OWNER= she
$$ F:/spectra/data/she/nmr/H-F/1/audita.txt
$$ ##AUDIT TRAIL=  $$ (NUMBER, WHEN, WHO, WHERE, WHAT)
(   1,<2021-06-08 13:06:55.45 +0400>,<she>,<DPX200>,
      <created by zg, POWCHK disabled, PULCHK disabled
       configuration hash MD5:
       00 E9 B6 7A A2 85 ED C7 34 08 36 98 17 FE 4E 26
       data hash MD5: 16K
       A9 56 4E 79 52 98 7B 8E 02 A6 C6 3A FB 96 58 EF>)
$$ ##END=
$$ 
$$ hash MD5
$$ 74 A8 6E 2C 9B CC BF 42 C5 91 3C 29 AE 37 2D 85
##$RELAX= 
##$RELAX= 
##$RELAX= 
##$RELAX= 
##$RELAX= 
##$RELAX= 
$$ Bruker specific parameters
$$ --------------------------
##$DU= <F:/spectra>
##$EXPNO= 1
##$NAME= <H-F>
##$PROCNO= 1
##$TYPE= <nmr>
##$USER= <she>
##$AMP= (0..31)
100 100 100 100 100 100 100 100 100 100 100 100 100 100 100 100 100 100 
100 100 100 100 100 100 100 100 100 100 100 100 100 100 
##$AQSEQ= 0
##$AQ_mod= 1
##$AUNM= <au_zg>
##$AUTOPOS= <>
##$BF1= 200.13
##$BF2= 200.13
##$BF3= 200.13
##$BF4= 200.13
##$BF5= 200.13
##$BF6= 200.13
##$BF7= 200.13
##$BF8= 200.13
##$BYTORDA= 1
##$CFDGTYP= 0
##$CFRGTYP= 5
##$CHEMSTR= <none>
##$CNST= (0..31)
1 1 145 1 1 1 1 1 1 1 1 1 1 1 1 1 1 1 1 1 1 1 1 1 1 1 1 1 1 1 1 1 
##$CPDPRG= <>
##$CPDPRG1= <>
##$CPDPRG2= <>
##$CPDPRG3= <>
##$CPDPRG4= <mlev>
##$CPDPRG5= <mlev>
##$CPDPRG6= <mlev>
##$CPDPRG7= <mlev>
##$CPDPRG8= <mlev>
##$CPDPRGB= <>
##$CPDPRGT= <>
##$D= (0..31)
0 1.2 0 0 0 0 0 0 0 0.06 0 0.03 0 0 0 0 0.0002 0 0 0 0 0 0 0 0 0 0 0 0 
0 0 0 
##$DATE= 1623143214
##$DBL= (0..7)
120 120 120 120 120 120 120 120 
##$DBP= (0..7)
150 150 150 150 150 150 150 150 
##$DBP07= 0
##$DBPNAM0= <>
##$DBPNAM1= <>
##$DBPNAM2= <>
##$DBPNAM3= <>
##$DBPNAM4= <>
##$DBPNAM5= <>
##$DBPNAM6= <>
##$DBPNAM7= <>
##$DBPOAL= (0..7)
0.5 0.5 0.5 0.5 0.5 0.5 0.5 0.5 
##$DBPOFFS= (0..7)
0 0 0 0 0 0 0 0 
##$DE= 6
##$DECBNUC= <off>
##$DECIM= 32
##$DECNUC= <off>
##$DECSTAT= 4
##$DIGMOD= 1
##$DIGTYP= 9
##$DL= (0..7)
0 120 120 120 120 120 120 120 
##$DP= (0..7)
150 150 150 150 150 150 150 150 
##$DP07= 0
##$DPNAME0= <>
##$DPNAME1= <>
##$DPNAME2= <>
##$DPNAME3= <>
##$DPNAME4= <>
##$DPNAME5= <>
##$DPNAME6= <>
##$DPNAME7= <>
##$DPOAL= (0..7)
0.5 0.5 0.5 0.5 0.5 0.5 0.5 0.5 
##$DPOFFS= (0..7)
0 0 0 0 0 0 0 0 
##$DQDMODE= 0
##$DR= 18
##$DS= 0
##$DSLIST= <SSSSSSSSSSSSSSS>
$$ [...]
##$SUBNAM2= <"">
##$SUBNAM3= <"">
##$SUBNAM4= <"">
##$SUBNAM5= <"">
##$SUBNAM6= <"">
##$SUBNAM7= <"">
##$SUBNAM8= <"">
##$SUBNAM9= <"">
##$SW= 20.0188882624521
##$SWIBOX= (0..15)
0 0 2 0 0 0 0 0 0 0 0 0 0 0 0 0 
##$SW_h= 4006.41025641026
##$TD= 16384
##$TD0= 1
##$TE= 0
##$TE2= 300
##$TE3= 300
##$TEG= 300
##$TL= (0..7)
0 120 120 120 120 120 120 120 
##$TP= (0..7)
150 150 150 150 150 150 150 150 
##$TP07= 0
##$TPNAME0= <>
##$TPNAME1= <>
##$TPNAME2= <>
##$TPNAME3= <>
##$TPNAME4= <>
##$TPNAME5= <>
##$TPNAME6= <>
##$TPNAME7= <>
##$TPOAL= (0..7)
0.5 0.5 0.5 0.5 0.5 0.5 0.5 0.5 
##$TPOFFS= (0..7)
0 0 0 0 0 0 0 0 
##$TUNHIN= 0
##$TUNHOUT= 0
##$TUNXOUT= 0
##$USERA1= <user>
##$USERA2= <user>
##$USERA3= <user>
##$USERA4= <user>
##$USERA5= <user>
##$V9= 5
##$VALIST= <valist>
##$VCLIST= <CCCCCCCCCCCCCCC>
##$VD= 0
##$VDLIST= <DDDDDDDDDDDDDDD>
##$VPLIST= <PPPPPPPPPPPPPPP>
##$VTLIST= <TTTTTTTTTTTTTTT>
##$WBST= 1024
##$WBSW= 4
##$XGAIN= (0..3)
0 0 0 0 
##$XL= 0
##$YL= 0
##$YMAX_a= 81273
##$YMIN_a= -61951
##$ZGOPTNS= <>
##$ZL1= 120
##$ZL2= 120
##$ZL3= 120
##$ZL4= 120
##$ABSF1= 10
##$ABSF2= 0
##$ABSG= 5
##$ABSL= 3
##$ALPHA= 0
##$AQORDER= 0
##$ASSFAC= 0
##$ASSFACI= 0
##$ASSFACX= 0
##$ASSWID= 0
##$AUNMP= <proc_1d>
##$AZFE= 0.1
##$AZFW= 0.1
##$BCFW= 1
##$BC_mod= 2
##$BYTORDP= 1
##$COROFFS= 0
##$CY= 11.3945322036743
##$DATMOD= 1
##$DC= 2
##$DFILT= <>
##$DTYPP= 0
##$F1P= 15.9154993809931
##$F2P= -4.1035820241983
##$FCOR= 0.5
##$FTSIZE= 0
##$FT_mod= 4
##$GAMMA= 1
##$GB= 0.15
##$INTBC= 1
##$INTSCL= 1
##$ISEN= 128
##$LB= 0.24
##$LEV0= 0
##$LPBIN= 0
##$MAXI= 10000
##$MC2= 0
##$MEAN= 0
##$ME_mod= 0
##$MI= 1.114404
##$NCOEF= 0
##$NC_proc= 0
##$NLEV= 6
##$NOISF1= 3.799351
##$NOISF2= 2.8
##$NSP= 1
##$NTH_PI= 0
##$NZP= 0
##$OFFSET= 15.70392
##$PC= 1
##$PHC0= -11492.54
##$PHC1= 17.40101
##$PH_mod= 1
##$PKNL= yes
##$PPARMOD= 0
##$PSCAL= 0
##$PSIGN= 0
##$REVERSE= no
##$SF= 200.130013532006
##$SI= 16384
##$SIGF1= 3
##$SIGF2= 2
##$SINO= 400
##$SIOLD= 16384
##$SREGLST= <1H.CDCl3>
##$SSB= 0
##$STSI= 0
##$STSR= 0
##$SW_p= 3612.71676300578
##$SYMM= 0
##$S_DEV= 0
##$TDeff= 0
##$TDoff= 0
##$TI= <>
##$TILT= no
##$TM1= 0
##$TM2= 0
##$TOPLEV= 0
##$USERP1= <user>
##$USERP2= <user>
##$USERP3= <user>
##$USERP4= <user>
##$USERP5= <user>
##$WDW= 1
##$XDIM= 8192
##$YMAX_p= 0
##$YMIN_p= 0
$$ End of Bruker specific parameters
$$ ---------------------------------
##NTUPLES= NMR FID
##VAR_NAME=  TIME,          FID/REAL,        FID/IMAG
##SYMBOL=    X,             R,               I
##VAR_TYPE=  INDEPENDENT,   DEPENDENT,       DEPENDENT
##VAR_FORM=  AFFN,          ASDF,            ASDF
##VAR_DIM=   8192,          8192,            8192
##UNITS=     SECONDS,       ARBITRARY UNITS, ARBITRARY UNITS
##FACTOR=    0.0002496,     1,               1
##FIRST=     0,             0,               0
##LAST=      2.0444736,     0,               0
##MIN=       0,             -61951,          0
##MAX=       2.0444736,     81273,           0
$$ Real data points
##PAGE= N=1
##DATA TABLE= (X++(R..R)), XYDATA
0 0 0 0 0 0 0 0 0 0 0 0 0 0 0 0 0 0 -4 8 -8 8 -8 8 -12 16 -16 18 -24 25 -31 33 -40 44 -50 57 -65 72 -81 93
38 93 -101 113 -126 139 -156 172 -189 210 -230 254 -281 309 -342 376 -414 458 -506 562 -622 694
58 694 -779 877 -996 1145 -1333 1583 -1923 2432 -3262 4854 -9005 44154 81273 -25580
72 -25580 -51156 4025 55776 28659 -18787 -26521 9239 26140 16413 -2390 -11945 -9355 20336
85 20336 33595 -6045 -36824 4575 47087 16230 -41481 -28836 36383 42946 -23075 -51219
97 -51219 -687 44158 12775 -35081 -26856 7902 19178 9560 -11494 -26438 -12300 21486 26258
110 26258 -16635 -45524 -8929 40623 19276 -45293 -44539 23166 38822 -18207 -47061 -10335
122 -10335 28197 13978 -22697 -24539 1337 15183 9761 -4607 -18221 -13784 16332 30373 -7425
135 -7425 -39271 -6414 40089 23997 -30235 -33570 20857 41664 -2051 -32915 -4192 31576
147 31576 19374 -11409 -11380 6360 15515 14380 1442 -13502 -7767 18189 27769 -5513 -33956
160 -33956 -6035 39335 26506 -29443 -36829 18584 42548 2093 -32269 -14180 21382 22237 -3618
173 -3618 -15563 -7270 5043 12614 6861 -12325 -20206 2715 23882 966 -29882 -13575 23354
186 23354 17897 -22458 -29987 10868 29100 -4743 -32277 -11995 19728 13622 -12554 -19687 -8683
199 -8683 5121 12469 940 -20406 -21604 6707 26807 1703 -32318 -18198 24610 27839 -14535
212 -14535 -30939 4538 28838 7049 -18262 -11035 12537 15761 -124 -8199 -3663 5075 12823
225 12823 9018 -7011 -13429 7261 27886 7882 -23302 -11589 24760 26847 -10093 -26047 4915
238 4915 28533 8912 -17614 -12252 10201 14072 537 -7962 -7843 247 11272 8718 -9500 -17641
252 -17641 1453 22112 6229 -24900 -18535 16432 22896 -11379 -29740 -3444 20808 7262
264 7262 -16583 -17170 1301 10179 2063 -7796 -11738 -5839 7190 10055 -6033 -19099 -4381 18330
278 18330 8501 -18389 -15923 11608 18873 -6542 -21762 -258 20068 7523 -13676 -11326 7054
291 7054 13536 4221 -5550 -8617 -280 14330 13815 -5306 -18047 -881 24322 15196 -16464 -19268
305 -19268 10825 25412 2131 -18936 -5902 14793 12120 -4104 -8728 337 7352 4845 79
318 79 -5669 -5085 5535 10531 -2495 -14957 -3673 16621 9154 -15693 -16899 7909 19120 -1327
332 -1327 -21038 -7895 12950 9842 -7182 -13490 -4182 5853 6076 -1013 -10421 -8966 4970 11772
346 11772 -1017 -16518 -8508 13531 12415 -11493 -17939 3264 17130 1924 -16134 -7978 8897
359 8897 10113 -2459 -9293 -3404 5290 7269 2915 -6071 -7723 4783 13655 2642 -12872 -6999
373 -6999 13246 13366 -6513 -13840 2751 16662 4753 -11508 -6080 9328 10520 -302 -7193
386 -7193 -2356 5960 8511 3327 -7081 -8117 5270 13803 2349 -13897 -10036 11636 15135 -5373
400 -5373 -16883 -2587 13400 7389 -8878 -9969 1098 7169 2594 -5000 -5984 -1356 3478 3545 -4023
415 -4023 -9104 -756 7925 1771 -11262 -8981 7194 9945 -5952 -14290 -1652 12025 5815 -10361
429 -10361 -10043 2637 8906 3154 -6602 -8151 -536 7546 6495 -5069 -11353 -725 11382 7340
443 7340 -8116 -10337 5954 13713 1044 -9419 -2669 9876 8470 -2979 -5458 1689 7526 4859
457 4859 -2230 -4439 148 6259 6527 -2670 -8466 -313 10744 6630 -7454 -9222 4828 11869 713
472 713 -10383 -5592 6898 6985 -4236 -8318 -2402 4169 3629 -3141 -7605 -4101 3877 5831 -3388
487 -3388 -10416 -2870 8373 6406 -6999 -10998 1912 10852 2290 -9592 -7207 4011 7422 -688
501 -688 -7210 -4696 2625 5556 108 -5295 -4426 2362 6704 434 -7206 -2567 6517 6583 -3811 -7727
517 -7727 2114 8925 2163 -7146 -5288 5414 8151 -509 -6435 -2741 4856 7685 1553 -6061 -4164
532 -4164 5161 10089 1639 -7845 -4473 6905 9645 -1587 -9787 -2138 7335 4818 -4250 -6719 422
547 422 5192 1524 -3733 -4128 954 4464 946 -4400 -4066 1628 5887 -40 -7779 -4418 5010 6635
563 6635 -3112 -9437 -1929 7189 5155 -4371 -7653 43 6902 3803 -3248 -5123 -2 5825 3780
578 3780 -3580 -5645 598 6536 2264 -5791 -5473 2900 6730 -563 -7728 -3002 5430 5176 -2397 -6372
594 -6372 -962 5373 3702 -2094 -5331 -924 5143 3758 -2600 -5552 -609 5997 3450 -4491 -4676
609 -4676 2860 6578 1247 -5298 -1881 5195 5696 -461 -5036 157 5936 4198 -1908 -5340 -988
624 -988 5920 4487 -3223 -6919 -933 6800 4127 -4590 -6912 350 6840 3045 -5325 -4898 1533 5298
640 5298 1179 -5133 -3855 1800 3431 -600 -4605 -2869 2387 2879 -1840 -5009 -1450 4560 2868
655 2868 -3791 -4846 1156 5899 1745 -5458 -4374 2261 5849 676 -6191 -4396 2713 5132 279
670 279 -5473 -3904 3514 5918 382 -4833 -2455 4425 5672 -822 -4536 -661 5410 4030 -2408
685 -2408 -3897 1237 4972 2255 -3578 -3072 2279 4888 1575 -3869 -2890 3420 5336 524 -4774 -2634
701 -2634 3789 4561 -1583 -5246 -2047 3993 3474 -3095 -5400 -707 3805 1678 -4119 -4654 837 4303
717 4303 1087 -4405 -4232 1831 4665 315 -5118 -3734 2812 5050 -567 -5288 -2877 3191 4622
732 4622 -1335 -4734 -1692 3768 3794 -1444 -4033 -274 3890 3003 -2129 -3106 1052 4089 1264 -2823
748 -2823 -2462 2393 4075 -330 -3746 -1419 4001 4194 -1031 -4126 -644 4477 4285 -2115 -4555 -452
764 -452 4664 3962 -2639 -4863 119 4889 2734 -3135 -4703 584 4564 1697 -3259 -3534 1300 4049
780 4049 325 -3573 -2328 1981 3205 -943 -3791 -1498 2792 2486 -2200 -4329 -163 3618 1792
795 1792 -3353 -4468 959 4344 1156 -3507 -3892 1328 4682 523 -3930 -3133 2180 4516 -98 -4200
811 -4200 -2172 2649 3467 -749 -4130 -1346 3107 2944 -1535 -4312 264 3980 2279 -2147 -3631 1026
827 1026 4320 1806 -2768 -3163 1774 4428 844 -3252 -2064 2248 3888 -184 -3167 -1209 2729
842 2729 3149 -902 -3355 -199 3538 2385 -1903 -3417 792 3886 1187 -3188 -3225 1292 4080 955
858 955 -3946 -3439 1603 4037 35 -4497 -2847 2051 3891 -187 -4482 -2307 2581 2863 -1075 -3890
874 -3890 -1365 2604 1974 -1652 -3208 -345 2886 1122 -2579 -2290 765 2961 217 -3384 -1932 2154
890 2154 3435 -287 -3522 -1171 3084 3262 -1074 -3812 -673 3867 3034 -1709 -3888 -332 4007 2620
906 2620 -1749 -3151 137 3823 1905 -2270 -2454 1031 3742 1011 -2604 -1687 1790 2960 -330 -3061
922 -3061 -1374 2526 2219 -954 -3325 -628 3089 1640 -1990 -3029 10 3181 1597 -2351 -2897 659
938 659 3222 743 -3384 -2855 1497 2505 -350 -3731 -1701 1960 2143 -966 -3503 -1277 2635 2737
954 2737 -1312 -3142 -454 3362 2491 -1875 -2683 -44 3739 2030 -2446 -2930 573 3177 1338 -2424
970 -2424 -2103 1215 2512 576 -2176 -1197 1928 2419 4 -1848 -563 2286 1686 -1659 -2211 452
986 452 2687 1176 -2681 -2885 992 3101 851 -3341 -2235 1861 3092 524 -2852 -1968 1714 3203
1002 3203 72 -2875 -1630 2024 2639 -434 -2840 -1334 2123 2095 -1294 -2135 -239 2195 1293 -1887
1018 -1887 -1961 795 2274 608 -2441 -1727 1542 2284 -270 -2656 -1742 1703 2140 -1202 -3112 -1078
1034 -1078 2431 2220 -1553 -2707 -152 2433 2168 -1336 -2121 376 2498 1399 -1636 -2054 725 2553
1050 2553 773 -2200 -1951 1369 2426 -214 -2596 -1121 1885 2315 -683 -2135 -469 2011 1833 -1139
1066 -1139 -2220 -31 2026 1357 -1341 -2157 329 2058 799 -1551 -1877 1292 2309 273 -1577 -1177
1082 -1177 2118 2531 -715 -2188 -581 2466 1975 -1724 -2764 -144 2171 1758 -1772 -2809 -343 2245
1098 2245 1627 -1932 -2758 0 2224 821 -1794 -2210 532 1825 84 -1587 -1274 845 1359 -564
1114 -564 -1584 -577 1557 1283 -1167 -1740 245 2265 1597 -1211 -1859 771 2956 1088 -1836 -1940
1130 -1940 1624 2721 187 -1899 -1376 1314 2328 -11 -2382 -896 1270 2060 83 -1810 -479
1145 -479 1469 1821 -649 -1978 -292 1802 980 -1201 -1864 433 1857 197 -1821 -1475 614 2070
1161 2070 -264 -1859 -1030 768 1961 -378 -2156 -675 1410 1631 -916 -2453 -713 1668 969 -1110
1177 -1110 -1852 195 1791 539 -1536 -1813 611 2340 407 -1644 -1106 1096 2146 373 -2010 -1162
1193 -1162 1287 2212 -63 -2174 -594 1660 1660 -284 -1774 44 1738 1304 -508 -1171 272 1486
1209 1486 484 -1047 -1007 149 1562 68 -1638 -980 851 1507 -374 -2215 -569 1715 1427 -958
1225 -958 -2101 -390 1767 1225 -1051 -2191 -273 1916 1102 -1263 -2039 -194 1753 760 -1393 -1285
1241 -1285 -71 1384 251 -1624 -822 757 1441 -259 -1410 -489 1544 796 -774 -1246 102 1451
1257 1451 820 -923 -1472 183 1864 764 -1593 -1436 502 2058 623 -1629 -1308 917 1779 218
1273 218 -1540 -871 1136 1729 30 -1793 -752 1434 1085 -628 -1725 -323 1552 1297 -816 -1514
1289 -1514 -116 1512 682 -1715 -1474 532 1584 335 -1276 -967 1068 1315 79 -1501 -915 801
1305 801 1032 -364 -1306 -369 1205 1013 -875 -1063 -31 1550 698 -1523 -1279 545 1662 277 -1503
1322 -1503 -1145 819 1347 -73 -1747 -1182 973 1636 -29 -1447 -1005 1212 1568 -118 -1392 -654 1044
1339 1044 936 -461 -1141 -162 802 586 -844 -895 473 1000 355 -1046 -715 929 1409 -36 -1329 -457
1357 -457 1515 1279 -465 -1317 -100 1486 1465 -770 -1480 -152 1581 1105 -938 -1389 159 1385 679
1374 679 -994 -1358 182 877 391 -1029 -997 482 1180 -246 -1075 -657 1054 923 -667 -1079 -213 952
1392 952 661 -886 -1202 77 1199 836 -855 -911 532 1097 546 -829 -897 466 1195 146 -1238 -930
1410 -930 775 1138 -136 -1347 -520 850 884 -589 -1390 79 1316 976 -686 -1136 287 1147 675
1427 675 -697 -1203 209 1305 572 -883 -982 449 1252 69 -849 -631 408 790 -197 -1065 -302 879
1445 879 712 -496 -1300 2 1178 684 -1046 -1317 233 1298 251 -911 -1130 674 1552 199 -1260
1462 -1260 -880 593 1463 125 -1341 -675 640 1400 67 -1027 -564 773 1001 -363 -1087 -14 817
1479 817 317 -181 -973 24 938 172 -571 -643 515 1281 -211 -1000 -391 613 1187 -428 -1461 -433
1497 -433 855 867 -240 -1363 -394 1084 956 -420 -917 197 1148 726 -370 -1061 301 1250 227
1514 227 -846 -637 487 1095 77 -1179 -395 539 848 -107 -1039 -208 685 768 -318 -981 -99 770 404
1533 404 -395 -885 -71 677 191 -550 -672 141 607 61 -809 -513 396 1032 -158 -1039 -592 702 656 -208
1553 -208 -1237 -245 1261 783 -471 -1321 -260 1100 735 -579 -1016 -252 891 675 -586 -889 232
1570 232 665 271 -527 -524 538 690 -126 -818 -484 710 376 -387 -892 52 785 314 -630 -574 131 1034
1590 1034 364 -586 -828 393 1244 604 -1086 -918 288 948 128 -1399 -894 335 721 -238 -842 -383
1608 -383 563 630 -276 -612 -205 661 410 -486 -888 -87 772 287 -642 -768 362 668 203 -603 -310 388
1628 388 698 -137 -648 -401 726 635 -197 -647 -65 825 493 -420 -532 210 687 573 -670 -779 214 823
1648 823 298 -1080 -460 561 742 87 -828 -939 379 668 104 -928 -555 376 781 -289 -927 -405
1666 -405 764 829 -621 -722 -120 894 400 -485 -669 336 581 -37 -389 -273 444 558 104 -452 -574
1685 -574 740 521 -305 -894 -159 904 772 -416 -932 -26 1131 405 -516 -568 71 609 545 -486 -645
1704 -645 147 660 582 -395 -384 422 643 258 -664 -102 670 449 -311 -722 207 640 599 -681 -629 301 365
1725 365 458 -597 -687 90 682 264 -792 -952 249 805 125 -742 -665 616 764 -213 -540 -131 585 471
1745 471 -178 -591 -213 404 322 -195 -272 -134 790 564 -329 -867 410 1128 391 -457 -541 539 673 -142
1765 -142 -616 -294 658 704 -345 -298 -180 352 410 -262 -312 -49 503 483 -226 -810 243 821 261 -982 -771
1786 -771 601 700 -74 -872 -219 729 464 -155 -592 -409 187 612 -69 -711 -544 216 723 -249 -634 -404
1806 -404 750 185 -276 -501 346 386 1 -456 -222 649 655 -218 -565 202 466 489 189 -525 -226 323 750
1827 750 100 -955 -297 783 759 -714 -692 161 602 359 -296 -307 179 377 -121 -500 -329 -332 352 339 -427
1848 -427 -460 210 785 41 -645 -410 769 263 -361 -953 174 592 180 -564 -500 308 397 -8 -130 -332
1868 -332 -350 353 262 -302 -527 -178 844 -49 -872 -184 759 642 -533 -998 213 780 -137 -388 -382 81
1888 81 343 200 184 -303 -226 403 380 -300 -550 -15 743 298 -520 -661 443 862 -348 -685 -141 715 164
1909 164 -321 -172 361 277 143 -277 -185 107 418 332 -248 -691 63 987 445 -605 -729 121 595 -133 -882
1930 -882 -251 573 333 -179 -355 -306 -137 6 298 -114 -564 118 438 -63 -852 -374 808 554 -856 -582
1950 -582 517 430 -258 -635 -2 259 242 -391 -477 -61 317 59 -119 -311 -551 147 473 120 -755 -339 933
1971 933 309 -711 -759 294 806 -51 -517 -67 494 164 -173 -137 157 60 233 290 -196 -407 336 623 114
1992 114 -629 -597 777 763 -550 -753 127 694 -117 -518 -435 360 -15 -260 -112 66 -67 -146 -114 66 -361
2013 -361 -91 669 153 -895 -612 840 645 -643 -657 138 816 240 -699 -12 463 22 -10 -144 -174 -206
2033 -206 8 291 -134 -875 -200 689 363 -508 -602 637 568 -415 -525 298 586 -306 -599 -154 295 -46
2053 -46 -257 -328 -130 -12 203 465 -209 -708 59 844 271 -721 -580 300 827 -29 -809 -165 931 232
2073 232 -395 45 137 113 25 216 96 -221 -190 432 262 -586 -542 795 442 -610 -797 324 660 -233 -581
2094 -581 -39 725 99 -594 -333 391 71 68 178 -39 -446 -257 400 -1 -483 -421 697 547 -698 -692 397
2115 397 522 -250 -614 -17 608 388 -349 -345 348 -12 87 329 -31 -624 -256 592 133 -558 -459 632 759
2136 759 -319 -680 495 561 -322 -401 187 575 137 -285 134 203 7 -56 274 -16 -100 196 668 194 -590
2157 -590 -447 680 951 -248 -902 294 831 119 -687 -59 284 50 -112 244 -113 -278 -117 422 0
2176 0 -511 -191 722 308 -769 -328 350 595 -491 -524 259 558 89 -500 -11 269 43 -226 -93 107
2196 107 -88 41 212 -18 -360 -391 640 363 -568 -427 425 696 -207 -587 316 782 -30 -399 -120 243
2216 243 83 -166 -100 7 -238 61 415 229 -660 -199 631 433 -287 -793 197 731 -115 -496 46 567
2236 567 60 -665 -370 158 -146 -142 -26 79 -633 155 124 93 -401 -295 490 607 -595 -305 347 670 -145
2257 -145 -869 43 312 142 -227 -271 130 122 103 525 114 -713 -395 460 171 -372 -182 315 580 -418 -677
2278 -677 420 277 -220 -484 499 567 -23 -476 -99 -74 158 -110 46 -115 -458 223 436 154 -803 -385
2298 -385 393 624 -167 -520 34 358 -13 -459 125 363 322 -98 -284 185 97 -261 144 126 -393 -46 297
2319 297 273 -526 -362 483 629 -180 -409 152 695 -164 -300 15 262 -211 -34 92 15 -16 -156 -78 63
2340 63 -274 -3 477 237 -492 -454 302 502 -66 -681 287 483 84 -336 -187 291 356 -273 -55 267 66
2361 66 63 162 142 -235 -259 363 548 -280 -366 111 292 -106 -540 -92 622 291 -471 -42 252 339 -271 15 61
2384 61 32 -183 266 78 -442 -125 373 330 -378 -584 231 616 -186 -520 -232 488 32 -239 11 147 -62
2405 -62 -182 -117 -59 -405 4 296 195 -5 -153 234 237 -218 -530 314 342 -298 -540 -206 539 190 -332 9
2427 9 40 59 -239 27 -16 -154 86 337 266 -219 -262 208 436 -84 -398 225 774 -37 -416 69 496 137
2449 137 87 -235 -123 11 261 265 -48 -71 -87 466 -139 70 -406 203 583 -146 -407 78 386 29 -476 -129
2471 -129 400 135 -174 -139 113 -218 113 -1 -63 29 -178 277 51 -559 -603 176 409 -55 -683 156 478
2492 478 91 -475 -289 208 -188 -373 -143 -79 52 93 70 236 -125 -174 455 344 -104 -125 251 156 -268 -393
2514 -393 -18 431 -172 -228 -238 94 -13 -199 91 -305 212 94 79 274 -393 -104 336 427 -95 -315 51
2535 51 391 53 -387 -6 331 238 -310 68 285 90 -158 30 55 -22 134 116 -51 35 -182 197 182 48
2557 48 -202 -40 303 116 -269 272 69 69 -286 -32 36 145 39 -52 -111 -318 52 -228 -178 -304 -337 104 78
2580 78 -149 -15 -45 491 220 -104 -56 167 212 -153 -19 -34 27 45 99 42 -183 -12 48 217 -230 -93 150
2603 150 124 -210 -5 109 -4 166 -311 114 213 280 25 -417 151 173 95 82 -338 -170 386 126 -92 -74
2625 -74 -342 251 214 -75 -161 -88 185 215 -150 -127 22 35 -171 -313 -53 35 -67 -172 -118 66 113 146 93 -125
2649 -125 -69 289 -47 -120 -79 86 164 267 -332 -63 245 265 -111 47 -66 154 -10 -3 49 -178 62 -15 185
2672 185 -181 -42 138 172 -36 -138 -272 212 73 41 -11 94 -86 -66 -85 295 27 407 -69 -90 -311 -154
2694 -154 94 156 -28 -220 270 358 -186 -99 113 -22 -69 -104 26 249 112 210 -238 -247 -74 150 -30 -340 -196
2717 -196 -224 329 78 -13 -348 -71 236 26 -8 31 34 121 -183 -267 30 85 131 56 -114 -229 -89 136 139 30
2741 30 145 115 211 134 -349 10 -32 -103 -27 -53 -41 258 72 -82 123 120 204 55 -45 10 -125 381 196 -308
2765 -308 26 183 23 -114 -62 355 265 -280 -57 -82 -35 53 27 36 -142 -163 54 -31 147 -8 187 63 -143
2788 -143 -311 -190 -74 -22 195 -387 -16 193 -105 19 -278 -103 213 139 -147 26 46 300 -206 -112 -237
2809 -237 -81 118 -96 -262 -46 131 159 -42 -415 273 29 -104 -125 -166 170 135 -102 -197 -255 -166 73 179
2831 179 -115 -54 -199 249 167 -91 106 213 314 -17 -311 -35 11 20 -6 29 53 -15 -25 -178 -106 -69 319 -35
2855 -35 -47 -321 -244 -89 226 -134 -114 193 261 -35 -268 66 156 122 116 -39 -175 -118 96 -41 -26 41 167 -331
2879 -331 53 -143 24 80 -150 70 144 142 202 44 -222 65 259 127 -220 -41 195 216 330 -112 52 243
2901 243 9 -7 50 -53 -32 146 157 13 147 72 -2 308 227 -187 154 98 187 -85 4 118 32 232 -361 -52
2925 -52 10 -29 223 -14 116 51 90 -191 33 11 53 -6 -242 -91 110 -228 65 -325 -61 -113 -4 -63 -215
2948 -215 -419 62 -4 -128 -75 -137 399 -40 43 -77 -282 113 -39 -14 36 -342 112 169 202 -132 56 -24 168
2971 168 -366 106 -33 42 207 -201 235 91 155 257 -337 -135 29 152 100 -121 64 -53 90 -359 -102
2992 -102 4 -55 159 -99 -40 -53 -192 97 95 56 3 282 119 -17 -234 150 165 -40 -162 -6 201 -52 -164
3015 -164 -62 -3 304 97 -3 -186 57 96 110 229 -31 53 5 -45 214 -178 -138 274 -271 195 114 260 389
3038 389 -111 64 -16 126 144 -233 -2 -35 90 36 192 -83 36 194 172 -116 -65 -75 -120 108 95 -314 7
3061 7 107 -28 -160 -29 70 57 -132 26 -269 19 256 -50 -63 -76 23 -106 15 56 191 15 -186 -388 139
3084 139 49 63 69 -151 93 -85 70 -297 -12 -94 135 203 -240 -23 -1 48 168 -30 -46 45 18 -225 -127 89
3108 89 57 228 -142 -133 0 -150 64 -78 58 186 135 -111 45 -262 -35 168 -25 -214 -270 68 50 156
3130 156 31 -214 -13 39 76 -61 123 120 -74 -46 -133 -88 -75 34 10 -279 218 5 356 -17 79 -98 13
3153 13 216 4 42 71 37 209 -43 -8 32 -21 -387 -48 68 -202 313 147 -311 10 146 -26 -31 31 -18 -2
3177 -2 270 -127 -71 123 49 58 -197 208 -113 -11 -171 -162 0 -193 -25 391 -144 -180 173 150 9 -97 -194 98
3201 98 -132 -27 -200 -126 16 -175 16 -24 -21 136 -11 -298 44 -34 265 -55 241 -15 -89 24 135 -165
3223 -165 -23 131 55 296 -44 -32 87 -207 -197 -169 -213 35 -308 24 82 -1 126 -308 128 70 88 38 -44 -346
3247 -346 47 235 -20 53 163 32 -210 135 -35 -243 -41 2 169 -26 -159 48 14 45 -122 115 334
3268 334 -122 68 -67 -73 17 -157 61 153 91 134 177 -133 -50 -4 61 249 78 -299 -205 274 10 83 122 -55
3292 -55 92 245 33 -103 243 -58 202 136 -205 -182 -52 -112 100 31 -111 -122 165 -119 -54 -39 13 74 74 45
3316 45 91 -116 -258 85 244 21 17 45 10 -150 189 -78 -125 24 -6 -179 -109 -71 137 -220 35 -7 -87 -15
3340 -15 220 122 -114 -296 -134 123 26 -25 211 -34 -137 122 19 -248 -1 176 -244 209 40 42 28 61 103
3363 103 192 200 138 -71 -155 19 36 37 28 -49 -51 163 -4 -65 99 37 8 -109 -109 118 139 256 139 -118 9 32 110
3390 110 58 -98 235 141 337 -173 -144 26 30 82 168 -31 31 16 -133 122 53 35 -286 -120 -38 -109 57 -286
3414 -286 -227 70 -116 189 -30 -7 -131 104 242 -73 96 -282 -56 -95 107 71 -37 121 -140 -65 113 25
3436 25 -64 319 -32 -84 68 59 -97 -129 1 26 -208 37 96 83 63 144 -208 15 -238 -117 416 157 20 -111
3460 -111 -25 107 -164 25 -170 67 1 22 -257 -148 102 27 -198 170 -29 -183 -101 -15 -128 5 93 -128
3482 -128 79 36 162 85 -3 104 -22 65 117 -27 56 -3 153 175 -70 -49 -22 -72 178 87 -143 -233 84 64 101
3507 101 -65 -219 1 -49 -72 -157 249 -10 -101 133 41 -31 3 9 60 171 -218 243 183 -28 80 -238 -49 123
3531 123 -102 -125 156 -118 -138 -225 6 169 -134 1 -16 -227 174 -224 17 77 26 40 -190 -304 66 230
3553 230 -59 -74 -299 -94 128 66 253 24 323 188 70 147 37 -89 -30 -25 75 67 -21 66 -67 -15 -39 120
3577 120 112 -89 204 47 -53 59 -107 41 1 195 69 -114 -83 15 284 -277 -88 -126 -95 111 85 -36 222
3600 222 42 107 91 -171 14 111 179 -105 94 -83 88 24 61 -184 27 119 -219 -283 -137 132 -223 310 -58
3623 -58 110 297 62 -60 122 -175 -41 -79 -224 -121 127 -118 267 54 84 -9 104 -183 -49 -56 72 7
3645 7 137 -19 138 139 -221 -81 -308 -64 -88 206 15 -100 -25 6 -53 -125 -93 -147 -151 269 198 49 120 145 -20
3670 -20 151 28 -8 -41 146 92 -106 123 -160 -260 -30 -78 88 112 -76 -329 -109 329 207 148 -93 -162 158
3693 158 13 -95 290 98 -75 13 -3 -30 -67 -118 136 -163 -62 84 36 133 0 100 145 -186 -37 67 65
3716 65 -17 -4 -274 -298 -169 198 296 2 -97 -194 36 183 179 -222 118 -162 -34 116 -35 78 12 -72 -63 1 295
3741 295 32 -137 -87 77 12 -122 26 -23 -121 179 48 115 -49 218 53 121 -30 34 -191 47 42 27 182
3764 182 104 26 -30 -5 -100 3 36 -62 122 -202 57 302 -72 -87 64 75 -203 -47 -332 63 -68 56 -141
3787 -141 -140 -84 21 104 160 -56 -50 126 65 -108 -12 -30 -45 105 -93 -129 -2 64 23 -20 -60 31 -106 -169 -93 -30 239
3814 239 117 -114 7 83 -74 -141 38 -106 49 -64 -174 115 69 37 224 -53 -301 99 -38 60 22 198
3836 198 24 23 -39 228 73 -194 -128 60 154 -64 124 143 199 -13 -153 74 89 57 -130 -177 87 184 -11 29
3860 29 110 -35 -21 47 213 -96 104 -147 -23 17 421 93 -70 56 -145 -122 159 152 -166 27 259 -21 14
3883 14 118 -21 -143 -60 -7 237 -138 71 50 43 -129 -14 6 144 -87 37 149 -256 -350 57 -21 170 41
3906 41 73 143 37 -170 -17 128 -59 146 -128 114 335 -107 -106 252 365 -65 -54 195 89 157 -146 -98 46
3929 46 94 114 -76 -124 216 -162 -33 94 -11 143 112 111 43 -134 262 45 24 -34 23 -88 -49 -123 -103 -61 -51
3954 -51 -3 309 54 -28 -140 37 106 0 -57 10 85 66 -52 -106 -55 33 -120 -154 -9 108 -52 35 86 -32 -79
3979 -79 33 18 -77 -14 46 88 -116 -163 -109 210 343 165 94 166 85 164 83 1 -33 12 96 -118 77 -80 -33 45
4005 45 80 -13 -49 -10 99 -261 220 -190 -223 174 -5 135 45 46 -44 214 -63 -113 4 -129 51 150 -85 -185
4029 -185 290 146 31 -13 -16 31 -116 153 19 -41 202 37 -48 89 -86 21 20 136 70 86 21 -123 90 -143
4053 -143 -123 16 32 57 -69 35 49 105 -111 -166 22 -6 -2 231 -130 -89 -47 -256 38 -58 -213 11 253 -316
4077 -316 108 19 265 30 13 -51 19 201 -309 -137 74 235 137 -228 43 -26 -34 216 147 360 147 -160 28
4100 28 -7 -83 40 -32 138 -119 -142 58 -38 -162 -29 -16 11 127 -140 67 1 178 -3 35 -20 -48 -54 -2 -26
4125 -26 -73 177 61 -121 114 43 -126 -18 3 -219 207 246 60 -15 3 155 -104 -105 18 197 -33 102 97 -202
4149 -202 -76 -162 122 -41 60 -22 -104 193 -187 -51 -124 111 -130 191 -263 -274 -40 -188 100 -47 148 -33
4171 -33 -22 239 -176 -53 -37 -206 -251 -198 106 29 -61 -153 19 218 -128 -309 -24 -10 -2 -240 -94 -111 102 -88
4195 -88 60 23 -120 -16 -179 -17 -71 47 31 230 -146 -20 90 -265 -105 253 -22 71 -80 160 23 119
4217 119 35 -202 -210 -202 57 153 280 211 85 403 286 -27 -151 -139 -66 8 -128 76 134 -200 -43 -9 2 110
4241 110 93 64 107 -119 -95 -118 194 249 78 -331 2 -164 -111 35 80 63 -29 57 54 -135 -281 -40 -13 111 102
4266 102 -105 -136 -167 87 -274 13 -43 67 281 -109 274 -109 -119 7 -94 241 -43 -51 24 -103 -7 5 -152
4289 -152 -93 99 17 -160 -55 100 -10 1 -31 -96 119 118 -4 -94 -51 411 -16 33 -95 24 91 93 350 385 90
4314 90 125 26 -29 -189 23 61 98 -171 40 59 21 40 -139 119 99 -103 91 62 180 -55 94 62 94 -73
4338 -73 -235 111 -75 -45 -74 -38 -26 -119 -60 -61 49 58 -179 -8 -244 16 23 -144 -14 31 -150 -28 -167 185 70
4363 70 246 202 -15 -112 -121 311 157 -30 -174 -277 50 49 47 -48 136 66 260 7 -124 141 -19 161 -36 263
4387 263 -36 249 57 -251 -103 -61 -5 -296 68 -82 -31 -377 169 -211 -270 101 154 -77 -53 -200 14 8 -87
4410 -87 109 -112 108 190 -123 -205 137 155 15 -58 -48 85 -124 59 55 25 54 -107 -70 -12 -61 171 -105 48
4434 48 3 -207 84 -14 -6 3 269 -33 172 145 -157 0 -1 -67 97 126 -150 -193 -8 -275 -26 81 143 -129 -5
4459 -5 91 49 99 -55 50 -86 67 112 4 160 168 -54 -112 -152 -164 -104 -28 118 -84 -212 -20 -137 79 105 -111
4484 -111 49 -302 -79 104 41 -99 123 -69 83 94 -190 43 -36 220 155 -119 -123 -135 -147 -37 -193 -140 91
4507 91 -236 299 -58 -62 185 100 94 37 28 -119 83 -181 -207 33 82 89 36 -55 50 37 199 -93 -175 60 64 193
4533 193 17 -206 79 216 -191 71 -76 38 47 154 -86 151 -42 212 62 -199 -85 -155 17 41 -57 98
4555 98 -7 94 -50 243 -98 125 -101 -93 91 62 -61 104 -120 -116 -179 -164 162 -32 -29 -60 37 20 -80 -74 59
4580 59 -161 -126 -89 61 -178 42 -265 -57 50 25 39 26 138 -176 -44 14 -75 -96 -69 109 158 224 -32 -271
4604 -271 29 216 -76 -37 66 -23 -229 -46 -392 -31 -175 -77 -222 -58 -63 -169 -35 72 6 1 161 71 -91
4627 -91 -200 -89 -15 -125 81 -44 -199 -41 109 130 142 -78 -226 77 -13 166 37 -54 88 40 26 -31 -368
4650 -368 -125 -15 47 -52 44 -69 160 86 -56 54 -18 -180 -66 -241 26 -39 -213 -96 -285 0 96 82 78
4673 78 129 -45 165 34 -36 -211 74 -148 -97 128 -117 -53 -105 -298 175 144 -83 142 -15 -19 -94 -125 -3 153
4697 153 -35 177 53 2 92 157 -80 -187 -265 173 -60 -122 62 5 -59 207 -52 19 44 66 -260 -14 80 10
4721 10 253 133 -81 -128 -33 246 36 57 79 -53 -94 -156 -67 34 -15 49 84 6 -81 -127 -124 193 76 -82 101
4746 101 -4 63 -275 -126 240 104 10 -99 2 33 -2 -76 12 -179 34 13 -45 -19 102 90 -144 -137 -180 -99 -322
4771 -322 -11 74 168 -173 -100 176 -150 -31 -77 -19 138 -329 -79 78 -38 -175 21 -37 -21 -124 12 -42 -75
4794 -75 -188 121 8 158 -242 -65 166 -80 183 8 -26 39 97 -49 58 -70 -139 -104 17 -172 -99 279
4816 279 -247 -92 158 -82 145 -306 200 65 -53 43 108 -79 -203 91 86 -97 -97 -110 -206 279 -3 -52 277
4839 277 84 351 162 86 -48 -155 -315 33 -31 -159 17 51 -176 -55 47 94 223 11 -163 124 -29
4860 -29 -174 -6 -109 23 -168 -104 -126 9 -200 -120 -95 -37 -122 56 -158 -25 239 -150 -7 91 -124 -25 163
4883 163 -195 -117 296 -223 -190 -4 91 -208 -33 -202 111 -54 14 -122 -181 103 -41 92 49 82 10 42 -120
4906 -120 -103 -67 31 -122 36 -55 -24 -27 -76 197 -95 -143 -65 47 -398 141 102 -38 -23 -8 116 -210 290 -86
4930 -86 209 -79 -81 -72 -29 30 137 117 -103 -192 127 5 -110 -102 -30 64 129 41 -375 -35 67 131 37 -16 -160 -164 -34
4957 -34 59 76 -53 135 -196 66 174 90 -6 -5 216 -248 -5 -86 262 99 88 23 45 -148 -121 105 173 54
4981 54 -88 -217 -66 20 -94 79 -82 -93 160 78 -201 197 131 -18 -244 72 -104 58 -29 -78 23 453
5003 453 426 -1 10 -338 -60 55 182 -111 240 -177 -76 -32 -136 -234 63 -175 40 -43 -220 -256 -211 165
5025 165 -103 -294 -133 -46 44 -83 -32 -163 -121 -272 -75 69 -79 -146 -37 77 -176 -3 -246 83 150 -17
5047 -17 6 -71 194 -55 -165 62 -37 241 20 -161 119 18 -3 -102 -107 -276 -185 278 -329 -91 -56 106 14 184
5071 184 43 18 49 -2 115 -144 -52 20 -51 -117 -15 144 18 -72 -8 -168 43 2 -152 -133 32 153 124 -86
5095 -86 159 83 132 77 -28 -20 23 185 91 -90 -59 -59 -46 1 246 -65 103 -61 296 130 139 -36 114 52 -111
5120 -111 -8 232 70 -159 50 132 -34 -112 46 23 -51 90 261 -47 -117 31 -41 58 -102 -147 24 5 -258
5143 -258 -84 -66 -104 -9 -123 125 45 9 -205 -213 2 32 71 22 -97 26 -7 -167 -76 -65 -174 19 271 -136
5167 -136 -59 19 123 86 -9 184 43 -130 -64 -77 143 -71 -102 -275 -89 -188 -58 178 -116 -227 124 -272 -259
5190 -259 83 -69 -363 150 -178 -169 180 137 -127 -211 113 152 111 -112 -21 -18 -59 39 132 122 38 -83 -17 242 10
5215 10 -60 -114 -93 72 91 -22 151 16 289 71 35 141 101 211 -7 84 -159 54 148 100 173 -93 207 54
5239 54 5 -13 -177 -242 31 -110 329 -366 -226 1 -202 -144 33 69 200 -122 89 305 8 116 -31 78
5261 78 -30 1 217 -14 172 123 -419 253 16 -288 -8 1 -28 148 26 133 -94 79 -185 -121 -230 -78
5283 -78 -8 -32 -114 -105 -84 -139 -19 -189 -61 -3 -1 -57 62 -107 -195 35 -228 -84 -74 54 -56 32 -127 -85 -16 55
5309 55 -131 45 95 -159 -192 65 4 113 -32 -45 98 -130 172 -74 -218 5 94 -95 -158 141 -56 166
5331 166 -22 -117 158 79 -30 -215 -154 34 26 62 207 -119 -125 96 58 74 -102 83 -367 67 -279 -55 88
5354 88 -75 77 -30 198 -47 -103 104 416 132 -120 16 108 -42 -76 -176 -114 1 -139 -328 25 133 -118
5376 -118 -117 -71 209 22 -95 -94 -83 -94 -73 104 89 -113 -147 -97 -223 11 -174 117 73 211 -59 -153 6 210
5400 210 -58 -119 197 -37 -26 -73 -179 -86 68 -15 -263 92 -194 -125 67 -195 -109 -89 200 113 129 -41 -187
5423 -187 32 -46 81 71 238 110 233 -328 43 -167 -166 -68 -197 -244 112 55 -115 -224 31 -18 180 -134 -90
5446 -90 -15 -136 -108 -116 -26 150 344 -101 10 -99 40 -177 101 167 94 65 -15 69 -28 82 165 40 161 -132
5470 -132 -28 60 152 -106 -82 -191 -114 -83 -5 -4 184 -83 49 -201 142 57 -142 5 29 251 265 23 10 4 36
5495 36 129 -134 139 -296 -219 -146 204 -26 -10 130 -87 138 33 59 -104 37 94 117 64 59 -106 136 41 6
5519 6 55 30 -192 -150 149 -279 -22 -30 -113 121 -201 -96 -103 14 74 -89 107 -144 -86 57 113 -114 -50 146 -80
5544 -80 -10 -127 8 -11 311 63 -217 -12 238 18 350 12 -72 -208 13 156 98 135 -35 52 63 -172 -85
5567 -85 -67 122 -118 10 -94 -232 41 161 -68 -67 -109 140 283 -42 -35 -53 35 -15 -137 240 -67 -145 -23 109
5591 109 -7 65 -125 9 -57 -104 -46 -20 35 -4 105 13 -67 61 135 -71 -97 120 38 -289 -165 -19 -45 18 -238
5616 -238 67 -16 -165 -186 36 -236 24 134 -4 -62 -125 22 73 -4 -25 179 -88 38 83 -66 -71 -77 -89 168
5640 168 -57 -254 -142 132 -27 -101 -2 -19 -265 -23 -36 66 -79 35 154 31 -145 -22 58 -22 -96 58
5662 58 126 -11 -51 95 -155 -82 34 15 -210 107 94 -147 47 1 -181 -106 -234 -125 -49 65 133 -157 362
5685 362 -97 -125 97 88 -87 156 -14 -92 -71 -89 -148 -19 238 -27 -153 40 39 20 7 -21 -119 -38 -271 50 -133
5710 -133 46 123 -14 -79 -174 135 -49 180 -80 144 117 -55 386 102 -211 104 -52 208 -51 -90 -39 -221
5732 -221 27 -28 22 20 -91 -76 -18 215 212 114 -246 -64 -103 272 -58 -246 -124 -1 15 109 -46 -186 52 96
5756 96 -118 -165 -9 104 -168 -235 223 11 -203 -132 242 -113 -16 -26 -97 3 53 -76 72 -46 -114 146 -100
5779 -100 -53 -80 42 13 -217 -18 -241 21 197 9 100 224 234 270 -6 49 106 -148 -12 12 -16 -79 37 77
5803 77 86 53 -34 -171 160 -44 31 159 79 -53 4 86 -41 23 274 -176 -137 -5 -263 33 -234 101 -75 237
5827 237 -160 -131 -44 15 237 -191 -5 13 127 136 -231 -68 2 26 -3 -113 -91 28 -97 -78 -73 -120 302 83 74
5852 74 -438 -45 104 -41 -90 -89 119 -98 85 82 97 301 45 87 101 -114 79 386 -74 -41 155 136 29 90
5876 90 133 53 16 -201 -191 51 -249 -49 55 57 -219 -390 -120 -81 -32 -87 91 7 4 43 -29 219 -152 103 -15
5901 -15 13 -67 -52 113 123 -176 -186 -54 -16 253 -86 -185 -216 -93 -196 -34 -106 -10 -211 62 36 -116 44 257
5925 257 -195 55 -96 186 -81 34 77 -175 -64 -54 -12 289 90 -79 138 -204 -208 -54 -51 81 83 17 -52 102
5949 102 84 136 -51 314 -72 148 243 -307 -44 -112 -321 146 -90 -195 163 -9 -266 141 204 175 363 241
5971 241 34 -63 -67 40 -19 69 90 -56 -25 250 12 63 3 -82 -19 323 -16 -170 57 5 230 -34 -286 -2
5995 -2 -173 30 157 -153 170 33 -263 -27 -27 -87 73 64 -126 -53 -98 -46 -121 -207 71 184 38 -10 182 -128
6019 -128 103 274 -198 -50 -117 -196 -289 -30 102 19 69 -33 97 10 -26 211 -108 318 125 51 -56 -185 48
6042 48 73 77 -167 -229 180 241 170 -31 -3 -125 -184 130 -26 -56 0 66 -232 73 118 -104 -87 185 -93 -200 236
6067 236 -363 -144 142 276 211 -118 243 -275 -113 -25 38 170 107 -232 33 -157 57 163 23 13 -207 -135
6089 -135 109 -106 -166 28 171 77 176 50 3 -20 -153 -23 -17 239 -143 6 -71 -118 -166 -475 15 -113 44
6112 44 -94 6 -154 -111 99 4 106 2 62 193 210 -75 -16 156 -59 -154 2 -74 172 116 175 225 134 -135
6136 -135 92 134 -387 -13 -187 110 -176 98 51 -49 -100 -114 148 70 -92 75 39 -141 -76 -73 -128 -158 -30 -186
6160 -186 116 203 -139 102 0 -28 145 73 -8 37 -30 -239 -130 0 -115 -63 71 -178 26 -5 115 -113 -168
6183 -168 -112 100 -129 -374 60 29 -212 36 4 -100 -150 -190 69 -103 -271 29 -10 11 32 -187 -144 -144 385 4
6207 4 140 -10 -76 -199 -328 -10 72 69 -186 -338 -221 95 202 112 100 255 -32 33 71 19 70 -212 -25 -122
6231 -122 100 115 -172 66 -14 32 -71 127 -55 -156 19 -94 -61 50 201 67 -86 -67 114 -106 -182 51
6253 51 19 -183 3 -29 -126 268 -95 18 -173 -79 -119 -9 -67 -168 -42 102 -155 -320 94 -11 62 -12 6
6276 6 166 -200 -202 -96 93 -219 -131 47 -65 48 199 73 -51 -85 135 -12 17 -175 -65 -255 -104 -13 171
6299 171 -45 -15 160 129 -55 -107 -17 -191 -16 -61 -1 -63 -39 -13 -90 -77 -82 47 -96 -167 158 -110 -294 -303 -12
6324 -12 21 -131 -72 -141 -263 171 114 77 -35 -79 10 77 -42 -54 -11 149 193 -60 -68 -254 92 40 -164 55 80
6349 80 -21 42 149 122 105 110 60 -23 76 62 -18 99 -36 108 187 9 -110 -9 -81 -94 57 2 -49 19 -137 22
6375 22 -368 -93 -166 35 81 -127 396 116 -52 41 142 82 161 134 40 -167 111 -66 -230 -35 56 -19 207
6398 207 308 98 91 -84 -177 -311 -94 -91 12 191 26 -92 -221 -28 139 -350 -115 -79 -141 -107 -136 149 -169
6421 -169 -27 -171 81 103 73 56 171 35 -262 -39 -121 59 -3 91 66 -58 -165 -35 -104 -100 177 -119 -105 68
6445 68 52 -24 45 -150 39 -90 110 367 -46 305 -91 41 92 88 -14 71 -40 -90 96 116 -138 -55 -147 120
6469 120 -223 27 175 65 -88 44 66 1 -24 -27 -62 -72 81 -27 110 67 62 -85 -221 -307 -195 189 119 70
6493 70 -105 160 -93 235 100 -112 106 -36 -203 -195 -39 42 -48 -40 128 103 -52 64 41 94 10 30 24 25 -52 -43
6519 -43 -57 -63 162 25 137 117 -171 -251 -104 65 -59 3 -19 -105 203 -196 42 -55 144 251 130 155 -60 -33
6543 -33 -290 -18 204 -62 -356 -102 80 -86 -92 -258 -4 -82 -235 -141 22 -132 25 88 173 12 -13 250 96
6566 96 -104 -127 -146 -122 -262 -2 -16 -35 -138 42 -59 -61 180 -16 220 -24 4 119 -8 234 173 269 -117 -174
6590 -174 -85 151 -66 180 47 -41 -148 -262 -203 0 -238 226 0 -72 -141 -270 -130 27 -70 -153 -71 135 101
6613 101 134 23 116 291 -152 38 217 -137 12 -110 -307 -115 115 -212 -49 -43 46 -89 217 -162 40 26
6635 26 -67 206 -10 110 -197 -33 -101 -156 -121 -47 -13 -99 80 -135 -47 -51 -139 -47 110 4 -92 -60 -81 -44 -220 162
6661 162 -84 -30 8 -82 -134 -107 -5 151 9 -33 26 -30 -156 -15 91 44 -149 53 145 90 114 153 64 -117 -44
6686 -44 46 -102 17 -1 170 -196 24 37 -110 92 19 -105 168 -14 -78 32 359 132 -11 314 31 -157
6708 -157 -117 5 185 14 -134 -262 37 -77 41 135 -38 84 186 -145 48 1 -69 176 -290 7 -188
6729 -188 -11 -132 -113 70 -73 -209 20 99 37 37 69 -159 92 124 -164 149 -45 69 -197 74 30 -188 55
6752 55 -142 262 -115 -129 -41 154 -98 121 112 33 133 27 -81 44 113 -119 -21 64 -37 -221 24 -139 -65
6775 -65 31 -121 33 4 32 200 -84 -119 327 -231 47 -23 -42 199 -101 -118 14 -103 -100 -62 -373 231 126 -38
6799 -38 -105 132 -111 -136 -178 -126 -72 44 79 -73 -71 53 -2 31 -70 -19 97 447 -116 -142 102 40 51 -6 -182
6824 -182 116 189 -129 -191 226 -79 204 -90 -241 83 172 87 107 122 178 15 -71 114 27 -21 -106 174 -77 80
6848 80 73 194 142 12 -35 -214 198 -23 3 59 286 -54 114 13 -86 -35 42 15 113 1 77 141 -173 147 -51
6873 -51 47 -186 -59 88 4 -142 -214 56 -102 -21 81 45 -83 242 76 305 -40 -154 12 166 161 133 130 -21
6897 -21 155 -109 228 -12 34 287 128 254 155 82 84 230 -113 1 135 -196 40 -125 -5 -293 81 50
6919 50 173 -31 -29 -141 -27 -4 -106 82 -186 -40 -95 -77 -60 47 -25 -125 -4 341 -180 -123 20 -113 -24
6942 -24 -113 -100 -84 47 -215 23 32 2 -66 133 -112 -137 36 144 -49 282 193 100 200 199 9 -147 -73 90 -263
6967 -263 -240 91 10 42 -96 -66 74 125 -23 -74 21 105 -16 127 14 -13 183 -17 -93 -9 -8 245 -200 4
6991 4 93 -304 45 147 -113 30 28 -44 -106 -173 -161 -189 122 3 -16 -42 232 -93 -105 86 235 -87 -106 -8 -10 -26
7017 -26 -159 41 -152 -18 117 37 -133 40 82 -179 -156 -18 117 -256 -160 -35 -25 74 -194 -135 -91 34 -9
7040 -9 -33 -94 228 193 53 31 201 112 -16 -16 20 238 51 56 82 -185 -3 234 58 -253 -21 -287 -342 -228 42
7065 42 -65 -215 -146 -379 -147 87 -266 129 -56 -71 255 4 192 -84 -73 95 -55 -82 -191 147 2 -156
7087 -156 -173 75 233 200 -218 73 157 44 -31 -12 -234 -72 187 -230 78 196 -189 100 -74 -341 72 -64
7109 -64 279 111 119 -28 -11 -50 153 107 212 -85 -168 343 -64 129 -164 -34 265 45 -110 -152 -50 -55 137
7132 137 -94 -1 116 -2 144 25 250 161 -185 53 -175 -56 -105 -213 9 0 81 -298 56 -103 17 -228
7154 -228 -126 135 19 137 3 112 78 127 -141 0 -28 -31 -91 181 6 -163 -281 165 128 -209 -97 -237
7176 -237 185 -60 -54 -18 71 112 -78 89 -11 -60 117 7 131 84 -151 -195 82 -82 -87 253 -135 229 -72
7199 -72 -145 -269 -113 -93 -10 -54 81 -29 27 -13 -227 -54 -173 13 -87 -28 -45 161 71 -101 7 -175 -38
7222 -38 -262 -26 129 150 -53 189 38 -154 38 -26 50 124 45 -189 -109 142 16 229 309 175 -78 -19 63
7245 63 -17 -40 -134 -63 133 323 88 87 167 -45 -24 206 47 31 -57 153 -203 -84 -192 17 57 -123 -109 -82 -162
7270 -162 244 30 51 15 18 -149 33 -97 185 19 -139 -159 179 -83 90 103 -1 441 -30 -41 -84 -162 -199
7293 -199 143 110 145 133 104 -166 102 225 -36 60 -174 -8 2 69 97 106 11 -44 -39 -116 -52 -157 58 -183 -105 -19
7319 -19 29 -81 -301 -277 -136 66 79 169 -56 -109 337 -168 284 201 -171 -9 -92 73 -127 -194 -37 -110 -198 -9
7343 -9 -200 -182 -27 44 -37 -105 -50 -223 13 87 87 124 191 -159 -71 -34 -214 279 -205 -60 36 30 114 -37 -29 -69 -192
7370 -192 -105 238 63 -10 126 137 -71 -52 -38 -94 -124 49 245 -6 260 -79 95 -218 -64 -31 26 -125 -24
7393 -24 -200 30 129 69 68 121 -55 47 102 -38 115 -23 106 22 113 29 -237 40 -18 -17 -124 -265 236 -114
7417 -114 -16 100 -26 -51 6 -62 18 35 178 -125 304 152 55 -181 212 4 -175 196 7 15 63 -10 -39 -18
7441 -18 40 136 92 -27 11 -128 -87 -142 -64 116 97 198 19 52 51 3 173 -92 122 -115 103 -20 -38 -226 195
7466 195 20 27 214 181 231 138 -102 -140 240 5 112 -249 47 162 -28 39 -277 -35 42 -41 -103 58 -157
7489 -157 -57 101 186 55 106 -98 -20 133 108 108 68 114 72 20 -376 42 200 -60 6 135 -50 76 75 90 143
7514 143 -101 234 -257 -83 -199 98 45 100 53 31 11 168 57 115 169 -287 -125 -36 10 136 14 153 -130
7537 -130 134 -213 -150 37 -130 -171 -53 -94 -86 -70 -125 -241 -18 -354 177 59 -125 21 -117 156 84 51 14
7560 14 -85 -34 62 32 73 -116 5 31 -147 192 -114 253 52 -107 10 124 -183 -84 101 24 -9 -35 45 -181
7584 -181 -207 238 4 30 57 -56 -119 -141 -234 -336 75 145 45 -70 -6 -150 106 -46 -282 108 -22 107 71
7607 71 -12 -61 154 -310 21 162 -42 244 -94 149 -285 19 -47 90 -90 -60 -51 -177 58 134 29 57 -124
7630 -124 -21 -123 4 -42 108 146 -130 8 79 -236 -40 127 145 -79 -208 -24 216 110 -119 -96 238 29
7652 29 -132 82 -9 -84 -65 89 84 135 -121 61 115 -28 -170 -145 132 -50 111 287 -250 -1 226 -146 -285
7675 -285 230 48 61 -161 10 -130 47 -130 -239 54 72 -245 -47 133 -17 265 -99 -140 11 262 66
7696 66 -95 102 -59 -90 -168 82 -115 -230 189 -40 -149 -59 31 30 -33 236 46 -88 -63 -266 -156 133 -100
7719 -100 51 75 256 -21 81 -143 -77 126 -4 72 -45 -152 27 58 -151 48 108 -154 135 29 -107 213
7741 213 35 -229 -204 -1 97 -80 169 -51 10 -87 146 77 -125 64 -30 -80 -50 -110 13 -88 -5 208 -166
7764 -166 -60 -50 -54 -170 150 -9 90 -165 -118 -72 198 81 186 85 -35 -240 -117 -39 88 -90 -128 -130 -6
7787 -6 65 -322 28 -84 52 -261 -93 214 208 16 13 -64 35 -25 232 224 -111 221 144 -98 -106 -10 189 232 -160 -10
7813 -10 16 -61 -138 -20 -122 297 -404 -76 -147 108 -85 49 238 64 -148 -53 -81 -17 -17 -34 -130 158 -393 -103
7837 -103 -126 118 -155 62 -63 -20 79 100 -105 -208 86 169 156 -47 -351 311 183 -230 -7 92 -120 190
7859 190 144 -81 -24 -296 19 91 37 -166 158 -54 112 -80 -151 -48 -62 121 -173 -93 87 -131 52 4 -34
7882 -34 -208 68 196 -56 -52 -288 -58 116 44 258 -21 -47 -253 -117 114 3 168 -43 -74 58 -214 -24
7904 -24 118 -219 110 -9 113 137 28 88 -83 -201 -255 46 114 -302 118 -118 -19 -44 228 231 -246 71 -117
7927 -117 92 -111 117 174 -101 23 29 -315 -74 -68 124 84 -196 -21 1 75 17 -108 -78 -303 122 69 90 -17
7951 -17 115 -58 -37 1 -95 -170 154 229 -143 -31 -12 48 -199 -84 -237 -2 -89 -132 -151 130 5 137 249 108
7975 108 -154 -51 -95 -189 135 -132 -205 -36 -207 -49 -114 -99 54 38 18 -38 222 52 244 -133 -91 13 -91
7998 -91 -98 -298 49 222 124 47 -74 -234 -52 78 -134 -79 65 -160 136 -114 260 -88 160 -117 -144 153
8020 153 56 111 -150 0 57 -60 188 96 -120 -133 2 40 -49 56 -201 -89 -89 -238 -147 -102 -159 -218 -13 6 -145
8045 -145 22 -124 7 -532 -24 -15 -15 41 -232 31 31 17 122 144 -132 3 183 122 -51 131 -36 62 120 101
8069 101 135 140 -271 132 -57 -11 382 71 -124 -30 -172 -47 -26 -141 -28 -6 -30 -76 -30 212 156 -135 -86 -71
8093 -71 -196 11 2 -156 222 -115 -17 -172 -346 -22 -32 -90 92 74 -7 -250 296 24 -7 -98 -425 258 65
8116 65 -216 24 -19 116 80 248 -151 -66 311 258 223 108 159 -59 304 188 43 -71 -239 -1 118 100 -168
8139 -168 56 399 108 29 98 194 41 -60 -32 60 -295 -99 26 167 2 115 -73 32 19 187 187 87 10
8162 10 29 97 -194 -249 69 -5 -70 -133 61 86 -126 61 128 6 -53 -24 22 -73 65 -86 -50 -5 -136 62 -21
8187 -21 2 -85 -81 100
8191A00
$$ Imaginary data points
##PAGE= N=2
##DATA TABLE= (X++(I..I)), XYDATA
0 0 0 0 0 0 0 0 0 0 0 0 0 0 0 0 0 0 0 8 -8 8 -8 8 -8 15 -16 16 -18 24 -26 32 -34 41 -47 50 -58 66 -74 83 -93
39 -93 106 -115 130 -143 159 -176 194 -215 237 -262 288 -315 348 -385 424 -468 518 -575 638 -714
59 -714 802 -907 1035 -1194 1400 -1678 2072 -2682 3769 -6295 29568 -27317 -61951 24963
73 24963 60664 22618 -32983 -24064 16097 31195 5031 -14293 -17051 -4784 13648 19565 -17754
86 -17754 -39647 1926 39095 985 -48892 -27189 35628 31507 -35611 -54131 5187 42136
98 42136 282 -48702 -28590 14348 17005 -5699 -22972 -25456 -5143 21107 16514 -22312 -38299
111 -38299 4109 44877 15487 -42513 -31101 36990 44589 -19424 -42047 5383 40088 14741
123 14741 -24615 -18332 14663 23889 7898 -6864 -10765 429 23417 28132 -6971 -30336 6721
136 6721 46380 20584 -31192 -25526 29520 41506 -9279 -35883 94 34483 14202 -20118
148 -20118 -14346 10518 15821 6230 -6570 -13699 -2964 17606 18205 -13424 -32813 -1315 35205
161 35205 12849 -39437 -37033 20005 36048 -13043 -43614 -13716 22527 15164 -16219 -23898 -6033
174 -6033 7107 7790 -1977 -16090 -16285 5493 20086 -3369 -29740 -9203 24923 13948 -24572
187 -24572 -25436 16674 30294 -7310 -30216 -2141 28827 16362 -13964 -14878 4970 16321 14426
200 14426 325 -14679 -8687 16661 27095 -896 -29243 -8230 31183 25417 -18035 -28205
212 -28205 11354 32627 3810 -21532 -7630 17298 16131 -4409 -11211 -886 7771 9255 2191
225 2191 -10556 -11882 7011 20545 -820 -27350 -10645 24077 18619 -18856 -28046 6720 27182
238 27182 1590 -24609 -12335 12551 12292 -6602 -13571 -7016 2111 8146 1642 -13384 -15447 3959
252 3959 18720 495 -26044 -13702 20273 20342 -14799 -27633 3736 25676 5497 -19266 -13207
265 -13207 8578 14235 563 -9378 -7216 1192 10707 9097 -6153 -13773 1711 20479 8266
278 8266 -17376 -10752 17250 19550 -7218 -19027 5090 22965 5508 -15638 -8230 11868 14488
291 14488 -156 -8773 -5724 4087 13628 8320 -9680 -15482 3523 22452 8797 -20967 -17814
304 -17814 14167 23060 -4136 -23003 -4830 16277 8381 -10402 -11799 599 7103 1101 -5043
317 -5043 -6867 -4260 4459 6444 -6052 -14447 -1872 14599 4713 -18183 -14426 10698 17309 -5905
331 -5905 -21960 -4707 16412 8272 -10836 -12913 679 9819 5277 -3733 -8804 -4204 8346 11025
345 11025 -2702 -14005 -2989 16514 11666 -11903 -14151 8740 19153 779 -15494 -3999
357 -3999 14411 10844 -4402 -9002 603 9159 6721 -21 -5977 -4458 6984 12211 -465 -12743
371 -12743 -4358 13934 10946 -9633 -13741 5072 15285 1038 -14695 -6158 10338 8016 -5645
384 -5645 -10203 -2281 6434 5031 -2252 -9066 -6720 5819 10439 -2563 -15435 -7450 12409 11845
398 11845 -9987 -17741 152 14344 4210 -12566 -10410 4155 7940 193 -6997 -5121 1743
411 1743 4992 2529 -3889 -6711 2106 9152 1675 -9547 -5350 9802 9991 -6745 -12048 2579
425 2579 13899 4373 -11072 -7567 7446 10883 1496 -7270 -4930 3979 9463 4588 -6011 -8775
439 -8775 2671 11995 4330 -9837 -8941 7187 12402 -2544 -11534 -1926 9774 5816 -6430 -7090
453 -7090 2830 7105 2418 -4726 -4834 1639 5824 3516 -4742 -7773 1352 9687 2899 -9336 -8958
468 -8958 5879 10523 -2386 -11828 -3469 8849 6437 -5776 -8267 391 5907 2537 -4493 -6884
482 -6884 -1542 4708 3686 -5254 -9542 -919 8894 3762 -8386 -9601 4241 11419 273 -10271
496 -10271 -4653 7524 8307 -1648 -6752 -1326 5429 5637 -645 -4948 -1684 4467 6052 -126 -6292
511 -6292 -767 7908 5787 -4230 -6000 4420 9720 896 -7401 -2937 7307 7636 -2823 -7602
525 -7602 -1243 5607 5517 -1925 -7330 -2972 5455 7596 -1560 -9282 -3094 8177 7401 -4199 -9759
540 -9759 -394 8531 3127 -6287 -6425 1677 5324 -242 -5529 -4252 1229 3164 -965 -5491 -3471
555 -3471 2268 4413 -1543 -7684 -2707 6175 4808 -4919 -8868 2 7597 2728 -6699 -7266 1912
570 1912 7257 1431 -5278 -4297 2296 6606 2665 -4159 -3454 3534 7981 2554 -5084 -2464 5593 7257
586 7257 -737 -6576 -687 7274 4629 -3766 -5434 956 6675 2872 -3615 -4450 1034 6105 2673
601 2673 -4001 -4816 904 5470 1526 -6265 -4908 2725 4743 -1666 -7134 -2497 4418 3111 -3812
616 -3812 -6016 -201 5521 2343 -4140 -4943 812 5895 2713 -5020 -5946 918 6558 2514 -6653 -6347
632 -6347 2169 6712 1045 -6696 -4398 3681 5181 -145 -4670 -2286 3718 4170 -957 -3980 -1051
647 -1051 3947 2905 -2178 -3847 144 5039 2231 -4201 -3613 3165 6095 634 -5375 -2426 4842
662 4842 5879 -233 -5474 -2131 4900 5324 -1009 -5476 -2365 4638 4910 -2050 -5773 -1752 4794 3724
678 3724 -2914 -5072 -67 5104 2500 -4162 -3900 2051 4309 522 -4525 -2904 2746 3810 -492
693 -492 -4743 -2398 3384 3741 -1638 -5267 -1766 4551 3920 -2608 -4819 128 5054 2871 -3806 -4384
709 -4384 1014 4688 924 -4553 -3913 1963 4051 137 -4510 -3360 2754 4648 -685 -5244 -2361
724 -2361 4198 4709 -1675 -4993 -1263 4637 3733 -2345 -5172 -138 4514 3318 -2562 -4042 441 4428
740 4428 2031 -2642 -2498 1995 4269 529 -2946 -1993 3251 4163 -1241 -3774 -715 4031 3272 -2532
756 -2532 -4531 330 4703 2541 -3276 -4604 955 5106 1926 -4034 -4757 1396 5273 1301 -4378
771 -4378 -4374 1619 4599 113 -4217 -3071 1870 3717 -957 -4451 -1849 2340 2765 -1750 -4036 -327
787 -327 3291 1713 -2775 -3906 965 4066 924 -3628 -3254 2050 4285 75 -3816 -2462 2928 4698
803 4698 -394 -4467 -1903 3515 4166 -713 -4097 -589 3678 3611 -1545 -3836 206 4013 2247 -2148
819 -2148 -3225 1133 4350 1460 -3114 -3035 1493 4132 436 -3646 -2262 2122 3831 -429 -3935 -1665
835 -1665 2597 2891 -1142 -4001 -999 2841 2123 -2288 -3678 232 3357 829 -3171 -2988 1096 3696
851 3696 218 -3855 -2673 1986 3798 -491 -4589 -2040 2922 3834 -1326 -4564 -1625 3242 3559 -1228
867 -1228 -4214 -854 3468 2665 -1393 -3662 -458 3733 1635 -2120 -2622 856 3051 956 -2486 -1638
883 -1638 1517 3109 -243 -3126 -733 3024 2375 -1289 -3427 -306 3669 2507 -2191 -3469 378
898 378 4369 2195 -2639 -3141 829 4097 1654 -2982 -2771 1014 3444 780 -3169 -2288 1575 2927
914 2927 65 -3458 -1743 2319 2118 -1052 -3177 -409 2591 1809 -2003 -2965 266 3167 1018 -2826
930 -2826 -2628 773 3017 536 -3165 -2512 1236 3034 149 -3282 -1699 2198 2773 -640 -3308 -1042
946 -1042 2722 2291 -1453 -3020 -696 2982 1672 -2418 -2869 472 3232 1560 -2369 -2510 1450 3860
962 3860 1227 -2587 -2110 1862 3408 597 -2361 -1488 2254 2632 -450 -2197 -611 2195 2066 -935
978 -935 -1909 145 2658 1432 -1848 -1902 1197 2730 356 -2858 -1976 1759 2705 -725 -3751 -2034 2127
995 2127 2437 -1090 -3718 -1898 2166 2514 -1254 -3091 -1616 2429 2280 -1634 -2950 -541 2187 1289
1011 1289 -1999 -2341 373 2057 404 -2085 -1583 1452 2066 -143 -2175 -868 2146 2390 -620 -2318
1027 -2318 -459 2733 2293 -1303 -2793 -253 3083 1652 -2137 -2514 881 2883 1321 -2120 -2061 1422
1043 1422 2998 811 -1893 -1683 1658 2761 390 -1986 -1337 1894 2298 -643 -2711 -648 1839 1762
1059 1762 -1621 -2598 -26 2147 1342 -1684 -2357 226 2131 576 -1968 -2097 851 1939 -139 -2271
1075 -2271 -1562 959 1839 -913 -2586 -948 1820 1836 -1383 -2320 419 2473 1455 -1570 -2278 888
1091 888 2917 1417 -1799 -2303 883 2954 1270 -2142 -2451 962 2886 319 -2048 -1484 1288 2417
1107 2417 -303 -2010 -469 1455 1340 -857 -1629 -31 1078 951 -1371 -1769 434 1940 342 -2259
1123 -2259 -1679 1113 2768 -231 -2394 -1360 1775 2370 -369 -2525 -880 1529 1949 -391 -2181 -753
1139 -753 1390 1834 -736 -2262 -476 1755 1231 -1068 -2026 230 2036 774 -1329 -1399 815 2023
1155 2023 -339 -1906 -933 1187 1602 -574 -2098 -694 1372 1964 -714 -2050 -146 1813 1659 -939
1171 -939 -1919 403 2249 903 -1535 -1761 728 1942 33 -1934 -1192 1255 1817 -241 -2157 -865
1187 -865 1273 2070 -25 -2108 -673 1700 1678 -528 -2617 -459 2060 1137 -929 -2144 -73 1703
1203 1703 735 -1123 -1190 456 1355 403 -1261 -679 983 1514 -20 -1630 -455 1616 1275 -744 -1927
1220 -1927 -431 1801 997 -1582 -1981 265 1934 704 -1582 -1903 346 1860 470 -1626 -1376 244
1236 244 1852 410 -1449 -1364 504 1451 -54 -1792 -881 1160 1092 -491 -1491 -109 1537 828 -916
1253 -916 -1038 708 1558 581 -1140 -1070 763 1795 437 -1523 -1222 1047 1864 -35 -2004 -757 1390
1270 1390 1535 -193 -1726 -563 1801 978 -593 -1281 -279 1499 980 -1014 -1413 -323 1245 568
1286 568 -1476 -1364 365 1737 247 -1709 -1204 748 1020 -13 -1587 -897 873 962 -382 -1429 -460
1303 -460 909 968 -673 -1347 -113 1256 703 -1136 -702 674 1437 485 -1438 -1231 1236 1509 -207
1320 -207 -1576 -636 1482 1204 -241 -1571 -628 1372 1645 -360 -1531 -572 1481 1486 -499 -1328 -340 1434
1338 1434 849 -786 -976 407 1097 366 -702 -646 749 806 -47 -871 -359 1359 886 -462 -1267 -136
1356 -136 1107 909 -826 -1426 -453 1568 703 -1027 -1253 7 1528 771 -1069 -1000 370 1260 227
1373 227 -1076 -964 490 1076 -99 -1048 -739 708 1015 -485 -1049 -289 1099 1165 -674 -1214 283 1061
1391 1061 695 -1010 -1003 470 1093 231 -896 -692 537 947 263 -1168 -572 1082 1253 -101 -1142 -112
1409 -112 1383 887 -311 -1081 -245 1290 741 -934 -1306 447 1424 448 -1195 -1159 204 1461 505 -1039
1427 -1039 -1213 868 1295 265 -1138 -789 774 976 -51 -1123 -296 627 690 -382 -1265 6 957
1444 957 435 -675 -794 381 1148 223 -938 -984 633 1297 -324 -1177 -753 812 1353 -343 -1410 -767
1462 -767 1028 1343 -169 -1438 -605 1007 978 -227 -1244 -130 1005 672 -250 -962 137 962 226
1479 226 -562 -632 635 1011 -76 -866 -373 723 1030 -319 -1202 89 1225 1034 -497 -1216 -154 1143
1497 1143 651 -805 -1152 251 982 448 -901 -969 147 1071 -156 -1046 -729 193 1063 233 -767 -628
1515 -628 465 1234 -250 -1075 -476 916 786 -354 -1009 -254 747 741 -402 -788 74 1207 404 -580
1533 -580 -554 176 1185 150 -686 -363 373 662 55 -695 -244 802 639 -261 -1054 -82 967 367 -536
1552 -536 -1125 172 1009 550 -485 -1025 43 1179 571 -1069 -927 132 1209 376 -856 -619 267
1569 267 1028 278 -969 -377 374 653 -260 -634 -197 690 144 -530 -904 -13 520 35 -718 -689 283 1161
1589 1161 -24 -973 -541 515 899 224 -1058 -421 868 1137 40 -1093 -390 906 745 -83 -592
1606 -592 -406 1102 581 -493 -740 264 1021 323 -459 -600 518 703 384 -662 -555 584 681 -268
1624 -268 -1090 -340 668 616 -462 -1038 -249 747 376 -499 -710 2 562 492 -476 -724 176 1060 194 -773
1644 -773 -519 558 711 -55 -1066 -719 525 758 -88 -761 -81 952 704 -176 -923 -118 656 913 -114
1663 -114 -913 -108 613 356 -720 -531 329 738 403 -428 -396 637 692 -109 -245 74 485 502 -124 -553
1683 -553 -86 548 617 -329 -812 -29 873 378 -639 -883 -85 858 485 -433 -915 184 876 82 -539 -741
1703 -741 25 665 162 -306 -348 124 729 -217 -820 -437 642 609 -475 -566 325 945 306 -472 -526 601
1723 601 552 220 -635 -357 200 476 -64 -755 -642 314 640 -218 -779 -573 696 683 -504 -697 -52 592
1743 592 682 -574 -328 105 439 315 -660 -476 139 484 340 -437 -625 471 776 347 -815 -282 320
1762 320 846 -405 -773 122 718 199 -249 -365 62 364 219 3 -496 7 162 487 -363 -609 96 747
1782 747 -9 -770 -538 697 656 -70 -851 -441 873 644 -314 -588 -153 210 622 -128 -586 -276 297 265
1802 265 -219 -1022 50 518 161 -308 -440 496 618 -295 -778 -114 514 126 -450 -522 -149 397 410 172
1822 172 -444 -241 468 623 -265 -756 66 877 446 -588 -850 296 728 -173 -380 -363 281 418 -192 -215
1842 -215 -85 261 252 27 -486 -438 212 626 -127 -839 -101 725 124 -179 -743 191 872 -65 -536 -278 217
1863 217 489 2 -351 -107 183 279 -112 -264 -310 16 522 79 -878 -228 693 787 -606 -808 503 855
1883 855 163 -413 -347 404 434 123 106 -245 10 669 621 -279 -528 88 749 87 -630 -288 459 445 -247 -559
1905 -559 58 495 -58 -734 -109 7 311 -166 -426 -274 79 353 327 -296 -581 171 906 160 -728 -656 762
1926 762 767 -320 -807 -146 1118 144 -442 -179 -184 202 163 81 -298 -369 163 438 -64 -669 50 346 315 -828
1948 -828 -523 481 377 -436 -698 -101 750 3 -457 -123 70 292 33 -168 158 -196 592 658 64 -681
1968 -681 -225 644 543 -945 -824 620 906 67 -890 63 578 119 -273 -278 10 104 30 211 -84 -469 313
1989 313 773 -74 -740 -9 658 692 -554 -721 765 598 -254 -648 -102 633 212 -357 -190 125 -172 -200
2009 -200 19 -292 -493 -129 685 223 -820 -284 626 568 -486 -914 364 668 280 -613 -281 414 98
2028 98 -263 24 -120 -44 234 657 157 -537 -75 708 353 -396 -80 588 674 -238 -837 360 649 -122 -349
2049 -349 -91 596 131 -257 -251 -19 328 117 139 -108 -756 -27 995 -47 -542 -493 662 896 -437 -887
2069 -887 174 677 177 -448 -277 442 51 -103 -276 -50 -298 53 402 51 -841 -171 316 358 -601 -921
2089 -921 478 566 -374 -860 174 378 261 -515 -149 378 -99 -60 44 277 -259 96 402 171 -640 113
2109 113 716 585 -727 -427 617 897 -363 -876 229 750 332 -404 -6 288 223 13 274 -251 -429
2128 -429 -296 361 392 -613 -421 489 199 -593 -718 247 806 -290 -698 95 664 -269 -205 -103 87 230
2148 230 37 137 35 -303 201 577 282 -862 -520 709 479 -617 -766 375 804 3 -626 -30 643
2167 643 143 -344 181 36 76 -239 77 68 -311 -378 369 298 -582 -306 620 454 -399 -576 408 600 -194 -552
2189 -552 137 393 156 -340 58 214 -69 -17 257 41 -374 62 514 375 -740 -789 194 690 -302 -780
2209 -780 274 404 34 -341 -212 304 222 -83 139 89 72 115 128 107 -657 -88 438 262 -618 -514 407 497
2231 497 -204 -456 168 362 -225 -447 275 541 -52 -232 64 178 -288 -166 574 63 -455 -169 802 307
2251 307 -600 -647 525 599 -83 -691 -98 666 -142 -159 -243 451 79 -69 143 74 -235 -23 115 199 -458 -355
2273 -355 519 604 -420 -367 383 510 -233 -656 346 473 -153 -508 34 315 360 -99 21 -8 -30 101 385
2294 385 137 -337 -335 468 488 -194 -662 59 429 -30 -542 -150 448 204 -302 116 79 -186 -82 108 -116
2315 -116 -293 -204 75 190 -73 -289 669 716 -293 -409 95 558 284 -751 -235 541 27 -179 8 48
2335 48 -31 -183 -99 185 -229 -33 409 202 -255 -524 158 187 -191 -343 300 560 -18 -256 -137 507 120
2356 120 95 -139 -26 -20 79 467 155 -353 -112 677 344 -441 -389 303 367 -299 -328 105 277 -5 -483 43
2378 43 287 95 -289 -180 -37 -202 79 -132 -17 -272 -225 421 242 -441 -420 66 502 -275 -422 -215 557
2399 557 343 -266 -285 458 42 -61 97 -205 -93 144 0 -44 -125 -323 296 197 -311 -540 122 529 -23
2420 -23 -377 -48 402 225 -293 -213 256 275 -18 -70 -1 -98 -1 269 51 -341 -46 282 180 -280 -611 131
2442 131 459 118 -321 -196 380 430 -542 -153 201 -3 216 95 52 -169 322 179 236 -331 -260 3 227
2463 227 -416 -388 177 452 -125 -239 -119 284 261 -87 -178 179 -233 2 -84 -140 107 -65 422 3 -479 -451
2485 -451 484 336 -321 -449 313 275 165 -62 -331 378 -16 -32 35 228 230 43 143 57 -162 3 177 344
2507 344 -225 -282 377 310 -164 -359 -89 150 -32 -253 -19 196 178 -203 -169 -104 102 172 -118 -373 -298 -190
2529 -190 15 222 -550 -170 57 108 -115 -704 -187 422 -90 -22 -505 19 -2 -83 -101 99 -55 419 175 -219
2551 -219 -95 -91 -87 208 -423 -239 331 -36 -121 -172 188 347 -310 -395 -134 -38 148 -186 -148 27 327 -173 -74
2574 -74 120 214 78 277 62 -136 -52 378 269 -219 -596 -207 380 283 -524 -253 -1 134 125 58 -61 -84 13
2597 13 189 -16 -39 -293 182 35 -135 -197 22 273 171 -270 -56 163 8 -168 -42 -85 82 42 -544 -59
2619 -59 -122 281 253 -129 -347 -230 -80 140 -149 59 -71 194 391 -455 -169 137 103 -194 -89 248 -172
2640 -172 -63 203 -35 -245 26 -11 -15 -264 -146 -12 239 -298 -102 79 210 165 -453 99 108 50 -140 -75 188
2663 188 142 0 34 19 -312 301 222 130 63 -233 -43 330 -194 -249 28 223 191 -68 -73 103 133 98 -46 -138
2687 -138 4 -405 39 -119 69 495 212 -140 -288 -102 -38 220 -384 -91 -9 216 84 -65 -145 442 131
2708 131 -139 132 -94 220 132 232 -188 -394 131 541 45 -162 97 253 58 -330 -10 -119 1 224
2728 224 -110 28 96 109 36 55 -174 113 -27 -76 58 -168 144 211 206 -56 -24 89 176 -132 80 64 107 441
2752 441 -46 -137 76 123 59 -222 -212 5 191 70 -16 -120 -102 125 34 -38 -291 21 87 14 -257 -53 75
2775 75 9 -220 -2 82 -81 50 -205 -35 -48 44 -16 186 -46 236 140 197 -183 -187 121 262 -64 -200 -76
2798 -76 147 125 -19 -23 -124 209 270 -72 148 210 263 119 -25 -188 171 210 33 -273 22 323 178 -184 -107
2821 -107 -207 57 210 31 31 -236 125 26 88 -308 -247 -127 223 -97 -317 -39 123 -151 -127 -239 53 -45
2843 -45 189 -141 -174 12 291 146 -189 198 -26 319 -35 -413 -195 -100 86 -235 -314 -276 -59 273 40 -171
2865 -171 -116 -115 181 -15 -239 10 85 -48 20 190 79 -41 -256 -92 -3 -69 86 300 -351 224 113 133 181
2888 181 94 167 82 -35 46 -196 -92 126 -195 -22 -222 38 -47 153 -122 -38 95 -177 32 -116 -97 7
2910 7 234 153 -160 225 -18 79 124 132 -174 101 274 -16 35 -304 2 166 -168 -164 128 183 352 378 -117 -122 109
2935 109 -206 11 -28 141 -79 -217 72 90 -52 -38 -64 -135 6 91 97 99 -339 32 132 13 -135 -161 -24 306
2959 306 -80 -225 -235 -51 20 35 -213 -14 11 100 -75 153 -310 -136 -15 -84 -10 -179 -19 211 -78 35
2981 35 154 273 232 -18 -196 237 309 50 17 144 72 113 -57 -369 -78 103 180 -239 -106 13 265 -127
3003 -127 -93 -270 -130 187 58 -260 -56 -95 30 53 14 138 128 114 -42 -43 -38 -129 272 229 -106 128 239 -103
3027 -103 73 18 12 -49 -4 -38 -92 -110 217 88 -273 -35 108 165 -140 165 -232 213 26 11 141 -140 111
3050 111 115 -4 -175 -163 116 217 29 -182 113 102 181 45 -146 -188 53 -6 -31 -1 84 226 -25 -196 -131 62
3074 62 9 -67 -79 15 88 29 -72 -47 356 20 -122 40 -18 112 142 232 -210 -226 34 175 81 45 80 -45 105
3099 105 73 -296 130 -17 -107 -78 -81 111 -50 -73 -95 51 75 160 404 -135 57 -125 146 -85 -2 -65 55 304
3123 304 49 -249 -235 -41 147 81 8 -12 -254 -99 108 -92 65 -141 11 227 -203 -158 39 -88 129 -117
3145 -117 191 108 -48 190 -17 -50 302 -292 -127 -220 227 214 11 35 -214 92 91 40 13 207 131 38 -122 77
3169 77 14 6 -152 -75 -136 -114 -35 -183 60 62 353 -63 12 -75 -12 57 78 -244 -190 32 315 297 -23 -267 19 127
3195 127 32 -25 442 -40 -106 133 -18 -113 -5 57 27 -129 156 208 7 -277 -37 56 126 74 37 -97 -143 21
3219 21 151 160 -205 142 120 23 -80 38 -37 174 -36 -289 -52 214 319 -161 41 -186 55 5 -253 -27
3241 -27 69 171 7 196 -92 176 -53 -92 118 -114 -12 155 -115 -73 -31 23 238 -34 -150 -144 185 64 252
3264 252 -68 -55 9 -284 126 -77 34 -67 -121 -196 142 -211 -33 -148 109 -257 58 -63 133 66 -47 -86
3286 -86 260 204 -67 285 -101 46 219 -145 -46 312 -57 -127 -115 215 -1 2 95 48 -94 -62 232 -280 30
3309 30 105 120 -64 90 20 198 -291 -77 -179 -46 -156 14 168 143 42 166 14 151 -314 82 -138 -162
3331 -162 -139 -167 121 89 93 -259 -64 -314 -79 144 22 10 -20 143 -83 205 -176 131 209 20 -21 86 52
3354 52 165 -179 -67 -39 21 111 -50 -187 130 7 161 -6 -193 -265 -120 -51 -223 18 -13 25 126 9 -46
3377 -46 -86 160 161 -233 -5 318 200 -58 -137 33 -62 120 12 2 -302 100 -15 -89 10 137 -70 -135 -144 -45
3401 -45 138 -15 -153 65 358 -11 -64 10 -26 255 130 -22 -345 49 5 -16 -142 120 23 -30 169 225 79
3424 79 -256 -51 404 -63 221 53 96 -47 -59 -79 -31 -103 172 -165 -27 40 110 -15 -8 176 -109 -74 77 -5
3448 -5 -253 16 -68 110 -225 -94 93 147 -146 106 -311 -44 22 -110 -243 -162 93 238 83 -129 109 -3
3470 -3 94 93 -163 -74 -28 43 -121 159 -76 -45 -90 -42 -6 -98 16 -93 11 -81 -150 131 114 -30 222 -30 63 -14
3496 -14 -226 186 235 -34 99 -61 199 387 171 -76 120 -144 282 -52 3 -126 217 110 73 63 -223 241
3518 241 -43 30 67 -142 85 117 -82 -6 -69 116 20 -120 -80 -119 -49 150 -82 73 78 -36 -240 19 -160 60
3542 60 -16 -13 -388 -68 -43 -108 231 14 -18 31 68 -237 -99 244 154 -106 -136 -178 309 37 192 49 -88 -56
3566 -56 103 -7 -57 56 171 133 94 -206 228 293 91 51 -164 61 -185 -30 17 245 -99 156 -10 5 -111
3589 -111 196 -46 -131 120 242 50 -148 -5 -34 -428 -126 81 43 -345 -5 -16 182 -222 36 -220 -62
3610 -62 241 292 -57 -17 72 -33 -181 -50 123 51 -111 166 -21 115 -81 -107 12 -98 241 44 102 -34
3632 -34 -109 -57 185 28 -120 15 179 -59 71 40 -205 65 299 -26 -22 -17 -27 11 16 36 -76 92 143 100 73
3657 73 -58 262 -238 157 -76 95 4 264 183 -110 -100 23 30 72 63 -48 15 -103 -171 -252 -107 -109 148 -98 -69
3682 -69 -58 -365 -121 155 133 52 89 309 261 -289 202 39 -9 -377 104 256 -109 -15 32 -172 -61 -89 -74 150
3706 150 126 197 141 121 -113 -144 -95 -73 -169 -73 -247 33 87 -4 -186 110 -232 -18 -106 59 188 -266 -204 -170 49
3731 49 51 391 -236 6 68 104 63 -98 68 81 -129 -208 158 103 -149 51 -136 165 137 225 -16 -176 -140 42
3755 42 105 220 10 12 149 -42 115 68 -34 13 -71 60 1 -91 -11 -34 75 -215 -197 22 109 97 127 -157 97
3780 97 -175 -112 229 -137 34 119 131 168 53 27 135 42 -15 -35 127 27 -167 -35 -167 162 -100 -15 48 47
3804 47 -125 132 258 72 -243 88 -112 -159 85 66 114 -78 -12 72 -48 52 -108 151 -115 139 -44 -136
3826 -136 108 107 -150 182 109 219 -101 189 -151 13 115 -123 -310 -41 13 -105 37 54 -11 -75 16 -166 88
3849 88 -91 151 -69 64 -182 -2 223 -335 -109 -200 -133 -175 133 21 172 103 -162 90 -69 242 201 104
3871 104 -189 92 31 -60 -61 -52 -109 61 -1 70 -9 147 -116 127 85 -122 -18 -141 101 167 147 -22 -63 -89 157
3896 157 -66 -239 -54 -90 24 -124 -45 91 200 -13 52 190 15 87 67 -58 -154 -6 -8 97 50 -7 -160
3919 -160 24 64 -54 -121 -212 137 -62 34 -49 -91 -76 -38 -187 -171 -68 149 -159 -41 193 44 -168 170 127
3942 127 123 -59 -181 75 -300 65 -172 5 8 -137 105 -49 50 -177 -29 -82 188 -192 -14 -1 -62 -9 265
3965 265 131 70 32 -208 -74 144 41 -139 -4 -250 83 158 -12 1 15 -11 167 -24 -145 -161 158 161 131
3988 131 37 -142 199 -47 154 355 158 119 -247 37 -97 109 -5 -174 145 22 134 42 -19 37 22 -36
4010 -36 -120 -46 -247 111 55 -12 -75 20 -196 -286 -227 -65 130 -3 -83 -58 -28 -114 204 -194 -47 133 -77 -174 102
4035 102 44 -15 64 237 -44 145 -98 90 -63 14 -146 -150 -137 -115 33 283 49 -5 -7 -28 256 -24 121 284
4059 284 78 79 164 92 164 20 -128 -25 42 -22 -53 -72 -187 58 -85 41 178 59 -241 -2 37 -35 -32 236
4083 236 -55 -85 -312 52 298 8 -137 -23 -10 -86 -80 12 30 -180 -67 245 -79 247 -110 -55 54 -251 139
4106 139 -121 310 -66 -8 125 73 -188 77 -97 -140 38 25 53 125 309 27 -94 120 -207 161 229 6
4128 6 -147 133 184 -40 -111 -170 27 -162 176 -2 -104 324 -105 117 -1 -17 0 -282 -162 -66 49 -48 52
4151 52 17 -202 80 -3 140 -27 -122 -121 41 60 243 -182 -62 -99 51 188 226 -233 -95 216 255 103 -105
4174 -105 -23 -27 23 -110 133 135 -279 -24 -136 73 61 9 -186 65 246 5 -64 16 165 218 179 -140 107 73
4198 73 97 157 -212 -69 117 100 149 -73 46 26 78 -23 197 134 -280 -127 145 -188 78 97 42 111 -83 -27
4222 -27 11 -178 -60 -27 -177 307 178 72 -146 89 71 32 -40 -70 51 50 135 302 42 287 146 -21 142
4245 142 152 -238 -181 46 -284 -26 52 -96 -89 -118 68 69 421 189 108 171 -228 182 184 101 -3 -81 -78 -183 -140 -32
4271 -32 113 -84 76 359 282 -177 -192 104 45 139 147 38 74 71 -227 -105 -19 4 -8 -60 176 57 -300 82 -239
4296 -239 57 -287 -149 -4 -44 -123 -70 187 -207 -184 -12 -67 -140 -53 148 -196 -230 127 -61 -136 -2 15 266
4319 266 -98 -71 136 -60 -70 138 -2 -4 -207 28 -49 -121 -112 258 55 -97 -55 -20 -261 -71 33 9 168 -42
4343 -42 112 135 19 75 42 -265 309 -20 71 -3 -118 76 66 124 -216 57 143 -133 137 81 -7 -60 -100 -265
4367 -265 304 -86 -26 -64 -100 236 198 186 -131 -12 43 -276 -142 206 130 200 -41 109 -157 23 173 91 55
4390 55 149 219 -38 -177 -326 51 78 28 50 39 -185 -60 92 65 101 33 127 -114 -118 7 99 24 120 -53 45 42
4416 42 -117 43 -32 33 -261 -107 -116 -263 -61 -159 -42 -76 21 -205 -116 -17 -55 19 -22 25 96 -183 -51 -192 -111
4441 -111 -109 18 -140 23 -22 94 -96 -69 170 -67 55 167 -6 363 68 -31 199 136 -211 23 -128 6
4463 6 41 -110 148 -27 289 -49 -321 -126 186 23 -28 114 50 -4 -47 63 -209 -204 -111 -38 -105 -22 192 74
4487 74 173 -15 89 -7 -228 84 -42 3 31 140 -58 46 -109 75 197 30 -59 -195 234 -118 13 -75
4509 -75 -36 -64 4 -142 0 -118 -154 80 31 -108 -161 9 204 55 -264 74 9 207 85 183 -30 20 263
4532 263 152 70 -63 2 -163 11 6 -25 64 114 -200 129 -221 159 -44 128 144 -10 14 185 43 -72 176
4555 176 -25 -8 -80 17 143 -17 -223 -187 175 -48 13 -99 -76 162 112 -35 78 79 -88 64 92 -46 6 -38
4579 -38 -1 251 56 69 97 -110 -12 -105 153 102 -122 -27 203 -26 170 -40 -69 -109 -174 -54 149 -23 -77 4
4603 4 -33 -199 57 -140 -137 -63 178 -127 -167 104 -159 -247 -117 -87 149 115 286 124 -14 -275 249 -79 23
4626 23 -149 -83 -12 -242 2 139 -93 -115 201 -151 194 68 34 -72 -50 106 72 -49 -108 -74 21 -32 -252 21
4650 21 -10 -72 207 -221 6 115 62 114 67 6 -111 -209 189 -245 -49 298 76 -249 -108 -39 44 -87 176
4673 176 -84 84 -42 -85 -335 149 -70 -73 -190 175 -221 127 78 39 -172 -105 36 150 -53 -31 -227 -21
4695 -21 18 79 -106 -10 -29 -141 -203 -116 51 -32 59 75 158 -61 219 -77 84 -269 -127 -277 119 -150 -101 29
4719 29 -186 141 -47 144 53 -21 -12 -132 166 124 -207 155 -63 -87 -88 -46 -76 -60 -155 -9 -66 -103 -18 0 115 -11
4745 -11 25 46 140 59 -77 67 8 -167 66 31 74 37 84 -175 -43 32 -147 210 -494 -90 -74 94 158 -309
4769 -309 -99 6 -122 -101 -101 -58 -10 43 -30 -73 -59 -108 105 24 120 16 194 76 -41 -97 163 -34 42 -21 -10
4794 -10 -20 -95 152 155 82 125 -5 -82 39 124 -79 -5 -6 -122 -35 -158 140 -162 132 10 -298 -95 -86 -42 -116 -117
4820 -117 15 -13 187 56 143 -57 -32 117 92 116 -103 262 -124 -19 -130 105 50 -272 -73 -150 55 -31 -112
4843 -112 -26 -67 101 86 90 -11 -124 19 -116 -87 19 -70 71 10 53 214 -85 235 171 -26 99 -190 -137 -70
4867 -70 -195 -113 116 -48 -64 -58 -15 -244 -237 171 -117 252 -147 -16 47 11 78 118 -77 -10 -5 -195 -5 188 -56
4892 -56 317 148 23 -19 26 -15 -50 84 -25 13 -96 -223 115 27 -112 -98 -66 101 182 112 187 182 -20 -64 166
4917 166 184 -124 39 29 -91 30 -23 -150 104 26 4 -76 45 113 -159 251 42 -27 419 -112 34 9 -75
4940 -75 -98 81 -29 -89 299 202 -111 -1 166 -27 34 -68 79 83 -184 -309 -23 141 0 -45 -108 95 100 -151
4964 -151 12 28 22 -36 -50 53 -137 112 -66 -143 103 296 -128 97 -43 5 10 70 -152 -34 -305 -207 0 -169
4988 -169 75 -81 -81 -63 118 -94 -83 85 -83 -27 30 -74 160 -88 -39 53 175 -427 60 -59 -13 132 109
5011 109 120 86 -4 140 -97 -105 78 -34 -110 -85 -88 -39 23 -117 -182 -144 -26 32 -98 -19 154 -9 -101 -281 114
5036 114 64 -18 64 -225 -78 -98 225 57 47 81 -61 -5 65 -131 -58 -83 -219 134 -15 -232 -1 61 -219 42
5060 42 81 -282 -32 -25 162 220 283 55 78 145 92 -147 -54 113 -134 164 -171 -227 49 67 -11 0 -128 108 277
5085 277 -91 -46 -95 7 -113 -105 -96 -232 222 -6 -57 -144 275 -141 -139 -62 -11 63 163 -176 115 -122 -225 51
5109 51 -75 7 -275 192 -168 -154 59 -83 -153 71 18 -163 42 24 -80 90 -273 333 158 -116 -29 -4 -21
5132 -21 -32 36 -182 -146 336 157 -237 -1 37 100 -44 153 -91 183 55 -57 -142 20 -105 -46 182 -85 -88
5155 -88 -78 78 -76 37 -202 -251 27 3 -25 -88 -131 -130 -22 14 -165 -149 118 46 -166 -17 -78 -78 103 -239 11
5180 11 33 20 -170 85 151 256 -77 180 -69 -170 63 -190 -73 -41 -84 -73 39 -170 -183 -105 -90 29 -152
5203 -152 6 -86 -295 68 -51 -130 35 5 -180 -56 -62 90 12 147 104 -158 -83 137 -32 -6 169 29 162
5226 162 -54 -119 -78 -28 165 -147 92 -17 -56 -189 -6 -96 37 -128 -214 -53 -51 -33 -176 118 51 30 154 -95
5250 -95 -58 173 -231 -321 -29 167 165 -23 -7 5 129 283 -187 179 -395 -25 -203 -114 247 9 -218 132 -98
5273 -98 -83 -227 94 212 275 -253 230 86 -232 272 -164 -119 17 218 4 128 -101 -14 -121 -137 197 -134
5295 -134 -155 -165 44 58 -108 -171 294 -115 19 31 27 176 32 261 -108 190 115 295 79 -44 149 272 28
5318 28 99 -180 152 169 -172 134 -266 -60 69 -221 42 -92 -75 91 -142 -106 154 -173 -102 386 16 -2
5340 -2 50 -123 -102 -152 -127 124 70 29 -96 -31 106 -77 -32 97 -11 35 -94 72 -10 56 36 5 -224 43 78
5365 78 -212 143 -44 62 -23 -190 160 52 -2 -186 -49 -63 158 -2 83 -67 -200 72 -133 24 125 -35
5387 -35 -58 39 14 108 -180 -166 -223 38 -146 23 -162 111 -57 -220 -147 7 -148 -169 31 -35 3 -192 29 -112
5411 -112 307 97 32 -188 211 -117 65 3 23 32 201 33 -72 -39 221 8 66 154 25 130 -163 150 11
5434 11 106 117 -182 -5 127 49 16 149 102 -32 9 -250 262 101 -79 -15 -149 115 152 145 -27 -152 95 45
5458 45 -38 213 167 39 312 -158 -88 -38 -23 297 143 206 -138 133 -134 -13 104 107 -56 -135 270 62 46 40
5482 40 -120 -8 229 199 -71 61 12 -11 -149 -79 -129 37 -140 -53 36 -3 -136 -122 210 -207 -87 4 -163 -181
5506 -181 109 -187 111 -41 123 111 45 -154 -86 238 -322 152 -48 15 -177 -17 81 -55 -110 104 -162 -112
5528 -112 121 66 65 -99 -162 102 -31 -237 41 334 -180 49 -20 -8 409 10 -77 65 279 -109 161 56
5550 56 76 -24 -119 190 -270 239 30 -77 -259 22 36 82 91 -248 22 -179 143 93 -214 -15 -141 -3 311
5573 311 -224 25 461 48 -37 -366 37 60 -90 185 9 -139 16 -135 -44 47 -241 30 -61 -123 -4 -123
5595 -123 -25 -29 -10 43 15 50 -255 -127 -66 -15 63 130 -32 60 133 25 4 -73 141 152 -106 55 67 -70 -166 -228
5621 -228 -58 43 -111 155 -222 60 -27 -89 -11 71 159 -35 -106 -84 112 306 199 -186 -89 -162 2 130 -218
5644 -218 114 -84 -264 116 -195 -138 64 -219 -121 -30 -171 -72 130 -95 244 75 -188 -58 -96 242 209 187
5666 187 -15 117 -23 -1 111 -39 -5 -68 85 12 -68 -31 62 44 -9 -106 152 -93 63 -182 15 -22 25 125
5690 125 23 210 77 -6 27 -212 -26 52 57 189 -211 240 -47 -129 131 -54 70 9 174 138 -57 224 55
5713 55 18 119 94 210 -137 -148 33 125 -68 137 -112 51 -8 -249 34 328 -64 -191 5 22 -14 -110 -436
5736 -436 -163 277 51 229 -168 -76 -7 -60 -244 18 39 -233 -390 30 -177 -5 67 123 -98 -30 45 -72 -286
5759 -286 9 -64 -16 96 -17 -8 -189 -49 145 135 201 96 5 -258 -72 327 230 -192 107 -82 -54 6 -167
5782 -167 -136 105 92 48 7 -53 59 40 198 -1 -180 -148 128 176 159 -60 -104 -98 -47 132 -167 -26 46 65 -26
5807 -26 -185 -49 -21 -23 -332 -26 164 -81 -158 -172 156 -41 66 -13 170 -169 -53 -98 201 -59 39 85 113 -27
5831 -27 -153 144 -75 11 212 -63 -4 -23 51 -19 177 -19 21 -34 -79 -116 -88 87 -205 239 54 -43 246 -68
5855 -68 60 38 24 33 -2 20 -50 -28 145 -27 -144 329 -50 206 -378 103 19 -122 -219 -74 -226 239 -24 126
5879 126 50 33 121 -80 318 -106 187 112 229 -126 -142 36 102 -212 15 -216 -46 61 272 109 -32 -91
5901 -91 96 -69 -145 197 105 61 171 -241 109 13 -82 81 -133 140 117 -92 63 84 126 -39 51 -131 -326
5924 -326 174 257 145 202 113 0 180 -149 43 -127 66 4 -91 10 -254 16 10 10 -161 -61 75 -36 -59
5947 -59 32 173 -2 55 18 83 34 -36 -168 12 -365 140 59 -196 -138 -117 -227 -67 -151 35 17 -96 189 -59
5971 -59 69 65 -114 1 85 202 -32 78 -179 50 -96 118 -171 -33 27 -247 -144 68 -15 -50 -137 -31 -7
5994 -7 68 108 72 -52 140 -102 -120 111 -159 7 256 23 195 163 177 76 -232 -60 -426 202 -142 445 38
6017 38 -70 45 1 -33 8 19 -188 -8 139 11 80 -41 135 -226 -83 -332 137 125 -146 -116 -53 -115 -175 44
6041 44 126 -130 121 -53 -56 13 -5 4 238 -43 -137 143 175 -160 -102 103 20 -54 81 68 83 68 -27 54 -193 -138
6067 -138 -90 18 48 39 161 -122 36 -14 4 -29 199 7 41 182 239 82 -19 -55 -136 -72 -48 -119 282 -171 165
6092 165 -43 -177 57 -133 -25 -57 -103 26 53 98 -42 -175 38 56 -17 314 -95 -103 17 1 -18 105 -63
6115 -63 -98 -53 383 147 190 350 19 -89 -185 -48 -33 -39 22 -68 -171 253 92 27 113 -150 -35 -2 -189 -222 -31
6140 -31 -99 35 166 -127 140 -240 119 -47 15 -96 -33 274 53 94 21 80 92 53 201 95 -211 109 150
6163 150 89 222 86 73 253 53 -145 221 -299 49 -147 63 -124 84 -31 53 99 137 10 -346 -57 231
6185 231 -203 -47 -211 -46 -126 20 119 160 -144 132 -48 127 96 -55 163 -91 190 194 125 64 158 -87 193
6208 193 153 469 -112 146 -254 -23 -13 -210 180 -88 47 -50 66 -99 148 -1 -77 214 54 -214 97
6229 97 -40 -66 264 68 7 -15 -100 -45 101 193 -139 228 174 33 -48 307 -143 161 -112 -234 223 210 188 6
6253 6 -99 -85 -195 -65 194 -92 125 11 -33 -85 -47 124 -285 45 -260 -47 23 -188 -107 251 156 113 154 100
6277 100 145 -67 73 50 -39 -139 -97 244 164 -94 25 -69 28 219 73 -229 165 13 64 67 -249 23 -117
6300 -117 53 203 -144 -6 -113 -71 -113 -51 297 -55 -203 65 90 30 -16 -3 -234 96 -217 107 -130 159
6322 159 112 -53 128 -231 -167 -252 56 292 142 34 302 -39 27 156 -74 -103 10 -103 -19 -21 -116 37 -121
6345 -121 -124 277 -129 54 221 116 -140 116 1 -116 209 -93 -88 105 -260 -58 102 272 -184 253 -124
6366 -124 38 -158 200 -170 -25 83 212 -34 -169 23 51 2 15 -96 -5 -55 86 191 -3 288 -292 -4
6388 -4 -177 0 -86 -127 85 -89 -343 39 -169 322 168 -174 -39 114 220 -91 -136 -78 18 -120 -15 106
6410 106 1 127 -143 -32 21 -81 9 76 57 246 -127 -330 -35 23 -109 -93 160 350 -90 425 -170 46
6432 46 414 102 -316 146 -80 53 -43 -200 260 -8 -84 -202 -216 78 207 -14 -94 90 179 214 -87 103
6454 103 180 -320 154 -216 -127 240 -200 -103 -37 88 223 -103 113 5 -245 -110 -48 -89 257 -72 0 203
6476 203 67 -118 -54 -175 -155 -292 115 22 -90 180 158 27 -225 -121 61 100 41 -12 56 -238 107 31 -90
6499 -90 29 156 80 -122 16 -111 173 110 -123 165 -55 -16 28 -22 140 -94 -85 -146 81 -282 73 99 -72
6522 -72 -285 18 113 76 35 -210 -59 -313 -74 4 113 109 -155 -13 12 -175 135 132 85 -95 -117 51 25 -150
6546 -150 15 94 33 151 -105 -210 -119 -38 -89 173 85 204 27 314 -173 20 263 45 -14 13 48 -138 21
6569 21 89 134 -137 -126 166 -112 -71 -64 156 343 -52 -91 -29 4 292 -57 38 36 -54 -10 -2 307 222 24 24 7 13 26
6597 26 -121 41 202 116 -7 -71 20 146 251 84 -27 -106 211 -37 203 7 -85 63 -25 -176 103 189 131
6620 131 -170 -178 -7 -274 -288 -136 -159 -74 49 -164 88 -50 -170 214 174 94 -392 -22 -35 -217 -104 -67 -25
6643 -25 116 94 -22 -19 -106 -182 217 -13 11 -32 134 -62 -223 -38 13 -47 -45 116 15 -117 185 -165 -13 -102
6667 -102 -89 100 154 71 5 -51 76 81 -140 26 58 -174 99 5 28 145 116 -56 -121 130 43 -191 -164 -141 -32
6692 -32 140 -152 48 -24 31 -52 274 77 96 -1 90 71 153 -142 183 -3 28 -140 -230 48 95 83 -127 157
6716 157 -74 -142 -189 74 -288 -38 -157 76 201 279 -29 -45 -49 -4 -147 281 115 -122 -81 -44 93 3 80 -32
6740 -32 279 -109 36 -17 123 -14 51 -418 90 0 34 -60 -213 46 233 -66 -65 70 -84 100 79 13 -74 -214
6764 -214 64 202 117 122 121 57 19 -50 -198 -68 5 136 -232 -3 -164 -223 -217 64 -132 -159 -29 -145 8 -96
6788 -96 74 199 -235 -24 138 -95 206 -107 11 -1 -58 -130 217 17 -158 19 111 -21 -62 101 14 -54 -274
6811 -274 -68 86 -70 -60 3 -16 -210 -22 -164 -78 -77 326 -115 -40 -74 -110 -66 -119 57 -103 191 -207 -143 -11
6835 -11 -138 -86 130 5 -17 -64 124 57 144 -75 59 -43 13 -79 -194 -8 293 -40 107 -170 -130 112 23
6858 23 170 61 -57 -96 -231 22 42 -85 -255 103 -15 -165 -7 -174 -127 -128 -5 108 130 -48 -211 -138 121
6881 121 26 365 91 -11 203 -340 67 -58 6 -25 -86 -8 42 -94 -54 -41 -40 105 105 144 -171 -31 137 32
6905 32 95 145 -123 -112 147 44 75 138 -64 -241 -210 27 4 -95 -23 -181 -39 -29 8 -41 34 -353 -60 84 186
6930 186 19 -201 166 -147 97 13 5 -76 54 111 -25 15 94 -84 139 183 -150 255 296 -37 88 21 21 187
6954 187 111 80 252 118 -146 -273 -195 -15 73 128 3 148 -50 159 12 -80 -169 4 -26 224 40 207 62
6977 62 -124 -200 94 64 -248 -378 1 -16 -5 -97 -28 -318 -179 226 -120 -169 145 125 -163 151 -203 -113 -35 75
7001 75 -135 92 95 -164 -3 80 109 51 -130 199 -20 -274 -47 143 -8 -142 221 190 -109 -121 -246 -20 -111
7024 -111 -132 -23 127 210 59 57 -59 193 -39 124 -52 212 -82 2 -94 -77 78 213 -16 -13 -41 -72 -11 -121
7048 -121 -174 151 212 143 165 171 -22 215 208 -51 -35 -164 205 -100 141 -61 -169 -45 110 236 64 -116 225
7071 225 -125 62 178 -50 145 -4 -93 263 82 -147 -109 -2 -87 -155 -4 88 -61 -22 -42 -154 -45 -153
7093 -153 264 67 74 -129 111 -187 -98 113 186 -277 -45 -194 -275 21 77 -5 -62 129 -279 8 -26 56 13 -4
7117 -4 70 73 -133 81 -55 -72 -51 353 -162 -37 -69 -61 -131 203 -202 209 470 272 37 -201 189 216 16 -125
7141 -125 208 137 -232 -115 16 -304 93 -156 -66 -165 113 -32 -101 -49 9 -18 40 87 -124 -206 30 -36 -85 17
7165 17 248 154 0 110 -46 141 129 50 -42 82 111 73 -278 -126 198 -10 -230 50 173 15 -72 45 53
7188 53 -3 -469 -58 -322 -15 320 -62 -153 -272 -40 195 -222 246 -40 -95 -5 18 -53 -130 -17 4 71 -234
7211 -234 12 222 -109 1 225 -55 18 165 -169 180 -94 31 72 -16 73 85 -322 79 -386 7 66 -176
7233 -176 145 71 184 -180 67 201 126 340 1 -84 3 -14 96 118 155 -202 174 141 98 -35 -73 -27 -133 45
7257 45 34 -48 91 -61 12 -24 -8 13 12 -65 245 270 -36 71 304 37 129 -38 -3 -50 177 57 43 -81 131
7282 131 148 8 22 -229 -98 27 89 300 -429 -48 -2 180 21 -292 -132 260 44 54 2 49 -44 -57 434
7305 434 59 242 -48 -157 -102 54 -2 140 57 8 -4 -158 -44 -28 71 7 29 181 -35 38 14 145 -167 -88
7329 -88 -170 -6 -49 -32 -64 75 36 -9 122 35 -25 236 32 -127 -142 34 22 113 -226 -110 -75 -57 -205 3 -120
7354 -120 -114 -115 -131 -151 -69 162 -162 228 -67 121 184 -94 -174 -10 -18 260 26 -77 111 72 43 -56 -35 146 34
7379 34 175 -97 22 -135 234 19 -205 268 75 87 -270 -73 -155 277 -10 -118 197 36 -164 -65 -114 -133
7401 -133 87 -48 272 113 150 -141 -47 318 -234 -78 15 -80 64 93 194 -111 214 -89 -3 -43 -63 -175 -149
7424 -149 84 79 130 -97 -31 -32 -81 57 -11 217 -52 62 -171 -93 224 240 -207 -59 -49 -9 89 -275 207 -84
7448 -84 -24 -20 172 20 191 -26 -42 99 -9 -49 36 37 71 -69 130 -143 59 -345 -24 29 150 -36 -135 110
7472 110 -221 -231 74 -60 98 39 -23 121 15 -234 -143 45 -164 -89 12 -240 -113 69 -190 227 0 3
7494 3 12 18 -288 15 163 117 -187 86 -50 34 -188 -53 102 237 177 -50 -104 175 -43 39 139 -201 168 37
7518 37 126 -88 138 187 -342 -61 -119 181 -66 -141 105 215 -93 186 -119 -142 -11 -118 58 -48 115 -295
7540 -295 97 64 108 -259 249 39 -72 -79 -17 34 -89 -211 -44 10 189 -31 -69 128 -55 18 -98 33 216
7563 216 5 -84 85 -106 -56 28 -65 -59 -45 121 -102 -65 61 64 -71 53 -115 205 76 38 114 139 -264 73
7587 73 49 -50 68 -74 8 -139 -71 -84 -3 -85 -85 -11 107 203 -31 -163 -92 -163 195 -40 0 10 -72 -119 58 149
7613 149 -170 212 -207 107 -83 -96 51 -162 39 234 152 -54 237 119 111 94 33 -76 235 -24 95 148
7635 148 51 -7 81 126 -83 35 -63 -223 -443 229 177 -21 19 123 368 135 110 50 -168 -111 -27 42 100 -71
7659 -71 -82 228 -133 -148 -62 14 -178 -104 168 254 -139 -121 -199 181 -146 -176 44 65 46 -62 49 119 -151 -97 20
7684 20 -70 121 51 -127 -84 -7 87 185 61 -25 -11 -29 109 23 243 64 -22 94 -3 29 187 -84 215 155 -103
7709 -103 43 -52 -289 18 132 97 76 218 -70 -105 -10 -64 -47 45 53 10 -12 179 87 104 -165 -113 -228 132 109
7734 109 119 -82 10 176 -41 191 152 -69 103 -114 73 36 -102 -32 -1 57 -219 -72 -7 62 -116 -242 105
7757 105 -32 6 26 -39 47 32 121 121 -130 78 126 186 136 -80 -29 -54 -107 56 137 -110 -122 92 -46 -287 -169
7782 -169 -28 -2 45 -89 342 -284 126 -37 92 -12 -122 73 -76 -90 96 -10 -86 142 100 -6 -195 109
7804 109 141 -63 -77 -26 42 -49 47 -42 -123 25 -60 -105 -4 -116 40 12 -208 206 101 -131 -13 -6 35 -198 -8
7829 -8 21 -79 51 -319 468 -250 26 -61 49 310 -89 137 -141 -68 -93 61 47 181 -105 -129 -36 50 98 137
7853 137 166 -61 80 166 8 -48 -85 75 -84 -125 -75 -111 59 45 114 -25 16 -100 46 205 -192 -156 582 221
7877 221 -67 -42 97 41 -276 -38 -80 129 -63 175 2 -108 23 -87 49 -33 -268 -110 125 -125 76
7898 76 -124 -120 193 -113 -77 118 56 -278 81 -54 -125 98 -9 -389 45 163 -182 -437 135 54 100 5 -158
7921 -158 -176 260 135 -120 -23 -114 -151 165 111 -141 -17 -39 -38 -77 235 118 -99 98 -47 -221 -29 247 -44
7944 -44 -165 29 23 -13 -28 -237 -204 -120 -101 -135 -154 -122 -84 86 123 59 -1 106 -154 -78 22 -205 250 -50 232
7969 232 160 -266 -25 -11 32 46 86 108 64 -113 271 55 2 -76 11 -231 -5 123 4 142 97 -160 72 -48
7993 -48 -87 37 6 93 -154 232 -313 17 128 -62 -47 -12 -88 -107 43 -45 129 -105 292 294 80 -155 116 -166
8017 -166 -64 -43 -154 -182 -96 173 -107 -329 -144 -198 40 -66 166 115 154 195 41 309 74 -111 269 207 28
8040 28 -198 -11 57 -192 107 47 -74 -243 108 -250 21 440 -153 9 -14 32 -10 -251 21 -69 145 11
8062 11 -18 220 -112 197 -141 -124 -232 -44 -50 218 187 -106 -42 131 -138 -206 75 101 72 142 -4 117 70 -37
8086 -37 -37 -250 143 208 1 -72 38 18 176 295 123 144 67 48 -66 -41 62 -162 -227 -27 -134 -6 -34 -359
8110 -359 229 187 496 206 -64 -166 -186 -205 117 -22 17 114 201 -17 -154 232 -314 43 136 -212 107 23 -20
8133 -20 170 -322 108 -185 -15 -102 125 -51 322 91 75 108 168 121 -271 -104 -68 -92 -183 -261 -85 -93 19 123
8157 123 2 -28 -19 -23 -75 45 -18 0 57 -55 -214 242 121 -103 -71 81 13 96 -100 -145 71 -53 -70 74 32
8182 32 -93 -12 50 -114 -72 -264 31 -45 -28
8191b8
##END NTUPLES=NMR FID
##END=
