##TITLE=1H_SA-29.122
 DMSO-d6, 48 sc, 
 26.7.2019
##JCAMPDX= 6.0         $$ Bruker NMR JCAMP-DX V2.0
##DATA TYPE= NMR FID
##DATA CLASS= NTUPLES
##ORIGIN= UXNMR, Bruker Analytische Messtechnik GmbH
##OWNER= root
$$ XWIN-NMR		Version 3.5
$$ Fri Jul 26 15:44:15 2019 Russian Standard Time (UT+4h)  she@DPX200
##.OBSERVE FREQUENCY= 200.13155
##.OBSERVE NUCLEUS= ^1H
##.DELAY= (6, 6)
##.ACQUISITION MODE= SIMULTANEOUS
##.ACQUISITION SCHEME= undefined
##.AVERAGES= 48
##.DIGITISER RES= 18
##SPECTROMETER/DATA SYSTEM= spect
##.PULSE SEQUENCE= zg30
##.SOLVENT NAME= CDCl3
##.SHIFT REFERENCE= (INTERNAL, CDCl3, 0, 15.7039)
##AUDIT TRAIL= $$ (NUMBER, WHEN, WHO, WHERE, WHAT)
$$ ##TITLE= Audit trail, XWIN-NMR		Version 3.5
$$ ##JCAMPDX= 5.01
$$ ##ORIGIN= Bruker BioSpin GmbH
$$ ##OWNER= she
$$ F:/spectra/data/she/nmr/H-F/1/audita.txt
$$ ##AUDIT TRAIL=  $$ (NUMBER, WHEN, WHO, WHERE, WHAT)
(   1,<2019-07-26 15:43:08.04 +0400>,<she>,<DPX200>,
      <continue with go, POWCHK disabled, PULCHK disabled
       configuration hash MD5:
       00 E9 B6 7A A2 85 ED C7 34 08 36 98 17 FE 4E 26
       data hash MD5: 16K
       BF 7F 83 06 08 18 EB 06 89 F7 62 1D 1B E0 6C 90>)
$$ ##END=
$$ 
$$ hash MD5
$$ E4 5B F3 DA 28 2A 5A 40 90 94 3D E6 1D A3 6E 12
##$RELAX= 
##$RELAX= 
##$RELAX= 
##$RELAX= 
##$RELAX= 
##$RELAX= 
$$ Bruker specific parameters
$$ --------------------------
##$DU= <F:/spectra>
##$EXPNO= 1
##$NAME= <H-F>
##$PROCNO= 1
##$TYPE= <nmr>
##$USER= <she>
##$AMP= (0..31)
100 100 100 100 100 100 100 100 100 100 100 100 100 100 100 100 100 100 
100 100 100 100 100 100 100 100 100 100 100 100 100 100 
##$AQSEQ= 0
##$AQ_mod= 1
##$AUNM= <au_zg>
##$AUTOPOS= <>
##$BF1= 200.13
##$BF2= 200.13
##$BF3= 200.13
##$BF4= 200.13
##$BF5= 200.13
##$BF6= 200.13
##$BF7= 200.13
##$BF8= 200.13
##$BYTORDA= 1
##$CFDGTYP= 0
##$CFRGTYP= 5
##$CHEMSTR= <none>
##$CNST= (0..31)
1 1 145 1 1 1 1 1 1 1 1 1 1 1 1 1 1 1 1 1 1 1 1 1 1 1 1 1 1 1 1 1 
##$CPDPRG= <>
##$CPDPRG1= <>
##$CPDPRG2= <>
##$CPDPRG3= <>
##$CPDPRG4= <mlev>
##$CPDPRG5= <mlev>
##$CPDPRG6= <mlev>
##$CPDPRG7= <mlev>
##$CPDPRG8= <mlev>
##$CPDPRGB= <>
##$CPDPRGT= <>
##$D= (0..31)
0 1.2 0 0 0 0 0 0 0 0 0 0.03 0 0 0 0 0 0 0 0 0 0 0 0 0 0 0 0 0 0 0 0 
##$DATE= 1564141209
##$DBL= (0..7)
120 120 120 120 120 120 120 120 
##$DBP= (0..7)
150 150 150 150 150 150 150 150 
##$DBP07= 0
##$DBPNAM0= <>
##$DBPNAM1= <>
##$DBPNAM2= <>
##$DBPNAM3= <>
##$DBPNAM4= <>
##$DBPNAM5= <>
##$DBPNAM6= <>
##$DBPNAM7= <>
##$DBPOAL= (0..7)
0.5 0.5 0.5 0.5 0.5 0.5 0.5 0.5 
##$DBPOFFS= (0..7)
0 0 0 0 0 0 0 0 
##$DE= 6
##$DECBNUC= <off>
##$DECIM= 24
##$DECNUC= <off>
##$DECSTAT= 4
##$DIGMOD= 1
##$DIGTYP= 9
##$DL= (0..7)
0 120 120 120 120 120 120 120 
##$DP= (0..7)
150 150 150 150 150 150 150 150 
##$DP07= 0
##$DPNAME0= <>
##$DPNAME1= <>
##$DPNAME2= <>
##$DPNAME3= <>
##$DPNAME4= <>
##$DPNAME5= <>
##$DPNAME6= <>
##$DPNAME7= <>
##$DPOAL= (0..7)
0.5 0.5 0.5 0.5 0.5 0.5 0.5 0.5 
##$DPOFFS= (0..7)
0 0 0 0 0 0 0 0 
##$DQDMODE= 0
##$DR= 18
##$DS= 0
##$DSLIST= <SSSSSSSSSSSSSSS>
$$ [...]
##$SUBNAM2= <"">
##$SUBNAM3= <"">
##$SUBNAM4= <"">
##$SUBNAM5= <"">
##$SUBNAM6= <"">
##$SUBNAM7= <"">
##$SUBNAM8= <"">
##$SUBNAM9= <"">
##$SW= 24.9336996594482
##$SWIBOX= (0..15)
0 0 2 0 0 0 0 0 0 0 0 0 0 0 0 0 
##$SW_h= 4990.01996007984
##$TD= 16384
##$TD0= 1
##$TE= 0
##$TE2= 300
##$TE3= 300
##$TEG= 300
##$TL= (0..7)
0 120 120 120 120 120 120 120 
##$TP= (0..7)
150 150 150 150 150 150 150 150 
##$TP07= 0
##$TPNAME0= <>
##$TPNAME1= <>
##$TPNAME2= <>
##$TPNAME3= <>
##$TPNAME4= <>
##$TPNAME5= <>
##$TPNAME6= <>
##$TPNAME7= <>
##$TPOAL= (0..7)
0.5 0.5 0.5 0.5 0.5 0.5 0.5 0.5 
##$TPOFFS= (0..7)
0 0 0 0 0 0 0 0 
##$TUNHIN= 0
##$TUNHOUT= 0
##$TUNXOUT= 0
##$USERA1= <user>
##$USERA2= <user>
##$USERA3= <user>
##$USERA4= <user>
##$USERA5= <user>
##$V9= 5
##$VALIST= <valist>
##$VCLIST= <CCCCCCCCCCCCCCC>
##$VD= 0
##$VDLIST= <DDDDDDDDDDDDDDD>
##$VPLIST= <PPPPPPPPPPPPPPP>
##$VTLIST= <TTTTTTTTTTTTTTT>
##$WBST= 1024
##$WBSW= 4
##$XGAIN= (0..3)
0 0 0 0 
##$XL= 0
##$YL= 0
##$YMAX_a= 741986
##$YMIN_a= -1000430
##$ZGOPTNS= <>
##$ZL1= 120
##$ZL2= 120
##$ZL3= 120
##$ZL4= 120
##$ABSF1= 10
##$ABSF2= 0
##$ABSG= 5
##$ABSL= 3
##$ALPHA= 0
##$AQORDER= 0
##$ASSFAC= 0
##$ASSFACI= 0
##$ASSFACX= 0
##$ASSWID= 0
##$AUNMP= <proc_1d>
##$AZFE= 0.1
##$AZFW= 0.1
##$BCFW= 1
##$BC_mod= 2
##$BYTORDP= 1
##$COROFFS= 0
##$CY= 11.3945322036743
##$DATMOD= 1
##$DC= 2
##$DFILT= <>
##$DTYPP= 0
##$F1P= 20.1537800932815
##$F2P= 0.134698688090026
##$FCOR= 0.5
##$FTSIZE= 0
##$FT_mod= 4
##$GAMMA= 1
##$GB= 0.15
##$INTBC= 1
##$INTSCL= 1
##$ISEN= 128
##$LB= 0.24
##$LEV0= 0
##$LPBIN= 0
##$MAXI= 10000
##$MC2= 0
##$MEAN= 0
##$ME_mod= 0
##$MI= 1.114404
##$NCOEF= 0
##$NC_proc= 0
##$NLEV= 6
##$NOISF1= 3.799351
##$NOISF2= 2.8
##$NSP= 1
##$NTH_PI= 0
##$NZP= 0
##$OFFSET= 15.70392
##$PC= 1
##$PHC0= -9234.562
##$PHC1= 27.80097
##$PH_mod= 1
##$PKNL= yes
##$PPARMOD= 0
##$PSCAL= 0
##$PSIGN= 0
##$REVERSE= no
##$SF= 200.130013532006
##$SI= 16384
##$SIGF1= 3
##$SIGF2= 2
##$SINO= 400
##$SIOLD= 16384
##$SREGLST= <1H.CDCl3>
##$SSB= 0
##$STSI= 0
##$STSR= 0
##$SW_p= 3612.71676300578
##$SYMM= 0
##$S_DEV= 0
##$TDeff= 0
##$TDoff= 0
##$TI= <>
##$TILT= no
##$TM1= 0
##$TM2= 0
##$TOPLEV= 0
##$USERP1= <user>
##$USERP2= <user>
##$USERP3= <user>
##$USERP4= <user>
##$USERP5= <user>
##$WDW= 1
##$XDIM= 8192
##$YMAX_p= 0
##$YMIN_p= 0
$$ End of Bruker specific parameters
$$ ---------------------------------
##NTUPLES= NMR FID
##VAR_NAME=  TIME,          FID/REAL,        FID/IMAG
##SYMBOL=    X,             R,               I
##VAR_TYPE=  INDEPENDENT,   DEPENDENT,       DEPENDENT
##VAR_FORM=  AFFN,          ASDF,            ASDF
##VAR_DIM=   8192,          8192,            8192
##UNITS=     SECONDS,       ARBITRARY UNITS, ARBITRARY UNITS
##FACTOR=    0.0002004,     1,               1
##FIRST=     0,             0,               0
##LAST=      1.6414764,     0,               0
##MIN=       0,             -1000430,        0
##MAX=       1.6414764,     741986,          0
$$ Real data points
##PAGE= N=1
##DATA TABLE= (X++(R..R)), XYDATA
0@%%%%%%%kN0r6R6r6R7j45J92k40K88l36M10m61N34o30P46q84J008j154J332j511
$$ 0 0 0 0 0 0 0 0 -2 48 -48 48 -48 49 -96 96 -144 144 -192 218 -243 291 -339 407 -477 531 -623 709 -802
28h02J713j933K174k452K758l087L452l854M283m759N292n868O498p198P971q826
$$ -802 911 -1022 1152 -1300 1458 -1629 1823 -2031 2252 -2507 2785 -3083 3415 -3783 4188 -4638
44d638R778j0836J2029j3387J4931j6709J8797k1274K4278k8016L2799l9193M8230
$$ -4638 5140 -5696 6333 -7054 7877 -8832 9965 -11309 12969 -15047 17752 -21441 26789
57B6789o2082Q6276j40848M98694j27435q36014K89761O30526L76319l91456n25190
$$ 26789 -35293 50983 -89865 408829 281394 -554620 -264859 365667 741986 350530 -174660
68a74660k11066L18599L64343Q6184k79026k46794l3698J85541J99031J49098
$$ -174660 -385726 -67127 297216 383400 104374 -142420 -176118 9423 208454 357552
78C57552o1791k80293k86974J02034M31246K77226k64109n07823j71145L66374
$$ 357552 295761 15468 -271506 -169472 261774 539000 274891 -232932 -404077 -37703
88c7703M46528L048m58864l86998J17649M73272K66756k14129m28386j73201K20045
$$ -37703 408825 411873 -46991 -433989 -316340 156932 423688 209559 -218827 -392028 -171983
99a71983L62359J67116j55514l32129j99614J45221L77278K25397j90730m28064
$$ -171983 190376 357492 201978 -130151 -329765 -184544 192734 418131 227401 -200663
109b00663j88316K88957M55803Q3318m13895m54675J7927M48388L57483j07833
$$ -200663 -388979 -100022 355781 439099 25204 -429471 -411544 36844 394327 286494
119B86494l90885k10353J77702L40374J55138j31365k36445j12331Q1383J86098
$$ 286494 -104391 -314744 -137042 203332 358470 227105 -9340 -121671 -40288 145810
129A45810J38320m1513k31803k24359M6931L26146K53032j58043m40705k25604
$$ 145810 284130 242617 10814 -213545 -166614 159532 412564 254521 -186184 -411788
139d11788K67471M55673J05608l78342m22905L0247M39902L22179j65836m23666
$$ -411788 -144317 311356 416964 38622 -384283 -354036 85866 408045 242209 -181457
149a81457j72469K43359L40304P2814k16573k49644o5186J40984K09978J05405
$$ -181457 -353926 -110567 229737 302551 85978 -163666 -228852 -87868 122110 227515
159B27515r5912k38774j75920O8732K68359J83083j40522l42012j46890K53644
$$ 227515 131603 -107171 -283091 -214359 54000 237083 96561 -245451 -392341 -138697
169a38697L77277N8787l28221l21820O0484L61824K52941j13490l16384j75522
$$ -138697 238580 297367 -30854 -352674 -292190 69634 322575 209085 -107299 -282821
179b82821J13526K46465J36727o6138j88149j40324M4710K09277J66951q4544
$$ -282821 -169295 77170 213897 147759 -40390 -180714 -136004 73273 240224 155680
189A55680k85692j73882J69139L53177J32580k62162l62521l4679L37002K95288
$$ 155680 -130012 -303894 -134755 218422 351002 88840 -273681 -308360 28642 323930
199C23930q7347l33985j65421J61251K50140N5857j46763j53871l2035P1171J02404
$$ 323930 236583 -97402 -262823 -101572 148568 204425 57662 -96209 -128244 -57073 45331
210D5331P4327j6252j45584j84522k1065K25369K56705l2116l28556k41625J68820
$$ 45331 119658 103406 -42178 -226700 -247765 -22396 234309 202193 -126363 -367988 -199168
221a99168L98834J45690k85516l62112M48L43342K55830j23727l27181j45154
$$ -199168 199666 345356 59840 -302272 -301824 41518 297348 173621 -153560 -298714
231b98714J63409K42624O1205j29188j52336m7313N2059R5956P8731o749j12496
$$ -298714 -135305 107319 168524 39336 -113000 -160313 -108254 -12298 66433 59684 -52812
242e2812j22297K5764J90014J58906p5476k46225j25183J71259K82758O3887k31167
$$ -52812 -175109 -149345 40669 199575 124099 -122126 -247309 -76050 206708 270595 39428
253C9428k48009J6371K42814J78932p0341k18045j30302P0656J70815R0846o7834
$$ 39428 -208581 -192210 50604 229536 159195 -58850 -189152 -118496 52319 143165 75331
264G5331j53451r3820N6135J70300J33073m7203k08500j58994Q2226K49275J27864
$$ 75331 -78120 -171940 -115805 54495 187568 140365 -68135 -227129 -144903 104372 232236
275B32236j51611k57826o4352J99365K21525q814k09895j55209P2263J97324R0035
$$ 232236 80625 -177201 -241553 -42188 179337 170523 -39372 -194581 -122318 75006 165041
286A65041r9698j55875n5731O3740J01945O3907p125q2033j07028k0648J21714
$$ 165041 65343 -90532 -146263 -82523 19422 83329 76204 -5829 -112857 -133505 -11791
297a1791J56059O919j78149j68409N6057K31503J28309j52562k61420n2699K25596
$$ -11791 144268 151187 -26962 -195371 -139314 92189 220498 67936 -193484 -246183 -20587
308b0587K35348l4345k44160j59362R4700K07539Q3982r2981j23570k2136O7966
$$ -20587 214761 180416 -63744 -223106 -128406 79133 163115 70134 -53436 -75572 -7606
319g606P4820K6614l0276p6094p7161K863J13249J19832k6358j76864j34468Q1987
$$ -7606 67214 93828 63552 -12542 -89703 -86840 26409 146241 119883 -56981 -191449 -109462
331a09462K17327R3637j48055k15951l0524J75361J59552l4819j60858q7465O9620
$$ -109462 107865 201502 53447 -162504 -193028 -17667 141885 107066 -53792 -141257 -71637
342g1637J32660O2998m1680r1531o8798O424Q7801J03497P096j27593j44051M928
$$ -71637 61023 124021 82341 -9190 -77988 -71564 16237 119734 126830 -763 -144814 -139886
354a39886J64576J31124o9752j92355p3122J41384J80572n086j76689j29188O3707
$$ -139886 24690 155814 86062 -106293 -179415 -38031 142541 137455 -39234 -168422 -104715
365a04715J63486P2636p2363j09024l5060M1760N7447L5602L065l9630o9867k4855
$$ -104715 58771 131407 59044 -49980 -85040 -43280 14167 49769 52834 13204 -56663 -81518
377h1518Q0252J20711J1555j42124j41654L8432J88725J13597j09759k12737o4486
$$ -81518 -1266 119445 131000 -11124 -152778 -114346 74379 187976 78217 -134520 -199006
388a99006J52561J84017R489j51363j18580M0749J27426O3075n2694r2575m0364
$$ -199006 -46445 137572 147061 -4302 -122882 -82133 45293 108368 55674 -36901 -77265
399g7265L0363O2105M5491n382o0593p1995o196Q3273R7782j048j11679r6012
$$ -77265 -46902 15203 60694 55312 -5281 -77276 -83472 -199 97583 96535 -15144 -111156
411a11156L6738J33509O9890p8771j33025k7627J09767J15189j3043j21380r1707
$$ -111156 -74418 59091 128981 50210 -82815 -110442 -675 114514 101471 -19909 -111616
422a11616L3046J11975P0963l0841r1781o7319J4672P8782P1165o594q9694q8149
$$ -111616 -78570 33405 104368 73527 -18254 -85573 -70901 7881 79046 72452 -17242 -105391
434a05391R562J07692Q9572l5784j25936o7221Q2536J46660M6333j04116j30412
$$ -105391 -95829 11863 101435 65651 -60285 -127506 -44970 101690 148023 43907 -86505
445h6505j2819J03095Q7949k0074q6818n4114K0997N3418L3105m178l0810l8829
$$ -86505 -99324 3771 91720 71646 -15172 -69286 -48289 5129 38234 34056 3246 -35583
457c5583j6983L5456O7406K3633o7003r5541k565J14986J04766l6394j41158p5693
$$ -35583 -52566 -17110 50296 73929 6926 -88615 -91180 23806 128572 92178 -48980 -124673
469a24673Q4752J39305K2220j16166j05773L0418J17469N8835n8743r6682l3034
$$ -124673 -39921 99384 121604 5438 -100335 -69917 47552 106387 47644 -49038 -82072
480h2072M3938O0073L0526r694m0685n1673j4638N5093Q4623K0151q1398r4394
$$ -82072 -38134 21939 52465 42771 2086 -49587 -64225 -9132 75491 95642 14244 -80150
492h0150P243J08188P3335n8744j30868m8583Q4822J12143J3122q4490p5044R611
$$ -80150 -72907 35281 108616 49872 -80996 -129579 -44757 67386 80508 -3982 -79026 -69415
504f9415O6642N2459l65l8500l9406r972L2331N1743J7010m7698o7379n110Q0482
$$ -69415 -2773 49686 49321 10821 -28585 -38557 -6226 45517 62527 14829 -52550 -57660 22822
517B2822P5723k5696j09229o4613N8480J08589K7986p9940q7034M774P9535N7277
$$ 22822 98545 72849 -36380 -100993 -42513 66076 94062 14122 -72912 -68138 11397 68674
529F8674k2843o4730l5593K1212N0981L9300L770l6260n1726j7106M9727P6906
$$ 68674 45831 -18899 -54492 -33280 17701 57001 60771 24511 -27215 -44321 5406 82312
541H2312K1294p3416r7964j2035Q8239Q6182j9386j02468o3419M8302R9037L1049
$$ 82312 103606 30190 -67774 -79809 8430 94612 75226 -27242 -90661 -42359 56678 87727
553H7727o8063q2673l555O8083N6735r778n4686m0978R471M1802L3478L10k5772
$$ 87727 19664 -63009 -66564 1519 58254 48476 -6210 -47188 -37717 4085 37563 37873 12101
566A2101k9280n382K6445L6382N340m5237n2062R463O9062N1957l1237q4669m2296
$$ 12101 -17179 -22561 3884 40266 45606 369 -51693 -42230 26832 78789 47552 -37117 -79413
579g9413M9167Q8902L1208n9991q2885j0489P1438O6402r139o2350m5292Q509
$$ -79413 -30246 58656 89864 29873 -53012 -63501 7937 74339 65200 2850 -42442 -33933
591c3933M6448L8033k433m5429m8142n07N4227O0302N276n7230o0862L964O5993
$$ -33933 12515 50548 48115 2686 -45456 -45963 8264 68566 73842 16612 -44250 -40286 25707
604B5707N3245k5183p4839l1347M7009O1615J892n3114m3169J0544M3672L0962
$$ 25707 78952 53769 -21070 -52417 -5408 56207 58099 4985 -38184 -27640 16032 46994
616D6994p388l4590l0788q019K0631L2081J3261k6479m7497j3123N1544O1475
$$ 46994 39606 5016 -25772 -33791 -13160 18921 32182 5703 -41794 -54917 -3373 58102
628E8102p425p5331n2476L9833R0352L7678n6584q2671j4294O3208O1286o297
$$ 58102 50677 -24654 -77130 -37297 53055 90733 34149 -48522 -62816 392 61678 55381
640E5381n5646l7278J0431L3292K2111P88j9236k7871j0213K6978M3147J1100
$$ 55381 -265 -37543 -27112 6180 28291 29079 9843 -18028 -28241 -1263 41884 52984
652E2984m0776n4056p330N2978N6280j379n7190m2374K3192N9424K5524l1944
$$ 52984 12208 -41848 -49178 3800 60080 58701 1511 -40863 -17671 41753 67277 35333
664C5333m6511j1743K8695L3198L467l3939m1959p957L6179M4260O443m0441m3601
$$ 35333 -11178 -22921 5774 38972 42439 8500 -33459 -41416 -5237 39023 45466 5025 -38576
677c8576J070M7839M4474j0790n1529l1558K1658M6807J6441l3208m5566r515
$$ -38576 -37506 10333 54807 44017 -7512 -39070 -17412 29395 45836 12628 -32938 -42453
689d2453L1323M0411O373k9073l5294j0621K0417L6107K2299j6469m0971k2398
$$ -42453 -11130 29281 35654 6581 -28713 -39334 -18917 17190 39489 23020 -17951 -40349
701d0349K7347M5872J3990l2839m1134l059M2761M6028j354n2311m2885J4852
$$ -40349 -13002 32870 46860 14021 -27113 -30172 12589 58617 57263 4952 -37933 -23081
713b3081N4452K6431l2991n2514j8558K7780L9431J0523k7902l1733L251L7826
$$ -23081 31371 57802 24811 -27703 -46261 -18481 20950 31473 3571 -28162 -24911 12915
725A2915K7353p372k6885j4875N965J8451J9693N452k1478l3643r690K7883L3259
$$ 12915 40268 32896 6011 -8864 -2899 15552 35245 40697 19219 -14424 -24114 3769 37028
738C7028J28l7713l5333O580M5209L3282k1890n4341k3891L6725N2111Q025l8473
$$ 37028 37156 -557 -35890 -29310 15899 49181 27291 -27050 -50941 -14216 37895 45920 7447
751G447l8456k631L1452K9478L532k2107k3351j752K1876K6564L805k8194l2375
$$ 7447 -31009 -33640 -2188 27290 30822 8715 -14636 -16388 5488 32052 35857 7663 -24712
764b4712O27L6316L0345j0786m1644k5221J8688M1168K1557j8579l2695r882K0665
$$ -24712 -24085 12231 42576 31790 -9854 -35075 -16387 24781 46338 27759 -4936 -14818 5847
777E847K1203j010j5717j4164m508P370K0107J3038j6587l3674j0744L2178L7580
$$ 5847 27050 26040 10323 -3841 -8349 -979 19128 32166 15579 -18095 -28839 3339 40919
790D0919J129l4605l2947M425L9869L0978j4653m4052j6062L0762L3220k805k9009
$$ 40919 42048 7443 -25504 -21079 18790 49768 35115 -8937 -24999 5763 38983 36178 7169
803G169k1645K957K0699K1044N686k1544l0661p982J8850K2504K846j9180k3790
$$ 7169 -14476 -11519 9180 30224 35910 14366 -16295 -24277 -5427 17077 19923 743 -23047
816b3047o488K0999K9285M930k5538j9719Q889K8857K0805l739k5116k5102Q25
$$ -23047 -29535 -8536 20749 25679 141 -19578 -10689 18168 38973 35234 10118 -14984 -14159
829a4159K7753K2719r936l3336j8319J6807L1619Q780k4970l1388l07L1953K4635
$$ -14159 13594 36313 26377 -6959 -25278 -8471 23148 31928 6958 -24430 -24737 7216 31851
842C1851j4487l4075j2497J8819K5338P533j3694j8439o580J2680J8455Q986p895
$$ 31851 17364 -16711 -29208 -10389 14949 22482 8788 -9651 -16231 -3551 14904 23890 15995
855A5995j4839j2366N338J9621J3526j1160l2716j9239J7416L2972J2719j9679
$$ 15995 1156 -11210 -5872 13749 27275 16115 -16601 -35840 -18424 14548 27267 7588
867G588k9957q945K0349L0377J0473k3041l1906l476K5722K3548o096k7439j6683
$$ 7588 -22369 -31314 -10965 19412 29885 6844 -25062 -28538 -2816 20732 14636 -12803 -29486
880b9486J1037K8343J4058j2982k5854n844J9639J6752l854j5490q083M864P610
$$ -29486 -18449 9894 23952 10970 -14884 -20728 -1089 15663 11809 -3681 -11764 -6900 710
893G10M032J89m571o571J75J0885J4314J625j7497k3685k824K5360K5497o962
$$ 710 4742 4931 360 -6211 -6036 4849 19163 20788 3291 -20394 -23218 2142 27639 20677
907B0677l3989k1263J1302K9384J5465j5943k4821o687J9361K4115M626j6755
$$ 20677 -13312 -34575 -23273 6111 21576 5633 -19188 -25875 -6514 17601 22227 5472
919E472j8766n769J2968K1556R356j4251k6246p267J9075K1591k77j6054j2737
$$ 5472 -13294 -19063 -6095 15461 24817 10566 -15680 -22947 -3872 17719 17442 1388 -11349
932a1349K489J2765O294j0650j4402l935R306R776j32n260l520k536M157J1123
$$ -11349 -8860 3905 10199 -451 -14853 -18788 -9482 294 162 -5098 -8618 -11154 -6997 4126
946D126J0587m082j6632o571J4590J7675k87k0247j9216K933K2141J8173p037
$$ 4126 14713 10631 -6001 -12572 2018 19693 19406 -841 -20057 -17124 5017 23190 16153
959A6153k6391j6412R753K5535J2269q829j9574j1948P411K1229J1833j0459k2150
$$ 16153 -10238 -26650 -16897 8638 20907 12078 -7496 -19444 -12033 9196 21029 10570 -11580
972a1580j0369J3421J9340L406j3674j3414M2J0751Q512N62n451n453m512K81
$$ -11580 -21949 -8528 10812 14218 544 -12870 -12828 -2077 6435 6997 1546 -3907 -8419 -8138
986h138O612Q383O52j0311o866N739J4208M615j4150j5925M619K1800J0798j7806
$$ -8138 -1526 6857 7509 -2802 -9668 -3929 10279 14894 744 -15181 -10562 11238 22036 4230
1000D230k5537l255K1757J9073n626k1735j0988R634J7349Q421p905j3432m564
$$ 4230 -21307 -24562 -2805 16268 10642 -11093 -22081 -12447 4902 13323 5418 -8014 -12578
1013a2578O793J3121R317k259j1485j3002j802J3626J5264L55j4980j4800NJ3658
$$ -12578 -5785 7336 16653 14394 2909 -10093 -11895 1731 16995 17350 2370 -12430 -12425 1233
1027A233J1637J90j2727j2040Q35J2025R251o336j6083q988J0261J7611N477j1898
$$ 1233 12870 13060 333 -11707 -10872 1153 10404 4068 -12015 -21003 -10742 6869 12346 448
1041D48j2538M817J6626R045q473j3777j83J2956Q748p642j3617o222L832P067
$$ 448 -12090 -7273 9353 18398 9925 -3852 -4035 8921 17669 10027 -3590 -9812 -5980 1087
1055A087N401Om062q610n611M715J3797R922p636j9625p268J4565J8939O81j7595
$$ 1087 6488 6494 2432 -6178 -11789 -7074 6723 16645 9009 -10616 -17884 -3319 15620 16301 -1294
1070a294j6321L320J7427J2938k527j3748q549J471R953P985J84q703j1533k247
$$ -1294 -17615 -14295 3132 16070 13543 -205 -8754 -7283 2670 10655 10839 2136 -9397 -11644
1084a1644J0763J0315k803j1391o020R192J2671J477j1476r008L127J1508J870
$$ -11644 -881 9434 6631 -4760 -10780 -1588 11083 12560 1084 -7924 -4797 6711 8581
1097H581o818j1072j593O022N304J390k560l055k243L088P394N356j101j1333
$$ 8581 1763 -9309 -10902 -4880 424 1814 -746 -3801 -6044 -2956 4438 9794 8693 -2640
1111b640p990O960J4313P547p894j4582p218R359J3020O411r062j3981n281P780
$$ -2640 -10630 -3670 10643 18190 10296 -4286 -11504 -2145 10875 17286 8224 -5757 -11038 -3258
1125c258J2900J698j1340j4629p70J2944J2142l456j2918p506Q032J4674L626
$$ -3258 9642 11340 0 -14629 -15399 -2455 9687 6231 -6687 -14193 -6161 8513 12139
1138A2139p942n631K587M702L73l876k459m04j217k181J073N736N61p784p100
$$ 12139 4197 -1434 1153 5855 6228 2352 -107 -511 -1728 -3909 -2836 2900 3461 -4323 -11423
1153a1423M864J4360O238j0408j5160q49J4172J1367n363j6035o661J0470J4595
$$ -11423 -6559 7801 14039 3631 -11529 -12378 1794 13161 7798 -8237 -14898 -4428 10167
1166A0167J914j0164j0167P45P977Q320J298p079r721j997O338Q453K556o400
$$ 10167 12081 1917 -8250 -7505 472 8792 10090 3011 -6710 -8707 -2369 6084 8640 2240
1180B240q339o7Q112P012k18o803m213J181N986M468k94o890q335l648O364R973
$$ 2240 -6099 -6166 1946 8958 8740 1937 -2276 -1095 4891 9359 9065 2175 -6160 -9808 -3444 6529
1196F529Q35j0940j1319L853J5544O334p667j3144o73J3172J0560m601j2315m521
$$ 6529 7364 -3576 -14895 -11042 4502 10836 3169 -9975 -10648 2524 13084 8483 -3832 -8353
1210h353O175J0541R25m704m726j348J348J614J993R29n959p958j57Q283P570
$$ -8353 -2178 8363 9288 4584 -142 -1490 -142 1472 3465 4394 -1565 -9523 -9680 -1397 6173
1225F173n461j0924l524Q974J3052K629q268r635R59Q845P853j12p003n511m91
$$ 6173 712 -10212 -13736 -4762 8290 10919 2651 -6984 -6025 2820 10673 10561 3558 -1953 -2444
1240b444L525O094K077n873j0207j474J1774J1323k472j2921p271M904J0529L472
$$ -2444 1081 7175 9252 3379 -6828 -8302 3472 14795 12323 -598 -7869 -2965 7564 11036
1254A1036p283q927J41O352M598l389o127O39L486L695J230l14k514m198r91M126
$$ 11036 3753 -5174 -5033 1319 5917 2528 -3599 -2960 526 4221 5451 5137 2623 -1575 -2566 1560
1270A560N154j223o257n593L364P009M737l316q636l147O422R254K403o411j0231
$$ 1560 6714 5491 -766 -6359 -2995 4014 8751 5435 -3201 -6348 74 9328 11731 5320 -4911
1285d911l998Q596J0470J021r896j2511m47J2570R918k814r939n242L944R695
$$ -4911 -8909 -313 10157 11178 1282 -11229 -11676 894 10812 7998 -1941 -7183 -3239 6456
1299F456L186m322n072m60L211J424N54J420j708m886j640N491O397j83q255n162
$$ 6456 9642 5320 248 -212 2999 4423 4977 6397 4689 -197 -1837 3654 10051 9868 1613 -3549
1315c549K302N811K521p889p820m33J0800N814o906q568K63P528N510J359l102
$$ -3549 -1247 4564 7085 -804 -8624 -9057 1743 7557 651 -7917 -7654 -126 5384 6743 3641
1330C641m652l168L323Q782K839o172r493l044P319R957J099r100j1367K02J0720
$$ 3641 -1011 -4179 -856 7926 10765 4593 -4900 -7944 -625 9332 10431 1331 -10036 -9834 886
1345H86P425m006o359j846m2P04K328L839M76n569k959J890P165N104n044q743
$$ 886 8311 4305 -2054 -3900 -3942 -3238 -910 2929 3405 -2164 -5123 -3233 3932 9036 3992 -4751
1361d751j374Q858Q677n550j1178j290P859N254n675p167j25O874O254o25m647
$$ -4751 -6125 2733 11410 5860 -5318 -6608 1251 6505 830 -6337 -6462 412 6666 6041 1394
1376A394o198K055O278M015j925l535l555l867o59Q278N961o761j2071r79R026
$$ 1394 -4804 -2749 3529 7544 5619 2084 -1471 -5338 -5997 2281 8242 1481 -10590 -11569 -2543
1391b543Q111R15n918o344j765N611Q682J318m985o656r06L469N113K846j006
$$ -2543 5568 6483 565 -5779 -7544 -1933 6749 8067 3082 -3574 -4480 -1011 4102 6948 5942
1406E942o104m947N246O800l41o268l534K318J678p45l236k227L404L307N13k293
$$ 5942 -162 -5109 137 6937 6596 328 -3206 -888 790 45 -3191 -5418 -2014 1293 1806 -487
1422d87k140j246M099M643L649m260n797j695M371M577K576m016p703k540M651
$$ -487 -2627 -3873 226 4869 8518 4258 -1539 -3234 1137 5714 8290 4274 -3429 -5969 -1318
1437a318O943K723o823o093k055L925M115M146j000p858p161K918J0289N121o119
$$ -1318 5625 8348 1525 -4568 -6623 -2698 1417 5563 4563 -3295 -10456 -7538 2751 7872 1753
1452A753q065o73O253M591J27k384m461R36K591k46m269J057N923J867o041m347
$$ 1753 -6312 -6985 -732 3859 3986 1602 -2859 -1923 668 422 -3847 -2790 3133 5000 -1041 -5388
1468e388M547N115j321j654L389J443l956m628l83M222L380j300o332o157L116
$$ -5388 -841 4274 2953 1299 4688 6131 2175 -2453 -2836 1386 4766 3466 -2866 -9023 -5907
1483e907R762L524n656p416M09O244L734M21j457m659k984J205O790L185k325
$$ -5907 3855 7379 1723 -5693 -5284 960 4694 5115 3658 -1001 -3985 -2780 4010 7195 4870
1498D870o068k794L436N914J827l628m468L13J844r59k200P26K833j518l529k350
$$ 4870 -1198 -3992 -556 5358 7185 3557 -911 -598 1246 287 -1913 -1187 1646 128 -3401 -5751
1514e751K728L832J202k297k268L268M076k597m596J620P186K131p235o051L269
$$ -5751 -3023 809 2011 -286 -2554 714 4790 2193 -2403 -783 6403 8534 1299 -4752 -1483
1529a483Q075J792n029n455j924N103N471j252n298l698J497J465l16J244L545
$$ -1483 6592 8384 3355 -2100 -4024 1079 6550 5298 0 -3698 -2201 -736 -1052 192 3737
1544C737j519n833r59N463N425o16m257k283N65K801K252nm131l398K208P86K91
$$ 3737 2218 -3615 -4574 889 6314 5698 1441 -842 -277 2524 4776 4771 640 -2758 -550 236 527
1561E27L45J748k975j181R68K493o73j713Q87J084j010r91o66J23j9J331o18j757
$$ 527 872 2620 -355 -1536 -568 1925 1252 -461 426 1510 500 -491 -1157 -1034 -1053 278 -340 -2097
1579b097r50K024L337l84j966j166q43j78J419L920J19n158l044K534N204j16
$$ -2097 -3047 -1023 2314 1930 -36 -1202 -2045 -2223 -804 3116 3235 -1923 -4967 -2433 2771 2655
1595B655r56r74N1n55J851M3k13j249j77l062j659K771L913k021o547j152O095
$$ 2655 1699 725 776 221 2072 2115 1902 653 476 -2586 -4245 -1474 2439 418 -6129 -7281 -1186
1612a186M520j411m873p22M179K768j162l265j086L944K452l399n656J540N707
$$ -1186 3334 1923 -2950 -3672 507 3275 2113 -1152 -2238 1706 4158 759 -4897 -3357 2350
1627B350J948m903l419K544L438r0l696j065K753J671j606l628j102N298L276
$$ 2350 4298 -605 -4024 -1480 1958 1868 -1828 -2893 -140 1531 -75 -3703 -4805 493 3769
1642C769k600l869r32M029L137j019k336k059K10J846K123q55k024j734J476P12
$$ 3769 1169 -2700 -3632 397 3534 2515 179 -1880 -1670 176 2299 1444 -580 -2314 -838 -126
1658a26J896m30r46r87J306J273M21k045l0R37l48l317K38L052J613l422l181
$$ -126 1770 1340 394 -593 713 1986 2407 362 332 1269 921 -2396 -2158 894 2507 -915 -4096
1675d096O59M137K347j540m082j705N467K650l038n488M17N283L491k969k577
$$ -4096 -3437 700 3047 1507 -2575 -4280 1187 3837 799 -4689 -4272 1011 4502 1533 -1044
1690a044L8L635Q21j326j831Q74L36K62j380j425n14O60j251r21J635J539K40
$$ -1044 -1006 2629 3450 2124 293 1167 1503 1765 385 -1040 -1554 -894 -2145 -3066 -1431 108 348
1707C48k161j64K297K335l47k424K07p06K145J220n50L1k382r79J525K489J572
$$ 348 -1813 -1977 320 2655 2308 -116 91 -615 1530 2750 2200 2231 -151 -1130 395 2884 4456
1724D456j904l839j712L444K886m85m175k383Q61L165J071k057j053N03P59Q26
$$ 4456 2552 -1287 -2999 445 3331 2846 -1329 -3712 -2851 314 1385 -672 -1725 -1222 -463 363
1740C63l63J086J021r95l81j161M06M95q4J245Q75j348j065j157J741J484K72
$$ 363 0 1086 2107 1112 731 -430 -24 471 387 1632 2507 1159 94 -1063 678 2162 2434
1757B434j465j390q06J349L94jJ253q27j819k367q87O803M067k583p466k800N714
$$ 2434 969 -421 -1227 122 516 515 1768 941 -878 -3245 -4132 2671 6738 4155 -3311 -6111 -397
1774c97O225k69n068l859J357L587J009j735j388J039J339j861j327L139K465
$$ -397 5828 5559 491 -3368 -2011 1576 2585 850 -538 501 1840 -21 -1348 1791 4256
1789D256q99l887k327J393K981P58k558j854M99J840m94j409j16K299N54j053
$$ 4256 3357 -530 -2857 -1464 1517 2275 -283 -2137 -1638 202 -292 -1701 -1817 482 1036 -17
1805a7j407r0K160K012J473k862l534m55K461L772J405k990m003k397L987M230
$$ -17 -1424 -1514 646 2658 4131 1269 -2265 -2720 -259 3513 4918 1928 -2075 -4472 -485 3745
1821C745l78k496l374K42K480J044j485j70M0p78k554J792L920K434k817l964
$$ 3745 3367 871 -2503 -2261 219 1263 -222 -392 -352 -1130 -3684 -1892 2028 4462 1645 -2319
1837b319n52L465L639j111l783p88J178J778j111k431O81K367K90j984k348J326
$$ -2319 -2871 594 4233 3122 -661 -1449 -271 1507 396 -2035 -1354 1013 1303 -681 -3029 -1703
1853a703L224J549j390l526m63P58J473J574M80j165l829m79J613M522J121k304
$$ -1703 1521 3070 1680 -1846 -2309 -1551 -78 1496 1976 811 -3018 -3497 -1884 2638 3759 1455
1869A455l586m51K264K220P13k319q91j825L56K853J686J690l137l814J93L968
$$ 1455 -2131 -2582 -318 1902 2615 296 -595 -2420 -2064 789 2475 4165 1028 -2786 -2593 1375
1885A375M316q48m877k634J225K575r09j230o75J580Q01o27j283N49K051K55p93
$$ 1375 5691 4843 -34 -2668 -1443 1132 223 -1007 -1682 -102 699 72 -1211 -662 1389 1644 851
1902H51j539r57J291M68J300K05j856k279p28K019M948L19l405l815P01M137J055
$$ 851 -688 -1645 -354 114 1414 1619 -237 -2516 -3244 -1225 3723 4042 637 -3178 -2477 1660 2715
1919B715o09k168p90j359n82J379K200J602j395m311j023M625N426m2o421l930
$$ 2715 2106 -62 -852 -2211 -2793 -1414 786 2388 993 -3318 -4341 284 5710 5668 -753 -4683
1935d683L191M771L34k857j570J327L08N79k344J001K172J328r90l340j278K747
$$ -4683 -1492 3279 3613 756 -814 513 821 1400 -944 57 2229 3557 2567 -773 -2051 696
1951F96K523pk694k421M35R76J152P56O25j439j506j700J697K977L81p5l141j595
$$ 696 3219 3212 518 -1903 -1468 -492 660 1416 2041 602 -904 -2604 -907 2070 2451 2376 -765 -2360
1969b360o43L064L294n25k771m459J105N136L177j427l423k986J632K895Q99k263
$$ -2360 -3003 61 3355 2830 59 -4400 -3295 1841 5018 3591 168 -2818 -1186 1709 2608 345
1985C45q15O46P38j160j087J315K222L5k785q47Q43J362J791k250p40M79J318
$$ 345 -470 176 914 -246 -1333 -18 2204 2239 -546 -1393 -550 812 2603 353 -387 92 1410
2002A410l92q67J212K189N4k474j557P66L059M59j002k420k186O97K051J521j901
$$ 1410 1018 151 1363 3552 3606 1132 -425 341 3400 3859 2857 437 -1749 -1052 999 2520 619
2019F19j879j419Q90J724K564J64k973j621J571K347J34j110j037K97o70r06J092
$$ 619 -1260 -2679 -1789 -65 2499 2663 -310 -1931 -360 1987 2121 1011 -26 271 -399 -1305 -213
2036b13J437N12k044j017O21K5K132p09j981j56J835R37k164j315J471K567n14
$$ -213 1224 1736 -308 -1325 -704 -679 1453 744 -1237 -1393 442 1379 -785 -2100 -629 1938 1424
2053A424l554J79K428J525q17j139r45J497K0N7j63n97M15l06j702L83L116J455
$$ 1424 -2130 -1951 477 2002 1185 46 -899 598 618 675 512 -85 330 24 -1678 -1295 1821 3276
2071C276k899m033K251M814P04l438k869Q32K873J241k594k304J055K226j075
$$ 3276 377 -3656 -1405 3409 4113 675 -2194 -1362 1511 2752 158 -2146 -1091 1135 60
2086F0k829k78M611J31k458k293O37L892O00k200l577N05L982K685m432k830L049
$$ 60 -2769 -3047 1564 1695 -763 -3056 -2419 1473 2073 -127 -3704 -3199 783 3468 -964 -3794 -745
2103g45L682l50m757n25K724J759k53k108j797J457J088M77j150k067J358K671
$$ -745 2937 2587 -2170 -2695 29 1788 1535 -573 -2370 -913 175 652 -498 -2565 -1207 1464
2119A464L28k147j76J771P33j930j070K162k15M89l53j660q73J905J992L67k498
$$ 1464 1792 -355 -531 1240 1973 43 -1027 1135 920 1409 1056 -604 -1477 428 2420 2787 289
2136B89j984J846K937j897m90N67J0j470P26N25k62m4r16J491j133o30O08Q86
$$ 289 -1695 151 3088 1191 701 1268 1278 -192 534 1059 797 753 -163 1328 195 -435 173 1059
2154A059j210o96J746L17j684q63K01J283n59j193Q82M96O05O42k734O18K274
$$ 1059 -151 -847 899 1216 -468 -1331 -1130 153 -406 -1599 -717 -221 384 1026 -1708 -1090 1184
2171A184J094o04j891n20K190j058m06j106J019J608q47k139p79K755K448j374
$$ 1184 2278 1674 -217 -737 1453 395 -11 -1117 -98 1510 663 -1476 -2255 500 2948 1574
2187A574m804N25L026L419l171k466J262K588K22j791J04J006N27k80j463p14
$$ 1574 -3230 -2705 321 3740 569 -1897 -635 1953 2175 384 488 1494 2021 1741 278 -436
2203d36K487K630l039m469O85M020J700l302l108J016L168p29k919Q61K058J884
$$ -436 2051 4681 1642 -2827 -2142 1878 3578 276 -2832 -1816 1352 623 -2296 -1435 623 2507
2219B507j708l356mL239J501p02l904J83L657J811l936j585L026K568l523k842
$$ 2507 799 -2557 -2561 678 2179 1477 -2427 -2244 1413 3224 -712 -2297 729 3297 -226 -3068
2235c068Q47L444K576k781n027j013M611L934j797m394J21L509J461l552k16K945
$$ -3068 -2221 1223 3799 1018 -4009 -5022 -411 3523 1726 -2668 -2547 962 2423 -1129 -1345 1600
2251A600J744k998k811j326M443L321n05o117j887M008M350j179m023j47L594
$$ 1600 3344 346 -2465 -3791 652 3973 3468 -2649 -4536 -528 3822 2643 -1380 -1527 2067
2266B067P80l015j332K103K728o40l703k105K012L314J720m069n033J939M830
$$ 2067 2847 -168 -1500 603 3331 2691 -1012 -3117 -1105 2209 3929 -140 -5173 -3234 1596
2281A596J206l665o17J463N33j562j770K080L298M32l062k932n47M403L424k619
$$ 1596 2802 -863 -1480 -17 516 -1046 -2816 -736 2562 2994 -68 -3000 -3547 856 4280 1661
2297A661m536q43L089J744j372j713Q86J170n16k820j401M471L841k202n280j093
$$ 1661 -2875 -3718 -629 1115 -257 -1970 -1084 86 -430 -3250 -4651 -180 3661 1459 -3821 -4914
2313d914M356M290k204k839n76J648J284j584j043Q77K823q1m244j749L594N505
$$ -4914 -558 3732 1528 -1311 -1887 -239 1045 -539 -1582 -705 2118 2037 -2207 -3956 -362 5143
2329E143k177o343j792M271M152k532l208L32L320j57k459k520L483K938j6m679
$$ 5143 2966 -3377 -5169 -898 3254 722 -2486 -2154 1166 1009 -1450 -3970 -487 2451 2435 -2244
2345b244l517K787P205J55o518l756L973M673k589k833J272L348r5m422j617L487
$$ -2244 -5761 -2974 4231 4386 -2132 -5888 -1915 2758 169 -2664 -1392 1956 1861 -2561 -4178 -691
2361f91M692j494m203l894L818N802k35o587k403M382L316k015l750J357M139
$$ -691 4001 2507 -1696 -5590 -1772 4030 3795 -2792 -5195 -813 2503 488 -3262 -1905 2234
2376B234K3m356k479L006M579j13l730m163K997N583o83m280p13L137J945k531
$$ 2234 2257 -2099 -4578 -1572 3007 2894 -836 -4999 -2002 3581 2898 -1382 -2095 1042 2987 456
2392D56l177J700M040J239n620l375K221O095R64m620m768K145M829j01k888j118
$$ 456 -2721 -1021 3019 4258 -1362 -4737 -2516 3579 4543 -77 -4845 -2700 2129 2028 -860 -1978
2408a978K417J540k552l208J486M292K074m114m392Q46O667J898l470n491J278
$$ -1978 439 1979 -573 -3781 -2295 1997 4071 -43 -4435 -3589 3078 4976 1506 -3985 -2707
2423b707M426J300l455k912L437K753j017n361k78M210M737k865m902k403M257
$$ -2707 1719 3019 -436 -3348 89 2842 1825 -3536 -3814 396 5133 2268 -2634 -5037 -780
2438g80N542k378m916O6L601J258l085k535K892M122r90n398k188M654O519j185
$$ -780 4762 2384 -2532 -2466 1135 2393 -692 -3227 -335 3787 2797 -2601 -4789 -135 6384 5199
2454E199o405l502L649N415m94n077j861L549K123k416l415J650M782K70m490
$$ 5199 -1206 -4708 -1059 4356 3862 -1215 -3076 473 2596 180 -3235 -1585 3197 3467 -1023
2469a023m708L978N991j4n679l891M388M324p04n241n41L927L140l297m143J022
$$ -1023 -5731 -1753 4238 4224 -1455 -5346 -958 3366 2662 -2579 -3120 807 3947 650 -3493 -2471
2485b471N373L196n619m781J702N210J842n202l466L263L988j868m547M69M519
$$ -2471 2902 6098 479 -4302 -2600 2610 4452 -750 -4216 -953 3035 1167 -3380 -2911 1608
2500A608K781m568o056K970O895J946m691n779K854M814J533n495k735K765N312
$$ 1608 4389 -179 -6235 -3265 3630 5576 885 -4894 -2040 2774 4307 -1188 -3923 -1158 4154
2515D154p08n081j996M769L828l295n823J052N689J939m129m756J844O052N09
$$ 4154 3446 -1635 -3631 1138 4966 1671 -4152 -3100 2589 4528 399 -4357 -2513 3539 4048
2530D048o010k824M485M917r79o028k111N000M378l211n112r32N488K718l306
$$ 4048 -1962 -4786 -301 4616 3637 -2391 -4502 498 4876 1665 -3447 -4379 1109 3827 521
2545E21m300J086M006J668m041k156K646M067n0n642j610L679M464j980n510j241
$$ 521 -3779 -2693 1313 2981 -1060 -3216 -570 3497 3447 -2195 -3805 -126 4338 2358 -3152 -4393
2561d393O237L801m386n577J000M646K759m085l992R24N015K669m940l064K593
$$ -4393 1844 5645 1259 -4318 -3318 1328 4087 2 -3990 -3066 1949 4618 -322 -3386 -793
2576g93M793r90m934j489N038M001l103n765L8N615L065l934n282N51N693K103
$$ -793 4000 3010 -1924 -3413 1625 5626 2523 -3242 -3204 2411 5476 1542 -3740 -3189 2504 4607
2592D607m685n218K625O705R62o030m302L927N803N4o565k102L946N071j308o577
$$ 4607 -78 -5296 -2671 4034 4996 -1034 -5336 -1409 4394 4448 -2117 -4219 -273 4798 3490 -3087
2608c087j08N334K855m608m662J194O445J018m966n665L798O096J132o412m109
$$ -3087 -3195 2139 4994 386 -4276 -3082 3363 4381 -585 -6250 -2452 3644 4776 -1636 -5745
2623e745L991O227q78o176j799M885M819k907o634R64N926K772m889n238K353
$$ -5745 -1754 4473 3595 -2581 -4380 505 5324 2417 -4217 -3253 2673 5445 556 -4682 -2329
2638b329N294J327m418m087K815N511n97n616k397M874N139k892o529J84O566
$$ -2329 2965 4292 -126 -4213 -1398 4113 3516 -2100 -4497 377 5516 2624 -3905 -3721 2845
2653B845L918n678n644J936N763R97m155l316K272M525r23m774j739M442L598
$$ 2845 6763 1085 -4559 -2623 3140 4137 -18 -3334 -1062 3463 2540 -2234 -3973 469 4067
2668D067k203o010L20O333L322n437m987J195N829K456l899m327J400M981K8m786
$$ 4067 1864 -4146 -3826 2507 5829 392 -4595 -3400 2429 4885 986 -3341 -1941 3040 3068 -1718
2684a718k866M125M818k129o032m10M875L970l194m956O69M457J608l471k469
$$ -1718 -4584 -459 4359 2230 -3802 -4212 663 4633 1439 -3517 -2848 1609 3217 -254 -2723
2699b723J939L651j04m603j672M302M246q08o109k325M596M774k685m152p23L220
$$ -2723 -784 2867 2763 -1840 -3512 790 5036 4228 -1881 -4206 390 5164 2479 -1673 -2396 824
2715H24K699k394l332J187L289O67m212k240L389N663k231n752k292M488L969
$$ 824 3523 1129 -2203 -1016 2273 2940 -1272 -3512 -123 5540 3309 -2443 -4735 -247 3722
2730C722r94m038j923L993L045k961m207J053N616J890n594m324K156O107J560
$$ 3722 2728 -1310 -3233 760 3805 844 -3363 -2310 3306 5196 -398 -4722 -2566 3541 5101
2745E101n326m470K895M724k10m202j674L228L599l782l975J148O157K132n256
$$ 5101 -225 -4695 -1800 2924 2714 -1488 -3162 66 3665 -117 -4092 -2944 3213 5345 89
2760H9n482K044O050K628m235o159K441N049K547n290k954L772M046k526n490
$$ 89 -5393 -3349 2701 5329 1094 -5065 -2624 2425 4972 -318 -3272 500 4546 2020 -3470
2775c470l69O829K298l208n388j64N415K812k908n485J589M696R39m305l380L500
$$ -3470 -3839 2990 5288 2080 -3308 -3472 1943 4755 1847 -3638 -2049 2647 3586 -719 -4099 -599
2791e99N786k454o290r94N542N406l016o133j673M603L156j460k997k26K979J472
$$ -599 5187 2733 -3557 -4551 991 6397 3381 -2752 -4425 178 3334 1874 -1123 -1349 1630 3102
2807C102n028k012L442N364j929o924j500N118M323j039n662j077L691L478k427
$$ 3102 -1926 -3938 -496 4868 2939 -3985 -5485 -367 3956 2917 -2745 -3822 -131 3347 920
2822I20l250j76M866R32m113m374L348N591o98m121k946J468O066m73m431j479
$$ 920 -2330 -2506 2360 3292 -821 -5195 -1847 3744 3046 -1075 -4021 -2553 3513 3040 -1391 -2870
2838b870K133M528k771l820P53M914L78n101k194K837M484J534m926m063J553
$$ -2870 -737 3791 1020 -2800 -2047 2867 3245 -1856 -4050 -1213 3271 4805 -121 -4184 -2631
2853b631L395L537l888l185J799M107j417m029N87L394K645m266l134J428M749
$$ -2631 764 4301 413 -2772 -973 3134 1717 -2312 -1725 1669 4314 48 -3086 -1658 3091
2868C091K44k842l265N20L275K146k372l071R56M535j271m907j83M418K699l712
$$ 3091 3335 493 -2772 -2252 1023 3169 797 -2274 -1318 3217 1946 -2961 -3144 1274 3973 261
2884B61l662J31M481J017j026l473o94L012K509k359k252J717L624r72n069q31
$$ 261 -3401 -3270 1211 2228 1202 -2271 -2965 47 2556 197 -2055 -338 3286 2314 -2755 -3586
2900c586N203L573l218n297m9M206L140k357l728j321M324J663k246l199J753
$$ -3586 1617 5190 1972 -3325 -3374 832 3972 1615 -2113 -3434 890 2553 307 -2892 -1139
2915a139M775p47m628j437K876L264Q0m480j472L054L738k166l715j490N611J660
$$ -1139 3636 2889 -1739 -3176 -300 2964 3044 -1436 -2908 146 3884 1718 -1997 -3487 2124 3784
2931C784m405k790K226M438J3m659k732K268L648J389l015m326K880K581R83l818
$$ 3784 -621 -3411 -1185 3253 3266 -1393 -4125 -1857 1791 3180 165 -4161 -1281 1300 2283 -1535
2947a535n12K322J759k649l572J914M481Q72m571k469K145M038J302m666j710
$$ -1535 -2047 275 2034 -615 -4187 -2273 2208 3080 -1491 -3960 -1815 2223 3525 -1141 -2851
2962b851K153L307o30l566l30K592K191k590k419K9L931J090k765k682J238K232
$$ -2851 -698 2609 1979 -1587 -1917 675 2866 276 -2143 -2114 1817 2907 142 -2540 -1302 930
2978I30P02k202j943J338L634j392k956m00K452L757k799m183N44L518J771q55
$$ 930 1632 -570 -2513 -1175 2459 1067 -1889 -2289 163 3920 1121 -3062 -2518 1000 2771 1916
2994A916l806j77K624J610j872k290n72M227p66j936j623K503J371o72j989r80
$$ 1916 -1890 -2067 557 2167 295 -1995 -2567 1660 894 -1042 -2665 -162 1209 537 -1452 -2432
3010b432K743J257o52k683j80J898J791j431k949J023L219M31k735k315J798L266
$$ -2432 311 1568 916 -1767 -1947 -49 1742 311 -2638 -1615 1604 2035 -700 -3015 -1217 2049
3026B049m89l382KJ800K451r79k278j003K257J436j656j506O51K624K67k688k268
$$ 2049 1560 -1822 -1820 -20 2431 1452 -826 -1829 428 1864 208 -1298 -647 1977 2244 -444 -2712
3043b712K289K641m98k570j631K412K503q94k702k058L156K548k124j992p04L045
$$ -2712 -423 2218 1720 -850 -2481 -69 2434 1540 -1162 -3220 -64 2484 360 -1632 -2336 709
3059G09J096j479k383Q87K069j83k712p91K275L029j145l483k03K276L039k476
$$ 709 1805 326 -2057 -1170 899 716 -1996 -2787 -512 2517 1372 -2111 -2314 -38 3001 525
3075E25k734L86K141J250j640k094P30K574J753l103k938K087L425n44k448k343
$$ 525 -2209 -1823 318 1568 -72 -2166 -1436 1138 2891 -212 -3150 -1063 2362 1818 -630 -2973
3091b973L168J910r56j784o60K126J097j698j469n42L640O22k317k475J019L108
$$ -2973 195 2105 1149 -635 -1295 831 1928 230 -1239 -1781 1859 2481 164 -2311 -1292 1816
3107A816J059l164k313J849K212k53j488j271J831Q57j316j745L20K755J100k536
$$ 1816 2875 -289 -2602 -753 1459 1206 -282 -1553 278 1135 -181 -1926 -1606 1149 2249 -287
3123b87k486J198K224J321k478r32P21J589o4j922o25J910J005J07k980r53K794
$$ -287 -2773 -1575 649 1970 -508 -1440 -719 870 806 -1116 -1741 169 1174 1281 -1699 -2652 142
3140A42J938j179j618p34J276J582p59l07j100J439O08j748n95K45K716N4k997
$$ 142 2080 901 -717 -1451 -175 1407 648 341 -759 680 1288 -460 -1055 -810 1906 1960 -1037
3157a037r14K962J161o0k333j318K124Q65l60j672K63J087N48k030p4P77J585
$$ -1037 -1951 1011 2172 2112 -221 -1539 585 1450 1090 -582 -319 768 1316 -714 -788 -11 1574
3174A574j81k253j207J479K015O12k875n10R92J151k76j224Q21Q48n21j201p82
$$ 1574 1393 -860 -2067 -588 1427 2039 -836 -1346 -354 797 521 -703 118 966 445 -756 -1538
3191a538L68K655M19k039k149J524J392J268j734n51L09J79J20j028M25J507j32
$$ -1538 -1170 1485 1904 -135 -2284 -760 632 1900 166 -385 -76 103 223 -805 -380 1127 995
3208I95j194r21N08J948M08k544j029J068J601K46j124q11J390j94k65j017R87
$$ 995 -199 -1120 -612 1336 1744 -800 -1829 -761 840 1086 -38 -849 541 347 82 -935 52
3225E2J773o8j628k141J369J123J437j154j829J005j02O59k180J748J229o9j456
$$ 52 1825 1757 129 -2012 -643 480 1917 763 -1066 -61 -163 496 -1684 64 1293 1224 -232
3242b32j403Q07K272R54j706k249r7J579J036j51q09p94O03k58jQ5J182J000j102
$$ -232 -1635 -828 1444 2398 692 -1557 -1654 -75 961 810 1 -793 -190 -448 -449 -364 818 1818 716
3261G16k256M67K298J65p83j923N8M85J408l41k28J47O18p44j49o67J334J306
$$ 716 -1540 -1073 1225 1390 607 -1316 -1258 -773 635 294 66 213 831 87 -62 -729 605 1911
3279A911j637q89j432J129J840P42j669q11J56R20J18M44q69J087j95j721m49
$$ 1911 274 -615 -2047 -918 922 1664 -5 -816 -660 260 378 822 -47 1040 845 -876 -1325
3296a325J869J289o31j005j306R64J301K97p06j141K11M0P78r3o0L92k37l97p06
$$ -1325 544 1833 1202 197 -1109 -145 1156 1453 747 -394 -183 -143 635 542 482 874 637 240 -466
3315d66k01K026qp14j843K54J601l5l91n62M42L92p5k52q07J001O79j131r39Q8
$$ -466 -667 1359 1351 637 -1206 -952 649 614 223 -339 103 495 420 168 -639 362 1041 -90 -1029 -941
3335i41J710M42l69j408m77J461K70j29J28m33J42l72p17k46J612O7l86o53j0
$$ -941 769 1211 842 -566 -1043 418 688 559 687 254 396 24 -693 -939 673 740 354 -299 -309
3354c09J384L63j481l61r59J342M71J76n72L33O34o12n37q5M97J017j31j018o46
$$ -309 1075 1438 -43 -404 -1363 -21 450 626 54 387 1021 409 -128 -213 284 1301 1170 152 -494
3373d94k8N44L80l41M19l48J49L40n16j63P09K77k102K30J302J263j121m05n61
$$ -494 -522 22 402 61 480 132 281 621 105 -58 651 928 -1174 -944 358 1621 500 95 -466
3392d66L24J201o23o50M73M55o60l09J76L42J88j51o78p55J155J120r30k78p29
$$ -466 -142 1059 436 -214 259 714 54 -255 -79 263 451 300 -378 -1133 22 1142 212 -66 -795
3411g95R99m34o2J42M87K8J15q60K50o54J787l89q50n01N15J255n84N36q41k75
$$ -795 204 -230 -292 -150 337 365 480 -380 -130 -784 1003 614 -236 -737 -222 1033 449 985 144 -131
3431a31L02m22M41J86J24l96O96j107K14J098q28j40N1l24N12Q00m22n15p7N87
$$ -131 171 -251 190 376 500 104 800 -307 -93 1005 177 37 88 -236 276 1076 654 139 62 649
3451F49j631N63J157p26K71k00j31k42l67J071l03q42k82J188q19R61r89K48L28
$$ 649 -982 -419 738 12 283 83 -48 -290 -657 414 111 -731 -1013 175 -644 317 -672 -424 -96
3470i6L37m30O31p25m6R45j305L07k70P45R51j665O3Q4O54L67l15n66L07L48k95
$$ -96 241 -189 442 -283 -329 616 -689 -382 -652 93 1044 -621 -558 -474 180 547 232 -334 -27 321 26
3491B6J66k1j86k02K89r49J421M85j006R3L23o30Q11l18o1q3k71N02o02j89K11
$$ 26 192 171 -15 -217 72 -877 544 1029 23 116 439 -191 620 302 241 158 -113 389 -213 -402 -191
3512a91K60J026j136n12P70L16r78q1M85k09P16j3K62r93J40P34j100m91K92J024
$$ -191 69 1095 -41 -553 217 533 -445 -526 -41 -250 466 453 715 -278 -138 596 -504 -995 -703 321
3532C21o40n37K27Q11j20K35o09Q45o12j43O65l25k94j28j25L66n5l69J164p50
$$ 321 -319 -856 -629 182 62 297 -312 533 -79 -222 443 118 -176 -304 -429 -63 -118 -487 677 -73
3552g3p20L28N45o7K90k48O94n66l81M20K37m4k16k55k58O41j65J094q99k71n21
$$ -73 -793 -465 80 13 303 55 749 183 -198 222 459 415 199 -56 -314 327 162 1256 357 86 -435
3573d35L9J6P42N66o84L70L13o61j099M97N01K46j070K06P24J69P0q60R4m67j34
$$ -435 -396 -380 362 928 244 614 927 266 -833 -336 165 411 -659 -453 271 440 510 -350 -256 -723 -857
3594h57O11q5R7k7K75K51k80o13J25J99j2k23O99M31o59j37L8p13j3J564K81l16
$$ -857 -246 -331 -234 -261 14 265 -15 -628 -503 -304 -316 -539 160 591 -68 -205 -167 -880 -893 671 952 636
3616F36p65j15J13l88K62J150n89M1m53K13N1J59M46p82l68J35O66k16m7O1J049
$$ 636 -129 -244 -131 -519 -257 893 304 345 -108 105 156 315 761 -21 -389 -254 412 196 149 210 1259
3637A259j514j91l8J212J02m71j90k10j458J599M19q41k6K11k03R2Q78q52N07
$$ 1259 -255 -446 -484 728 830 359 169 -41 -1499 100 519 -322 -348 -137 -340 -248 630 -222 285
3656B85p80n69L83P86m20P72q29n48o78J63J627k85L27l17K77j295Q41R34l53
$$ 285 -495 -1064 -681 105 -315 457 -372 -920 -1598 -1435 192 -93 234 -83 194 -1101 -260 674 321
3675C21n28l34KO51n39L56N52j84j164j01J183P49k23j232N89o03J9J275l70N61
$$ 321 -207 -541 -539 112 -427 -71 481 297 -867 -968 215 964 741 -491 98 -505 -486 789 419 980
3695I80j182o6J06M93o63J287o51r75J98J55P98j78p1q8j631J146M46L33n0l41
$$ 980 -202 -268 -162 331 -332 955 304 -671 -473 -318 480 302 231 143 -1488 -342 104 437 387 46
3715D6K7n00J09j02P47k46j43l62K76J86k53P58m78l64R6J07N0J13J1p51M38o12
$$ 46 73 -427 -318 -420 327 81 -62 -424 -148 38 -215 543 65 -299 -203 -96 -46 67 78 -673 -235 -847
3737h47J169J15k85L26n39m05p76R96R89k91m75j32O8j86P60J82R8p75n51P99
$$ -847 322 437 152 478 -61 -466 -1242 -246 743 452 -23 -155 -87 -273 487 669 767 -8 -559 240
3757B40N35k97K27j0o56m44L99j4N71m80o89R33jo70O0N34L32j072M29o1J61m45
$$ 240 775 478 705 695 39 -405 -6 -20 551 71 -618 315 314 -356 -296 238 570 -502 -73 -134 27 -418
3779d18R53l11r60p93R47J254K6L1j174P6PN12K7J46k52j29n89R20j27P96j450
$$ -418 535 224 -736 -1529 -582 672 698 729 -445 -369 -362 150 177 323 71 -58 -647 273 146 942 -508
3800e08N55n83L93Q6J059o34q73K4L49r3J69L31K46l00J71m15O4M46m81N85p99
$$ -508 47 -536 -143 -57 1002 368 -505 -481 -132 -225 -56 275 521 221 392 -23 41 487 6 591 -208
3821b08j35Q1M54P40p42o76N34J14o3O5l86J16n9p90P42l65j48R65n43p94K09
$$ -208 -343 -262 192 932 190 -486 48 162 99 164 -222 -106 -165 -955 -213 -578 -726 239 -304 -1098 -889
3842h89J241J31r2m11K91j45L33l21j29q61P5N57j89N13k66K90l7J18r96N41J38
$$ -889 352 483 391 -20 271 126 459 138 9 -852 -777 -220 -409 104 -162 128 91 209 -787 -246 -108
3863a08N97l33k6j65J03p61N50O12o19m17O42j50J56R39o80K64p30O16P9m03K19
$$ -108 489 156 130 -35 68 -693 -143 469 -150 -567 75 -75 81 1020 340 604 -126 490 569 166 385
3884C85l84k91N70M0k28O77r99n5pl0L74J10p5q8j06J86lj45r8K73o4n18J28q4
$$ 385 1 -290 280 320 92 769 -230 -285 -292 -322 52 162 87 -1 -107 79 76 -69 -167 106 42 -476 -348 -432
3908d32O9K93P7M26j200P86R5qL83n19n10M32K41O60k52j19k92k53j68P26J38
$$ -432 -363 -70 7 433 -767 19 114 106 489 -30 -540 -108 133 793 541 422 130 -123 -291 435 573
3929E73m70m40M03P9k64R5q32J451m05k7p39J121L40r93O32j35N7O55j000O35
$$ 573 103 -337 66 145 -119 -24 -856 595 190 163 -576 545 885 -108 524 389 446 1101 101 736
3949G36j118M98l36R8R14j311O17N73m49m1K08j50m41Q00k47j196M64J33O52L75
$$ 736 -382 116 -220 -122 792 -519 98 671 222 181 389 239 -202 598 351 -845 -381 -248 404 779
3969G79j148O95m83P11m16j28M15r73M10P2L0L74n2r9L8L26k32M71o21o8o93L41
$$ 779 -369 326 -157 554 138 10 425 -548 -138 -66 -36 338 286 187 225 551 319 790 169 101 -592 -251
3991b51J83k3p8k49j87M72L54l23j32P9l23L78P0Rm3l94M85Q1M93r29R42n04k94
$$ -251 -68 -91 -169 -418 -605 -133 221 -102 -234 -155 -478 -100 -30 -21 -64 -458 27 108 601 -328 614 110 -184
4014a84l1j10M69J9m00K83k96J6o0M67L05l35l37K76m82N84j0J56k33m11M37K6
$$ -184 -215 -325 144 163 -237 46 -250 -234 -294 173 478 143 -194 82 -400 184 174 330 97 -314 123 149
4036A49J94j58K31p26O07j50M13q51R99n54O5m19n05R92N35j155k92L04O82m16
$$ 149 343 185 416 -310 297 147 560 -291 708 154 219 -200 -705 287 822 -333 -625 -321 361 -55
4056e5P25o74J19J13q0m05K19M10J45oq99J26n3Q26m66K34K54o45K80J99M25p44
$$ -55 670 -4 115 228 148 -257 -38 372 517 511 -388 -262 -315 511 45 279 533 -112 168 367 792 48
4078D8j48M3J25N66J69o36K13k07m30K69O08L34n60r83L06j72N83O88o99l96Q0
$$ 48 -100 -57 68 634 803 167 380 173 -257 12 620 954 394 -589 -283 -455 128 816 117 -279 -199
4099a99O5O47j84m43k71M02J49j38L00O88j7j438K41M26m68P18n65K01n43M54
$$ -199 -134 513 329 -114 -385 17 166 28 328 1016 999 -439 -198 228 -240 478 -87 114 -429 25
4119B5k19j40N15l54M80p24m85Q82M6J077o06n59m43p38J544PL49j238M28J59
$$ 25 -194 -334 181 -173 307 -417 -902 -20 26 1103 497 -62 -505 -1243 301 308 657 -581 -153 6
4139Fm53M56k39r8L59p95N53M36k70N83p49J87m45%J61L68Q04j195r6N24j07l78
$$ 6 -447 9 -230 -328 31 -764 -211 225 -45 538 -211 -24 -469 -469 -308 60 864 -331 -427 97 -10 -388
4161c88O63M35J6j001k60R4O3J005k18r87K72j21J055l26J18p94K0M39l33O93
$$ -388 275 710 726 -275 -535 -441 -378 627 409 -578 -306 -427 628 302 420 -374 -354 85 -248 445
4181D45N26r80j162J156q03O99j77Q38m67m62M77N26K12j01l91n05j163P11O15
$$ 445 971 -9 -1171 -15 -818 -119 -296 542 75 -387 90 616 828 727 336 -169 -1332 -621 -6
4200fJ198j017o66K5l2O17K45r1L64m78o47Q29l74O85O3q69M84n68N9O57N25m96
$$ -6 1192 175 -491 -466 -498 119 364 273 637 159 -488 341 -33 652 715 -154 330 -238 -179 478 1003 507
4222E07O5q64N83l81N18P78p15o08j00Q05q77R22o06m83pO75k71j39M60J98l40
$$ 507 572 -292 291 -90 428 1206 491 -117 -217 588 -289 633 27 -456 -463 212 -59 -198 262 460 120
4243A20O4j100J218j20k94O8n09M01O13M94n15K04k45o68K07K1J059m34m01q95
$$ 120 184 -916 302 182 -112 -44 -553 -152 461 955 440 644 399 -269 -62 -41 1018 584 183 -712
4263g12L01J0P37K80l62J46r39J99k2J194q02P08j44o07p49P70J57O81j562P81
$$ -712 -411 -401 336 616 254 400 -539 -340 -362 832 30 738 594 -13 -762 8 165 846 -716 65
4283F5r0k73M30J63l29OM54O4o23L4rO42r91J66O28k05n7M39q86j00L26N58k50
$$ 65 -25 -298 132 295 -34 -28 426 490 -133 -99 -108 534 -457 -291 337 132 75 514 -372 -472 -146 412 162
4306A62Q14j012k30P19m71l23J041r38k33L44P1M57l37k4K8p33L51Q48O77j166
$$ 162 976 -36 -266 453 -18 -341 700 -238 -471 -127 -56 401 64 40 68 -665 -314 534 1211 45
4326D5k6k08r15J433j70q8j29k5j88J013o03l16K86K74q3l37M36j149P59L23J13
$$ 45 19 -189 -1104 329 159 71 -58 -83 -271 742 139 -177 109 383 300 -37 399 -750 9 332 445
4347D45K10r74J44J19J051l34J05p44p71Q31P2P4k16J59L5n78N21m12P29n81k8
$$ 445 655 -319 -175 -56 995 661 766 22 -749 82 154 228 12 171 206 -372 149 -263 466 -115 -143
4368a43K25O53l14k45m02K82o8L61M46p76l44j5J012j020Q32j57o96K07L03P78
$$ -143 82 735 421 176 -226 56 -12 349 795 19 -325 -340 672 -348 484 327 -369 -162 141 919
4388I19o62m3n08M44M82o58j54j55K30N64l11L5l55J5N35j25N8j040Q5L23kM94
$$ 919 257 214 -294 150 632 -26 -180 -335 -105 459 148 183 -172 -157 378 253 311 -729 -644 -321 -323 171
4410A71J08K60m11lK06l12k60m75Q29n16M97J30m78L41p80O41k61j52Q79j13m8
$$ 171 279 539 128 125 331 19 -241 -716 113 -403 94 224 -254 87 -693 -52 -313 -465 414 301 253
4431B53o29O11j9K5j13n93M76J5L7o21M51n17L68L47l81N78r18O41o69J306j039
$$ 253 -376 235 216 241 128 -465 11 26 63 -558 -107 -624 -256 91 -290 288 -630 11 -658 648 -391
4452c91P38k99k08L38J41q13Q90K8N2o93O08k13l65L27KN29j036L17m63j04K10
$$ -391 347 48 -160 178 319 -494 396 424 476 -217 391 178 -187 140 142 671 -365 -48 -511 -615 -405
4473d05O16k76J14N0j22l23j08J079j035o06N81K23R09J89j290r9R15n00L45L46
$$ -405 211 -65 49 99 -23 -346 -454 625 -410 -1016 -435 -212 697 886 -404 -503 412 -88 257 603
4493F03q03M66j26r17J283k03N8j99j6L05p51O21m1l47l3n94P94p27Q40K40J41
$$ 603 -200 266 140 -777 506 303 361 162 146 451 -300 321 280 -67 -100 -694 100 -627 213 453 594
4514E94p93J40j20K89l67P84k43j052J013L27m56l0q6j03k32l65J234L66p98k88
$$ 594 -199 -59 -179 110 -257 527 284 -768 245 572 116 86 0 -103 -335 -700 534 900 102 -186
4534a86N99r24K68N03K68P9n13J84o87L70K15K38l70k57N22j41p0j31N1n4K43
$$ -186 413 -511 -243 260 528 607 94 278 -409 -39 176 414 44 -213 309 168 98 -33 18 -36 207
4555B07l73k69L06M3L99j013RJ63Q35K58m83j3J58m73k76P46P14j087r57R48l36
$$ 207 -166 -435 -129 -86 313 -700 -691 -528 307 565 82 69 227 -246 -522 224 938 -149 -1106 -158 -494
4576d94p5P15l28k48L19j57N82L15j271R19o5m52k03N11m98j5N86p79P86l72K07
$$ -494 -569 146 -182 -430 -111 -268 314 629 -642 277 212 -240 -443 68 -430 -445 141 -638 148 -224 -17
4597a7j83M51j45j2K06o45L02Q59k17n55O4o55J174q23Q00n28j4j27L7L2O00q43
$$ -17 -200 251 106 94 300 -345 -43 816 599 44 108 -547 627 -196 604 76 62 -65 -28 4 604 -239
4619b39J29j65N53j17l44J28n09j48J032p82K80J53K45m48q15J352P0m90j78j34
$$ -239 -110 -275 278 161 -183 -55 -564 -712 320 -462 -182 -29 216 -232 -1047 305 375 -115 -293 -427
4639d27j74M74k59M66l81L25n65M84l83M02M04n59L85p11M03J60K70K99k94q43
$$ -427 -601 -127 -386 80 -301 24 -541 -57 -440 -38 366 -193 192 -519 -116 44 314 613 319 -524
4659e24K45M4R68r15o2j16J20O9O25P90q30j06o07M81m64P33N07j270n48O56j1
$$ -524 -279 -235 733 -182 -244 -360 -240 -171 454 1244 414 308 -299 182 -282 451 958 -312 -860 -204 -215
4680b15J21P04j83r15L65l17O5L38L39n42J75J6M45m93l43R3P38m35J24q57Q07
$$ -215 -94 610 427 -488 -123 -440 -375 -37 302 -240 -65 -49 396 -97 -440 -347 391 -44 80 -777 30
4701C0o6L32m74p7L3l66K85P35p69O0L64m4M28n56K63l23m45L78k61P79O01m89
$$ 30 -36 296 -178 -255 -222 -588 -303 432 -337 -277 87 43 471 -85 178 -145 -590 -212 -473 306 907 418
4723D18q72K02R05q54n82R87j03J98o00M59K0m7k79J030j008M7J90L78K0p90J0
$$ 418 -454 -252 653 -201 -783 204 101 299 -301 158 178 131 -148 882 -126 -79 111 489 509 -281 -271
4744b71J73j67P98K7l46l58K18k20K27J9K83o48l4J28M52O1r8N31n57j051J349
$$ -271 -98 -265 533 560 214 -144 74 -146 81 100 383 -265 -299 -171 281 342 244 775 218 -833 516
4765E16k56J27p29Q79L9j018L49N80r45N80K57k20m29R05P9m18k1L88j74q48J026
$$ 516 260 387 -342 537 576 -442 -93 487 -458 122 379 159 -270 635 714 296 275 663 489 -359 667
4786F67q4n19J48q46N27L31j58N56m52k77m14M24L77n60N50j34j4O31m31J16l0
$$ 667 583 64 212 -634 -107 224 66 622 170 -107 -521 -97 280 -280 270 136 122 753 322 438 408
4807D08l82o48M27K72L72l80J10m39N42j47K00q99M81K63o76j65N07J029j546
$$ 408 26 -622 -195 77 449 69 179 -260 282 135 335 -564 -83 180 -496 -661 -154 875 -671
4826f71P55o47O82q3J22o66P34m84M94J11q08P50n6m56O13n23j08R8l1J070q11
$$ -671 84 -563 119 36 158 -508 226 -258 236 347 -461 289 233 -223 390 -133 -241 -143 -174 896 85
4847H5n51J80N06L78k62p70N30k49O69m76rR24r86R0o82p6k13J410l77J89j4o85
$$ 85 -466 -286 220 598 336 -434 96 -153 516 40 31 955 -31 59 -623 -699 -912 498 121 310 296 -389
4869c89N66k57p9M36l23K45o21N84L46o07J98m99P89J72K5q42J22j36N05k43K39
$$ -389 177 -80 -159 277 -46 199 -422 162 508 -99 99 -400 389 561 586 -256 -134 -270 235 -8 231
4890B31n24J55M61L4o81l63P05M19j010K93m85J309l36J80j016J554q58K2K37
$$ 231 -293 -138 323 357 -324 -687 18 437 -573 -280 -765 544 208 388 -628 926 68 90 327
4909C27j110O00j98Q90m33l27O8q2o79L29M28M98J11m86M61k25O56p00j85M83
$$ 327 -783 -183 -381 509 76 -251 -183 -265 -944 -615 -187 311 422 -64 397 172 828 128 -57 426
4929D26m65N63j60n73l4J46L72K53L82j479Q72o70O92p06j59J115n68j00o82M70
$$ 426 -39 524 364 -209 -243 -97 275 528 910 -569 303 -367 325 -381 -540 575 7 -93 -775 -305
4949c05M23l37M66k97K50K39n50l2k83N0P14l14p16L97J50L78j01K55r51J177
$$ -305 118 -219 247 -50 200 439 -111 -143 -426 -376 338 24 -692 -295 -145 233 132 387 -564 613
4969F13n55l00k28R61L31K83j130j84j07p4M51K86n5j72M4L15o03N3O35j8j95
$$ 613 58 -242 -470 491 822 1105 -25 -209 -316 -390 61 347 292 120 164 479 -124 -71 564 546 351
4990C51r92Q17j27L73m06l92J40O3NM32k10N1j05J99o3l64r5m5N87q72j59J450
$$ 351 -641 176 49 422 16 -376 -236 -173 -168 264 54 105 0 199 136 -228 -323 -368 219 -653 -812 638
5012F38k65L72q17l54K97j8J88j21Q4k17P00m15K32J2l84L35m91J46k4J40m07
$$ 638 373 745 -72 -426 -129 -147 41 -80 4 -213 487 72 304 316 -68 267 -224 -78 -102 38 -369
5033c69L38j22o32L60N49l60k02M97L58l49n19Q42K87m81l78r1O08j9K84p47L02
$$ -369 -31 -153 -785 -425 124 -236 -438 59 417 68 -451 391 678 197 -181 -272 336 317 601 -146 156
5054A56k15p3q4N74o7J55n75L4j02j45N36j86j093L04J8M85M06l88L50j85Q7K22
$$ 156 -59 -132 -216 358 291 446 -129 -95 -197 -342 194 8 -1085 -781 -763 -278 128 -260 90 -95 -8 214
5076B14j045Q64J42L81q8l57r51J702j32j338O85l73J83J64J78l50l13R15k77
$$ 214 -831 33 175 556 468 111 -840 862 730 -608 77 -296 -113 51 229 -121 -434 481 204
5095B04o53N62K74M24p71j023J312K1J8l89o13P83j69m83Q70p18J77Q29N8r09
$$ 204 -449 113 387 811 40 -983 329 350 368 -21 -634 149 -20 -503 367 -351 -174 655 713 -196
5115a96q84J194K68l43m48P21p50K76L85p49K7Q72J15r53L39J0R94k11r14L16
$$ -196 -1080 114 382 39 -409 312 -438 -162 223 -526 -499 373 488 -465 -126 -116 878 667 -247 69
5135F9O48j01p06l44p1J55o2J506r94J97L29m43J19j187J371J90j91r75J8K90
$$ 69 717 616 -90 -434 -505 -350 -412 1094 100 297 626 183 302 -885 486 676 485 -490 -472 -182
5155a82N39k67L0q71O62M23k93J16n72J270p82n62l68J048O17j01j127J38Q68
$$ -182 357 90 120 -751 -89 334 41 157 -415 855 73 -489 -857 191 808 707 -420 -282 586
5174E86l29m03J26R5j35L14k04R4J28j59m7q03OK30J032n76J78j06l72k32R00
$$ 586 257 -146 -20 75 -60 254 50 144 272 113 66 -737 -731 -501 531 -45 133 27 -345 -577 323
5195C23n42L22k36J74op29Q71K60J8p50%l60N06O59p50l54M16m12O64l32O28j99
$$ 323 -219 103 -133 41 35 -694 177 437 455 -295 -295 -655 -149 510 -240 -594 -178 -590 74 -258 370 171
5217A71N72j058j61K54P11N09r12l30k85J141n52J85j17O4J96k50k00m0n02L41
$$ 171 743 -315 -476 -222 489 998 86 -244 -529 612 60 245 128 192 388 138 -62 -102 -604 -263
5237b63K25j60q5k69J121p92j47k96M41M78l75N85k35m45N63o93L04J9P2J71n65
$$ -263 -38 -198 -283 -552 569 -223 -370 -666 -225 253 -122 463 228 -217 346 -347 -43 -24 48 219 -346
5258c46j56K86qM96k17o93j47J241J72n57n9L28K84p50j90r6k44Q04R0j089L6
$$ -346 -502 -216 -224 272 55 -638 -785 456 628 71 12 340 624 -126 -316 -412 -656 148 238 -851 -815
5279h15R59Q2j13p91R6J609j208o5n60J494O2n58r47J73Q54J15m5m65m4M96J35
$$ -815 144 226 113 -678 -582 1027 -181 -246 -806 688 750 192 -755 -582 272 387 342 -123 -167 329 464
5300D64m25N6J02l3K67m55M51m43L42O8o43O1Q25n25j92m51m0J199j117L87m47
$$ 464 39 95 197 164 431 -24 427 -16 326 394 -249 -188 637 112 -80 -531 -571 628 -489 -102 -549
5321e49J43R79J30p63k72N62j22j52k99P9k4O51l35o49M97P98j68o01p42P30J017
$$ -549 -406 573 703 -60 -332 230 108 -44 -343 -264 -288 363 28 -621 -124 674 506 -95 -837 -107 910
5342I10j024j26o2L17k30M41k98o90R37L30M07q34q4qJ017j578Q86n78n5L89o14
$$ 910 -114 -240 -302 15 -215 226 -72 -762 175 505 912 78 -6 -14 1003 -575 311 -267 -322 67 -547
5363e47M23q2J16k29N40k42L57j10m59n06P26j0N62%r08L93J75J04o65j35M01
$$ -547 -124 -206 -90 -319 221 -21 336 226 -233 -739 -13 -23 539 539 -369 24 199 303 -362 -497 -96
5384i6K50K71m39N2l83J253m58j040l27J186q2M22K5p72J20J82m00k55J79j59
$$ -96 154 425 -14 38 -345 908 450 -590 -917 269 187 609 634 -138 -18 164 -236 -491 -312 -471
5404d71Q71j98q82Q77O0L94j31j039L19Q29l97q73M00K38N19k61q87M56K48j16
$$ -471 400 202 -680 197 257 651 520 -519 -200 629 232 -641 -241 -3 516 255 -632 -176 72 -44
5424d4O89o31o20N04K23j01m29L38J74l75k23L5N47N33j087M87o2k31O71q1l63
$$ -44 645 14 -606 -102 121 20 -409 -71 103 -272 -495 -460 87 620 -467 20 -42 -273 398 317 -46
5445d6L52n26L31J90K43k04K43p49O9j81M61K37P67j962R64K91q17J41L93r00
$$ -46 306 -220 111 301 544 340 583 -166 -97 -278 183 420 1187 -775 189 480 -337 -196 197 -703
5465g03J063m48O4r7K14J83k60R4k81N11l68O00j061L1M16N15m83l31k22N02M01
$$ -703 360 -88 -24 -121 93 276 16 110 -171 340 -28 572 -489 -458 -42 473 -10 -341 -563 -61 340
5486C40l57j66K24qlr2k59L03N32o39K20OL5j81L39l06m7L76q88J04P08j93k52
$$ 340 -17 -183 41 33 30 -62 -321 -18 514 -125 95 101 136 -45 294 -12 -59 317 -571 -467 241 48 -204
5509b04K19l17N59l06N27p28L07n47K15J154j085m23N81l65J052k96o77Q98n72
$$ -204 15 -302 257 -49 478 -250 57 -490 -275 879 -206 -629 -48 -413 639 343 -334 564 -8
5528hQ11j045m0k87P31N59j372L14L4P03m61J89K5n16M45n15QL36K20j24L16k80
$$ -8 803 -242 -282 -569 162 721 -651 -337 -303 400 -61 128 153 -363 82 -433 -425 -89 131 7 323 43
5550D3l17P08k33K85j030O68N47m17p31J18J099p38P53j270K59R63K32r02q5m75
$$ 43 -274 434 201 486 -544 124 671 254 -477 -359 740 2 755 -515 -256 707 939 37 -48 -523
5570e23P20O20k55p53N75M25j258L3K39l80J085k71j32K72o35K96K85k65j94k82
$$ -523 197 817 562 -191 384 809 -449 -416 -177 -557 528 257 125 397 -238 58 343 78 -116 -398
5590c98O84j026K07J107K10j037j77K37P99m42O74q31J74k67N87m3M11j188J024
$$ -398 286 -740 -533 574 784 -253 -430 -193 606 164 838 7 181 -86 501 458 869 -319 705
5609G05k50n83K15L1o37L27k88M12M82m08N00L58j060O82r6r59P02k13l74M71
$$ 705 455 -128 87 118 -519 -192 -480 -68 414 6 506 864 -196 486 390 -569 133 -80 -454 17
5629A7L19r88R2J114k15j212P17P25p16P24m91o57Q0O64l64P5K83l2J78k05m52
$$ 17 336 -652 -560 554 339 -873 -156 569 -147 577 86 -571 -491 173 -191 -116 167 135 313 108 -344
5650c44M75K56k29J35o55M02K09k70n54RL38K89k12L20J41J0n81J81J32o2P06
$$ -344 131 387 158 293 -362 40 249 -21 -575 -566 -228 61 -151 169 310 320 -261 -80 52 -10 696
5671F96J98p75j30m6J72j05j83m02Q27K42o9k96l09K54R82j578M52K01K92J06
$$ 696 894 119 -11 -57 115 10 -173 -575 252 494 425 129 -180 74 1056 -522 -70 131 423 529
5691E29k63m49J80r6O06K55m41R6n4j15k83L13m37N44J22n47j01o5K75R31j551
$$ 529 266 -183 -3 -99 507 762 321 417 363 248 -35 278 -159 385 507 -40 -141 -206 69 1000 -551
5712e51l49J518K2k49j196O65N95q29k21J67J14Q3L41J81r38K29J168p24k73J67
$$ -551 -900 618 640 391 -805 -140 455 -374 -595 -428 -314 -231 110 291 -647 -418 750 26 -247 -80
5732h0k58J254j347J240r63LJ88j00l51M60K4j14N1p3L26O3r51P81M67l58k21
$$ -80 -338 916 -431 809 -154 -151 37 -63 -414 46 70 -44 7 -66 260 323 -628 153 620 262 41
5753D1q72N73p4Q15r2j07q77R92r7M31o65m98N66k68M19n32J25O57n37r57J019
$$ 41 -831 -258 -332 483 391 284 -593 399 302 733 68 -430 136 -132 287 -245 -120 537 0 -957 62
5774F2L12j45l59N89p24m78J157J77j056N69m33O51p37K02k16j74J337q96n55
$$ 62 374 229 -130 459 -265 -743 414 591 -465 104 -329 322 -415 -213 -429 -603 734 -162 -717
5793g17M42m85R05l99l41N28l92j17R95p58l1M21J47R4m60p1J92j78N41N04r04
$$ -717 -275 -760 145 -254 -595 -67 -459 -576 419 -339 -370 51 198 292 -168 -239 -47 -225 316 820 -84
5814h4l16L89K84n33K67l67O57l96L99M3J23k25j74m40O88m57N55j66n39N56l07
$$ -84 -400 -11 273 -260 7 -360 297 -99 300 343 466 241 67 -373 315 -142 413 247 -292 264 -43
5835d3j37p15P26J35o7K2L14p35j09J61K78l17M44L12m25L9M08l79J42L01J1j40
$$ -43 -180 -895 -169 -34 -101 -79 235 -500 -609 -448 -170 -487 -43 269 -156 -117 291 -88 54 355 366 226
5857B26p46J088k79mo25L14q8K64k61L0K33p06r4J138l74L7K83K87p05k2K49l48
$$ 226 -520 568 289 285 -340 -26 -114 150 -111 -81 152 -554 -648 490 116 153 436 723 18 -4 245 -103
5879a03J57L01k38J48m2J06n65P08n70L17j67N62k67o54j37J047m55M4o41L88
$$ -103 54 355 117 265 223 329 -236 472 -98 219 52 614 347 -307 -444 603 148 192 -449 -61
5899f1j33M7K33j39K92r12Q83l42O53K09m80L84j80m48j94J67M27n58K75o89O39
$$ -61 -194 -147 86 -53 239 -673 210 -132 521 730 250 634 454 6 -188 -21 406 -152 123 -566 73
5920G3J87n89J31J89K45m57N60q53N09j29m65R2L79o2J27n65J435o31l59R1k47
$$ 73 260 -329 -198 -9 236 -221 339 -514 -5 -134 -599 -507 -128 -190 -63 -628 807 176 -183 -92 -339
5941c39K86J16N00o12M37q79M58M94n96r4m02R2L6Q98j26Q7p0m48k68l89L79M96
$$ -339 -53 63 563 -49 388 -491 -33 461 -135 -229 -631 -539 -503 395 269 356 286 -162 -430 -819 -440 56
5963E6J50k44j6n6J14l01Q43m71M23l64m1K56o10l03N42k40K20N98r54K73m64
$$ 56 206 -38 -54 -110 4 -297 546 75 498 134 93 349 -261 -564 -22 -262 -42 556 -398 -125 -589
5984e89J66N56k22Q75j46r66P8J48J71J20K53m16m5L28n37K88O0l43M01r4k41
$$ -589 -423 133 -89 786 640 -326 -248 -100 71 191 444 28 -17 311 -226 62 122 -221 180 86 -155
6005a55k36l00J189l82j44P6K47j06nj72j22r06J425p43N78K69m17k43k59J42
$$ -155 -391 -691 498 116 -28 48 295 189 184 12 -110 -1016 409 -334 244 513 96 -147 -406 -264
6025b64Q78l96r3l92P1O8o48r7Q25L64m00K38j1J09n93M75k76J76q42R14J24L27
$$ -264 614 218 125 -267 -196 -128 -776 -873 -48 316 -84 154 143 252 -341 134 -142 34 -808 106 230 557
6047E57L85n41l83l54L47M98l59j92l12k00L76N77P3n15K27j40r2j14K12N54q04
$$ 557 942 401 18 -336 11 509 150 -42 -354 -554 -178 399 472 -43 184 44 -48 -162 50 604 -200
6068b00O43o68O69j23n08p67J559j388M72k7k2N98m61L34q40O14j17L81r90P76
$$ -200 443 -225 444 321 -187 -954 605 -783 -311 -338 -360 238 -223 111 -729 -115 -232 149 -841 -65
6088f5P71N9o28n4j5M71j224Q95r58P90n03R80m81j86O09n07l17K66R43j599L00
$$ -65 706 765 137 83 68 539 -685 210 -748 42 -461 519 38 -148 461 -46 -363 -97 846 -753 -453
6109d53j66Q15n13n0Q75p18N34M90o11j6k98m03M85K1n22P56o29m8J163n12k98
$$ -453 -619 196 -317 -367 508 -210 324 814 203 187 -111 -514 -29 -8 -530 226 -403 -451 712 200 -98
6130i8l55O96Lk16L1p45M04N22p28Q17o55L0J407j697L09L93k76Mk5K23O8L13
$$ -98 -453 243 246 30 61 -684 -280 242 -486 331 -324 -294 1113 -584 -275 118 -158 -154 -179 44 112 425
6152D25m48J61j45k45O64J5N2o75j118J294J33l18J07n16j86K69R44k97K0k61
$$ 425 -23 138 -7 -252 412 427 479 -196 -1314 -20 113 -205 -98 -614 -800 -531 413 116 136 -125
6172a25K44j45L1J20K4r3j29J20K24o1p85m36J042K6o84M22J23N26J8o22M05L30
$$ -125 119 -26 5 125 149 56 -73 47 271 210 -575 -1011 31 57 -627 -205 -82 444 462 -160 245 575
6194E75k30l39o65L25k52K82M1j36K47R3J2r7N80k98l58J23J007j223j44m2Q46
$$ 575 345 6 -659 -334 -586 -304 -263 -399 -152 -59 -47 -144 436 138 -220 -97 910 -313 -457 -499 347
6215C47k97j93j26M79m38m33O22m90M53J43j15m5K92R0m02Q67j39n90L43r33m71
$$ 347 50 -143 -269 210 -228 -661 -39 -529 -76 67 -48 -93 199 289 -113 754 615 25 368 -565 -1036
6236a036R07o13Q87J45j71q3p51k71Q45J90K73n30K87j04L66m35K0k12k96P65
$$ -1036 -129 -742 145 290 119 36 -715 -986 -141 49 322 -208 79 -25 341 -94 -74 -286 -582 183
6256A83K53m92l82K18N81j19l72j36Q1J54k47O96k63p48R27j93J09n8k63P20m85
$$ 183 436 -56 -438 -220 361 242 -130 -266 -185 -31 -278 418 155 -593 334 141 250 192 -71 649 164
6277A64o89Q7O28m23M19r3l75N34J14j46K40J34p34O20q7K81q33l49L65J94p22
$$ 164 -525 -438 190 -233 186 93 -282 252 366 220 460 594 -140 480 393 674 -159 -508 -143 51 -671
6298f71J93R52m27oK45k48R9k41M14n81J020p71J53p4O84j635J99L67N46p30O42
$$ -671 -478 474 47 41 286 38 137 -104 310 -271 749 -22 131 57 741 -894 -695 -328 218 -512 130
6319A30K68p30O71o88Q17l79k08K97Q1k76k16L97L63J03m60J54n84j10L45J59
$$ 130 398 -332 339 -349 468 89 -119 178 259 -17 -233 164 527 630 170 324 -260 -370 -25 134
6339A34o6l47K96J62n84j21P69l10j055Q21K13j84P40o57n43L83N76J60k73M94
$$ 134 68 -279 17 179 -405 -526 243 -67 -1122 -301 -88 -272 468 -189 -732 -349 227 387 114 608
6359F08r49L98k70N52R7r34J128q30L24q09K26P26r35N44J59L8L33m96JO23n06
$$ 608 -341 57 -213 339 436 -498 630 -200 124 -685 -459 267 -668 -124 35 73 406 -90 -89 534 28
6380B8j52l52K57K37N43k07l22k22P4j03n6P29j88n89K4R04p77K31K4Q1o72Q82
$$ 28 -124 -476 -219 18 561 354 32 -190 -116 -219 -275 454 266 -323 -299 605 -172 59 83 164 -508 374
6402C74n7o3n38l30Q8O70j09l53J79O43l88n16M03L20k03j15P1N6k77j85M54J93
$$ 374 317 254 -284 -614 -526 144 35 -318 -139 504 116 -400 3 323 120 5 76 132 -145 -330 124 317
6424C17%j20k85L68o84M35L49p26O1l45k47J214q5m33N78l78r0K8L20o92K88j98
$$ 317 317 197 -88 280 -404 31 380 -346 -285 -630 -877 337 252 -181 397 19 -71 -43 277 -415 -127 -325
6446c25M88NJ46J81l29K72p18R37o49L85r68K89M89n69K06L91j25J09k01L78o54
$$ -325 163 168 314 495 166 438 -280 657 8 393 -575 -286 203 -366 -160 231 106 215 14 392 -262
6467b62K92m00K18j3k66M78J57j73K39m6L60k06J84m51p24Q05J47l69P79q71j1
$$ -262 30 -370 -152 -165 -431 47 204 31 270 224 584 378 562 111 -613 192 339 -30 749 -122 -133
6488a33K94k70Q10p48j32J72l07P75n4q95L15M1j79k79K75Q24j109Q57j98N38
$$ -133 161 -109 701 -47 -179 -7 -314 461 407 -488 -173 -132 -311 -590 -315 509 -600 257 59 597
6508E97o15K11p16P37K7O8j21j00l41K34m6j46kO10k40N29k82j12j53q11J447
$$ 597 -18 193 -523 214 241 309 188 88 -253 -19 -65 -211 -213 397 157 686 404 292 139 -672 775
6529G75l50l02n53j66Q73l96M27K3r8m44m04L04J141k24r72JK4%K30M7J98l67
$$ 775 425 123 -430 -596 277 -119 308 331 233 -211 -615 -311 830 606 -366 -365 -341 -341 -111 -64 134 -233
6551b33J28K91KK1l68J4l38J215r95N56j5j88p6m32Q35n53n30Q03K86j06J93j46
$$ -233 -105 186 188 209 -159 -145 -483 732 -263 293 278 90 14 -418 417 -136 -666 137 423 317 510 364
6573C64k9q3m35M71m14N62m88%M90n61O06j111M01R99m34m19N21n80O83n67k93
$$ 364 335 252 -183 288 -126 436 -52 -52 438 -123 483 -628 -227 772 338 -81 440 -140 543 -24 -317
6594c17O71r74N84m42j01N50J64r76J163L04p31O6r6j44N09l44K67k11j3l05Q02
$$ -317 354 -620 -36 -478 -579 -29 135 -841 322 626 -105 -39 -135 -279 230 -114 153 -58 -71 -376 426
6615D26l86l45O2j16M46k24l69m7L78k29K56N51n42j57M97m73N93k79j87q0n17
$$ 426 40 -305 -243 -359 87 -137 -506 -553 -175 -404 -148 403 -139 -296 201 -272 321 42 -145 -225 -742
6636g42O25l23L65M40O8m62J9q26M29m1N13L84q10k5P35q8p1p07M59m32J101p69
$$ -742 -117 -440 -75 365 433 -29 -10 -836 -407 -448 65 449 -361 -386 349 261 190 -517 -58 -490 611 -158
6658a58O77o53J62j62O64j021P29n04K71O1j84J68k20l37P33l9M62j97J05k33
$$ -158 519 -134 28 -134 530 -491 238 -266 5 66 -118 50 -170 -507 226 187 649 452 557 324
6678C24n03K23K3N66o40J82m05L27n03Q79m67M72p70L17N40l47j81N02k53k22
$$ 324 -179 44 67 633 -7 175 -230 97 -406 473 6 478 -292 25 565 218 37 539 286 64
6698F4j28Q0o90P89m00J78j5l1j09q3J56M24M00l74k79O1R4o56R63j10p50Q55
$$ 64 -64 16 -674 115 -285 -107 -122 -153 -262 -345 -189 235 635 261 -18 43 137 -519 444 334 -416 439
6720D39p89P21J88o74l26Q23m9O34q61J9M32K0k67m92M36j78J15n08m42R59n62
$$ 439 -350 371 559 -115 -441 382 333 967 106 125 557 577 310 -182 254 76 191 -317 -759 200 -362
6741c62P80j01j158O71M53m6J00m07j3Q6K27M23q1j041O71J5o10K85M44k13q16
$$ -362 418 317 -841 -170 283 237 337 -70 -83 3 230 653 572 -469 202 217 -393 -108 336 123 -693
6762f93J697q02p61O93p7N1J89J38l7o57L06j82K1o0L05%K57j94k27L10m14M46
$$ -693 1004 202 -559 134 57 108 297 435 398 -259 47 -135 -114 -174 131 131 388 194 -33 277 -137 309
6784C09p29J032j080Q12j82l82N8M24j69l61M53K0K41m36m42N42l33N7L27m63
$$ 309 -420 612 -468 344 162 -220 -162 262 93 -268 185 205 446 10 -432 110 -223 -166 161 -302
6804c02O4M34k57n2p9Mm80O54j96M11J17p96Q1J055q63J51j27K57m32M72j15j23
$$ -302 -238 196 -61 -113 -192 -188 -668 -14 -210 201 318 -478 -397 658 -205 -54 -181 76 -356 116 1 -122
6826a22N41p15P0L82j024Q46M2j36J52j91j67L35M22q0k71O43j288N26j9P88j147
$$ -122 419 -296 -226 156 -868 -22 20 -116 36 -155 -322 13 435 355 84 727 -561 -35 -54 734 -413
6847d13L68J08P02q82j22Q83p25N49l54J44r5m19N03o43j6N29L54p90L51K5n07
$$ -413 -45 63 765 -117 -239 644 -81 468 114 258 163 -256 247 -396 -412 117 471 -319 32 57 -450
6868d50N53J6n85J390j113K6K84l02K42J34K89m60L12n82M15L4m97k1L79j067
$$ -450 103 119 -466 924 -189 -163 121 -181 61 195 484 24 336 -246 169 203 -294 -315 64 -1003
6888a003J307j009J595r91K59j64j09L21J45R5r39J249r99R6j77P17K3M6j31J42
$$ -1003 304 -705 890 -101 158 -6 -115 206 351 446 -493 756 -243 -147 -324 393 416 462 331 473
6908D73J04r30Q03m36N89p76N15n60K23m91Q97l4r76O60m90M40o98K93l8k65J16
$$ 473 577 -353 450 14 603 -173 342 -218 5 -486 411 377 -599 61 -429 11 -687 -394 -432 -697 -581
6929e81j18P77L9l58K22k06l7K43NJ31n65O03p06P37j82L41q60N62K87N4n90N62
$$ -581 -699 78 117 -241 -19 -225 -262 -19 -14 117 -448 155 -551 186 4 345 -515 47 334 388 -202 360
6951C60k82M29o28L33l02j02n2M73o60M74K67n26q5J7O89j71n78m35J142j17m71
$$ 360 78 507 -121 212 -90 -192 -244 229 -431 43 310 -216 -301 -284 405 234 -344 -779 363 246 -225
6972b25Q25p30J29J76K5M1n25J342j780R39L11n13k61O85j069N02J39M65j41l20
$$ -225 600 -130 -1 175 200 241 -284 1058 -722 217 528 15 -246 439 -630 -128 11 476 335 15
6992A5O37m6q09j69K48N2O82r64O96l84M2O4L30k26q40J068K07j419J015K7N5
$$ 15 652 606 -203 -372 -124 -72 610 -354 342 -42 0 64 394 168 -672 396 603 -816 199 226 281
7013B81l08M0K83N01j260M84j47L64j09L09m57J28R3K14n22P3k21j84L8P27k35
$$ 281 -27 13 296 797 -463 21 -126 238 129 438 -19 109 202 416 -106 -33 -254 -438 -400 327 92
7034I2Kl41P17j448L24J58Q36K67l90k01K71L28j88n68J04L43n47M15r7k00p19
$$ 92 94 -247 470 -978 -654 -496 340 607 217 16 287 615 427 -141 -37 306 -241 174 77 -123 -842
7055h42O51l19J271j620N68N6R32o74r08N51LL71j02L08o46L58J96j62J82J77
$$ -842 -191 -510 761 -859 -291 -235 697 23 -885 -334 -331 40 -62 246 -400 -42 154 -8 174 351
7075C51n32K24K57l24J70J6O57p08O3m38l7J42J83j92j8R34j322O05m18j37L04
$$ 351 -181 43 300 -24 146 162 819 111 174 -264 -301 -159 24 -168 -186 748 -574 31 -387 -524 -220
7096b20M15p26J73j45K82M90q84M26m15R30l33l03N15K46j131P02k56O09n17l31
$$ -220 195 -531 -358 -503 -221 269 -615 -189 -604 326 -7 -310 205 451 -680 22 -234 375 -142 -473
7116d73N26m4J76o88M04Q7R4k74K50K81q15P87m21J79k8RL61m03Q8J48J27R9o80
$$ -473 53 9 185 -503 -99 -12 82 -192 58 339 -476 311 -110 69 41 50 411 8 96 244 371 470 -210
7139b10j65L21J0L55l50j05k61Q91k89M75j116R39j19ql45KJ7m74J04J170r9p67
$$ -210 -375 -54 -44 311 -39 -144 -405 486 197 672 -444 495 376 368 23 25 42 -432 -328 842 743 -24
7161b4K81o88J29P4L93l94N30J24n55j32J91O20l11k45m60K89N54q53K15lm80
$$ -24 257 -431 -302 -228 165 -229 301 425 -130 -262 -71 549 238 -7 -467 -178 376 -477 -262 -265 -745
7182g45N75m62R59p02L80J74N69p46O36n19L97j30l8j021J075J6j084n7J178o75
$$ -745 -170 -632 327 -375 5 179 748 2 638 119 516 386 348 -673 402 418 -666 -723 455 -220
7202b20j71M05n14M82p14O00P14n66N63l16m59L56j68J12k96J00N16m84K03l45
$$ -220 -391 14 -500 -18 -732 -132 582 16 579 263 -196 160 -8 104 -192 -92 424 -60 143 -202
7222b02N59k64p47P48k26Q96q64k53L63p31M36O89j49O26n33l87J0n36O14l72
$$ -202 357 93 -654 94 -132 764 -100 -353 10 -721 -285 404 255 881 348 -39 -29 -565 49 -323
7242c23lQ95Lj076J020o59J37K93l24l89M15p0L48N9m54J47k1M81r78J181o66
$$ -323 -326 569 572 -504 516 -143 -6 287 -37 -426 -11 -81 267 326 -128 19 -2 479 -499 682 16
7263A6L47k19l23L82j95o5k6N65k41j35n52O52j40Q89j085m42q2N05m17L14M29
$$ 16 363 144 -179 203 8 -57 -83 482 241 106 -446 206 66 955 -130 -572 -654 -149 -566 -252 177
7284A77N6n50P01m88l79J2P92k13l65M32l8N26q56M43o46M18L39m79L7n3O70m60
$$ 177 233 -317 384 -104 -483 -471 321 108 -257 175 137 663 -193 250 -396 22 361 -118 -81 -134 536 76
7306G6K05j97j47R9M33k30o1J29n66k88M25J32m70j69K09r2O37L20l01N87Pj064
$$ 76 281 84 -63 36 469 239 178 307 -259 -547 -122 10 -460 -629 -420 -512 125 445 144 731 738 -326
7328c26N49l07J70m69P2l84Q30m15R07q53K02K70n17M11J17l02j67Q9k97J05N86
$$ -326 223 -84 86 -383 -311 -695 135 -280 627 -226 -24 246 -271 140 257 -45 -212 -123 -420 -315 271
7349B71J4k25L11m03k74J21Q07q62m62O60N95k79Q8j42j82L15m7k69j15k27M15
$$ 271 285 60 371 -32 -306 -185 622 -240 -702 -42 553 274 362 220 38 353 306 37 -78 -305 110
7370A10J230j410n6J068j034j39L00j79q6P35j72p97R7J18J8N64jn04q16Q31j00
$$ 110 1340 -70 -126 942 -92 -231 69 -110 -196 539 367 -430 -333 -215 -197 367 366 -138 -954 -123 -223
7391b23K96l03N18n97n68M33M25l92J2J50R33j557J139m0n67K85P1O66r08O79
$$ -223 73 -230 288 -309 -877 -444 -19 -411 -399 -249 684 -873 266 226 -341 -56 15 681 -227 452
7411D52o13R19m67m44o54Q38r00K51M95K48n51J039l48j18LK06l46q0r1O1N87
$$ 452 -161 758 291 -153 -807 31 -869 -618 -123 125 -426 613 265 147 150 356 10 -70 -161 -100 487
7432D87k70p87R13j139M23J90j77N12n45O23P67m5j006l8L08K33o06O52m08P7
$$ 487 217 -570 343 -796 -373 -183 -360 152 -393 230 997 952 -54 -92 216 449 -157 495 87 164
7452A64n22J1Q7N66L1K44n95O23P1r92N03n3M72p03o23R87K82l64j1K68m21o66
$$ 164 -358 -347 -260 306 337 581 -14 609 680 -312 191 138 610 -93 -716 271 553 189 178 446 25 -641
7474f41J209j139J230j071K23K07K32l5o41J007p03Q67r83M24k33k0m26K62K02
$$ -641 568 -571 659 -412 -189 18 250 215 -426 581 -122 745 -238 186 -47 -67 -493 -231 -29
7493b9q27P80l70j31Q27n07M22j65j65K27k75j05K55J78J3L19o41L73l2p34N36
$$ -29 -856 -76 -446 -577 250 -257 165 0 -165 62 -213 -318 -63 115 128 447 -194 179 147 -587 -51
7514e1J04J92J4q97Q24m42j49L87l68P99K65j091R71o7o38Nl17N35k45jN8Q37
$$ -51 53 245 259 -638 186 -256 -405 -18 -386 413 678 -413 558 491 -147 -142 -459 76 -169 -170 -112 725
7536G25j189J27L93o49j05J157o18M96j06o19R54n03k4l48R85k42o89P46o88J02
$$ 725 -464 -337 56 -593 -698 459 -159 337 231 -388 566 63 39 -309 676 434 -255 491 -197 -95
7556i5j2K60l10L63K9K9l72o0O62m17K43m15M29k14p43L59L6j15K76L74K23n51
$$ -95 -107 153 -157 206 235 264 -108 -168 494 77 320 -95 334 120 -623 -264 -228 -343 -67 307 530 -21
7578b1O14j184O14r60N88Q61p76L10RJ69o1l09K07K88o8Q1q17N43j23L35o84R77
$$ -21 593 -591 23 -937 -349 512 -264 46 55 224 163 -146 61 349 281 362 -455 88 -35 300 -384 593
7600E93p03J79J83r17J035n66L28j4n68R63m68m96P46m8o08N25K12j81o30M84
$$ 593 -110 69 252 -665 370 -196 132 118 -450 513 45 -451 295 247 -361 164 376 195 -435 49
7620D9p74P54J57o7nQ0J19r63J156j003O99q8m88R78q27Q81q24O61N62j160j42
$$ 49 -725 29 186 119 114 194 313 -650 506 -497 202 114 -374 604 -223 658 -166 495 1057 -103 -245
7641b45P84k51m97n9R27j47j22Qn71j59j06j88N57K41J30n50k1L19K94j122R39
$$ -245 539 288 -209 -268 659 512 390 398 -173 -332 -438 -626 -69 172 302 -248 -269 50 344 -778 161
7662A61j47j73L72r2j36J96Nm19O04p23L30o3L77j82K25l00k70J23K75J34n20
$$ 161 14 -159 213 121 -15 181 186 -233 371 -352 -22 -85 292 110 335 35 -235 -112 163 297 -223
7683b23M59j70l5m08N10O1j31l97K08M50k07N47n26m63R3k78P62r3m9L55o89j7
$$ -223 236 66 31 -377 133 194 63 -334 -126 324 117 664 138 -325 -232 -510 252 159 110 465 -224 -241
7705b41P67n44J94J41m81O36M05o89QJ47m46J30k94n8p3N07m47K49j30l25Q65
$$ -241 526 -18 176 317 -164 472 877 188 196 343 -103 27 -267 -325 -398 109 -338 -89 -219 -544 321
7726C21K18j119L21j44N81n16L54K27J90j093M00Q50q71J25O7K78l42O74l65j70
$$ 321 539 -580 -259 -403 178 -338 16 243 433 -660 -260 590 -281 -156 -89 189 -153 521 156 -14
7746a4n5K96m47j37P52L00p19j96O03k54P35j015K86M19k43o17M86%NJ88m27J05
$$ -14 -69 227 -220 -357 395 695 -24 -220 383 129 864 -151 135 554 311 -306 180 180 185 373 -54 51
7768E1l30k6K15j72p19R26O66k59n02J26Q3J25j98J36k72L83m74K00K12n22O31
$$ 51 -279 -305 -90 -262 -981 -55 611 352 -150 -24 59 184 -14 122 -150 233 -241 -41 171 -351 280
7789B80l64j16L19k98Q4o41O36j53P17m95l34N12l70M04r29P79r8J30O51r15P80
$$ 280 -84 -200 119 -179 -95 -736 -100 -253 464 -31 -365 147 -223 181 -748 31 -67 63 714 -201 579
7810E79r0o60q92J144k73O1M82M0m00J95o95K16M78K74o46j49M81l13K24L26K
$$ 579 489 -171 -1063 81 -192 -131 351 391 -9 186 -509 -293 185 459 -187 -336 145 -168 56 382 384
7831C84R1o7o64L98j41m61M12N94n10j65m02P60m84J43l12K64M67j82k11J54J05
$$ 384 475 408 -256 142 1 -460 -48 546 36 -129 -531 229 -255 -112 -424 -160 307 125 -86 68 173
7852A73L42k28j07j75l45J71J25o8K11k44j07L96p45R99m91k7J06j82J03n38N3
$$ 173 515 287 180 5 -340 -169 -44 -112 99 -145 -252 144 -601 398 -93 -120 -14 -196 -93 -631 -578
7873e78L32m13P08m12K78j84K46L63n4j188O22P75n11r8o4m9N98q67K43j4k34
$$ -578 -246 -659 49 -363 -85 -269 -23 340 286 -902 -280 495 -16 -114 -178 -227 371 -496 -253 -267 -501
7894e01J061p6l04j55k28J68J65K70q42j30J033m32l47M80O13n58K29j28n76Q77
$$ -501 560 484 180 25 -203 -35 130 400 -442 -572 461 29 -318 162 775 217 446 318 -258 619
7914F19l39k39n02L42J76j38R7j18M01m36m9N40J99r96k37Q58q6j31J91o90J85
$$ 619 280 41 -461 -119 57 -81 16 -102 299 -137 -186 354 553 -443 -680 178 92 -39 152 -538 -353
7935c53K15n37J011j92m24k86O62j86q3j60J49J51n94P34L44j042N30m21N23m20
$$ -353 -138 -675 336 144 -280 -566 96 -90 -173 -333 -184 -33 -627 107 451 -591 -61 -482 41 -379
7955c79J11O37n12M3k12M66l00P50j136L47M26K05r19Q18o33j78M25O23l34l36
$$ -379 -268 369 -143 -100 -312 154 -146 604 -532 -185 241 446 -473 345 -288 -466 -41 582 248 -88
7975h8K38o72m22J570m98j82M4k99L32j9L45m28m97P26q95L79L27J14K47n1K9
$$ -88 150 -522 -944 626 128 -54 -10 -309 23 4 349 -79 -576 150 -745 -366 -39 75 322 271 300
7996C00l24q34J070J74p95k79R02Lm54K68K46k47L33p9p00J015n08q0j04K12k41
$$ 300 -24 -858 212 386 -409 -688 214 217 -237 31 277 30 363 284 -416 599 91 11 -93 119 -122
8017a22j91L11k54R54o87k27l81M40j34k77J87P25J60o36O15L5o68p1Q36l93L12
$$ -122 -313 -2 -256 698 11 -216 -597 -157 -291 -568 -381 344 504 -132 483 518 -150 -221 615 222 534
8038E34p29L25J07l22P9m84J85J52J77M39j110m25O32P80M6o52N36o12N5M52l42
$$ 534 -195 130 237 -85 -6 -490 -305 -153 24 463 -647 -1072 -440 340 386 -266 270 -342 -287 165 -177
8059a77o5m38J37L55R08m73m65n9L23K92m99K46M60n86J04m87M98j43M64j75n48
$$ -177 -242 -680 -543 -188 720 247 -218 -277 46 338 -161 85 545 -41 63 -424 74 -69 395 220 -328
8080c28M14j92l08M34j4k06K10P16j096L65j86o07R62m22j28L08NK47l76J49J60
$$ -328 86 -106 -414 20 6 -200 10 726 -370 -5 -191 -798 164 -258 -386 -78 -73 174 -202 -53 107
8101A07l8k08P48j092J6P23j22l31J66l50Q30q55L71J78p9J89M7k03o11N27n99
$$ 107 69 -139 609 -483 -467 256 134 -197 -31 -381 449 -406 -35 143 64 253 300 97 -514 13 -586
8122e86K97O60r39M79q31J530l38q48Q08n41nK67j10J59j30k45q5R98r32J060
$$ -586 -289 371 -568 -89 -920 610 272 -576 232 -309 -314 -47 -157 2 -128 -373 -458 540 -392 668
8142F68l99o9n53L84K61q28M1Q98m95n67J890p91n5r86L32j85n16J233j27k99
$$ 668 269 200 -353 31 292 -536 -495 403 -92 -659 1231 440 385 -601 -269 -454 -970 263 136 -163
8162a63Nl76K25O72l91n85N11k50J083m99k37p8O47l26l19J46k95Q05j32m44n48
$$ -163 -158 -534 -309 363 -28 -613 -102 -352 731 232 -5 -83 564 238 -81 65 -230 575 443 -1 -549
8183e49K77O42l10k07K97o90N25n71
$$ -549 -272 370 60 -147 150 -540 -15 -586
8191e86
$$ Imaginary data points
##PAGE= N=2
##DATA TABLE= (X++(I..I)), XYDATA
0@%%%%%%%%%M1q9R6r6R6j02J50j92K16k64L18l66M31n07N65o42P43q56R79j108
$$ 0 0 0 0 0 0 0 0 0 0 41 -48 48 -48 48 -54 96 -96 120 -144 174 -192 239 -268 297 -345 398 -458 521 -587
29e87J252j415J595j787J993k231K485k757L066l406L775m183M634n129N681o287
$$ -587 665 -750 845 -942 1051 -1180 1305 -1452 1614 -1792 1983 -2200 2434 -2695 2986 -3301
45c301O969p751Q629r636J0812j2185J3831j5848J8377k1663K6130l2593M2831
$$ -3301 3668 -4083 4546 -5090 5722 -6463 7368 -8480 9897 -11766 14364 -18229 24602
58B4602o1611J07346m22847o47920O57693P32619J54605n64842m59793M6948M68246
$$ 24602 -37009 70337 -352510 -1000430 -342737 389882 544487 -20355 -480148 -433200 35046
69C5046L06811q8779l61585j85120J20959K79028J63219n835j82901k56055j19225
$$ 35046 341857 253078 -108507 -293627 -172668 106360 269579 263744 80843 -175212 -294437
80b94437K34710L83377O8682m10036m33065M8859M74073L26505j96035m90178
$$ -294437 -59727 323650 392332 -17704 -450769 -401910 72163 398668 202633 -287545
90b87545k07874L12933M78236R6930l64444l84792K1272L70810L25496j5812l07100
$$ -287545 -495419 -182486 295750 392680 28236 -356556 -335284 35526 361022 345210 38110
101C8110l11618m0299K64953L12515J6873l42744l70992J2289M05257L52717j21058
$$ 38110 -273508 -313807 -48854 263661 280534 -62210 -433202 -420913 -15656 337061 216003
112B16003m79163k93502K32885M90706J87217l03901m16616o7299L16054L31038
$$ 216003 -263160 -556662 -323777 166929 354146 50245 -366371 -433670 -117616 213422
122B13422K3430k40080k16664J1436J92406J85441K9409j51808k27506j00733
$$ 213422 236852 -3228 -219892 -208456 -16050 169391 198800 46992 -180514 -281247
132b81247J62906L02328R9797k72264l67078j4157M04038L79265q5632m58359
$$ -281247 -118341 183987 283784 11520 -355558 -369715 34323 413588 327956 -130403
142a30403k94189K17038M70838J69930l21290m07192j0611L65074K90034r1164
$$ -130403 -424592 -207554 263284 433214 111924 -295268 -305879 59195 349229 258065
152B58065l24218k06468P0061K28162J70279j5938j79968j96814l3408J83119
$$ 258065 -66153 -272621 -202560 25602 195881 179943 -25 -196839 -230247 -47128
162d7128K46207N0364k38297k95257m961L24872K82642j08723l85899k08398K17283
$$ -47128 199079 249443 11146 -284111 -289072 35800 318442 209719 -176180 -384578 -167295
173a67295L83754J12808k65708l33006n4449K31196K37351J5551j82773j92238
$$ -167295 216459 329267 63559 -269447 -323896 -92700 144651 160202 -22571 -214809
183b14809m1186J43029K06201P1416j60387k41596l4078K59918K89655k4782l39545
$$ -214809 -255995 -112966 93235 164651 4264 -237332 -271410 -11492 278163 253381 -86164
194h6164k68453J33330L91551J92555k23732l49741n8008K58645K30202n1499
$$ -86164 -354617 -221287 170264 362819 139087 -210654 -268662 -10017 220185 168686
204A68686k22160j27228N9214J38161R2516O841p7986j31762q8230Q1401K27121
$$ 168686 -53474 -180702 -121488 16673 109189 116030 38044 -93718 -181948 -100547 126574
215A26574J39556j58768l26841j09178K79345L54686l516l65275k73445J56368
$$ 126574 266130 107362 -219479 -328657 -49312 305374 301858 -63417 -336862 -180494
225a80494L81338J35990k62562l34320k9916K60583K20140m4693k03515j25982
$$ -180494 200844 336834 74272 -260048 -289964 -29381 190759 146066 -57449 -183431
235a83431L9705J19532R0998J5535o7297j15577o2625Q3644J73632O8108j50624
$$ -183431 -143726 -24194 66804 82339 15042 -100535 -163160 -79516 94116 162224 11600
246A1600k20682k1601K32980K22750o2775k86384j73634J38084K77088R9991j65259
$$ 11600 -209082 -230683 2297 225047 162272 -124112 -297746 -159662 117426 217417 52158
257E2158k20505l7423J62759J73733J5945j35443j42267j4490J22173J54293M4788
$$ 52158 -168347 -205770 -43011 130722 146667 11224 -131043 -145533 -23360 130933 175721
268A75721j24544j88457n0507J73158K28493J9761k33291k27654L1773K36549
$$ 175721 51177 -137280 -187787 -14629 213864 233625 334 -227320 -195547 41002
278D1002J47856j15568k37686p7990J62453K06849K5826j52720j34283K0852J25517
$$ 41002 188858 73290 -164396 -242386 -79933 126916 152742 22 -134261 -113409 12108
289A2108R5706K505o9967r5270n9940M0058J30747R4204p1826j87645r5332J31063
$$ 12108 107814 110319 40352 -54918 -114858 -74800 55947 150151 78325 -109320 -204652 -73589
301g3589K15962L2419k12765k12364N7094K68649J58335j43130k65075p4980J83296
$$ -73589 142373 174792 -37973 -250337 -193243 75406 233741 90611 -174464 -249444 -66148
312f6148K06926L876j59171j18362L5778J12634O8074j3080n9799o0369k5256
$$ -66148 140778 144654 -14517 -132879 -97101 15533 83607 70527 10728 -49641 -74897
323g4897M7670J02342N1201r2205j68278n3179J50770J97901J1718j97398j66473
$$ -74897 -27227 75115 126316 34111 -134167 -187346 -36576 161325 173043 -24355 -190828
334a90828O4105K12941J04153j15730j82222l9846J19951J22640R22r6414q9584
$$ -190828 -126723 86218 190371 74641 -107581 -147427 -27476 95164 96086 -328 -89912
345h9912j3823O8146R9672N7919n0994j34599q4561P4443J69997O5969j31071
$$ -89912 -103735 -35589 64083 122002 71008 -63591 -148152 -73709 96288 162257 31186
356C1186j76035J105J81915J37189p9512j95344p1686J29993J62897J1000j26387
$$ 31186 -144849 -143744 38171 175360 95848 -99496 -171182 -41189 121708 132708 6321
367F321j06993J3900Q3378N7223j843l9442n5351m4984J3256Q6321P8503l8672
$$ 6321 -100672 -86772 -3394 53829 51986 12544 -42807 -87791 -74535 11786 90289 51617
379E1617j37545p0064J11283J86688L9583j67808j80288K1130J96483J35493p9182
$$ 51617 -85928 -155992 -44709 141979 181562 13754 -166534 -145404 51079 186572 107390
390A07390j87099p5460J02635J38852K1088r3771q7354J882O5262N7309N129m6740
$$ 107390 -79709 -155169 -52534 86318 107406 13635 -73719 -71837 -6575 50734 55863 9123
402I123o6643l8126L5442R3635O0298m6833j12288m9772Q5421J27052J9076j15134
$$ 9123 -57520 -95646 -60204 33431 93729 46896 -65392 -115164 -29743 97309 116385 1251
414A251j09388K9755J34438P7450o8384j33862m8683Q1846J12092K1147q2026
$$ 1251 -108137 -78382 56056 133506 65122 -68740 -117423 -35577 76515 97662 15636
425A5636r5557k1307O4670Q9922L7488m7322r0167m4609N5677J07755M0420q6207
$$ 15636 -79921 -101228 -36558 53364 90852 43530 -46637 -91246 -35569 72186 112606 26399
437B6399j22764j6957J14311J19813j8426j36003r5530N1590J31580N7974o7793
$$ 26399 -96365 -113322 989 120802 102376 -33627 -129157 -77567 54013 111987 44194
448D4194j03756k9528N4958N9499J2807k8291l4221j5201J5036M7878M5240j1568
$$ 44194 -59562 -89090 -34132 25367 38174 9883 -24338 -39539 -24503 23375 68615 57047
460E7047p8479o3675L8824J13784N5478q7308j36090k2785J22815J15431l4153
$$ 57047 -21432 -85107 -46283 67501 122979 35671 -100419 -123204 -389 115042 80889
471H0889j38862p0438P8650J24040K0962r2748q5392J5709Q1163N9136l480m2946
$$ 80889 -57973 -128411 -49761 74279 95241 2493 -82899 -67190 13973 73109 69629 26683
483B6683m7409k7769J6830O2201N4658k1559q9924n8516N3843J11683L4093r5904
$$ 26683 -20726 -48495 -31665 30536 85194 63635 -26289 -84805 -30962 80721 114814 18910
495A8910j15692P83J10768Q4882m2354j10444n2154N0616Q5317L3198l0825m9034
$$ 18910 -96782 -95999 14769 99651 57297 -53147 -105301 -54685 30632 63830 33005 -16029
507a6029k3068J5909M3452L3565j2397n9206m7100K4827Q0192M0717o1593j02047
$$ -16029 -39097 -23188 20264 53829 41432 -17774 -64874 -40047 40145 80862 19269 -82778
519h2778j7956R3675R6409j3383j02951o4546M5757R2446L1949n3586o9332r651
$$ -82778 -100734 -7059 89350 75967 -26984 -91530 -45773 46673 78622 25036 -44296 -53947
531e3947M6430M9179R279l1703m8134l1722J7547O3179N6514j4262q4149o2495
$$ -53947 -7517 41662 50941 19238 -28896 -60618 -43071 20108 76622 62360 -21789 -84284
543h4284L6173J00423N2632o1024j05241k5570Q2992R3184m983q6539o1376L6170
$$ -84284 -48111 52312 104944 43920 -61321 -86891 -3899 89285 84302 -2237 -63613 -27443
555b7443Q2339L4344m4336o8505k3957L0560M4405J2789k4363l6187j6876J2529
$$ -27443 54896 89240 44904 -23601 -47558 -16998 27407 40196 15833 -20354 -37230 -24701
567b4701L2613K5324j1456m4261k6544L2441O7999K1258n7021p4212m700P4949
$$ -24701 7912 33236 21780 -22481 -49025 -16584 51415 72673 15652 -58560 -63260 11689
579A1689P3502j1949q5236o5568K7545Q4643M5351m1501p0657k0810L8893N2168
$$ 11689 85191 73242 -11994 -77562 -50017 34626 79977 38476 -32181 -52991 -14098 38070
591C8070J5936l1284n3578k8313K3847N8835L3810k7788o2770l1927L9464P5976
$$ 38070 54006 22722 -30856 -59169 -35322 23513 57323 29535 -33235 -65162 -25698 50278
603E0278L3882m6734o8340m440O3188M8089k6903o6175k7689L2987M9888J3592
$$ 50278 84160 37426 -30914 -35354 27834 75923 49020 -17155 -44844 -11857 38031 51623
615E1623k6635l6566j4499J5590L0104K1271o698l6740l4884R268N5315L7261
$$ 51623 24988 -11578 -26077 -10487 19617 40888 34190 -2550 -37434 -28166 27149 64410
627F4410l5457p4725k3246O4145P7752k263q2184o5168K3615Q1123M5822l7300
$$ 64410 28953 -45772 -69018 -4873 72879 70616 -11568 -76736 -53121 28002 73824 36524
639C6524o7072k2735L1555L8065P445j8766k6103j4108R165L5266L2108p485m7185
$$ 36524 -30548 -53283 -21728 16337 23782 5016 -21087 -35195 -26030 9236 41344 33859 -13326
652a3326l2778K0173N7739L3350l3129o7692k5844M2372N5693L009m8013l7431
$$ -13326 -46104 -25931 31808 65158 32029 -35663 -61507 -19135 36558 39567 -8446 -45877
664d5877J2887M4527K8165j2972l8292k4854J4373M3520K8417j7575m7083k8061
$$ -45877 -32990 11537 39702 26730 -11562 -36416 -22043 21477 49894 32319 -14764 -42825
676d2825K4970N2688K5425l1489n3358j3415M0101M2849n325m6712l7363J0140
$$ -42825 -17855 34833 60258 28769 -24589 -38004 2097 44946 39621 -7091 -44454 -34314
688c4314M1847K6225j6074m1277k5958J1313L2875K9788K945l0037l4300j831
$$ -34314 7533 33758 17684 -23593 -49551 -38238 -5363 24425 27370 -2667 -36967 -38798
700c8798L9440L8957q119m5755l1624J3710M5778K5956k6463n4556k0998L9837
$$ -38798 642 39599 31480 -14275 -45899 -32189 13589 39545 13082 -41474 -62472 -22635
712b2635N8095Q985m7612m4559N528M2721L0741j1040l8337k4489J7237L8642
$$ -22635 35460 44445 -3167 -47726 -42198 523 31264 20224 -18113 -42602 -25365 13277
724A3277J4423k2496l0269k058J9308K1081Q726r654k5722k2612P146L2986K3886
$$ 13277 27700 5204 -25065 -27123 -7815 13266 21992 12338 -13384 -35996 -28850 4136 28022
737B8022j6396l9228j7316K4613M6098J4212l6151m7114L86N1307M3238j5040
$$ 28022 11626 -27602 -44918 -20305 25793 40005 3854 -43260 -42874 8433 51671 36631
749C6631n0293k8865J6963L7354J5541j8321l2437j8064Q572K4924J6850j0694
$$ 36631 -13662 -42527 -25564 11790 27331 9010 -23427 -41491 -32919 -7995 8855 -1839
761a839k8260j7525J8183L9749J6142k6191m0174o782L4109L8767M199l1374k9365
$$ -1839 -30099 -47624 -29441 10308 26450 259 -39915 -46697 -12588 26179 30378 -996 -30361
774c0361M758K9673J9244j1951k2498j0108L441J0540J1840j87k4149k4888N469
$$ -30361 -25603 4070 23314 11363 -11135 -21243 -17802 -7262 4578 4391 -19758 -44646 -39177
787c9177L8429K6425j5501l8959j7378K4330M1989J6666k9097l9512J019M0335
$$ -39177 -748 25677 10176 -28783 -46161 -21831 20158 36824 7727 -31785 -30766 9569
799I569K7275j8056l5916j3075J6449K2132J2521q553k4815j9276R509K8181J9015
$$ 9569 36844 18788 -17128 -30203 -13754 8378 20899 12346 -12469 -31745 -22236 5945 24960
812B4960q781k5636j7810M330K1696J8302j1420l0852j3871K0332L0105R454j4918
$$ 24960 16179 -9457 -27267 -22937 -1241 17061 5641 -25211 -39082 -18750 11355 20809 5891
825E891k4293j0862J5681K9295J2304k2562l3957o616K7319K7648l427k9855j9416
$$ 5891 -18402 -29264 -13583 15712 28016 5454 -28503 -35119 -7800 19848 16421 -13434 -32850
838c2850J5020L5804J4164k4690l1694K09K8083K0849n946k4681j5840J646J5814
$$ -32850 -17830 17974 32138 7448 -24246 -24037 4046 24895 18949 -5732 -21572 -19926 -4112
851d112J4213j467j6427j2491Q90J4734J9279N793j7351k6043l130K7719K7938
$$ -4112 10101 8634 -7793 -20284 -19394 -4660 14619 20412 3061 -22982 -26112 1607 29545
864B9545m103l1381k4559P081K8794K4159l526k8179k1802J1434K9805J2887k0535
$$ 29545 25442 -5939 -30498 -23417 5377 29536 26010 -2169 -23971 -12537 17268 30155 9620
877I620l0798r302J6664K3408m02k2028k1511O894K5797J5479q657j6307j072
$$ 9620 -21178 -30480 -13816 9592 9190 -12838 -34349 -27455 -1658 13821 5164 -11143 -12215
890a2215J0631P962J321n227n990k666K809R577P375n753j8644j2273J0294K8133
$$ -12215 -1584 6378 7699 2472 -3518 -6184 -3375 6202 13577 7824 -10820 -23093 -12799 15334
904A5334J4464k0366l2549r587K3152K8149K084k5530k3557L898K5959J9016p057
$$ 15334 29798 9432 -23117 -32704 -9552 18597 20681 -4849 -28406 -24508 1451 20467 13410
917A3410k0603j3501Q020K0044J6342k489k2735k1135J860K3760J3542r797k0576
$$ 13410 -7193 -20694 -12674 7370 23712 21223 -1512 -22647 -20787 2973 16515 6718 -13858
930a3858o758J2047J6573L813r290j0145K953J2356N820n912j0319n562P62M762
$$ -13858 -20616 -8569 8004 11817 2527 -7618 -4665 7691 13511 7599 -2720 -8282 -7520 -2758
944b758P198L458r715j4126M56J6256J2397q142k0629q762J3723K2429Q978j6204
$$ -2758 4440 7898 -1817 -15943 -15487 769 13166 5024 -15605 -24367 -10644 11785 20763 4559
958D559k4135m987K1380K3511K236j8503j9068j630J6082J9772K549j7586j9930
$$ 4559 -19576 -24563 -3183 20328 22564 4061 -15007 -16637 -555 19217 21766 4180 -15750
971a5750k3J8251J4584n626k0299j1531O359J3997O643n642p883l501J844N240
$$ -15750 -15773 2478 17062 11436 -8863 -20394 -14035 -38 6605 963 -6920 -10421 -8577 -3337
985c337O547N174k864r538l926P845J3189k153j4697r652R906K0612K247k2394
$$ -3337 3210 8384 5520 -4018 -7944 -99 13090 10937 -3760 -13412 -3506 17106 19353 -3041
999c041k0209O581K5387J0912j5155k3100m412J6567J7001L29j4375j2728J636
$$ -3041 -23250 -16669 8718 19630 4475 -18625 -23037 -6470 10531 10860 -3515 -16243 -14607
1012a4607J2174J2001J527q529j2775n220Q346J5570R761q521j8489j0517P308
$$ -14607 -2433 9568 11095 2566 -10209 -15429 -7083 8487 18248 9727 -8762 -19279 -11971
1025a1971J5632P760o363j2039o114R176J4152M782r350j6109j701J3885J2396
$$ -11971 3661 11421 5058 -6981 -13095 -3919 10233 15015 5665 -10444 -12145 1740 14136
1038A4136n244j7139j0402Q307J4218L736j2621j0675O201J4528N333j0286j0758
$$ 14136 8892 -8247 -18649 -10342 3876 7612 -5009 -15684 -9483 5045 10378 92 -10666
1051a0666m97J0065Q241Q1m670n190n152J19Q358J2521K282j2594j5403P97J8696
$$ -10666 -11163 -1098 7143 7224 2554 -2636 -7788 -7669 689 13210 15492 2898 -12505 -11708 6988
1066F988J3376p693k1651j1984J0668J7538N158j1958j5294l295R526J2050O838
$$ 6988 20364 12671 -8980 -20964 -10296 7242 12400 442 -14852 -18147 -8621 3429 10267
1079A0267m425r156n429M450J2167O674p516j4069k478J0782J0086k545j2890
$$ 10267 5842 -3314 -8743 -4293 7874 14548 7032 -7037 -9515 1267 11353 8808 -4082
1092d082m923Q131J0858R20j0929q840J076O834L861l732n890l247K74N055O394
$$ -4082 -9005 -874 9984 10904 -25 -8865 -7789 -955 2906 -826 -6716 -9963 -9689 -4634 1760
1107A760M203n140q591j493J0197J3080Q08j3385j3708k46J1941J2610j974j2827
$$ 1760 5963 823 -7768 -9261 936 14016 14824 1439 -12269 -12515 -574 12036 10062 -2765
1121b765j1168K120J3840J1204l179j3119r454O840J5058O740j0005j5341l748
$$ -2765 -13933 -11813 2027 13231 10052 -3067 -12521 -5681 9377 16117 6112 -9229 -12977
1134a2977J0994J2012j462j1398n433M996Q012q2m263j311J432p69j221P26J925
$$ -12977 -1983 10029 8567 -2831 -8264 -3268 4744 4662 399 -912 520 -249 -1470 -744 1181
1149A181j401p303m205R415J1855K518j1873j0872P495J6427O526j2380j6553
$$ 1181 -220 -7523 -11728 -2313 9542 12060 187 -10685 -3190 13237 19763 7383 -9170
1162i170j633J3897Q818o654j4325p472N106J1187N413l214p470n361L377Q798
$$ -9170 -10803 3094 11912 5258 -9067 -16539 -11433 -246 5167 1953 -5517 -10878 -7501 1297
1176A297Q242k317q494o779M482R699L817m341q662k603M333P258J708k440o925
$$ 1297 9539 7222 -1272 -8051 -3569 6130 9947 5606 -3056 -5659 -1326 5932 7640 5200 -1725
1191a725l577J759Q296O033m973j1867o614P577J3541J923j1815r995M851J5180
$$ -1725 -5302 -3543 4753 10786 5813 -6054 -12668 -5091 8450 10373 -1442 -11437 -6586 8594
1205H594N852q485j3195l75R974O404k098r110m793K689L990K519J300n66m520
$$ 8594 14446 5961 -7234 -7609 2365 8769 6671 -2439 -7232 -4543 -553 1966 3266 2700 -1820
1220a820l543K971R541K148p842j0514n52J1132Q939l975j1107q727M072J1283
$$ -1820 -5363 -2392 7149 9297 1455 -9059 -9611 1521 10460 6485 -4622 -13349 -9277 2006
1234B006N154m514q313k915L380O388L452r49p762p962L619J1961P236o868j2229
$$ 2006 7160 2646 -5667 -8582 -5202 1186 4638 3689 -4073 -12035 -8416 3545 10781 3913 -8316
1249h316k592J1985J1210K07q775p518L737O523K475p485o611K81K969K286r25
$$ -8316 -10908 1077 12287 12494 3719 -3799 -62 6461 8936 1451 -5160 -4879 -1910 376 -549
1264e49k330j404j783J275N500M548k005n833k893M645O997R13o196o288J076
$$ -549 -2879 -4283 -6066 -4791 709 5257 3252 -2581 -5474 -829 6168 7081 885 -5403 -4327
1279d327P412O475j013r292o921J695J0217P539k871j3317q278N219J1589O059
$$ -4327 3085 9560 8547 -745 -7666 -5971 4246 11785 8914 -4403 -12681 -7462 4127 10186
1293A0186q151j1785j877P170R920R96o733m566L453M187J728j010J90j771l867
$$ 10186 2035 -9750 -11627 -4457 5463 6459 -274 -4840 -1387 2800 4528 3518 3708 1937 -1930
1308a930j054N916M433j975q483j609N799O220N27p864n300M601P831K267r256
$$ -1930 -2984 2932 7365 5390 -3093 -4702 1097 7317 7844 -20 -5320 -719 7112 9379 123
1323A23p395L124R364K428k670n459l787J325M523O613j113r402o637K557R280
$$ 123 -7272 -4148 5216 7644 4974 -485 -4272 -2947 1576 8189 7076 -2326 -8963 -6406 2874
1338B874O652m045j0629p238N536J2291N821p788o947j81L627L569J665J279k288
$$ 2874 9526 5481 -5148 -12386 -6850 5441 11262 3474 -3473 -3654 -27 3542 5207 6486 4198
1353D198o575k351K979N208K54p182o683K461R958N722o998r767J883J0121L123
$$ 4198 -2377 -4728 -1749 3459 3713 -3469 -10152 -7691 2267 7989 991 -8776 -6893 3228 6351
1368F351o298o165J883P670L289k699o917k977N196P466J143m642l842k566K74
$$ 6351 53 -6112 -4229 3441 6730 4031 -2886 -5863 -667 6799 7942 3300 -542 -3108 -2834
1383b834K951N277J336q922r810J974J2013N525n301q233k374K874P807N599j519
$$ -2834 117 5394 6730 -2192 -12002 -10028 1985 7510 2209 -6024 -8398 -5524 2283 7882 6363
1398F363p705m742K309N087L704j225m183p005j005O018O257j588o012j830M365
$$ 6363 -1342 -6084 -3775 1312 5016 3791 -392 -7397 -8402 -2384 3873 2285 -3727 -5557 -1192
1413a192M601j587m190O86L399J795j743l625k636K84M710L382j380m350m044
$$ -1192 3409 1822 -2368 -1682 1717 3512 1769 -1856 -4492 -4208 502 3884 2504 -1846 -5890
1428e890J041N068M027j285n990m877J351O693O193q93p850l754K407P727L901
$$ -5890 -4849 219 4246 2961 -3029 -7906 -6555 138 6331 5438 -2412 -6166 -3759 3968 7869
1443G869O49m138n460m885N369R067M92j1001q010K790O912L157l053l983k152
$$ 7869 8518 4380 -1080 -5965 -596 8471 8963 -2038 -10048 -7258 -346 2811 -242 -4225 -6377
$$ [...]
8191c73
##END NTUPLES=NMR FID
##END=
