##TITLE=1H_SA_28.201.MeOH
 DMSO-d6, 8 sc, 
 4.6.2020
##JCAMPDX= 6.0         $$ Bruker NMR JCAMP-DX V2.0
##DATA TYPE= NMR FID
##DATA CLASS= NTUPLES
##ORIGIN= UXNMR, Bruker Analytische Messtechnik GmbH
##OWNER= root
$$ XWIN-NMR		Version 3.5
$$ Thu Jun  4 12:09:38 2020 Russian Standard Time (UT+4h)  she@DPX200
##.OBSERVE FREQUENCY= 200.1315
##.OBSERVE NUCLEUS= ^1H
##.DELAY= (6, 6)
##.ACQUISITION MODE= SIMULTANEOUS
##.ACQUISITION SCHEME= undefined
##.AVERAGES= 8
##.DIGITISER RES= 18
##SPECTROMETER/DATA SYSTEM= spect
##.PULSE SEQUENCE= zg30
##.SOLVENT NAME= DMSO
##.SHIFT REFERENCE= (INTERNAL, DMSO, 0, 15.7039)
##AUDIT TRAIL= $$ (NUMBER, WHEN, WHO, WHERE, WHAT)
$$ ##TITLE= Audit trail, XWIN-NMR		Version 3.5
$$ ##JCAMPDX= 5.01
$$ ##ORIGIN= Bruker BioSpin GmbH
$$ ##OWNER= she
$$ F:/spectra/data/she/nmr/H-F/1/audita.txt
$$ ##AUDIT TRAIL=  $$ (NUMBER, WHEN, WHO, WHERE, WHAT)
(   1,<2020-06-04 12:08:15.71 +0400>,<she>,<DPX200>,
      <created by zg, POWCHK disabled, PULCHK disabled
       configuration hash MD5:
       00 E9 B6 7A A2 85 ED C7 34 08 36 98 17 FE 4E 26
       data hash MD5: 16K
       AD E2 7B 57 91 79 C0 16 65 B6 BC 33 A4 34 60 FF>)
$$ ##END=
$$ 
$$ hash MD5
$$ 3C A5 A6 CF FD AE 3A 5E 16 C2 76 0D 28 EC 80 00
##$RELAX= 
##$RELAX= 
##$RELAX= 
##$RELAX= 
##$RELAX= 
##$RELAX= 
$$ Bruker specific parameters
$$ --------------------------
##$DU= <F:/spectra>
##$EXPNO= 1
##$NAME= <H-F>
##$PROCNO= 1
##$TYPE= <nmr>
##$USER= <she>
##$AMP= (0..31)
100 100 100 100 100 100 100 100 100 100 100 100 100 100 100 100 100 100 
100 100 100 100 100 100 100 100 100 100 100 100 100 100 
##$AQSEQ= 0
##$AQ_mod= 1
##$AUNM= <au_zg>
##$AUTOPOS= <>
##$BF1= 200.13
##$BF2= 200.13
##$BF3= 200.13
##$BF4= 200.13
##$BF5= 200.13
##$BF6= 200.13
##$BF7= 200.13
##$BF8= 200.13
##$BYTORDA= 1
##$CFDGTYP= 0
##$CFRGTYP= 5
##$CHEMSTR= <none>
##$CNST= (0..31)
1 1 145 1 1 1 1 1 1 1 1 1 1 1 1 1 1 1 1 1 1 1 1 1 1 1 1 1 1 1 1 1 
##$CPDPRG= <>
##$CPDPRG1= <>
##$CPDPRG2= <>
##$CPDPRG3= <>
##$CPDPRG4= <mlev>
##$CPDPRG5= <mlev>
##$CPDPRG6= <mlev>
##$CPDPRG7= <mlev>
##$CPDPRG8= <mlev>
##$CPDPRGB= <>
##$CPDPRGT= <>
##$D= (0..31)
0 1.2 0 0 0 0 0 0 0 0.06 0 0.03 0 0 0 0 0.0002 0 0 0 0 0 0 0 0 0 0 0 0 
0 0 0 
##$DATE= 1591258094
##$DBL= (0..7)
120 120 120 120 120 120 120 120 
##$DBP= (0..7)
150 150 150 150 150 150 150 150 
##$DBP07= 0
##$DBPNAM0= <>
##$DBPNAM1= <>
##$DBPNAM2= <>
##$DBPNAM3= <>
##$DBPNAM4= <>
##$DBPNAM5= <>
##$DBPNAM6= <>
##$DBPNAM7= <>
##$DBPOAL= (0..7)
0.5 0.5 0.5 0.5 0.5 0.5 0.5 0.5 
##$DBPOFFS= (0..7)
0 0 0 0 0 0 0 0 
##$DE= 6
##$DECBNUC= <off>
##$DECIM= 24
##$DECNUC= <off>
##$DECSTAT= 4
##$DIGMOD= 1
##$DIGTYP= 9
##$DL= (0..7)
0 120 120 120 120 120 120 120 
##$DP= (0..7)
150 150 150 150 150 150 150 150 
##$DP07= 0
##$DPNAME0= <>
##$DPNAME1= <>
##$DPNAME2= <>
##$DPNAME3= <>
##$DPNAME4= <>
##$DPNAME5= <>
##$DPNAME6= <>
##$DPNAME7= <>
##$DPOAL= (0..7)
0.5 0.5 0.5 0.5 0.5 0.5 0.5 0.5 
##$DPOFFS= (0..7)
0 0 0 0 0 0 0 0 
##$DQDMODE= 0
##$DR= 18
##$DS= 0
##$DSLIST= <SSSSSSSSSSSSSSS>
$$ [...]
##$SUBNAM2= <"">
##$SUBNAM3= <"">
##$SUBNAM4= <"">
##$SUBNAM5= <"">
##$SUBNAM6= <"">
##$SUBNAM7= <"">
##$SUBNAM8= <"">
##$SUBNAM9= <"">
##$SW= 24.9337058887773
##$SWIBOX= (0..15)
0 0 2 0 0 0 0 0 0 0 0 0 0 0 0 0 
##$SW_h= 4990.01996007984
##$TD= 16384
##$TD0= 1
##$TE= 0
##$TE2= 300
##$TE3= 300
##$TEG= 300
##$TL= (0..7)
0 120 120 120 120 120 120 120 
##$TP= (0..7)
150 150 150 150 150 150 150 150 
##$TP07= 0
##$TPNAME0= <>
##$TPNAME1= <>
##$TPNAME2= <>
##$TPNAME3= <>
##$TPNAME4= <>
##$TPNAME5= <>
##$TPNAME6= <>
##$TPNAME7= <>
##$TPOAL= (0..7)
0.5 0.5 0.5 0.5 0.5 0.5 0.5 0.5 
##$TPOFFS= (0..7)
0 0 0 0 0 0 0 0 
##$TUNHIN= 0
##$TUNHOUT= 0
##$TUNXOUT= 0
##$USERA1= <user>
##$USERA2= <user>
##$USERA3= <user>
##$USERA4= <user>
##$USERA5= <user>
##$V9= 5
##$VALIST= <valist>
##$VCLIST= <CCCCCCCCCCCCCCC>
##$VD= 0
##$VDLIST= <DDDDDDDDDDDDDDD>
##$VPLIST= <PPPPPPPPPPPPPPP>
##$VTLIST= <TTTTTTTTTTTTTTT>
##$WBST= 1024
##$WBSW= 4
##$XGAIN= (0..3)
0 0 0 0 
##$XL= 0
##$YL= 0
##$YMAX_a= 432316
##$YMIN_a= -252352
##$ZGOPTNS= <>
##$ZL1= 120
##$ZL2= 120
##$ZL3= 120
##$ZL4= 120
##$ABSF1= 10
##$ABSF2= 0
##$ABSG= 5
##$ABSL= 3
##$ALPHA= 0
##$AQORDER= 0
##$ASSFAC= 0
##$ASSFACI= 0
##$ASSFACX= 0
##$ASSWID= 0
##$AUNMP= <proc_1d>
##$AZFE= 0.1
##$AZFW= 0.1
##$BCFW= 1
##$BC_mod= 2
##$BYTORDP= 1
##$COROFFS= 0
##$CY= 11.3945322036743
##$DATMOD= 1
##$DC= 2
##$DFILT= <>
##$DTYPP= 0
##$F1P= 16.9975609425685
##$F2P= -3.02152046262296
##$FCOR= 0.5
##$FTSIZE= 0
##$FT_mod= 4
##$GAMMA= 1
##$GB= 0.15
##$INTBC= 1
##$INTSCL= 1
##$ISEN= 128
##$LB= 0.24
##$LEV0= 0
##$LPBIN= 0
##$MAXI= 10000
##$MC2= 0
##$MEAN= 0
##$ME_mod= 0
##$MI= 1.114404
##$NCOEF= 0
##$NC_proc= 0
##$NLEV= 6
##$NOISF1= 3.799351
##$NOISF2= 2.8
##$NSP= 1
##$NTH_PI= 0
##$NZP= 0
##$OFFSET= 15.70392
##$PC= 1
##$PHC0= -9823.124
##$PHC1= 54.60082
##$PH_mod= 1
##$PKNL= yes
##$PPARMOD= 0
##$PSCAL= 0
##$PSIGN= 0
##$REVERSE= no
##$SF= 200.130013532006
##$SI= 16384
##$SIGF1= 3
##$SIGF2= 2
##$SINO= 400
##$SIOLD= 16384
##$SREGLST= <1H.CDCl3>
##$SSB= 0
##$STSI= 0
##$STSR= 0
##$SW_p= 3612.71676300578
##$SYMM= 0
##$S_DEV= 0
##$TDeff= 0
##$TDoff= 0
##$TI= <>
##$TILT= no
##$TM1= 0
##$TM2= 0
##$TOPLEV= 0
##$USERP1= <user>
##$USERP2= <user>
##$USERP3= <user>
##$USERP4= <user>
##$USERP5= <user>
##$WDW= 1
##$XDIM= 8192
##$YMAX_p= 0
##$YMIN_p= 0
$$ End of Bruker specific parameters
$$ ---------------------------------
##NTUPLES= NMR FID
##VAR_NAME=  TIME,          FID/REAL,        FID/IMAG
##SYMBOL=    X,             R,               I
##VAR_TYPE=  INDEPENDENT,   DEPENDENT,       DEPENDENT
##VAR_FORM=  AFFN,          ASDF,            ASDF
##VAR_DIM=   8192,          8192,            8192
##UNITS=     SECONDS,       ARBITRARY UNITS, ARBITRARY UNITS
##FACTOR=    0.0002004,     1,               1
##FIRST=     0,             0,               0
##LAST=      1.6414764,     0,               0
##MIN=       0,             -252352,         0
##MAX=       1.6414764,     432316,          0
$$ Real data points
##PAGE= N=1
##DATA TABLE= (X++(R..R)), XYDATA
0 0 0 0 0 0 0 0 0 8 -8 8 -8 16 -16 23 -25 32 -39 47 -55 63 -75 89 -102 116 -137 156 -178 202 -230 262
30 262 -293 330 -369 415 -464 516 -572 638 -709 783 -868 965 -1065 1178 -1307 1448 -1608
47 -1608 1787 -1994 2233 -2512 2845 -3248 3750 -4395 5253 -6465 8314 -11500 18458 -65867
61 -65867 171191 280458 -93816 -252352 -116596 23560 -6395 12403 26122 -64696 -115869
72 -115869 55068 165572 -6481 -188891 -50100 144909 47673 -154854 -96641 69653
82 69653 33061 -104770 -64480 47955 8804 -82208 -32365 41863 -8410 -49771 32953 54454
94 54454 -75061 -111489 67383 156636 -35790 -207151 -72822 134836 86126 -87976 -109648
105 -109648 -15812 17671 18354 41202 -8360 -121144 -77780 120962 157015 -59828 -184086
116 -184086 -19948 139801 52591 -89186 -55069 29582 9588 -16409 31570 21192 -68271
127 -68271 -58142 72798 90660 -39962 -75443 39287 72155 -39400 -60279 59949 87637
138 87637 -41078 -90023 23021 80564 -3615 -58671 -6897 20062 -9786 12021 57843 -3698
150 -3698 -94245 -22771 124962 95843 -71072 -99808 37820 95287 6134 -54547 -19958 570
162 570 -14027 15564 41234 -24394 -88403 -15834 90032 50964 -60945 -50095 44537 45553
174 45553 -31148 -29406 31459 18601 -42644 -30542 25269 4741 -54817 -39527 10559 -2409
186 -2409 -33029 6953 41830 -18325 -73781 -4888 83015 34429 -68303 -52916 37565 44014
198 44014 -23425 -46765 -25299 -26214 -20842 26146 29879 -49926 -81768 9865 83370 16744 -69318
211 -69318 -33113 45103 33299 -24211 -24557 13 -15044 -21234 13416 14496 -41488 -52978 11020
224 11020 38890 -15514 -41019 15867 47407 -7572 -47142 -4287 32743 42 -32709 -10935
236 -10935 11730 -6953 -17461 -835 -6390 -32742 -10945 43763 38492 -26923 -40203 22701
248 22701 56238 9503 -34027 -10753 22701 18086 3399 -1097 -17244 -28678 81 38618
260 38618 15683 -36285 -30868 27851 44006 -2632 -24301 7419 30221 13195 -290 6093
272 6093 1021 -10439 3718 24987 7644 -24711 -10590 20843 11908 -22724 -16743 21210 24485
285 24485 -4934 -9667 11644 16299 550 -809 10284 5827 -953 12320 17925 -6987 -26542
298 -26542 -2929 26524 14306 -16809 -12966 11829 15401 -852 -4991 2946 5525 7004 16446
311 16446 14075 -6012 -13657 6655 21495 5979 -11145 -2714 13766 7982 -4982 -2416 7220
324 7220 5871 3825 10203 11515 2187 -2236 6276 10724 308 -5609 1569 6617 -2691 -10974 -5085
339 -5085 3488 1900 -2717 2148 4735 1527 -1496 4176 8032 3081 665 5671 6434 -2680 -9605
354 -9605 -7759 -4469 -6139 -5666 -1791 2017 -4194 -4923 1515 3161 -59 1712 6573 9086 2706 -1547
370 -1547 -1376 -4490 -9296 -9474 -6105 -5000 -7845 -7851 -6207 -2194 -869 1027 3222 3766 4546 4192 4126 3194
388 3194 675 -503 378 -1484 -4015 -6397 -5799 -3680 -2397 -696 1474 3306 3548 3214 1383 431
404 431 1833 5942 8764 6552 2051 14 3101 3545 -456 -3178 1072 7867 10347 6093 2611 1759
420 1759 5660 8742 7319 1488 1554 4788 8311 4386 -3273 -4561 1867 8796 6447 485 -1416 2941
436 2941 9151 10894 3226 -1706 3334 13661 11915 68 -6617 246 10593 8900 -3001 -8429
450 -8429 -2203 4610 4026 -3706 -8345 -4390 6885 11107 3155 -7073 -4937 9262 12480 1744
464 1744 -8511 -2755 7186 5906 -7633 -12754 -11127 -2732 2828 -1662 -13025 -16424 -2348 7870
478 7870 2983 -13719 -12052 7769 15357 3169 -13714 -10747 336 4441 -1820 -8830 -15671 -11537
492 -11537 -537 2715 -10773 -23916 -12264 7080 6689 -11124 -14911 -546 8977 880 -6920
505 -6920 -4729 -5377 -4114 -311 -793 -11307 -16181 -3099 5730 -4620 -18752 -9892 9654 7361
519 7361 -8437 -8038 8466 10176 366 -2501 -1823 -5661 -4700 2797 4251 -13346 -18303 2998 14672
534 14672 -2506 -21553 -5757 17728 13325 -2445 -2511 5740 4353 1158 6814 4523 -10472 -11992
548 -11992 8755 15544 -5427 -18767 -840 16738 6214 -6116 5471 14010 4433 -1801 11913
561 11913 17704 -403 -9184 3961 11250 -2616 -7884 4755 6870 -8644 -6275 16035 17019 -9939
575 -9939 -17186 12894 28109 5802 -10077 899 12520 2623 -1404 10564 2235 -17645 -7062
588 -7062 19779 15847 -17886 -19487 9769 17513 -4916 -12644 8899 9246 -10638 -6977 13212 9817
602 9817 -14339 -11985 10919 8489 -11398 -5899 11573 -1545 -23175 -5801 26020 8555 -30850
615 -30850 -23082 16709 21244 -8363 -19144 -3413 143 -4716 7891 10665 -17207 -32374 3589
628 3589 37068 7424 -38098 -23314 21411 22711 -8548 -11965 1871 -37 -5476 8992 15596
641 15596 -12657 -27592 3769 27517 109 -29753 -6623 20301 2313 -19723 449 23738
653 23738 4114 -18802 565 23261 8686 -10338 2577 12185 -4921 -9511 17836 19359 -23999
666 -23999 -33759 13333 39170 -475 -37378 -11054 26579 19308 -1340 2833 3361 -9810 4312
679 4312 35443 20879 -29788 -32361 22761 43153 -5051 -36592 -7906 19577 5217 -5568
691 -5568 9969 8035 -13631 -3067 30734 23654 -18477 -20480 20073 24421 -9900 -15727 13310
704 13310 10078 -20537 -16932 20685 20197 -17626 -21238 14944 23413 176 -2969 11520 3197 -15133
718 -15133 4217 31863 7441 -35572 -21870 28909 29841 -14728 -26740 2146 15063 1280
730 1280 5955 15262 -5293 -23237 6152 36734 8505 -34804 -20224 23008 19584 -13852 -12996
743 -12996 7003 100 -15324 4135 25198 304 -26769 -4027 29496 13311 -18045 -8125
755 -8125 13104 -503 -15218 6376 21377 -10285 -33160 -3032 30619 6472 -27000 -14654
767 -14654 13018 6689 -6425 6418 9568 -15860 -17683 20111 31660 -10702 -36671 -3408 26570
780 26570 4635 -21570 -9727 4049 -7610 -11212 10713 10916 -20021 -21583 14511 26804 -6740
793 -6740 -22390 4144 17181 -4217 -11514 9918 11001 -18490 -21804 9077 17730 -10913 -21514
806 -21514 1977 10201 -5175 -5236 10467 1507 -20639 -6727 28509 22415 -19390 -26406 8802
819 8802 24987 -209 -14035 -2357 840 -5870 6190 18306 -1805 -25498 -7012 30776 21461
832 21461 -16700 -19086 11950 20089 -2505 -6230 5036 640 -11321 1887 16760 1756 -18784
845 -18784 -3031 20165 9430 -11195 -540 19074 6112 -13521 -1483 21612 8904 -14179
857 -14179 -10283 8296 3871 -8777 -3178 3625 -6883 -9319 11826 19983 -4636 -22946 699
870 699 28303 13611 -12694 -11451 6379 7554 -3145 -1651 -3426 -14719 -11033 10170 13981 -10965
884 -10965 -22274 1936 21252 5444 -13330 -3906 9150 2840 -6791 -900 2028 -8729 -9705
897 -9705 1871 3536 -10746 -14437 711 7523 -6471 -11937 4165 9929 -6222 -12604 1045
910 1045 8781 -2089 -10309 -3361 236 -6702 -6039 2134 -1814 -15669 -8918 9863 8724 -11409
924 -11409 -15570 2813 10697 -1475 -8444 -1276 3050 -1726 -955 3096 -3708 -13262 -5198 8849
938 8849 3826 -12072 -11398 2961 6336 -4594 -5291 3282 4360 -2631 -512 5930 2783 -5390 -1841
953 -1841 6018 2453 -6202 -2805 4244 451 -7920 -2930 8738 4025 -4112 -1516 6497 7133 1739
968 1739 1782 5347 3199 1174 3641 4699 -3130 -7815 -825 7055 1924 -8263 -4893 4569 4070 -845
984 -845 -615 3902 5178 4565 7145 6140 -91 -943 5004 5712 -2045 -6988 -1221 5739 -266 -8132
1000 -8132 -4933 2225 3063 -312 -687 328 2222 4464 5342 1621 -3986 -1750 5398 4431 -5671 -10356
1016 -10356 -2652 5226 1553 -7063 -7232 -780 3624 3381 -1670 -4457 -2483 4044 7303 -706 -9359
1031 -9359 -7797 1988 4315 -4809 -12028 -5715 4069 3603 -3263 -8034 -4847 2928 7329 2615 -5442
1046 -5442 -6194 940 6966 904 -10565 -10238 1499 5697 -768 -9644 -7939 2033 7031 2044 -4357
1061 -4357 -5658 2080 9583 6228 -3975 -8539 755 9245 5247 -6887 -11000 -1418 7307 4439
1075 4439 -6008 -8664 -384 7556 8007 -754 -6949 -892 9791 10748 864 -6823 -1703 8418 7265
1090 7265 -3242 -7672 -2502 5850 5956 -1748 -6960 -4654 4388 8245 1687 -5225 -1873 7260 10812
1105 10812 2754 -6378 -3575 6118 9070 1694 -6629 -5302 1531 5560 1250 -5543 -6310 1983 8038
1120 8038 4431 -3579 -4681 3164 8660 4728 -2889 -2982 2347 6028 1684 -3570 -5378 -992 3625
1135 3625 2627 -3649 -6128 -1005 6492 5063 -2262 -3774 2101 7063 3531 -3142 -4109 491 3018
1150 3018 2430 -1770 -5545 -4260 2192 3268 -1583 -5567 -1848 5411 6689 -75 -3496 484 3930
1165 3930 1902 -1902 -2183 -2046 -1219 -990 -1517 -5234 -5521 -847 1933 115 -5087 -1175 6026 4645
1181 4645 -1308 -1814 2628 3650 539 -2633 -2723 -3851 -2418 -261 -1473 -6086 -5210 592 3987 -1404
1197 -1404 -5810 -708 7124 4949 -471 -2900 1097 2330 773 -24 -1867 -4154 -3236 2167 1381 -5670
1213 -5670 -7646 900 6583 794 -5174 -1782 5209 4036 -1500 -1261 918 -328 -124 2259 1143
1228 1143 -4212 -2278 4074 4314 -5300 -5854 4157 7944 -513 -6303 -228 7288 4692 -39 -1748
1243 -1748 -1450 -847 3438 5398 -801 -9054 -3381 9290 7969 -6138 -8754 2311 9973 4042 -2605
1258 -2605 -1988 1950 2689 4180 6019 -2501 -5427 1030 10620 3661 -9044 -5859 5310 7412 -3144
1273 -3144 -6546 1737 5110 1819 -1821 1307 1961 921 3486 5858 -1434 -7199 1767 8943 -1049
1288 -1049 -12577 -5366 8618 7419 -5489 -9286 1064 6199 2803 91 -799 -3819 -2862 8671
1302 8671 10235 -5183 -14736 -1828 13616 4969 -12013 -10295 2519 4994 -1228 -2415 -1614 -2557
1316 -2557 -1117 5723 5934 -5551 -8749 3765 9762 -1883 -10212 -1922 5692 -1078 -8718 -2061
1330 -2061 5616 -212 -5694 -1421 2870 -642 -2328 3149 2008 -6584 -5725 8017 8604 -8170 -14255
1345 -14255 575 10809 736 -10043 -5638 1688 2198 2228 4856 -447 -7926 -1810 12055 8273
1359 8273 -9585 -11558 4428 9965 -1771 -8778 -1328 1624 -3146 -2249 5336 3201 -5170 -2628
1373 -2628 9027 7291 -3896 -2533 6258 3432 -5612 -2194 8841 4376 -9874 -7279 6876 7957
1387 7957 -3576 -5770 1879 3447 -435 3524 6706 -1743 -7513 4631 15659 4740 -11295 -6599
1401 -6599 9860 9007 -3081 -6787 1244 927 -2501 2572 6078 -3791 -7810 2294 11078 2628 -7717
1416 -7717 -1384 8494 2419 -5435 -280 6550 396 -7809 -104 6026 528 -6387 -2062 3736 -873
1431 -873 -4116 3703 4967 -5430 -9054 5261 12221 -1551 -12097 -3669 6342 2376 -5268 -4229
1445 -4229 -1308 -2368 -1234 4161 2472 -9139 -9121 6617 12532 -2691 -10852 -1174 7327 2018 -4355
1460 -4355 -1384 145 -4646 -3465 4849 2866 -8066 -6330 5839 6852 -4854 -6703 3722 5915
1474 5915 -4313 -4843 4472 4696 -4428 -6395 1901 3617 -3128 -3532 1643 -882 -5672 -592 8777
1489 8777 3124 -8387 -3440 8817 8959 -1532 -6551 1668 3396 245 -447 1782 -3658 -5978 1748
1504 1748 9131 1752 -9945 -3559 8309 8128 -2378 -3948 4332 3388 -371 2458 4563 -642 -5481
1519 -5481 1007 6377 672 -6740 -2221 5039 2648 -3775 -59 5966 1835 -3427 683 7322 1337
1534 1337 -4024 -632 3759 65 -1813 1383 3343 -2767 -5180 3369 7029 -749 -7457 -705 6640
1549 6640 4367 -3177 -1826 1492 -1108 -1732 3453 2248 -4563 -5753 3098 5946 -3051 -6086 808
1564 808 4717 506 -2057 1738 3024 -969 -1757 3439 2408 -3120 -3440 722 3387 -2199 -2883 445
1580 445 97 -3769 -2278 2033 1985 -3022 -4225 3065 4430 526 -2512 -73 1072 196 337 2960
1596 2960 -734 -4778 -2173 3742 1515 -4355 -5227 1197 3518 -1992 -3501 -484 1395 -918 293
1611 293 1706 363 -2511 -1059 2272 -821 -4145 -3168 3043 140 -3979 -2601 2786 2945 -1962 -2148
1627 -2148 1111 2418 296 1064 846 -1623 -974 2567 4169 -2095 -6263 -1198 3370 2221 -4104 -4026
1643 -4026 174 2726 772 807 380 -517 700 2846 1942 -3759 -3045 1730 5945 723 -4878 -1573
1659 -1573 4179 2588 -745 -2205 -382 2773 2556 1433 -1083 -2826 1623 3912 1786 -3006 -3429
1674 -3429 1324 3728 374 -4345 -2869 1426 2611 548 -499 -415 784 3329 2114 -280 -2882
1689 -2882 423 3429 2688 -2217 -4652 714 3471 -87 -3740 -3375 236 2640 991 -1469 -1502 -1310
1705 -1310 2389 3128 133 -3202 -1367 2448 2552 -1617 -4611 -423 1277 639 -1406 -2741 -1752 -200
1721 -200 898 8 -1389 -1252 1152 2548 130 -1868 -2383 1659 1964 -942 -3082 -1989 327 805
1737 805 -976 -1952 -2207 -399 1345 438 -1890 -1720 -282 2451 507 -2067 -1769 -283 1641 -443
1753 -443 -1666 -2271 291 -586 248 -1676 -544 -558 457 273 -1197 -2 1560 2304 790 -2751 -2393
1770 -2393 609 863 -743 -2111 -888 551 359 377 -1011 -89 239 2684 1244 -589 -846 215 1448
1787 1448 906 -1053 -536 1138 621 -989 -1172 -1252 89 92 636 342 -1006 677 2679 2390 142 -1955
1805 -1955 1891 2248 1725 -1472 -459 1503 396 1049 -1105 -1223 -958 1210 1772 -344 -1921 -147
1821 -147 3612 3201 -212 -1244 471 2745 680 -1366 -1853 -893 1072 1022 -104 -3503 -2151 696
1837 696 2334 227 -2192 -765 2604 3066 -1067 -1560 -54 2000 289 -818 -2251 -1352 -642 1535
1853 1535 362 -2056 -2759 1333 2506 804 -3671 -2488 2433 2848 -482 -3172 76 -835 2419 1198
1869 1198 -2198 -4694 205 2665 1630 -3925 -4678 1251 3916 1321 -3363 -2059 90 2636 248
1884 248 -936 -2545 -2719 643 783 -1256 -3069 -2221 2247 2106 -2091 -3547 638 2078 1552 -1357
1900 -1357 -92 835 3549 795 270 -1716 -1589 1231 2094 -287 -2561 -1736 1414 2409 -2487 -3775
1916 -3775 -315 2708 1585 -252 -685 -99 991 1636 1402 -798 -2326 -658 2242 1623 -3855 -2551
1932 -2551 1391 3609 169 -1150 313 2008 546 -738 1859 -222 -645 1290 1953 -284 -2727
1947 -2727 112 2989 1158 -1464 -861 1514 1857 -969 -1689 197 582 576 1257 966 -885 -914 1675 2580
1965 2580 -1856 -4408 -898 2770 1113 -2501 -1870 1929 1138 -451 390 1143 921 -118 1417 2976
1981 2976 -1173 -1605 982 3093 -899 -3702 -644 2250 -245 -2251 850 1925 205 -1582 360
1996 360 2717 364 -723 452 629 -2311 -1182 2809 1634 -2986 -4555 679 3217 -786 -3780
2011 -3780 -682 1201 959 -147 540 -461 -1817 62 3954 1888 -3247 -3317 2792 3251 -1736 -3000
2027 -3000 -752 2004 -137 -430 791 56 -1471 212 3173 1791 -1976 -1676 2887 2136 -1801 -1763
2043 -1763 2255 3204 -3170 -3245 1973 1897 -2198 -2253 554 594 775 850 1114 -1813 -3857 2402 5085 3013
2061 3013 -5283 -3636 2999 2950 -475 -1848 -211 97 244 2010 1951 -1178 -3408 1986 5681 1443
2077 1443 -4527 -2619 3977 1919 -1834 -1928 923 1190 -997 702 1164 -1459 -2078 1437 3250 -120
2093 -120 -2310 1614 2576 -940 -1786 1864 4367 -724 -3712 -1702 2576 998 -2530 -696 471 -1957
2109 -1957 -856 2621 1578 -2351 -2633 2567 4937 -907 -3734 -608 2098 1156 -1220 -294 389 -2581
2125 -2581 -1711 1648 1101 -3661 -2787 1639 3113 -1271 -822 44 1157 -1054 -1755 1012 497 -2475 -2233
2142 -2233 1420 1710 -1554 -2840 516 632 -1905 -1501 1156 1012 -1792 -960 2565 1311 -1922 -3951
2158 -3951 1025 1257 -1239 -1864 1612 -814 -2006 94 3448 -387 -4074 -2454 4055 2943 -1707
2173 -1707 -1307 434 947 -650 636 764 -1467 -3004 -596 1900 1044 -1587 -205 1837 74 -1185
2189 -1185 650 1331 -479 -1839 680 3026 816 -3171 -1550 2229 -1327 -1349 155 1011 -1132 -1527
2205 -1527 1751 2226 -99 -2212 483 4096 272 -2116 -874 147 158 -414 1497 -118 -1289 -2125
2221 -2125 1836 2639 -1949 -2500 928 2375 -144 -286 1175 1184 -18 380 1950 1835 -862 -962 1456
2238 1456 1132 -937 -972 452 1367 -672 -1622 977 1806 -1353 -561 430 967 -205 -1164 610 459 -325
2256 -325 -418 1781 -626 -2305 -1420 2010 1383 -1862 -1892 -353 1768 -665 -703 1117 292 -621 1026 2459
2274 2459 -1092 -2931 -1252 2042 807 -2736 -3009 713 858 -820 -369 -612 188 -497 99 1059 460
2291 460 -1337 -111 1718 -322 -1480 -911 2666 817 -1429 -564 848 445 353 -1089 -494 193 376
2308 376 1570 749 -147 -495 1613 1431 -171 -2600 -1261 1883 1330 -1307 -1487 47 1087 877 560
2325 560 -385 -1784 376 2012 1969 -327 -1906 810 2388 174 -1168 -1003 886 1448 317 -1030
2341 -1030 -921 -23 1044 799 123 -1520 2 1522 1674 -1164 -1283 1024 1841 692 -820 -750 214
2358 214 1001 127 -1128 -528 -578 702 1775 -84 -1959 -698 2486 2290 -324 -1045 193 2106 189
2375 189 -796 -576 -991 350 911 -282 -446 47 286 1415 -288 -1940 -8 1527 1751 -1119 -1739
2392 -1739 125 278 80 -806 -557 -366 -458 501 168 -790 -227 397 1924 283 -1640 -167 977 967
2410 967 -471 -1270 -652 800 -82 -789 -899 -228 -161 1101 1041 -1584 -1382 775 1401 -390 -1224 -363 1408
2429 1408 1021 -540 -870 376 1072 751 47 -1333 -992 779 1198 378 -1637 -322 340 2008 729
2446 729 -1639 -1259 1105 1117 -36 -729 -1204 349 958 591 -967 -1146 1300 1101 480 -772 -171 1455
2464 1455 2460 88 -1226 -812 1146 1308 -224 -1860 -513 904 1236 983 -473 -2073 -37 1109
2480 1109 569 -373 -1087 71 1712 746 -440 -910 865 1510 532 -423 -1029 -210 -125 237 -1101 -1747
2498 -1747 -712 2662 1039 -1274 -1682 257 1667 543 -759 -1540 -848 691 1055 53 -1851 -1405
2514 -1405 -45 1234 -80 -1555 -326 1331 1158 -735 -933 -481 909 587 -215 -741 677 323 1213
2531 1213 230 -992 -941 705 1522 -756 -1099 77 1302 695 353 -257 26 -72 916 -507 -20 -1664
2549 -1664 -634 931 1083 -59 -740 24 1421 -539 -1331 1001 1029 255 -25 -91 45 -108 -109 237 216
2568 216 -361 -1452 1222 -583 132 -423 250 1141 -62 -1728 1549 1700 619 745 -492 33 565
2585 565 -30 -66 -1530 -1806 -746 336 671 -1528 -278 532 343 -22 -166 698 645 -63 720 413 -309
2604 -309 -500 1674 718 53 -179 -750 1014 1379 -1575 -182 1225 200 -498 -614 -301 1064 812 129
2622 129 335 -765 870 1103 1719 -375 -2458 -373 1569 -49 -1658 -994 91 804 732 -452 -901
2639 -901 -418 233 681 90 -1009 -796 1641 1029 -562 -718 -71 1432 282 -862 -22 1194 -625
2656 -625 267 22 -44 -509 -1030 212 899 -718 -1170 1762 822 -803 -620 -65 1999 -729 -2406 -693
2674 -693 -697 348 -429 310 -36 -751 -551 1172 704 -418 -1289 1502 1544 -1006 -1087 -331 486 -276 -383 364
2694 364 -574 -509 282 396 1268 -1495 -1205 899 1544 -1403 -1522 292 1764 -1448 -568 1551 -287 -397
2712 -397 253 864 216 -713 424 679 599 -804 603 704 926 -1336 -489 1388 168 -962 221 -479
2730 -479 -708 -24 333 1416 385 -737 384 1608 133 -978 -101 571 -30 -1236 -538 5 -757
2747 -757 -1038 548 1406 -421 -1685 199 1720 17 -817 -926 -128 -25 194 -148 875 -351 -1282
2764 -1282 568 395 -644 -1457 -3 855 -202 -492 317 763 55 -635 997 1250 -731 -1032 921
2781 921 1363 -521 -530 694 218 -617 -1331 231 1466 -1412 -753 119 584 31 -691 101 -572 -1779 -1104
2800 -1104 548 106 -1653 -462 1743 1096 -1505 -149 505 972 -1080 -535 761 995 -949 524
2816 524 1081 83 -983 -722 1338 -599 -843 -744 417 -467 -830 995 1459 1013 -1082 -768 1605 544
2834 544 -512 -291 -364 1056 3 951 416 -406 -1460 -288 1325 364 -1224 -782 1111 325 -463 -256
2852 -256 172 52 -330 260 1196 435 -878 447 749 -491 -1369 -104 1036 -124 -1481 -539 1126
2869 1126 347 -1207 109 1455 385 -4 -167 1029 359 529 437 815 -667 -783 342 1146 -580
2886 -580 -1744 129 5 958 569 -360 236 119 41 812 -173 -1412 -334 2045 1703 -1172 -1110 -538 1738
2905 1738 215 -1243 -543 -278 781 638 1229 187 -618 352 850 1580 -807 -758 1669 -155 -1174
2922 -1174 -911 217 505 -122 32 -655 239 763 688 84 -816 -1369 -49 1244 84 -1046 -512 1364
2940 1364 842 -1051 -854 566 988 701 -1109 -551 -1853 -672 171 252 -473 -1117 91 71 -1208 159
2958 159 -284 570 1609 -494 633 -429 39 -744 616 457 -2093 -87 1447 -45 -643 -1447 -348
2975 -348 1934 960 -341 43 1875 -314 -226 -523 512 325 -320 53 -434 -676 1024 -123 63 -788
2993 -788 -751 633 1677 956 -186 -1019 960 85 765 -960 -834 -1442 -652 1864 -1479 -175 -303 1202
3011 1202 1160 -312 -596 -757 915 422 -522 85 1438 1233 -809 -1217 -450 972 285 758 -870 -296
3029 -296 -890 1049 660 -776 -566 670 1138 212 -763 -345 109 1321 585 1286 -2386 -306 718 886
3047 886 1184 -1246 23 841 696 -572 5 182 -49 -323 365 514 -65 630 690 132 -213 -1003 1364
3066 1364 403 -737 -1004 -1270 245 191 -1057 -747 91 -1048 293 -110 -841 -377 275 1263 -204 -877
3084 -877 -127 -523 216 36 -1158 -772 -206 148 -105 -238 -763 -567 782 506 90 -632 -536 1023 566
3103 566 75 -2143 540 1149 -169 -1678 -13 -317 974 169 345 -760 922 -183 923 -606
3119 -606 -681 -1942 -261 193 777 -219 338 1034 -1417 -260 -1095 -113 607 792 -557 39 -418 616
3137 616 786 733 -365 -86 207 612 532 -698 -25 779 1079 437 -713 492 -204 727 683 -413 -230
3156 -230 450 122 112 -1675 -617 462 -418 15 -800 -82 650 318 1136 327 -596 73 497 -419 -677
3175 -677 -720 -136 279 80 -783 150 342 567 345 -87 180 588 -522 -472 -132 -336 -271 -55 -163 369 55
3196 55 819 606 -122 228 199 957 332 252 203 -377 1327 569 -51 -1292 -467 701 -519 -382 -1040 -721
3216 -721 0 1175 670 -565 475 -4 -208 -806 578 -204 -547 863 865 -132 598 -388 1118 -133
3234 -133 162 -37 -39 858 -275 207 -238 729 70 55 234 -207 521 879 -26 -735 371 -246 564 389
3254 389 56 -214 244 502 433 -1094 759 194 -1538 598 343 -104 -83 -199 80 260 -198 -585 31
3273 31 233 -973 -152 3 388 42 616 311 115 -379 338 872 -853 576 291 748 737 852 421 528
3293 528 826 5 -1501 -1017 710 -2 -123 384 -1021 73 196 546 -1059 -329 663 1351 134 -436
3311 -436 -460 741 -2 630 856 704 -808 -543 1560 887 -222 336 -119 189 140 -141 -1058 553 1444
3330 1444 -173 1549 -215 254 -701 459 234 100 245 604 107 -116 -498 93 46 -1083 507 345
3348 345 -601 143 128 -396 414 887 576 1965 96 -1255 -1178 1272 -859 -688 -551 -64 -427 -16 -974
3367 -974 -350 236 -165 607 1021 -1165 -428 -502 490 295 -1344 -491 18 345 348 -699 577 156 -1049
3386 -1049 -968 1023 -603 -386 -215 452 338 45 216 -404 1343 14 386 211 442 -309 -540 1413
3404 1413 285 648 -700 778 74 -701 73 471 208 -32 294 359 -832 -1148 -31 92 684 -85
3422 -85 607 604 -349 -190 -93 934 268 -1016 957 570 79 -1226 54 3 -672 -524 -610 -476 436 433 -975
3443 -975 1120 -701 -578 -279 -167 -344 -1688 475 -59 -716 -29 -624 878 377 -1350 -46 312 171
3461 171 32 -777 311 -277 503 1759 731 -838 223 31 183 -725 -55 468 719 662 -548 49
3479 49 -886 -1046 479 327 -162 650 -36 379 -957 -136 -18 19 310 -52 -1018 -525 951 -1094 -686
3498 -686 -26 798 933 355 109 -828 -42 -125 383 -176 -782 -1068 514 388 -1265 -792 382 248 311 -568
3518 -568 -106 333 -210 308 1947 -28 -1023 -222 866 -370 -268 -1491 891 -89 222 996 68 533
3536 533 -42 117 -341 -1193 -288 861 178 80 -337 384 211 850 327 -768 1151 436 -1078 -296 -821
3555 -821 -1475 -932 1247 503 -723 787 910 -140 -318 2 302 605 -959 -137 -70 179 -446 991
3573 991 119 -779 788 -795 400 305 -44 -48 913 -1051 249 139 930 -750 248 -659 282 1029 465
3592 465 -289 483 28 441 -473 1093 -372 -568 -90 1037 215 -964 -31 126 322 -301 358 -93 383
3611 383 252 139 923 846 -337 -330 568 1229 110 670 385 -414 -648 -1148 359 -720 -1191 -17 958
3630 958 56 195 -21 166 537 -289 -421 170 67 465 -44 1273 -202 -481 -503 379 1163 59 832
3649 832 214 317 -367 749 451 -1505 -413 726 1790 -265 -833 715 681 -500 285 464 -678
3666 -678 -146 347 -27 235 -15 70 -439 -204 -570 174 -267 -10 -333 -242 440 -532 1184 -1354 175 -95
3686 -95 -1521 -914 -420 1074 -1376 -1607 -248 -87 502 -832 67 1350 -91 -636 -222 -777 -265 474
3704 474 -319 -1428 541 387 -507 721 -175 -293 -1077 1396 242 -306 340 1258 -449 -418 -458 -415 386
3723 386 516 636 78 758 -1102 988 -126 -870 -237 782 2073 812 332 -102 -228 -1262 -689 -605
3741 -605 -662 870 1687 216 -1108 -104 1526 658 173 -947 1785 60 -505 1052 -291 -794 1004
3758 1004 -874 -190 104 236 268 -69 601 -333 -1022 -916 412 277 -1005 79 -1679 133 -194 -115
3776 -115 -227 62 -850 -890 -308 -267 99 38 360 -287 -1254 -512 76 -781 -279 -541 845 -212 612 -843
3796 -843 -297 -396 1122 -494 247 -80 -284 -524 -298 -168 -46 -937 -274 -1 205 5 -658 -356 4 744
3816 744 -800 177 -342 241 490 -477 144 255 273 -497 -296 479 -405 590 548 616 -91 -183 -432 -87 -1898
3837 -1898 121 -590 -693 -393 -231 -39 -372 76 469 21 119 -193 488 1088 -830 -383 -383 56 -831 455
3857 455 -981 11 552 -195 20 302 -303 -647 752 -957 382 -401 -498 -38 -582 511 -464 277 21
3876 21 -517 4 -1228 -304 854 556 -431 249 152 646 443 -714 -1082 747 683 -466 -690 -73 336
3895 336 -198 314 7 70 845 5 -1082 153 -343 -565 -85 -190 50 -1210 8 249 140 273 -324
3914 -324 -89 403 -280 276 -318 -104 305 -450 -1069 -1241 -505 255 -199 76 -626 -335 -470 133 -654 -841
3934 -841 122 713 1183 45 -9 -1 383 216 154 -364 674 -15 830 146 -531 1420 -81 -705 23 -57
3954 -57 -554 221 -46 511 -789 -242 270 699 569 607 -351 172 793 101 -750 44 -220 1607 -818 940
3974 940 1286 -236 239 -333 -86 -667 127 802 974 144 990 -621 256 -240 -359 -733 512 397 1400
3993 1400 -179 291 910 355 130 99 387 -621 -561 307 -162 -204 15 577 264 83 -652 -427 472 151
4013 151 -857 -926 -591 -1177 -95 -498 -743 38 133 -312 284 -207 416 62 118 -113 -40 -127 -577 -126 -54
4034 -54 469 -1036 -245 -414 332 632 -349 323 364 -830 618 -451 -64 188 594 568 509 -80 -20 312
4054 312 161 -374 -690 670 688 -241 -415 -341 109 -86 202 -349 -137 386 422 -165 -255 68 294 584 -204
4075 -204 -942 -545 -183 378 -257 -403 389 546 239 343 236 548 -41 -307 -370 -8 -508 487 50 311
4095 311 -292 257 1066 -127 -502 -238 -429 -610 -127 514 -563 150 -660 -479 326 -444 204 -133 -558
4114 -558 39 -212 680 219 -207 236 499 294 450 -184 -231 -35 -319 -221 -340 109 -500 -168 -268 123 395
4135 395 175 51 -794 227 -99 16 48 -126 -268 59 234 -582 272 585 -106 198 343 23 -350 -22
4155 -22 151 -63 53 153 125 138 53 -460 -68 -73 -309 -20 171 711 610 -299 -244 51 -53 -517 42 289
4177 289 -77 -84 -467 348 -386 72 -146 205 480 -398 34 4 -35 197 -187 182 -25 -151 109 -269 -107
4198 -107 -14 -5 194 -54 -129 494 -28 12 -168 17 373 -446 -241 -43 124 -186 631 674 -151 -181 -405 205
4220 205 339 3 -68 391 46 -85 106 -237 -40 347 167 411 44 187 99 -130 -263 -219 -58 202 200 203
4242 203 -36 -72 369 -434 -234 123 105 -496 -225 704 582 -185 87 890 227 -489 -167 190 -261 -281 -500
4263 -500 569 69 -468 -274 70 -234 185 -824 615 191 -43 -433 691 -268 269 64 45 -60 -457
4282 -457 -215 158 -40 -540 76 -104 122 -460 250 216 -139 1 233 152 -13 -500 414 400 415 555 147
4303 147 -200 50 -282 -112 -235 -229 312 288 335 -40 150 450 460 -413 -353 -25 -308 788 368 -207 -198 -265 394
4326 394 364 -24 19 -219 326 -71 -460 -466 69 283 -781 -331 107 406 248 426 115 -289 -342 48 -220
4347 -220 169 -93 219 -48 315 -235 -28 543 -136 -198 510 246 -225 82 94 418 -241 -516 83 -230 -51
4368 -51 -325 -36 87 792 -362 -405 64 308 27 -76 336 362 -89 -502 -29 -246 -140 -204 692 -572 -711
4389 -711 -214 -34 503 589 71 733 323 225 84 -239 201 -623 30 -357 -306 186 521 50 -164 492 -399
4410 -399 371 598 691 -245 393 126 -59 -303 -147 -264 -264 -422 793 280 804 55 -25 -132 -279 27 -203
4431 -203 125 1145 51 -607 -279 -490 -269 -658 -395 -336 -46 -342 246 216 483 247 -930 -19 515 -44
4451 -44 53 -204 -146 174 -374 -466 -142 -65 -650 -591 576 -5 147 -1287 -3 -181 346 627 -153 79 -40
4472 -40 -234 -130 -142 -18 59 47 -232 -729 -547 262 -16 188 -359 -140 250 -212 444 -130 -520 -183 18
4493 18 216 217 -63 -890 396 -277 -626 45 -239 -178 439 128 -514 523 -175 342 -206 248 158 182 305
4514 305 748 430 -115 99 -221 -55 699 -208 -944 -480 -244 796 38 -429 159 174 -345 -280 195 264 180
4535 180 -697 736 -587 -12 -202 -738 -770 51 455 401 179 93 -184 420 -163 -720 212 -349 185 581
4555 581 487 -567 480 -498 96 -176 45 433 -43 -390 139 -239 -114 -471 -237 -682 662 524 -984
4574 -984 287 50 -558 -1087 -200 -677 241 545 531 570 -190 -41 -387 -171 178 -655 757 -305 538 1012
4594 1012 -1066 369 -323 191 -58 -366 -892 -272 -686 -384 817 -786 653 620 106 575 -447 -79
4612 -79 305 -103 424 876 88 -60 -7 34 -479 -1170 -13 402 -1 -139 -206 -236 -91 184 43 193 -812
4633 -812 354 426 -347 -203 -281 79 375 -301 127 -536 3 -442 -284 -193 -95 1213 -252 474 -255 -1458
4653 -1458 357 525 -199 31 -27 79 302 259 388 -104 -547 1053 -816 -115 -187 -1195 513 -1605 565
4672 565 -180 1113 -207 -146 380 -261 454 411 -665 164 -201 -79 -550 -148 977 657 162 428 643
4691 643 -47 -759 267 228 -82 351 -483 971 898 68 -308 -167 -1052 34 534 744 -86 150 -588 -690
4711 -690 468 -112 -352 27 19 -382 -202 258 205 541 -234 268 43 -565 -90 -1189 -189 529 -169 -236
4731 -236 -317 -768 -536 147 306 -505 773 178 -375 409 263 265 240 -560 26 652 144 -304 -103 368 -301
4752 -301 99 -363 253 587 -90 227 -399 -354 -312 928 -1029 -340 781 590 -365 726 59 267 -1089
4771 -1089 -117 285 411 341 -8 368 63 -365 330 336 305 783 191 -434 -864 193 -105 1298 -543 -400
4791 -400 971 -348 -299 -462 780 -792 -367 1130 -1 699 639 635 550 -718 -384 -549 820 83 572
4810 572 -228 649 884 334 150 -204 -127 172 -193 -615 -1173 393 719 -688 -80 -492 -655 -49 -606 248
4830 248 -743 366 -699 -221 1021 -627 242 9 -276 -379 -24 140 6 173 -297 763 -52 -166
4848 -166 425 285 407 -1222 -246 415 -47 -4 -510 -639 -259 -724 -81 490 -321 298 189 -367 -48 -459
4868 -459 -696 600 -371 262 -684 626 -754 315 233 626 -3 -173 -326 -247 -129 -436 -979 576 524
4887 524 -712 113 -159 -392 -1403 146 361 -432 973 767 -675 -31 276 601 737 -524 -68 298
4905 298 -236 389 313 -602 958 -330 189 -81 97 -22 -352 98 -73 -497 -216 -653 -463 -72 1040
4924 1040 298 -85 422 1 566 -226 261 375 -1350 -590 252 -1098 9 140 945 -207 989 518
4942 518 -774 988 -821 -110 225 53 130 -385 359 -274 256 -519 -452 -447 -26 423 -39 -401 -623 877
4962 877 62 -296 -171 -182 760 318 395 -812 417 -1051 435 452 934 -457 305 -264 349 716 631 19
4982 19 173 -394 -1032 1351 -139 118 -941 443 -5 -754 95 -471 652 192 -812 -404 -579 -1045
5000 -1045 -388 682 -558 215 -232 -373 285 912 336 -996 -982 76 -484 531 -45 117 -664 728
5018 728 -79 480 727 546 -1225 308 76 -759 715 -400 89 -40 308 398 -259 -232 270 103 298
5037 298 -433 -109 -512 70 -364 398 -558 -765 -510 -182 -349 157 -855 322 551 32 -661 -295 313
5056 313 -702 393 -810 183 -256 -577 -275 308 166 -843 1075 -575 -65 -1126 285 97 900
5073 900 -395 -6 -328 -398 635 -961 312 -242 -363 -146 -37 -545 -199 -383 746 -316 279 554
5091 554 54 -117 717 0 -177 246 -464 513 569 390 450 54 -236 213 -541 -61 333 -362 -416 -43 44
5112 44 -1353 194 -319 652 401 69 -124 28 896 -940 -224 -134 212 646 -239 -526 565 268 -197
5131 -197 -958 749 -353 -130 -371 -211 -488 -103 628 388 205 -301 -129 -5 298 348 -516 140 76 641
5151 641 -70 262 401 -528 -1071 237 352 -548 -353 473 -396 379 155 236 409 -26 -240 -673 -700 610
5171 610 12 -510 894 -594 -162 300 131 -199 510 1664 -30 -771 -125 -1112 -277 158 597 -110 556
5190 556 678 157 141 626 122 386 421 199 -529 -88 102 -283 -413 -388 -252 86 -268 -832 -243 323 216
5211 216 -81 -434 497 -749 61 89 536 -601 -79 -517 -469 862 -411 129 -180 -574 466 207 163
5230 163 337 246 -94 -227 -28 -1 -615 -162 -209 408 295 885 95 -150 -235 165 203 -974 -330 249 345 -22
5252 -22 490 188 -9 -809 57 -99 405 -142 -497 -265 192 653 214 -760 141 345 -319 -219 -280 -66 -586
5273 -586 -426 -842 -178 1101 -261 -415 405 128 -770 170 -445 155 41 -923 117 -696 -545 -985 -169
5292 -169 935 337 283 -126 883 -185 120 557 -12 762 192 -560 515 -367 -300 932 223 -592 395
5311 395 -405 338 -235 72 -436 -644 5 -489 301 392 552 -45 337 338 -869 550 850 -379 183 44
5331 44 -494 124 366 -229 -35 -232 143 -23 -569 123 -273 258 1 -126 736 -907 -63 544 -232 -143
5351 -143 98 189 424 304 738 -284 -91 279 967 115 17 379 -451 -365 -286 342 112 -56 -477 -139 792
5372 792 1064 354 -668 -63 275 -107 -346 69 712 -17 53 111 498 -596 -471 -158 217 -723 -546 -443
5392 -443 153 -80 -207 -301 176 -465 -483 191 34 -270 435 -4 -350 78 -134 76 -144 110 -279 -100 212
5413 212 -610 129 -312 126 96 -541 -44 236 -215 -367 -221 33 -340 530 -77 339 413 -382 942 -8
5433 -8 -162 64 213 -769 -658 423 -333 -8 397 -88 -86 -673 -407 15 259 -302 -507 231 529 126 -101
5454 -101 -485 273 341 -264 -293 -231 -489 -248 -706 447 -419 608 -132 20 503 -104 707 247 49 187
5474 187 354 598 426 702 -47 -155 -467 59 -143 -178 -319 -26 757 12 85 -844 -485 382 67 -303 -360
5495 -360 -675 -239 110 25 -506 -49 -32 -724 160 -311 374 -23 -1088 -38 341 72 94 127 636 129 267
5516 267 44 442 536 310 281 436 -726 -226 161 -157 -68 -153 298 366 56 -90 60 -410 46 265 252 -310
5538 -310 811 -118 165 329 -290 344 878 128 686 -95 -190 671 1 -347 -385 -33 246 86 -147 278
5558 278 148 316 172 119 -422 105 88 483 -38 22 -147 60 -209 -233 2 194 499 73 -150 590 -176
5579 -176 171 -694 3 -406 332 -191 21 337 -321 -10 -142 37 181 260 -120 291 281 -572 -431 809
5599 809 -111 467 -217 -5 -309 46 94 126 505 -281 579 -146 562 223 164 -380 -567 740 -397 599
5619 599 553 139 -420 -243 -52 -399 -470 -284 -380 -277 -240 189 -311 -816 -8 -591 112 -137 -420 247 -276
5640 -276 -212 -26 194 -330 -523 152 341 -784 581 311 564 703 -486 531 -547 -556 103 368 -49
5659 -49 123 373 185 93 148 215 18 -610 601 531 426 -356 631 746 218 138 427 769 -103 335 252 -825
5681 -825 79 842 672 251 90 195 410 945 -433 -28 -555 -8 237 366 -556 -309 410 308 -151 1148
5701 1148 78 -26 636 1423 274 -197 391 497 -794 415 159 -652 -309 -461 -187 60 -620 163
5719 163 693 -275 -460 -744 -407 -16 492 -533 186 173 321 448 1160 -118 -228 266 -895 -555 245
5738 245 -13 -48 -144 -79 37 -298 -146 37 -142 145 334 -166 -512 -419 -136 -273 595 -403 -170 27 -600
5759 -600 697 -159 -770 -178 -414 306 135 234 -254 722 799 -128 -42 -364 729 44 1269 -216 48 439
5779 439 188 63 -503 -68 -232 54 -137 549 -232 230 14 358 400 331 332 -124 -460 -20 241 370 512
5800 512 367 424 -74 547 -558 -407 100 10 -217 -498 147 116 260 199 -397 19 724 350 324 -441 460
5821 460 24 -715 303 -258 -442 -122 574 -310 187 -453 302 -210 125 -650 24 422 -629 -33 60 265
5841 265 -598 410 -447 -132 -124 -160 426 -177 53 514 -2 80 -212 -109 28 151 49 -393 507 -602 126
5862 126 505 91 609 193 -413 287 175 126 -308 -171 13 58 -158 346 111 -731 -587 -108 626 193 48
5883 48 98 -37 77 14 515 94 -187 120 232 -153 618 -82 -146 325 -773 -189 358 222 194 341 185
5904 185 -555 99 -144 -724 -316 68 76 333 -17 -457 396 -209 129 -190 -573 707 561 22 19 -132 -233
5925 -233 284 227 -57 589 850 64 25 -309 245 -769 -778 -234 -133 293 848 137 -184 -172 500 586 328 -315
5947 -315 -363 -451 -17 446 62 894 -84 690 136 683 540 -480 -60 -792 308 -213 -234 778 -696 300
5967 300 419 -493 17 -334 -523 -666 319 244 -5 -153 373 506 168 33 -306 569 117 -256 -61 -175
5987 -175 -226 -209 -13 -564 515 478 -299 -454 189 -158 9 -403 -467 364 -132 -232 81 177 866 174 93 145
6009 145 -40 -455 346 552 -463 -520 -64 763 63 -215 -67 39 -362 -522 525 108 305 -523 -779 -311
6029 -311 665 -329 -253 -470 159 -160 -141 -266 -441 -254 -248 120 624 89 -289 -42 118 -215 -28 -146 335
6050 335 233 415 585 0 196 33 433 302 -61 -312 21 -83 -101 -61 781 -41 -157 241 -117 637 444
6071 444 541 267 -193 -621 -193 -104 127 -175 -702 483 -402 88 -333 393 240 193 -201 120 240 -237 367
6092 367 519 545 99 -294 455 -241 -157 238 -402 -470 553 -225 2 1 -280 -206 -47 294 554 -706 -82
6113 -82 -1256 103 -169 -730 22 288 -239 -179 -459 20 164 -310 229 -760 169 418 132 -268 -191 -188 333
6134 333 67 502 55 126 353 -151 -315 -344 -58 445 -260 -50 -552 119 610 -202 -551 -423 -317 228 -85
6155 -85 -144 -433 -188 -154 -48 209 -308 355 40 359 -416 744 188 -80 -27 482 -116 530 367 38 -24
6176 -24 443 543 -1056 21 -264 -165 -187 73 370 488 226 -223 -33 547 139 -131 -282 286 52 -197
6196 -197 479 127 85 193 -511 -81 252 -494 43 480 -556 137 -229 -306 -252 -477 -568 -177 -306 221 -166
6217 -166 37 187 -116 130 -323 -76 129 -515 -5 190 -155 5 -368 -516 -806 414 -178 152 -195 -49
6237 -49 672 -348 68 -31 -323 -33 -408 137 87 191 -269 -98 -102 -171 440 500 30 355 377 215 635 -590
6259 -590 300 186 85 69 263 -23 165 42 238 -284 355 -163 -429 -489 247 -498 -310 -246 -180 -380 470
6280 470 397 283 128 -137 -707 -46 -219 -287 247 941 -87 516 -52 684 19 -447 201 695 219 57
6300 57 362 1308 -382 641 513 -200 271 -206 58 41 -404 326 681 -236 136 -468 313 -46 -486 -229
6320 -229 -280 264 -586 155 747 -356 -32 721 137 501 330 -350 -62 320 -275 142 180 148 39 203 118
6341 118 -255 -193 -89 -304 344 -116 292 -76 63 -234 -321 244 53 230 -237 474 -18 111 -119 -75 -332
6362 -332 227 -342 -338 328 193 584 475 -590 594 -178 256 157 118 -138 -244 376 -211 196 -390 -263 179
6383 179 258 133 -244 -263 -338 -518 140 -209 -534 -445 387 158 68 182 -529 -288 -222 359 -12 -177 -525 -383
6405 -383 282 -16 -423 285 -901 -345 129 314 20 107 474 476 -275 23 136 -248 83 171 -51 131 -494
6426 -494 48 -172 -265 -349 -309 112 -6 224 100 -508 -303 278 -282 42 -154 -212 -271 -418 -203 -342 -717 955
6448 955 -244 -588 -5 -179 248 -4 -358 -251 -239 -594 -37 -156 -58 -289 -377 241 33 281 -491 126 39
6469 39 -148 31 90 119 -62 -300 -236 -450 36 53 565 309 -279 208 117 -184 439 325 56 -258 100 -243
6491 -243 -357 -432 -497 214 117 -370 243 271 387 374 179 265 89 59 -744 -94 88 -215 -56 292 145 -203
6513 -203 18 -236 100 -704 259 -170 -144 -230 -194 352 239 -46 322 -111 -218 -452 -124 -528 144 -489 -122
6534 -122 42 -514 36 116 24 263 88 43 8 72 -18 122 239 602 -53 307 586 -212 7 -37 -391 -457 -120
6557 -120 233 392 295 277 104 314 357 239 -497 391 -64 -483 154 115 180 9 -479 62 -109 -379 -259 -180
6579 -180 236 -243 -187 -62 279 -74 360 -174 708 -621 218 76 275 307 87 -377 -623 653 -538 736
6599 736 -96 -51 98 579 -617 -292 -93 -54 -468 -43 263 -160 -284 41 266 -9 -66 24 221 -358 -63
6620 -63 -285 -97 187 330 394 402 -428 526 658 423 -410 519 644 6 258 -35 -106 252 -537 -650 32 246
6642 246 -29 1269 14 324 636 82 -891 -133 -132 -370 22 -357 976 -594 1243 -329 541 708 389
6661 389 -108 -335 -240 124 1233 -60 564 -133 335 23 725 -339 -47 -913 345 505 926 -351 -726
6680 -726 496 -560 -166 -194 -376 567 -208 916 638 -58 783 -530 482 -200 -506 -299 311 -312 533
6699 533 -400 16 -135 -392 406 63 -277 869 753 301 -670 -348 760 262 -10 -232 772 -323 943
6718 943 179 512 -169 328 322 -350 -8 -304 -355 864 512 -159 730 -625 654 -796 -690 -224 -544 518
6738 518 187 10 -4 171 18 -164 61 -488 18 347 172 -409 -328 -697 -475 -487 -653 -340 525 627 1121
6759 1121 671 390 -286 120 55 -274 844 331 400 -411 -109 37 249 1168 175 -711 492 -372 15 -99
6779 -99 662 -260 -452 459 -498 488 -449 349 -214 167 370 -231 888 -686 77 -61 -354 -992 404
6798 404 20 739 -18 -311 1347 -220 -78 346 574 -98 1024 478 677 737 62 1091 1153 -623 7
6817 7 375 503 133 278 -89 -276 -53 73 -295 -727 330 332 34 810 699 73 -284 131 374 446 843
6838 843 23 265 689 38 -547 -314 -344 772 -253 200 -87 88 343 -242 -116 33 -10 133 -497 270
6858 270 -311 208 98 824 -838 -881 -18 -101 101 -27 114 -271 -6 -407 -121 -448 142 -339 238 -326
6878 -326 238 197 -294 935 -35 803 1001 -426 -303 239 195 737 141 -604 32 139 370 300 -428 225
6898 225 -174 516 -27 -292 889 800 302 -307 -222 -235 -86 400 451 -164 -415 1258 -1273 436 182 60
6918 60 -531 405 -125 -205 -178 -350 -696 91 -108 -632 350 -267 -628 377 -727 -131 553 420 207 -352
6938 -352 216 901 -307 -500 -161 196 -12 -611 -373 679 -81 -736 -651 258 248 -300 526 -23 802 86
6958 86 -112 679 -119 3 1473 535 -357 760 -209 228 194 -363 -38 -183 452 -151 -366 1015 405 98
6978 98 132 596 -993 279 239 267 330 -213 -259 646 432 -193 271 -40 15 318 -48 -74 251 421 -776 264
7000 264 61 -49 662 -678 -9 153 122 -563 -377 -278 393 434 634 64 56 780 -739 -347 -574 -718 467
7021 467 288 -261 52 712 304 954 162 -307 351 -92 561 600 559 421 851 -272 -1 453 205 -532
7041 -532 -216 598 491 -443 15 359 -230 1189 -956 413 -291 -239 25 -86 -220 -466 578 -230 994
7060 994 -209 920 105 284 -34 444 263 -165 -15 322 280 305 109 -485 -658 -465 -319 249 244 100 -192
7081 -192 -897 -237 -273 60 564 -272 211 203 -145 215 -209 -404 537 465 586 92 -575 -306 -156 86 111 60
7103 60 -370 -149 -339 68 377 33 494 -538 370 273 181 -8 -661 362 -686 -512 711 323 283 374
7123 374 21 170 -284 -321 -285 542 828 -600 879 -337 -183 -39 -395 -427 -325 236 264 -412 -290 205
7143 205 345 -257 951 353 82 -657 -436 -295 182 1271 413 -256 121 314 -6 518 -675 312 487
7162 487 371 -132 -403 692 91 545 192 401 165 -348 -417 92 -193 314 368 -93 39 -56 330 -513 -98
7183 -98 248 -376 573 457 617 -338 -778 -12 -641 349 436 35 -79 -281 287 566 -308 -285 -142 -949 -154
7204 -154 138 77 -322 49 -48 1101 -85 -454 -246 -297 -227 109 -457 248 -912 -341 398 730 98 275
7224 275 -55 734 201 285 140 1102 96 -496 -110 126 761 666 -82 -486 395 602 574 116 -87 755 320
7245 320 233 -333 -295 307 94 294 435 -171 -391 148 370 -167 280 435 -546 354 405 34 55 97 303 -58
7267 -58 574 247 208 376 -23 1127 -93 -242 160 -216 -258 -224 -224 -196 58 202 -266 184 -123 -174 -81 42
7289 42 31 221 388 111 -485 97 83 -343 306 -209 586 -590 -146 158 -49 162 67 -144 614 -593 -98
7310 -98 -7 55 375 -420 -262 -397 -49 -258 309 545 -49 193 -88 105 207 -650 36 -136 -172 -537 -258
7331 -258 312 93 -335 -590 -152 -5 146 186 -274 18 -433 52 -55 29 88 -45 100 -351 93 -161 2
7352 2 -775 -453 509 153 -170 198 39 13 -92 302 -259 63 260 90 -420 1 -58 -167 -35 147 -248
7373 -248 181 212 12 45 -246 146 -249 85 -127 67 -18 -184 -170 -8 260 -26 -20 175 -144 276 65 -88
7395 -88 14 255 23 -305 -36 -152 294 -29 -30 -271 157 -79 68 -261 -576 -284 -31 -190 500 355 -310
7416 -310 -114 168 -240 -296 -136 -53 -326 269 -7 -171 334 134 -376 168 359 -281 108 -68 50 -257 53
7437 53 -184 -25 287 88 -330 -28 181 180 524 208 -169 103 -233 -101 185 48 334 -425 -16 284 296
7458 296 -192 -119 -145 -181 -276 -168 31 76 14 -169 -7 258 -9 30 -155 39 64 39 -255 10 162 -409 -143
7481 -143 186 55 -72 -199 -129 -12 -196 239 87 124 5 -82 -76 365 -37 178 -84 -218 111 199 -71 300
7503 300 -252 33 -85 -38 248 170 260 -212 94 -377 -70 -303 17 136 341 161 -12 84 47 35 250 -145
7525 -145 -183 -174 -105 169 -174 -60 -44 -16 109 46 101 101 -108 -73 101 155 43 177 -20 6 -126 -119 73 -238 -132
7550 -132 127 98 -83 120 54 -4 -120 -29 43 388 -192 36 -278 -68 -234 -160 -62 -103 -42 -73 -203 555 -18
7573 -18 181 -1 71 317 -34 108 126 57 53 137 34 220 27 -402 232 87 282 -87 16 -148 -238 -273 30
7596 30 -68 -259 -259 109 -38 -382 93 -138 27 4 -1 -1 -105 -116 -263 216 -157 -179 -266 130 229 152 54 -56 137
7621 137 74 -18 -41 100 203 -31 -122 199 326 102 180 175 353 -10 -170 -80 -330 6 153 -51 -15 -316 -302
7644 -302 241 139 15 196 -116 96 111 251 333 116 231 331 0 111 58 21 190 -124 -231 -60 -109 126
7666 126 -204 77 238 -35 -86 36 -167 -57 107 -15 179 -208 -183 96 144 164 -270 82 208 -69 7 -135
7688 -135 26 -240 52 219 -335 86 -174 124 151 116 17 -185 54 -69 -2 51 254 583 104 -277 131 -100
7710 -100 155 182 -79 -4 -139 -221 69 -127 -167 -36 -207 -155 -166 -52 -93 -94 -16 23 24 29 20 8 -182 174 -145 135
7736 135 -186 -11 -143 271 -82 -227 63 24 89 -115 -101 -136 -136 166 -7 -253 -290 87 -33 101 166 108 -235
7759 -235 -145 221 -53 157 -134 61 8 128 223 20 -59 137 184 -6 -231 50 -66 224 128 -7 231 275
7781 275 49 183 -52 -13 18 -53 119 -39 0 239 0 -81 -157 29 96 47 -145 111 94 41 103 242 6 36
7805 36 -190 -90 -161 52 -59 1 150 63 2 32 192 -319 -66 -60 -352 49 -107 29 120 -127 -143 399 279
7828 279 239 356 84 -178 -2 54 -71 330 179 164 -236 -90 -151 28 -34 -132 -276 277 -48 -108 176 4
7850 4 -230 -256 -88 -205 -70 100 95 55 -103 65 22 -89 215 62 -132 -38 73 -75 -9 30 204 155 -39 35
7874 35 -231 144 -28 -145 137 -187 125 240 80 170 -59 145 102 -120 206 170 221 128 137 -14 -12 -90 -286 -22
7898 -22 -37 -7 -188 178 -24 -47 -110 27 -71 -40 -194 -154 -6 249 -108 -137 88 -264 140 -215 242 19 115
7921 115 23 18 -25 -226 280 107 94 -21 46 -124 -213 -141 123 -144 4 88 -45 -175 -286 110 66 -118 27
7944 27 -187 -132 72 -257 69 157 -15 -140 4 -169 84 -30 126 -39 -236 -8 91 187 162 -191 -39 18
7966 18 -43 -85 -404 -38 -7 -35 -377 -78 48 -113 55 -141 -79 -83 97 83 71 10 190 -48 -4 45 -239 130
7990 130 134 60 -93 256 -166 -225 -206 41 -473 52 -131 -69 -1 155 -96 48 17 50 75 -175 -23 -19 204 450
8014 450 105 63 -29 -111 151 42 -83 229 43 -128 -50 -111 87 -427 -171 247 -38 -64 -37 3 -46 91 -66
8037 -66 -14 -15 -52 -20 -52 201 -99 -118 69 5 -82 -100 51 -50 65 -2 175 -157 -92 167 175 173 -81 269 -48 -328
8063 -328 50 6 36 72 88 -44 248 -70 -21 66 -71 -433 -15 101 -314 -343 104 17 -50 153 -541 35 -48
8086 -48 -62 14 278 -58 -72 223 188 -120 97 -23 -283 -52 65 -141 -80 -77 -5 -33 6 -29 -199 -13 289 -17
8110 -17 216 176 -50 -34 -98 -34 62 19 -103 -69 -131 -164 -494 -23 -97 -120 -170 58 -22 65 -111 146 -2 -47 184
8135 184 -232 -200 -8 -29 95 -65 -344 70 -346 173 39 -5 -117 20 -129 82 -237 162 -262 22 -45
8156 -45 -248 -53 -31 102 152 284 -10 -249 -3 327 -24 -74 -97 -17 -106 166 165 -144 -115 89 -37 129 -45
8179 -45 -92 -83 215 -231 -90 61 44 68 326 -123 -173 136
8191A36
$$ Imaginary data points
##PAGE= N=2
##DATA TABLE= (X++(I..I)), XYDATA
0 0 0 0 0 -8 8 0 8 -8 16 -16 24 -30 38 -46 54 -64 80 -94 110 -128 150 -174 203 -236 271 -308 351 -398
28 -398 452 -510 575 -646 724 -809 905 -1006 1119 -1245 1379 -1528 1693 -1875 2074 -2299
44 -2299 2549 -2825 3139 -3499 3913 -4393 4961 -5645 6484 -7551 8948 -10874 13711 -18308
58 -18308 27041 -49580 230019 432316 -100007 -231736 -35017 148390 53799 9893 6843
69 6843 -41963 -79567 69249 146746 -12297 -156816 18226 210432 94537 -119533 -48498
80 -48498 126217 79784 -76469 -37989 79491 37617 -71579 -30530 49848 4684 -49904
91 -49904 18007 51146 -49858 -73740 82771 139592 -51502 -182069 -10093 185754 91034
102 91034 -112654 -111809 21336 53096 7820 -2685 -34544 -98740 -40912 120177 111149 -105312
114 -105312 -185544 12694 167261 41576 -116871 -62684 49664 26283 -29286 -45 3822
125 3822 -64257 -49141 63499 65488 -68840 -97156 28822 66289 -41410 -66461 49904
136 49904 72391 -54104 -90246 32607 89522 -10306 -71300 -4807 36950 -4571 -10550 21869
148 21869 -22896 -86907 -12407 110408 58107 -102096 -98107 62943 113515 1482 -62739
159 -62739 -4460 38252 15429 15476 28484 -25309 -70234 1859 89087 29968 -81455 -55909
171 -55909 52601 53465 -27953 -25007 45817 39503 -22538 -9971 46691 28008 -33146 -20223 32197
184 32197 16142 -26507 -5593 22552 -27279 -68189 2755 79543 22626 -72034 -36634 65541
196 65541 63578 -18736 -40409 2922 14436 6969 25315 14759 -53781 -70815 18701 73824
208 73824 -6077 -86622 -31120 57474 37756 -28144 -23227 17706 11570 -4111 15965 14385 -35711
221 -35711 -44530 15306 35530 -24371 -51270 5149 35373 -18532 -50616 1429 41722 6033
233 6033 -29977 -4457 20666 -2228 -22875 -10115 -10389 -30922 -16867 23700 8495 -53123 -55323
246 -55323 13320 41627 -12134 -49037 -12111 29102 18400 -8896 -11750 -13082 -18308 4381 27685
259 27685 -2627 -51898 -38650 20625 25056 -27051 -46583 -6237 20053 -3188 -20422 -8184
271 -8184 -3029 -8872 2044 18400 960 -26741 -12545 16836 5238 -29852 -20880 13622 11613
284 11613 -21947 -27484 -107 5593 -10390 -10444 2995 3558 -3185 5582 10756 -8947 -20684 4555
298 4555 29486 9620 -22729 -15384 11518 12362 -8596 -12615 1075 5088 3875 7987 6149 -8948
312 -8948 -9591 12082 24100 7012 -10073 -374 15827 7965 -8074 -4381 7383 6701 1956 5551
326 5551 7847 1227 -477 9705 15659 6659 821 10448 14299 5632 -3183 3640 10544 5010 -2592
341 -2592 -1590 2375 -1378 -3948 3611 7046 2599 2154 8461 10552 2147 -1444 4464 9366 6465
356 6465 2370 3286 1076 -5326 -8570 -3844 -1510 -3420 -2275 5542 7138 3165 709 3756 6872
371 6872 5425 3683 6782 7155 -1156 -5735 -5167 -5276 -7403 -8924 -6449 -5103 -4889 -4273 -2399 -198
387 -198 1473 3704 4344 2253 -86 -2259 -1872 -3051 -3623 -5937 -5734 -7572 -7978 -10614 -8491 -7656 -4778
404 -4778 -1115 1393 -2350 -5103 -5495 -2485 -2385 -5590 -7597 -4588 -455 -944 -5813 -10992 -7697 -2001
420 -2001 701 54 -2636 -2339 3440 5214 960 -5149 -4903 848 6252 -282 -7044 -8116 -2540 4070
436 4070 1410 -4570 -5674 1516 11073 7214 -2634 -4845 6678 16210 12253 -1020 -2777 6463 11421
451 11421 8242 -1096 -4304 1939 10248 8776 -175 -8897 -1222 13354 14859 3104 -2366 8354
465 8354 17708 14856 3802 659 7494 15648 14327 6055 -4364 -3972 6454 13019 2710 -10969
479 -10969 -5942 13400 17080 2103 -9912 -513 14886 17403 10861 1628 346 6077 14122 10385
493 10385 -4367 -14349 -2023 14140 6720 -13250 -15697 686 9419 1044 -6521 -4222 2462 4084
507 4084 5495 3467 -4947 -8816 2761 6274 -8180 -22383 -11141 6712 -435 -17926 -15262 1815
521 1815 4167 -7905 -8973 -3393 -2467 164 5001 3448 -10974 -15431 1465 8227 -12471 -28856
535 -28856 -13252 9456 638 -18640 -16110 -1897 -99 -2932 958 2212 -7785 -7775 8381 11620
549 11620 -10060 -22397 -4194 8439 -5919 -18522 -7406 3734 -5184 -9881 4642 12625 -2783
562 -2783 -9609 5563 14253 2023 -6694 4100 7535 -6653 -7747 11333 7959 -17254 -19681 10360
576 10360 23077 -2364 -17133 925 15713 5291 243 9124 5826 -7126 658 23133 14874
589 14874 -17502 -16551 14784 20957 -5415 -15260 7759 11881 -6961 -6703 15666 11906 -10842 -8797
603 -8797 16787 14542 -6669 -4098 14212 6217 -15313 1194 26859 8074 -27744 -16213 24316
616 24316 23847 -12026 -19077 2131 11056 2170 5508 7667 -12666 -22489 10831 34324 1097 -38586
630 -38586 -18151 26786 21378 -16238 -19777 957 5101 -3769 5489 10396 -11511 -20317 9615
643 9615 27789 -3261 -32078 -7111 19929 -341 -24798 -7174 15756 -4871 -27739 -8056
655 -8056 16888 1168 -19981 -5496 10262 -2979 -8167 13387 12916 -22070 -28439 16145 35124
668 35124 -12082 -46216 -13466 24747 10387 -21310 -16575 -5097 -9118 74 23221 9036 -32712
681 -32712 -24694 30004 40995 -13479 -42375 -3672 26646 5137 -15744 -4165 -528 -17199
693 -17199 -9258 19122 12473 -25170 -20200 22361 28180 -8804 -15023 14669 15757 -15346 -12224
706 -12224 20722 16249 -22485 -24448 12268 20901 -7537 -15615 5807 5611 -9083 6731 29721
719 29721 7374 -30306 -8930 37836 29520 -20405 -28147 9093 20990 1619 -2154 6722 -4944
732 -4944 -15534 12343 36643 8073 -31105 -9384 36005 26363 -14010 -14053 11195 7304 -9601
745 -9601 2506 20692 -2611 -25566 325 31203 12443 -20279 -6873 19901 9854 -7435
757 -7435 9364 23805 -4299 -24821 7439 35753 6644 -28848 -11632 18614 11009 -7917
769 -7917 -591 6183 -10463 -11301 21490 27478 -13217 -31899 8830 37842 8681 -20902 -6187
782 -6187 14266 1628 -7662 7802 8555 -19232 -19608 14416 22613 -11817 -27126 4021 20232
795 20232 -1765 -11600 9261 13947 -12106 -13630 16735 20806 -10377 -21466 3159 13524 -4933
808 -4933 -9306 4251 -997 -18513 -6030 23965 12895 -25171 -24653 15039 27216 -3353 -19629
821 -19629 -2641 7093 -1992 1835 9725 -8415 -27770 -6069 27471 12749 -26142 -21450 14563
834 14563 20185 -5084 -10811 3910 4743 -6564 550 13489 -1844 -21887 -5442 16138 3948
847 3948 -19226 -8104 14110 4340 -14061 61 22147 9700 -12849 -4359 16199 11775 -4796
860 -4796 -2830 5844 -2522 -7677 7697 13710 -10607 -23266 4496 28821 10691 -16460 -7688
873 -7688 17702 16488 3161 1790 3524 -2669 -542 13278 12747 -11206 -18784 5013 21371 3043
887 3043 -15694 -3383 14558 8605 -2604 3869 8907 1964 -1036 9796 9946 -5785 -10730 6437
901 6437 10588 -5538 -10467 4313 9075 -4820 -11197 4686 12207 9 -8565 3038 7435 721
915 721 -3056 3600 893 -9387 -4950 10407 5708 -14246 -16411 4696 9935 -3794 -11849 -3287
929 -3287 4257 -1219 -2498 1489 -1686 -9569 -2206 9447 2295 -14093 -11711 2977 3575 -8368
943 -8368 -10420 -739 1070 -7076 -5408 2197 -1108 -7128 -2008 4942 1786 -6876 -3651 3682 -754
958 -754 -8761 -4275 3472 -1561 -11264 -8141 1593 1335 -5802 -4824 1177 1267 502 2889 4237 -1578 -3691
975 -3691 4256 8891 851 -8829 -4939 2718 1314 -5635 -5480 -779 1396 -741 1645 2307 -607 -510
991 -510 7489 8520 1540 -1355 5102 10810 2999 -4581 -2059 4980 3045 -2396 -3729 -1024 1077
1006 1077 2211 3070 1078 -1622 2359 9218 7456 -1240 -3665 4450 9856 3790 -5916 -5609 1609
1021 1609 4789 750 -3572 -2862 548 6425 7526 449 -6320 -1085 9562 9033 -1538 -7499 -943
1036 -943 6786 3573 -6225 -9575 -3276 3477 5501 -904 -6443 -4726 4923 8266 1343 -6754 -4122
1051 -4122 6601 8375 -1914 -11080 -6592 2181 3811 -3578 -9744 -7918 1386 5899 428 -6814
1065 -6814 -7266 2522 9298 3441 -8471 -8575 2947 8599 1220 -10146 -10446 -444 4942 -597 -9220
1080 -9220 -11033 -2913 6240 4441 -6694 -9748 -1163 8126 5332 -5100 -8073 -434 7160 3293
1094 3293 -6614 -9334 -3357 3433 3157 -5140 -10146 -5042 4631 6085 -3739 -9344 -2692 8276 8222
1109 8222 -351 -6752 -2008 4953 5946 -279 -5842 -4943 2146 5759 -575 -7890 -7021 2823 7098 1508
1125 1508 -4839 -2364 4932 7128 2838 -2503 -964 4203 5642 2253 -3225 -4506 -101 5545 2681
1140 2681 -4738 -4660 2407 7123 2585 -3747 -1045 4542 7013 4253 -736 -3154 -858 3723 3672 -2220
1156 -2220 -5360 -1762 5252 3430 -3884 -4230 1778 5994 3887 278 1501 4211 3909 2859 1317
1171 1317 -1522 -2836 1949 2452 -2260 -6354 -3054 2162 1451 -4937 -3056 2416 4536 1429 -660
1186 -660 1786 2060 2308 2998 464 -3470 -3299 1259 2414 -4623 -8020 -3175 3881 1457 -5271 -4912
1202 -4912 1828 3660 1883 -163 296 -1055 134 3698 1747 -5324 -7002 1142 5569 -2288 -8515
1217 -8515 -3969 3706 1408 -4691 -2769 1340 1593 -624 645 -255 -3466 -1557 3118 2197 -6343 -6851
1233 -6851 3544 5130 -3838 -9476 -1122 6739 1551 -4594 -3599 -608 991 2317 3403 -2706 -7869
1248 -7869 -1222 9075 4940 -10396 -10807 3377 8556 210 -8313 -5164 2032 2526 1650 1590 -2561
1263 -2561 -4158 3450 9430 2652 -8051 -4599 7552 8493 -4386 -8164 1346 5887 -1351 -3933
1277 -3933 -498 2339 916 1559 4215 -919 -2464 4874 10018 1748 -10027 -751 12252 7707 -7042
1292 -7042 -9454 2989 7768 1530 -2251 -2266 -2235 776 9078 8404 -4471 -9604 4187 17417 4532
1307 4532 -10717 -6242 8439 8666 -1133 -4790 -1062 -1647 -894 4675 3645 -6452 -7673 6116 10568
1322 10568 -194 -7940 1649 9153 1091 -6654 -649 6817 439 -7504 -2519 2300 -806 -3603
1336 -3603 1406 1080 -5834 -3707 7986 6084 -8889 -11888 4062 11889 -1087 -12772 -6432 2564
1350 2564 1301 -2040 -1107 -3999 -7882 -987 8639 4826 -10600 -9069 7407 11273 -2747 -10230
1364 -10230 -1811 3421 -3509 -4549 1273 -663 -9428 -5094 4377 3104 -6804 -5275 5511 4450
1378 4450 -4325 -1105 8664 3759 -8992 -5755 8678 7156 -6065 -9143 1396 3960 -2774 -1082
1392 -1082 2713 -4252 -6874 4144 12772 1354 -12398 -3734 12700 9645 -5163 -5840 2825 3412
1406 3412 -376 1591 4194 -3337 -7383 2325 9798 489 -8822 -1477 9221 2740 -5019 -393 8289
1421 8289 2349 -4967 1722 8740 2544 -4282 -758 4842 -416 -3013 2507 3974 -3689 -5605 6298
1436 6298 10922 -1416 -11101 341 11762 6157 -5090 -2757 2515 1205 558 5307 1511 -8534
1450 -8534 -7157 7151 10169 -5571 -12438 389 11233 2166 -4606 -460 2833 -1112 -1053 5031
1464 5031 2189 -6260 -5463 5597 5100 -6565 -7608 2391 4738 -3930 -5526 4833 5445 -4202 -5947
1479 -5947 2905 4738 -2504 -4583 1298 -500 -5983 -1569 4917 -2061 -9993 -4642 7818 6803 -7213
1494 -7213 -7571 2477 6748 851 -1198 -37 -1584 -4453 1957 6493 -2660 -11548 -5442 6978 5034
1509 5034 -6625 -7394 2113 3090 -1168 -553 2584 -682 -4167 1565 6705 718 -7313 -2135 5056
1524 5056 1380 -4691 -1924 3766 113 -5194 393 5920 1384 -4563 362 5325 1715 -2093 2033
1539 2033 3469 -2084 -4366 3566 7158 -1794 -7832 -551 7011 3037 -4303 -761 3540 644 -285
1554 -285 3782 3130 -3640 -2388 4582 6521 -1901 -6827 -84 5478 -431 -3845 636 2343 -144
1569 -144 -721 2630 3597 -1423 -2492 3869 5652 -234 -1991 2380 1882 -2771 -1133 3111 1200 -4745
1585 -4745 -5321 1801 3594 -996 -3574 -635 2455 218 251 2359 365 -2862 487 5263 3245 -5008
1601 -5008 -4026 3120 2897 -1993 -4434 -2 1058 -1127 -1221 542 -127 -1752 1451 3431 1787 -3054
1617 -3054 -567 4338 1616 -4405 -2077 3632 1741 -3518 -2820 521 1780 -549 -1519 454 -1988
1632 -1988 -1349 3097 3484 -1780 -4176 1117 4939 1078 -4292 -3800 1694 3422 -1141 -3700 -2017 -627
1648 -627 1339 988 555 -3046 -1711 3368 4751 -1038 -4930 -208 4292 2782 -3038 -3374 711 1286
1664 1286 1541 543 -687 -588 1604 4786 2038 -2799 -1529 3650 5577 -182 -3378 -1082 3138 1542
1680 1542 -1739 -2539 -763 1678 1437 1819 -1576 -2330 1381 4622 3158 -2665 -1631 2934 5353 623
1696 623 -3284 -2279 2479 2740 -143 -1180 -2214 611 2297 3271 -624 -2443 988 5234 4061 -1048
1712 -1048 -1304 1184 3671 2068 -412 -1537 -125 1324 898 609 -1729 -13 2634 1046 466 -1679
1728 -1679 -717 3081 2532 -204 -1036 1070 3313 1889 -80 -1561 -758 1579 2039 462 -2358 -1749
1744 -1749 1270 2674 6 -2640 -1122 1980 2518 -530 -2320 -1159 212 1718 -1278 -844 -1783 -122
1760 -122 303 342 -2674 -2214 490 1147 575 -1996 -791 633 1905 208 -1700 -1772 178 -73 -680 -1471
1778 -1471 -1952 -1160 -195 254 -2192 -1727 738 2765 981 -1263 -1051 1966 1081 -345 -1294 -644 -24
1795 -24 204 -1503 -2005 -1403 -332 240 -516 -1927 -839 1217 2200 75 -1528 212 753 2308 42
1812 42 -616 -1144 -104 1238 1370 -2072 -3069 -1 2147 1035 -1345 -2643 1173 3413 1425 -660
1828 -660 41 1149 3079 1258 -808 -1453 -987 1625 1216 -646 -3978 358 3781 1654 -2340 -1932
1844 -1932 346 3055 1365 474 -1007 1026 2585 2972 105 -2902 -1045 1270 3733 -348 -2898
1859 -2898 -2139 2688 2972 -1523 -2900 379 2626 1586 -10 -1569 -1102 762 3544 1896 -3215 -3099
1875 -3099 318 2270 77 -4150 -1976 1451 1302 1455 -942 -3454 175 1462 837 -905 -1911 -191
1891 -191 2128 2088 -2813 -3531 -658 2285 -526 -2483 -1837 410 1164 172 -1200 -225 -21 2760 1340
1908 1340 -563 -2865 -736 2783 584 -2536 -4179 -31 2740 1067 -2365 -3097 -906 590 1012
1923 1012 1014 -2366 -1914 -409 3812 1416 -3659 -2941 1619 2219 -1173 -2222 -33 527 -540 -673 -543
1940 -543 137 -524 1473 2273 -215 -1863 1292 2639 183 -2327 -1113 2987 1423 -1340 -2334 1160
1956 1160 533 -326 559 1489 -90 235 2602 1785 -1104 -2336 363 4006 1361 -2536 -1728 2629 455
1973 455 -1708 -1167 383 -32 -315 1387 1782 -363 -1887 2536 3233 108 -2080 1231 2854 -298
1989 -298 -2735 -527 2122 -480 -2556 -526 2175 -43 -975 1283 1749 -178 201 2823 1968 -2189
2005 -2189 -2836 2073 3817 -1823 -4156 -577 1697 200 -1414 -812 -879 -2409 656 3247 1340 -4463
2021 -4463 -1006 4650 4053 -1991 -3520 1027 1686 -205 -1869 -746 -412 -1936 -688 1981 184 -2691
2037 -2691 -1345 2324 2102 -3101 -1074 1752 691 -2548 -1565 2548 1125 -823 -2906 666 352 -1340
2053 -1340 -81 1634 -2021 -2966 1018 4107 873 -5004 -3475 4638 3434 -2803 -2556 -230 979
2068 979 837 1532 155 -2456 -3197 2066 4360 -367 -4359 -685 3859 2694 -1931 -1057 1981 19
2084 19 -965 1421 597 -1627 -3179 -451 1791 -983 -2636 576 3092 -578 -2508 2105 4918 23
2100 23 -3434 -94 3808 1392 -1869 -530 2406 -453 -497 2151 630 -3551 -2802 3346 3408 -1504 -3443
2117 -3443 1290 4705 1965 -1720 -997 -139 -608 1901 2830 994 -2305 -2869 2893 4208 -2082 -4214
2133 -4214 1279 3265 -511 -1382 1637 1478 -509 -612 2077 1802 -1919 -2403 1154 1360 -909 -749 1955
2150 1955 971 -3070 -1571 2658 1906 -1909 -2114 1405 2076 -43 -1452 1293 -362 -1571 332 2470
2166 2470 -1879 -3628 -1836 3172 1154 -1854 -1428 1024 842 -1061 132 1978 -695 -2749 973
2181 973 2115 -308 -2659 -1249 1607 391 -2705 -334 429 -173 -2032 964 2345 -642 -2103 -532
2197 -532 2448 -95 -1080 18 1915 -32 -1403 586 1752 -1218 -3090 572 1861 -294 -2699
2212 -2699 -444 1413 1278 -135 -20 977 -1838 -955 1868 2048 -2263 -3290 562 2329 -512 -2422
2228 -2422 231 1024 -492 -520 505 1312 -1012 -696 1879 2256 -1348 -1208 1039 1489 -123 -1018 548
2245 548 1813 -657 -1820 669 1617 -159 -766 748 293 98 544 962 1142 -1912 -867 2517 2504
2262 2504 -2013 -2482 1248 2571 580 -862 -1217 -244 128 935 1234 -254 -2016 82 2633 417
2278 417 -954 -1978 1209 1128 -1193 -993 -1086 -182 101 -188 413 -864 -1526 930 2433 -120 -1445 -581
2296 -581 2271 476 -1553 -1350 382 273 -25 -1599 -755 -275 -549 160 -62 -852 -645 871 1776 -1098
2314 -1098 -2507 -727 2460 1533 -918 -1859 -72 1339 176 -431 -1169 -1284 -577 1365 326 -2073
2330 -2073 -2023 898 1625 50 -2045 -908 1531 1332 -606 -990 -953 267 -96 225 -782 -1695 -95
2347 -95 591 460 -1289 -1403 501 1947 -100 -1343 -804 941 1702 -93 -544 -708 -458 414 1077 -775
2365 -775 -1546 -150 2030 438 -957 -1269 931 1888 1089 -392 -320 1068 798 1105 36 -918 -695 1078
2383 1078 587 -290 -1432 -871 1702 1472 -858 -1104 745 1128 -903 22 450 -163 802 965 -364 -1229
2401 -1229 -626 482 188 -160 -730 -717 1958 1014 -1195 -1118 863 1426 -11 -1074 -156 -670 78 -277
2419 -277 42 -1363 -656 1166 867 6 -1307 -227 1156 273 -769 -1562 591 1093 1292 -989 -757
2436 -757 -189 1569 1388 -109 -1584 -1051 1947 628 -193 -1718 -340 705 799 -915 -1650 -66 904
2453 904 1693 168 -641 -770 229 694 172 -1377 -525 1386 963 255 -1652 -574 1615 1168 -1059 -839
2471 -839 -488 1207 1615 -394 -1092 -530 44 938 699 -1201 -1348 891 1447 -90 -1105 -1295 626 1288
2489 1288 594 -1424 -1289 -415 1239 1228 -458 -2615 -517 1244 139 -1350 -648 902 1309 228 -651
2506 -651 -999 1460 552 382 -61 21 -133 747 1510 -1179 -954 -514 49 1065 -191 -2107 -125 1304
2524 1304 957 -121 -265 323 1223 1964 471 -787 -904 1889 829 -874 -1593 -840 1092 1721 -1044
2541 -1044 -2084 475 983 258 434 -92 -209 -62 1842 750 -1028 -766 461 1229 -410 -1008 -287
2558 -287 1263 688 265 -321 353 -1359 417 301 116 284 -198 266 -19 -245 -976 1464 1126 -1859
2576 -1859 -1404 216 198 55 -386 259 398 676 431 622 -160 -1752 -142 808 649 -1477 -1959 1056
2594 1056 768 -307 -887 418 327 -1428 -316 468 650 568 741 -126 314 -764 227 1019 -285 -1148
2612 -1148 24 654 750 -1297 -1209 518 281 310 -1190 167 -81 -114 1287 -203 -1018 -1042 454 2387
2630 2387 104 -2233 -1205 834 1249 39 -1112 2 -622 334 57 357 -140 -728 1515 1527 -538
2647 -538 -1967 30 596 720 -842 -1213 -61 1622 -38 757 -450 354 99 85 -327 -1014 -918 703
2665 703 669 -1037 -1574 511 2150 -571 -1385 -47 880 470 -1171 24 -832 139 325 1706 -85
2682 -85 -676 -629 1163 1757 -761 -1847 -533 658 -568 332 133 842 -287 276 646 400 68 -149
2700 -149 1237 980 -407 -585 492 707 -1767 -963 1666 -328 -561 -975 96 -519 -259 -1007 544
2717 544 -230 -611 -10 1096 467 -1288 -564 1578 993 -1255 26 430 323 -453 -218 -103 -649 -1327
2735 -1327 96 1853 -1225 -785 459 982 1355 -386 -259 404 167 -1054 19 652 -149 -1111 1112
2752 1112 582 -413 -1813 330 -304 438 -128 514 -6 -775 -1120 167 1726 -308 -594 284 1374 295
2770 295 -680 -635 312 644 -299 1570 -192 -1959 -944 1284 52 145 82 154 788 -798 -674 1687 978
2789 978 -1484 -190 1032 1272 120 -480 538 -984 229 143 2240 -255 -1749 312 798 1042 -1573
2806 -1573 -1027 998 243 -1090 -559 -116 -263 -1040 -1059 1282 506 -1082 -960 522 1839 -107 -1708
2823 -1708 -314 482 -949 -159 811 -163 -1586 764 387 1648 -159 -874 642 242 72 417 517
2840 517 784 -1241 594 2119 1158 -1680 -854 422 162 -85 -694 48 125 26 -127 1285 -1056 -1272
2858 -1272 86 905 -758 -1222 -33 1473 -1299 -2183 -537 754 105 -1296 -558 911 -164 -475
2874 -475 -368 366 609 377 1622 1608 -479 -1343 941 1484 82 -1436 146 1395 1713 24 -35 247
2892 247 -764 179 1153 98 -2431 -1459 1293 481 -836 -680 186 1205 505 -715 -367 648 -251
2909 -251 -290 610 -1093 -729 -241 2280 -237 -1630 -15 1333 1204 -878 -788 1222 -44 -626 -398 -2035
2927 -2035 83 -485 -489 -221 -649 -1385 676 1482 -583 -1771 -964 2054 1858 -985 -1712 -875 419 1187
2945 1187 5 -53 80 777 555 1501 762 -1438 717 1835 229 -1340 -1377 1233 2171 -1740 -377
2962 -377 -561 109 48 629 -336 430 -1367 -694 1518 -743 -1159 567 1182 612 -1096 -778 2093 281
2980 281 59 -1074 1609 2075 -223 267 28 613 -934 594 681 -531 -1442 615 1684 739 -130 377
2998 377 811 46 407 -1035 206 694 343 70 32 -248 -580 846 863 -903 -688 905 384 124 -643
3017 -643 -181 615 -313 606 325 -1148 174 146 46 662 -401 157 1383 780 -813 -1454 1099 126
3035 126 -47 -1860 454 656 -573 685 132 -783 -28 863 674 20 -1378 -20 141 1428 -609
3052 -609 -1131 288 1225 -203 537 1075 -775 902 -465 1459 -58 -663 430 630 -338 -1689 90
3069 90 668 371 -1206 -1909 811 909 682 652 1 895 212 807 446 -494 -627 -327 970 -247 -1041 -1184
3089 -1184 -813 1598 -448 -817 89 233 492 114 1094 456 725 95 1059 -738 -792 -426 1316 557 -1161
3108 -1161 -482 818 1086 -961 -616 -1231 692 1445 663 -1639 -905 -413 -898 -439 -1656 -17 -921 -265
3126 -265 455 -1131 -576 -229 157 -632 -368 -590 70 123 353 -255 -699 -684 1098 1068 -862 -893 907 374
3146 374 43 189 -84 57 -2 322 -361 -174 -862 -310 922 207 -774 241 203 729 -77 -507 628 1254
3166 1254 1135 178 41 1486 217 -6 525 -108 -452 454 584 -747 270 -443 312 790 -62 -391
3184 -391 -494 243 821 979 -617 -175 538 -363 825 -687 -338 226 656 -227 -966 -147 578 631 -409
3203 -409 -871 -155 -168 366 1010 -1054 736 -355 -533 -391 -358 -939 352 106 -161 125 246 802 441
3222 441 -237 23 257 732 -861 8 -51 -267 -1 -340 -22 -846 -761 567 291 171 -30 279 -533 204
3242 204 451 9 -884 1006 -388 -100 637 -136 200 784 1146 271 112 1113 1494 669 -86 -439 296
3261 296 108 21 -475 -554 -1045 -14 107 -353 -276 -561 1372 -289 -63 718 -781 203 126 139 229 -638 -436
3282 -436 -351 272 -583 158 994 654 -417 -1387 80 133 47 -613 52 -895 192 183 -177 -504 250 583 927
3303 927 -311 96 -495 558 2107 -191 -1521 -231 777 507 -62 -570 228 290 -453 473 -452 -156
3321 -156 25 1068 817 -30 -324 -350 840 -114 654 -146 -661 308 -529 59 590 -992 -558 -318 950
3340 950 -601 -1674 -137 1128 5 263 598 676 -9 -662 61 -171 214 624 794 -102 -1733 -432
3358 -432 -37 224 -992 -432 92 308 -454 -474 432 783 -670 426 1363 -201 630 -105 471 796 -1229
3377 -1229 176 743 -207 780 54 290 215 -940 183 600 -408 -856 -446 997 -160 -481 -187 277
3395 277 180 436 975 59 232 -592 1084 1016 165 716 -460 658 8 -77 985 1598 369 -628 -152
3414 -152 -12 -729 -1236 816 456 -1375 -406 -302 748 -495 -767 -344 -325 97 -53 1285 347 -91 -169
3433 -169 370 -1 -247 303 299 563 -569 -1422 -958 484 294 94 -768 293 -115 423 690 66 -344 -39
3453 -39 849 847 -799 -1200 104 -151 -142 493 -212 592 -1024 229 825 -99 -309 -78 455 -190 28 170
3473 170 -162 968 -1319 606 -245 -765 361 1245 381 -1120 -37 -458 371 -235 -1228 550 728 388
3491 388 -1074 -326 602 471 -110 -175 -127 260 421 -188 -270 -1486 -442 -45 389 -236 -837 -125 61 628
3511 628 28 -935 397 327 53 574 680 -294 -601 760 -142 -1116 -1357 521 386 -420 -773 -149 -131 439
3531 439 1311 -248 2 214 -560 731 -777 -1273 -864 255 1109 -410 -1029 163 375 -361 -539 -542 1306
3550 1306 -1545 -321 96 -281 -423 -324 -699 -71 -443 -268 288 251 -1084 -460 -1324 510 628 -1206 -71
3569 -71 540 -419 -131 876 -1401 -10 -404 310 282 -155 240 83 227 475 725 929 1619 -295 -666
3588 -666 -847 529 909 796 1404 -702 215 -1312 -867 -5 -607 1193 963 12 -863 124 76 1288 508
3607 508 31 852 71 -432 143 -933 -1134 -1222 -64 1074 1304 475 -234 1038 661 -1046 -179 202 -247
3626 -247 632 846 -710 349 1026 -1071 895 -585 -518 -37 696 313 -518 833 -64 -523 -995 -458
3644 -458 241 -50 88 -1086 -832 -712 301 -325 517 -248 -588 -86 100 -726 -341 314 182 616 -800
3663 -800 892 -1207 273 -568 507 -1002 202 877 472 118 -1412 -866 1192 57 622 111 452
3680 452 525 527 311 35 219 -67 103 619 550 723 -869 1318 461 14 -197 741 134 -216 72 -1270
3700 -1270 158 66 8 -791 -593 646 -348 -691 -200 -1123 2 -961 341 -567 151 30 -89 -563 1173
3719 1173 935 -78 -249 470 57 203 -416 -181 63 213 -381 6 -860 271 -1389 115 70 -197 656
3738 656 -437 -625 -409 -69 530 312 -45 -712 703 1041 297 1193 318 -249 572 -362 244 1396 -764
3757 -764 23 250 586 -480 -1340 519 -320 679 1019 -771 -356 -258 -85 65 -437 632 -1244 -306 681
3776 681 -771 600 1201 -212 566 268 300 146 -856 169 100 100 146 103 -494 -864 241 -254 41 -462
3796 -462 -1135 478 38 424 -537 300 -700 77 -141 50 -5 282 97 -1152 106 -1197 340 1616
3814 1616 241 750 -292 -113 532 1165 330 872 683 70 -836 -479 -220 -560 -375 462 -203 989 -714
3833 -714 1786 -1283 -410 824 -224 991 -1042 -1005 -956 402 1038 563 273 641 -871 41 -702 -119
3851 -119 -529 489 -988 516 288 221 -67 807 -1108 605 279 440 -631 -1384 17 121 -84 -402
3869 -402 803 682 -949 837 912 -632 -511 -712 -942 1763 979 -603 898 1327 461 -736 41 -239
3887 -239 7 166 275 602 -274 -500 1075 315 1043 411 -1493 428 768 -216 598 330 797 -222 -725
3906 -725 -331 -418 -125 229 -186 476 -9 -895 557 -576 6 1265 -78 -831 -438 -524 -482 159 82 -256
3926 -256 150 241 791 -41 739 -273 -619 710 524 -210 -1344 223 -7 -53 507 812 -894 -739 176
3945 176 -229 -476 -135 -616 -441 -619 -719 49 -745 -79 -1016 -334 914 -251 257 368 182 -311 192
3964 192 251 549 -334 -22 519 146 64 -254 -400 1044 570 -1092 940 -333 -74 -386 188 275 219 1275
3984 1275 149 -663 -1267 246 -414 345 -328 -1094 143 -757 692 1278 -391 -149 650 -48 -660 -1703
4002 -1703 -473 -860 -114 1075 -281 -948 775 639 -77 90 -69 -130 94 261 804 -125 -98 -786 -422
4021 -422 774 85 -291 -239 524 -285 -758 336 669 -890 -236 31 -639 266 199 -298 76 119 -946 -169
4041 -169 138 397 -7 -400 -660 270 18 366 154 -311 125 -564 -142 -242 236 517 361 -212 -366 607
4061 607 82 -392 -239 466 -375 -982 -267 555 -84 174 594 598 -170 270 155 202 -428 92 182 -126 258
4082 258 455 494 -431 166 596 151 423 -1006 21 260 461 -20 -423 72 631 491 -771 -703 169 -146
4102 -146 -246 -31 448 -45 -229 -302 312 613 921 -331 -719 252 164 489 537 190 340 -372 -247 -410 193
4123 193 209 388 -321 179 381 220 -704 -331 338 367 589 -386 -319 -497 296 -194 -63 -204 8 105 552
4144 552 47 -248 -131 -193 440 -182 170 482 368 -47 -114 -188 93 -228 197 -157 -47 9 -153 97 -165
4165 -165 -195 221 -80 461 88 -162 37 396 -126 13 362 -103 89 -46 27 20 -450 556 106 -680 -161
4186 -161 3 180 -165 -678 -323 211 163 -147 -110 385 -171 -63 11 88 -285 262 359 -78 -306 -452 173 68
4208 68 -149 -116 -15 423 149 230 508 30 -182 208 601 212 55 38 189 -18 -437 -96 -114 749 -237 -163
4230 -163 -68 129 301 62 -26 -56 -276 -170 248 521 200 3 -36 515 175 156 251 175 -240 8 -429 122
4252 122 -301 54 262 -134 93 3 -189 -32 763 -188 163 246 -322 47 -428 -4 8 67 -78 -102 196 351
4274 351 -300 -131 -31 816 -78 97 134 295 299 -176 -379 -270 -219 -136 -319 -103 -63 -56 289 19 672 -159 436
4297 436 -8 80 155 -219 -253 241 185 -66 248 -251 -213 -291 290 317 503 15 115 -34 -35 264 -252 255 -536
4320 -536 -183 -7 -318 66 349 333 377 101 50 528 609 73 86 704 308 142 -380 268 293 540 -372 160
4342 160 369 244 122 82 -54 108 140 -406 34 287 -153 403 -891 -137 252 -9 19 109 -32 -66 -104 307
4364 307 64 532 69 -347 44 174 286 -48 -49 -10 272 -205 790 333 114 185 -694 -129 -130 0 -305 124
4386 124 271 156 154 112 8 238 328 213 -64 45 279 345 551 269 177 -530 -10 -195 130 650 97 709
4408 709 -425 -558 -17 83 -385 253 241 -358 -281 -83 283 559 550 460 -148 207 236 5 260 -50 498 -580
4430 -580 -389 79 324 -105 -674 257 35 -235 -1320 424 -70 279 265 425 104 145 -219 -367 -98 -202
4450 -202 110 210 637 315 -117 388 -116 -241 116 303 752 -763 -162 684 65 18 -755 -205 -317 -369
4470 -369 873 -329 251 -407 234 -518 -710 -137 -60 84 -179 287 -267 -362 -167 -269 -73 432 429 1035 536
4491 536 145 -160 -36 656 -555 -14 127 -59 364 123 923 -163 228 -323 81 408 351 -45 -195 184
4511 184 315 382 -219 -153 -69 170 917 18 343 563 -207 -349 -32 -24 16 10 101 359 284 252 39 -210 365 -463
4535 -463 607 -989 -680 224 0 78 207 296 -183 78 104 70 62 -77 -533 341 -342 68 307 -1186 159
4556 159 111 574 558 469 -410 173 298 48 45 -336 -6 -274 195 195 -208 -858 91 1023 -382 692 132 -68
4578 -68 -301 -48 -638 -606 307 -24 -284 -504 348 401 -261 -364 -448 450 -421 114 16 817 350 500 -333 126
4600 126 -359 -240 -257 -344 -326 -195 909 361 263 -55 -153 223 -159 -52 285 396 -117 1535 -70 -590 4
4621 4 -345 -69 -402 -151 -599 130 -45 504 148 -428 216 208 -223 -207 502 144 22 472 -100 126 -68 -873
4643 -873 643 1405 235 976 533 -198 -717 -866 104 -645 264 31 -170 237 -318 -366 709 -238 -254 950
4663 950 573 -324 -303 -80 230 -4 -1090 1003 -909 -809 -546 1280 -246 -1158 661 -414 36 374
4681 374 -484 -152 -603 105 -216 621 659 594 -80 24 -168 -1156 -614 -227 582 28 -189 690 882 156 142
4702 142 150 -101 14 304 196 -677 705 -293 -659 556 -723 -228 -178 692 -3 114 -51 -407 -1716 -558
4722 -558 127 243 742 455 684 0 333 -683 126 -823 86 -247 -49 264 -641 -294 -24 -128 496 -961
4742 -961 308 64 65 -20 115 -877 198 -565 -473 156 -417 87 176 -618 699 62 -533 -556 436 -336 32
4763 32 57 -1157 136 33 -882 861 170 454 -870 334 -94 -450 76 -621 526 514 36 -200 124
4782 124 -572 -460 -857 477 -108 147 1047 -210 -758 -96 958 776 -48 -402 -608 -496 17 -1074 -266
4801 -266 357 223 277 -1090 -1 555 -188 -147 836 -233 -1058 207 -209 24 340 134 63 49 -227 -1099
4821 -1099 90 61 471 468 1433 -279 -649 80 25 279 -286 -635 183 -182 245 399 239 -213 -225 305 767
4842 767 415 268 -659 -826 385 198 186 9 -714 546 274 1201 431 -132 172 -584 44 -813 -100 -353
4862 -353 -144 162 -474 500 -6 -826 -68 -281 179 -480 296 325 -230 826 213 -630 -362 463 -295 661
4882 661 -596 -305 -441 -192 326 319 223 517 -174 389 -459 -825 110 108 -881 -543 -146 -92 -455 128 -357 -635
4904 -635 144 -481 -693 147 370 -227 -148 -430 1393 -567 -327 687 -1692 -30 557 5 1206 828
4922 828 -586 -280 372 -686 -588 -128 -555 -78 268 396 210 -848 40 634 -203 173 -352 308 -174
4941 -174 -76 23 846 -285 864 -340 371 -305 -106 847 992 521 -86 -327 -601 247 -74 -52 -1025 -543
4961 -543 350 100 546 268 -291 -564 517 -641 390 -469 -361 442 431 308 325 -109 -140 -545 -165 -606
4981 -606 -374 327 193 -213 171 -451 -595 959 -294 432 851 622 765 -526 149 -257 38 -231 -955
5000 -955 248 -131 -48 955 -389 185 -367 -539 648 -677 48 -257 -66 -420 435 -32 174 349 -272
5019 -272 -299 99 -353 -75 -1097 -125 -221 -195 116 328 595 547 -1147 -291 -132 -667 415 -289 701 -255
5039 -255 -148 -170 873 -190 232 -707 -261 -408 695 231 323 -64 -918 -248 -4 -257 112 60 -295 445
5059 445 467 -818 -192 689 555 319 853 335 -458 79 -380 -486 -213 -331 406 56 150 136 -104 277 395
5080 395 64 106 807 -672 426 518 334 -127 -195 818 517 565 358 -757 -685 -635 -468 143 -14 -323 -611
5101 -611 -858 9 126 17 486 -143 -205 -253 -600 36 -563 -100 713 536 583 -504 -890 140 -364 -268 787
5122 787 155 -541 158 273 177 58 -262 -351 266 -726 -791 914 97 557 -640 104 13 455 -310 50 -370
5143 -370 -200 829 231 -399 -840 -146 -9 -22 -747 923 216 -293 -390 -332 89 52 97 -447 -384 177 384
5164 384 -232 -606 -386 187 -203 33 -407 -501 -168 198 -468 -31 -758 172 649 -220 -316 311 -116 -506 301
5185 301 -103 -399 353 -262 144 242 -332 562 359 -324 -296 -677 116 479 304 -86 -545 398 -576 694
5205 694 -32 915 241 -343 260 -691 369 -259 -124 439 -34 -461 -281 -791 -178 -320 820 -102 -775
5224 -775 40 50 160 20 74 74 -684 266 63 -299 -129 -244 -126 -139 -122 635 267 -106 -29 -549 614 155
5246 155 -137 -276 -490 -1 -14 87 -44 -55 -213 -258 -163 -563 -107 -134 -181 78 -8 -328 -35 262 101 324
5268 324 -995 -201 -727 364 -109 151 -320 -211 -77 -206 -333 804 1148 203 462 -344 -335 -258 806 -474
5288 -474 339 427 324 546 -238 13 809 -191 -93 561 438 -230 -452 295 51 -647 -141 481 424 162 193
5309 193 250 -177 370 720 334 46 389 290 101 -128 455 470 -389 388 -9 261 138 226 -404 -198 254
5330 254 -336 -199 -74 78 -145 127 -41 -225 44 -187 -80 -40 -41 -392 275 605 -324 -175 268 -122 -628
5351 -628 143 1037 -319 449 -81 296 22 172 252 -185 1023 -5 -204 -612 -242 308 -75 47 507
5370 507 309 581 381 -700 -366 -346 -752 -885 337 -288 -79 548 238 -747 -557 503 -232 175 819
5389 819 -651 622 109 155 410 320 70 -43 -185 -352 84 38 424 490 261 44 292 -289 312 24 205
5410 205 -38 446 1082 -206 -190 147 147 -264 -328 -880 -19 406 -136 -54 84 339 430 13 -180 -313 -320 80
5432 80 533 282 1055 377 -307 265 250 115 247 -75 247 331 -4 658 493 38 -508 -454 426 525 -273 -478
5454 -478 286 233 -226 416 -192 -284 203 94 119 340 429 -256 -796 62 -93 -351 559 -649 -1088 940 -179
5475 -179 -183 -4 1286 192 383 455 -824 -215 -342 161 -326 -342 39 377 -799 587 225 105 682 -52
5495 -52 250 -74 189 235 -16 96 -421 -110 560 -361 33 107 56 -439 -333 -686 -749 -618 -130 -350 318 595
5517 595 -117 373 -197 -508 -394 -405 -465 -264 23 513 320 -227 -170 683 128 -216 -130 -191 -289 51 -546 -366
5539 -366 456 -27 -56 209 -590 -134 122 9 91 134 36 322 -303 -8 -82 -119 -149 -136 517 -219 -119 532 -551
5562 -551 -285 57 -15 -139 -92 -805 508 301 -94 172 -81 298 -98 271 -252 482 4 195 -31 -305
5582 -305 507 -847 310 563 253 -134 8 236 -400 58 524 466 -21 453 -426 -21 -335 62 -2 -51
5602 -51 28 243 -823 -35 316 -293 -298 -148 -166 596 -32 -254 233 50 856 -248 -146 -182 -1103 -214 -301 104
5624 104 -70 -257 624 141 251 241 166 161 372 41 -533 -376 -252 -387 658 262 -226 305 -169 -512 392
5645 392 409 -172 447 760 109 -384 -407 233 -668 -411 42 301 432 -39 -88 -404 711 258 274 -499 238
5666 238 103 -192 -468 -50 -1264 95 -5 -51 316 1095 245 182 358 562 -515 538 123 6 -64 -45
5686 -45 345 -176 28 -906 331 596 -17 114 168 179 258 117 -367 -393 104 -495 -444 -532 345 -132 -462 637
5708 637 -1093 -203 21 -259 252 -117 868 -511 -309 297 742 174 -15 -200 150 325 421 720 -637
5727 -637 -57 405 421 230 112 204 -593 -280 -152 360 -191 354 201 -393 549 488 -464 -554 -369 336 82
5748 82 54 21 -568 136 29 -77 -545 -81 613 -885 -735 -146 392 160 468 189 -415 29 -680 -1031 397
5769 397 272 456 650 488 -233 157 -258 -118 -473 -594 -972 105 479 179 350 442 41 200 -374 20
5789 20 103 -389 39 817 853 -132 -412 -305 -78 229 364 816 -946 322 595 449 298 88 -378 -542
5809 -542 -508 33 -545 -691 -135 -112 37 -858 364 299 -424 -249 38 105 -2 -326 134 -13 358 -338 -111
5830 -111 -239 -203 880 -162 -109 355 -49 -279 -76 -531 -677 378 217 -209 528 3 285 -107 153 87
5850 87 -97 -14 -191 -184 -420 -344 192 95 -397 243 -198 -101 -630 784 678 86 -111 -120 -39 -351 -9 -173 -257
5873 -257 -774 4 -290 139 -406 -167 146 357 190 151 -170 -256 -257 385 -66 -286 -272 84 408 487 376 -388
5895 -388 -48 662 -46 -25 -322 277 425 -7 402 455 -149 -466 191 584 -386 -515 339 189 887 -134
5915 -134 160 240 211 362 -257 425 -222 -88 -530 392 166 40 -141 249 156 127 399 132 -291 -202 282 427
5937 427 12 327 -234 242 -632 -543 124 -623 428 515 -3 243 -124 -199 138 650 188 251 478 462 349
5958 349 -325 66 760 465 908 199 -779 -468 -457 -39 -479 535 564 312 231 258 -308 385 530 -172 -106
5979 -106 -63 -413 13 105 -839 197 -61 417 547 360 -315 -192 -485 354 -336 -818 326 -190 -300 452
5999 452 456 148 511 427 -136 -67 164 456 -682 -101 433 707 -127 -176 -59 210 -463 415 -15 -4 562 182
6021 182 -283 245 78 108 305 -429 -428 -625 138 17 183 -122 83 -78 -170 -195 136 -81 -97 214 148 333
6043 333 689 455 14 21 240 99 415 -32 -600 -694 -704 -123 -923 486 -205 -173 -98 527 188 -128 217 345
6065 345 264 267 539 -51 718 -265 -314 412 -320 -439 -93 425 337 268 866 270 304 127 239 326 575 205 -108
6088 -108 -227 -324 -240 -352 -7 72 -351 -352 -273 286 -228 213 291 559 -136 143 -251 -86 -152 -261 -636 49 169
6111 169 93 33 -387 1108 677 -409 367 -463 446 510 -269 -10 268 442 205 -51 -125 -186 306 -37 144
6132 144 308 380 -182 -390 287 -87 293 294 799 50 407 -1 255 707 377 -691 -265 -568 -153 330 57
6153 57 746 625 241 -142 -515 449 537 77 -256 -11 -403 -198 -455 -161 -388 46 563 -137 -289 -129 52
6174 52 183 789 337 -155 -838 61 351 -41 -97 -801 -163 -210 44 -237 577 -210 169 -136 273 849 274
6195 274 180 336 6 -199 387 151 617 -42 -23 -7 241 -6 65 -229 109 277 40 202 -119 -175 38 130
6217 130 306 -161 -261 275 24 -233 -199 300 -95 -296 -77 -279 -298 -373 217 -186 -135 186 -433 -226 41
6238 41 -93 256 407 -130 -217 -126 -46 205 -3 -616 -395 386 131 -15 377 -62 366 327 186 403 82 -243
6260 -243 240 -159 -853 356 105 -71 366 635 339 -17 121 413 873 356 -198 336 -277 -227 -166 174
6280 174 -633 -8 267 -172 298 725 -125 180 8 825 -134 -261 411 -101 464 -261 568 416 16 -143
6300 -143 -133 321 -223 -121 397 755 474 1647 -478 -173 -497 -390 138 -146 165 -143 -394 17 -578 305
6320 305 1180 -574 203 630 21 -123 -108 110 285 -59 -367 -85 475 -58 -285 281 -450 -319 -367 -123
6340 -123 -220 -75 -278 312 838 -143 270 204 -205 -481 -274 -94 8 -577 -478 1111 -53 45 -10 623 -628
6361 -628 -304 418 281 215 457 -324 322 335 -170 86 -247 34 196 -16 -150 -115 -61 -320 -276 -146 -351 199
6383 199 430 47 -184 -20 872 255 -276 -260 291 -59 47 313 148 367 247 -700 176 -87 41 -154
6403 -154 -383 -6 -77 -357 171 33 168 -418 130 156 -782 208 738 262 -148 402 -260 302 -129 -69 -208
6424 -208 -363 -386 -11 16 639 612 -162 -234 -153 -110 465 826 141 28 29 -14 -16 408 -63 148 -375 261 -111 -458
6448 -458 -154 -304 192 470 -303 68 79 440 -260 -20 500 -49 452 -336 -547 -372 356 -37 595 -618
6468 -618 155 664 -362 -49 -364 400 115 -253 140 389 422 -137 320 -74 -410 460 -34 15 46 -329 153
6489 153 -34 -334 -329 311 81 164 -52 587 2 273 -886 157 -43 -262 -25 71 39 -124 264 -545 -163
6510 -163 139 432 76 -184 97 -444 135 -243 -371 325 -262 -376 23 -501 -136 -294 -81 -315 -86 -344
6530 -344 -144 151 317 439 116 -91 124 140 -15 -291 -182 -131 -280 -243 -106 46 -141 25 363 -26 -73
6551 -73 139 1 438 -83 357 -380 -342 -329 -665 179 285 239 -197 222 14 249 33 194 -147 317 -351
6572 -351 251 391 -227 -327 -158 -144 -2 83 320 -202 311 -153 -248 60 49 147 181 -546 30 -148 -923 -2068
6594 -2068 -567 287 -441 578 -108 78 -234 198 35 -334 442 -155 844 -603 -553 227 248 -164 -758
6613 -758 -390 -128 1250 -266 589 817 485 200 794 -626 308 -111 -393 -144 -169 -646 80 -129 1451
6632 1451 -499 101 -53 -925 -271 783 846 -439 -320 2 229 -525 315 -635 -189 723 608 -515 -530
6651 -530 385 462 -80 -209 110 389 801 469 114 3 -377 772 1006 50 -667 385 357 -419 108 513
6671 513 -733 -209 565 255 525 487 129 145 142 -448 340 -347 -575 57 -368 745 64 411 330 -714 -181
6692 -181 916 639 -340 14 -1142 -817 964 778 402 -867 203 133 360 -621 -665 609 -720 456
6710 456 505 26 -286 -398 0 -325 560 -186 -470 -660 146 1246 -156 -283 -279 -421 731 -184 -246 -234 495
6731 495 359 147 -480 -597 -512 -234 -425 541 -354 -72 -402 227 683 -99 467 -538 22 44 53 -489 -184
6752 -184 132 -28 -386 -547 -197 -791 554 85 541 -519 -149 265 342 -23 475 -6 1028 101 -318
6771 -318 145 -571 -53 -28 -50 -189 -405 -62 -226 -377 67 190 -752 521 -216 -608 511 331 -900 -499
6791 -499 381 1100 613 -655 37 -145 1486 217 -183 -581 157 -491 -141 -65 355 -40 -241 119 142 92
6811 92 -380 639 749 88 1065 22 157 434 1428 192 -586 -97 -501 1097 381 -18 -330 332 -710
6830 -710 151 770 -148 -27 167 352 181 -667 534 -657 288 155 668 791 512 269 173 39 -639 240
6850 240 -97 -616 488 198 -461 1339 -288 405 -501 -1482 -446 -1440 -485 -751 -681 365 -385 192 -869
6869 -869 631 554 80 -14 424 -28 -189 -14 -469 224 282 -25 35 -828 -850 -73 104 860 65 84 -728 108
6891 108 -284 493 -75 20 1061 -359 -296 -22 231 -1103 250 371 -720 -651 -410 -270 38 1239 -185
6910 -185 -211 -142 415 435 -454 -416 385 -685 686 790 -115 -80 483 -98 -80 -69 -271 105 249 -224 -626 193
6932 193 -209 305 -346 239 -646 90 930 -802 -641 -183 436 -682 -413 488 -826 -331 -568 136 -423
6951 -423 -444 -27 70 73 796 224 85 611 -738 -412 -579 -862 121 197 270 -529 1313 464 -186 -312 361
6972 361 547 236 86 -43 415 -208 -287 57 404 388 439 -45 584 28 521 190 -51 120 -373 -32 179
6993 179 385 313 165 927 -154 -367 40 -121 297 -346 -269 107 -37 -18 -945 681 78 260 358 223 -1
7014 -1 414 -9 -284 56 -126 502 -4 481 -535 339 339 257 557 71 -187 519 -482 -337 1043 -379
7034 -379 -208 55 -731 10 -210 54 -235 -213 -661 188 161 238 -949 539 578 -355 112 144 -295 -583 508
7055 508 276 -272 610 415 -61 43 4 -351 713 -81 58 1197 -53 -109 -121 -12 -394 -22 621 24
7075 24 -46 -367 -24 -210 12 355 105 -70 -665 380 506 49 212 -767 -191 280 340 -568 -232 492 -534
7096 -534 -107 258 28 1050 244 -426 298 533 250 552 182 -599 725 -886 72 937 24 -509 389
7115 389 758 147 -508 348 104 228 1272 -191 -516 -321 -384 -126 -116 31 -508 -591 144 -1156 -79 -255
7135 -255 -107 -875 -69 131 -74 -767 118 208 -203 220 6 -390 390 545 -966 -93 -604 131 -96 239
7155 239 -171 -83 -557 -309 714 411 227 866 -720 832 -3 -712 -72 765 554 -426 279 635 23
7174 23 -160 -104 20 -47 -139 380 351 200 3 151 292 -94 -831 -103 299 278 223 2 786 517 -32 -206
7196 -206 -105 320 749 -87 -85 -170 142 421 -126 13 -61 439 -143 328 75 -231 135 231 -62 543 -82 393
7218 393 -808 475 -338 102 10 233 -508 -70 619 -747 526 521 -608 -168 350 -232 -58 -118 215 -95
7238 -95 221 -451 566 -80 -31 -72 -403 412 -110 49 391 -83 -505 -120 2 190 109 332 -101 -1031 -40
7259 -40 68 495 -275 -250 -127 42 -31 433 -228 512 224 -296 9 -456 335 -9 2 -200 298 74 122 288
7281 288 580 440 74 -145 277 192 10 -333 -270 -35 833 629 460 -164 13 162 156 198 302 92 165 -103
7303 -103 -195 408 -180 416 792 -342 -189 118 -224 425 -586 457 398 68 -177 575 -186 -169 -478 586
7323 586 117 -165 130 200 38 -153 -133 -516 388 -82 408 -297 -503 255 170 -63 586 -332 101 382 -543
7344 -543 -126 82 131 -212 67 -358 172 157 307 281 -96 -402 79 318 656 342 -50 150 -28 -190 476
7365 476 9 16 -133 302 317 164 33 -14 -164 77 48 230 384 55 -302 -196 47 -307 69 118 -285 69
7387 69 52 -306 -138 22 199 10 -64 148 -226 225 -271 -118 40 -172 182 -201 15 -398 -746 -108 -121
7408 -121 38 251 -162 -262 7 148 47 -165 -276 245 351 -154 353 -164 22 75 64 -259 51 -165 -23
7429 -23 -106 -66 274 -318 66 -340 -53 112 -178 -17 -150 193 171 -162 -284 114 19 -264 -272 -12 -368 -267
7451 -267 36 6 181 -285 181 -261 120 -260 -36 77 206 -436 52 277 -198 112 -155 228 -220 61
7471 61 -45 72 -46 -217 29 572 358 -118 -146 81 209 27 239 -66 -161 -38 -79 -1 304 146 -414 135
7493 135 272 4 34 292 -313 434 530 -185 326 381 -109 315 -233 -289 166 125 -80 -139 -158 -416 -154 209
7515 209 141 56 110 -190 -158 91 161 147 83 72 283 306 31 333 17 -95 -175 -105 107 277 -19 -112 -1 -78
7539 -78 252 -29 123 93 -12 347 362 -261 -102 -254 229 -27 -49 24 55 -14 204 -10 -3 372 60 -69 -28
7562 -28 35 -23 83 -101 49 89 256 -9 -389 229 22 133 155 -203 30 166 236 74 128 -69 322 265 -89
7585 -89 66 4 213 39 -46 -204 -195 -141 128 30 29 65 248 213 -257 -185 -181 90 -153 -72 -185 32 13 75 411 -48
7611 -48 -134 -114 143 -268 -164 43 222 -40 232 273 87 -40 464 -358 213 -204 75 184 103 -20 138 183
7633 183 -277 -282 72 -217 20 169 -136 41 69 -50 -396 -197 146 -107 -7 39 -356 20 26 28 -170 20 0
7656 0 75 -75 9 -310 -73 29 178 193 149 216 -110 49 -159 96 168 76 13 170 -38 -90 -207 -85 -116 -134
7680 -134 59 62 45 -43 82 -203 -175 -22 -87 104 202 49 0 205 6 56 -214 161 -364 -46 100 105 -20 62
7704 62 2 164 -304 20 12 18 20 -35 209 21 277 12 318 196 -142 -161 123 14 209 -42 175 64 33 -249
7728 -249 81 -34 27 243 -70 454 233 169 33 -100 126 71 -122 -162 164 -299 -318 234 -205 47 -86 -146
7750 -146 110 -11 140 -284 -215 -229 -78 194 347 31 180 202 -391 -6 51 49 275 -243 95 -69 25 80 -25
7773 -25 353 -3 -100 -172 171 44 -34 -70 98 47 -131 -63 -2 233 -229 -204 78 228 91 219 148 7 -73 86
7797 86 -141 -269 42 -121 32 168 388 89 -103 -83 96 85 61 5 -332 -132 171 -43 243 265 -96 187
7819 187 298 7 -113 186 447 -330 -40 288 136 -102 -140 238 195 -106 -232 133 -168 124 104 159 149 3
7841 3 -199 59 131 -252 130 202 -101 -244 80 -141 87 158 306 -85 -22 32 28 97 128 -168 -44 9 112 -105
7865 -105 -13 -150 110 88 118 -131 87 84 -75 22 113 -289 88 34 -179 -179 88 78 -162 -3 -123 -117 7 -25 -91
7890 -91 137 -94 62 -113 114 100 305 64 -94 -150 -126 -65 -71 -112 -12 -271 -32 -21 162 -30 -158 -325 71
7913 71 81 222 95 -88 -10 -120 184 -143 -128 -400 316 -41 -311 -52 63 34 -70 166 60 -7 121 35
7935 35 -65 74 56 55 -222 -16 -138 5 -175 -59 -21 -115 -245 199 -341 0 -15 -188 -122 28 -13 66 -35
7958 -35 -5 -120 -159 239 44 21 -198 13 -32 50 62 -118 -51 149 -73 132 -15 72 211 31 -147 -181 232
7981 232 -227 -308 -218 33 154 -75 -136 -64 93 218 12 96 28 191 93 -229 -104 -142 -382 192 15 -14 145
8004 145 -185 54 -19 -10 114 81 128 79 -101 -166 81 -135 183 -172 -123 141 146 -132 53 -7 -63 30 -49 -77 -59
8029 -59 305 74 11 4 11 -99 -90 15 -310 145 37 -43 58 -75 135 147 145 357 -24 83 -188 53 -21 -51 -300
8054 -300 56 -165 -59 -53 10 -272 -87 204 -96 85 -208 -39 57 -91 81 99 141 12 -93 -182 -128 211 -37
8077 -37 -61 150 8 65 -206 -173 52 -107 54 -151 -265 65 -118 252 -159 38 27 -209 252 231 133 252
8099 252 396 227 -151 -149 -48 34 115 -62 230 -68 -7 159 -153 -98 124 154 -157 -162 9 -6 -135 -126 125 93
8123 93 87 -54 134 156 -26 -122 -28 172 -104 48 61 62 -292 -98 -64 338 -31 -7 19 -72 94 -84 18 -265
8147 -265 155 -294 -9 -152 168 158 -23 -193 131 -36 121 -52 -68 -234 61 -218 -163 -18 -124 -35 -118 -41
8169 -41 47 -1 -179 129 -271 -66 -255 71 173 -200 244 18 58 -157 -23 215 219 67 -240 -104 95 82
8191H2
##END NTUPLES=NMR FID
##END=
