##TITLE=1H_SA-26.112
 CDCl3,78 sc, 
 11.4.2019
##JCAMPDX= 6.0         $$ Bruker NMR JCAMP-DX V2.0
##DATA TYPE= NMR FID
##DATA CLASS= NTUPLES
##ORIGIN= UXNMR, Bruker Analytische Messtechnik GmbH
##OWNER= root
$$ XWIN-NMR		Version 3.5
$$ Thu Apr 11 14:03:16 2019 Russian Standard Time (UT+4h)  she@DPX200
##.OBSERVE FREQUENCY= 200.1315
##.OBSERVE NUCLEUS= ^1H
##.DELAY= (6, 6)
##.ACQUISITION MODE= SIMULTANEOUS
##.ACQUISITION SCHEME= undefined
##.AVERAGES= 78
##.DIGITISER RES= 18
##SPECTROMETER/DATA SYSTEM= spect
##.PULSE SEQUENCE= zg30
##.SOLVENT NAME= CDCl3
##.SHIFT REFERENCE= (INTERNAL, CDCl3, 0, 15.7039)
##AUDIT TRAIL= $$ (NUMBER, WHEN, WHO, WHERE, WHAT)
$$ ##TITLE= Audit trail, XWIN-NMR		Version 3.5
$$ ##JCAMPDX= 5.01
$$ ##ORIGIN= Bruker BioSpin GmbH
$$ ##OWNER= she
$$ F:/spectra/data/she/nmr/H-F/1/audita.txt
$$ ##AUDIT TRAIL=  $$ (NUMBER, WHEN, WHO, WHERE, WHAT)
(   1,<2019-04-11 14:02:17.78 +0400>,<she>,<DPX200>,
      <continue with go, POWCHK disabled, PULCHK disabled
       configuration hash MD5:
       00 E9 B6 7A A2 85 ED C7 34 08 36 98 17 FE 4E 26
       data hash MD5: 16K
       DF F9 07 B0 1F 35 94 E9 9F 77 2C 3F 99 1B AA 47>)
$$ ##END=
$$ 
$$ hash MD5
$$ 1C 6A 80 DF A8 EA 18 6A D7 6E E1 81 3E D8 A0 17
##$RELAX= 
##$RELAX= 
##$RELAX= 
##$RELAX= 
##$RELAX= 
##$RELAX= 
$$ Bruker specific parameters
$$ --------------------------
##$DU= <F:/spectra>
##$EXPNO= 1
##$NAME= <H-F>
##$PROCNO= 1
##$TYPE= <nmr>
##$USER= <she>
##$AMP= (0..31)
100 100 100 100 100 100 100 100 100 100 100 100 100 100 100 100 100 100 
100 100 100 100 100 100 100 100 100 100 100 100 100 100 
##$AQSEQ= 0
##$AQ_mod= 1
##$AUNM= <au_zg>
##$AUTOPOS= <>
##$BF1= 200.13
##$BF2= 200.13
##$BF3= 200.13
##$BF4= 200.13
##$BF5= 200.13
##$BF6= 200.13
##$BF7= 200.13
##$BF8= 200.13
##$BYTORDA= 1
##$CFDGTYP= 0
##$CFRGTYP= 5
##$CHEMSTR= <none>
##$CNST= (0..31)
1 1 145 1 1 1 1 1 1 1 1 1 1 1 1 1 1 1 1 1 1 1 1 1 1 1 1 1 1 1 1 1 
##$CPDPRG= <>
##$CPDPRG1= <>
##$CPDPRG2= <>
##$CPDPRG3= <>
##$CPDPRG4= <mlev>
##$CPDPRG5= <mlev>
##$CPDPRG6= <mlev>
##$CPDPRG7= <mlev>
##$CPDPRG8= <mlev>
##$CPDPRGB= <>
##$CPDPRGT= <>
##$D= (0..31)
0 1.2 0 0 0 0 0 0 0 0 0 0.03 0 0 0 0 0 0 0 0 0 0 0 0 0 0 0 0 0 0 0 0 
##$DATE= 1554976680
##$DBL= (0..7)
120 120 120 120 120 120 120 120 
##$DBP= (0..7)
150 150 150 150 150 150 150 150 
##$DBP07= 0
##$DBPNAM0= <>
##$DBPNAM1= <>
##$DBPNAM2= <>
##$DBPNAM3= <>
##$DBPNAM4= <>
##$DBPNAM5= <>
##$DBPNAM6= <>
##$DBPNAM7= <>
##$DBPOAL= (0..7)
0.5 0.5 0.5 0.5 0.5 0.5 0.5 0.5 
##$DBPOFFS= (0..7)
0 0 0 0 0 0 0 0 
##$DE= 6
##$DECBNUC= <off>
##$DECIM= 24
##$DECNUC= <off>
##$DECSTAT= 4
##$DIGMOD= 1
##$DIGTYP= 9
##$DL= (0..7)
0 120 120 120 120 120 120 120 
##$DP= (0..7)
150 150 150 150 150 150 150 150 
##$DP07= 0
##$DPNAME0= <>
##$DPNAME1= <>
##$DPNAME2= <>
##$DPNAME3= <>
##$DPNAME4= <>
##$DPNAME5= <>
##$DPNAME6= <>
##$DPNAME7= <>
##$DPOAL= (0..7)
0.5 0.5 0.5 0.5 0.5 0.5 0.5 0.5 
##$DPOFFS= (0..7)
0 0 0 0 0 0 0 0 
##$DQDMODE= 0
##$DR= 18
##$DS= 0
##$DSLIST= <SSSSSSSSSSSSSSS>
##$DSPFIRM= 0
$$ [...]
##$SUBNAM2= <"">
##$SUBNAM3= <"">
##$SUBNAM4= <"">
##$SUBNAM5= <"">
##$SUBNAM6= <"">
##$SUBNAM7= <"">
##$SUBNAM8= <"">
##$SUBNAM9= <"">
##$SW= 24.9337058887773
##$SWIBOX= (0..15)
0 0 2 0 0 0 0 0 0 0 0 0 0 0 0 0 
##$SW_h= 4990.01996007984
##$TD= 16384
##$TD0= 1
##$TE= 0
##$TE2= 300
##$TE3= 300
##$TEG= 300
##$TL= (0..7)
0 120 120 120 120 120 120 120 
##$TP= (0..7)
150 150 150 150 150 150 150 150 
##$TP07= 0
##$TPNAME0= <>
##$TPNAME1= <>
##$TPNAME2= <>
##$TPNAME3= <>
##$TPNAME4= <>
##$TPNAME5= <>
##$TPNAME6= <>
##$TPNAME7= <>
##$TPOAL= (0..7)
0.5 0.5 0.5 0.5 0.5 0.5 0.5 0.5 
##$TPOFFS= (0..7)
0 0 0 0 0 0 0 0 
##$TUNHIN= 0
##$TUNHOUT= 0
##$TUNXOUT= 0
##$USERA1= <user>
##$USERA2= <user>
##$USERA3= <user>
##$USERA4= <user>
##$USERA5= <user>
##$V9= 5
##$VALIST= <valist>
##$VCLIST= <CCCCCCCCCCCCCCC>
##$VD= 0
##$VDLIST= <DDDDDDDDDDDDDDD>
##$VPLIST= <PPPPPPPPPPPPPPP>
##$VTLIST= <TTTTTTTTTTTTTTT>
##$WBST= 1024
##$WBSW= 4
##$XGAIN= (0..3)
0 0 0 0 
##$XL= 0
##$YL= 0
##$YMAX_a= 241182
##$YMIN_a= -295677
##$ZGOPTNS= <>
##$ZL1= 120
##$ZL2= 120
##$ZL3= 120
##$ZL4= 120
##$ABSF1= 10
##$ABSF2= 0
##$ABSG= 5
##$ABSL= 3
##$ALPHA= 0
##$AQORDER= 0
##$ASSFAC= 0
##$ASSFACI= 0
##$ASSFACX= 0
##$ASSWID= 0
##$AUNMP= <proc_1d>
##$AZFE= 0.1
##$AZFW= 0.1
##$BCFW= 1
##$BC_mod= 2
##$BYTORDP= 1
##$COROFFS= 0
##$CY= 11.3945322036743
##$DATMOD= 1
##$DC= 2
##$DFILT= <>
##$DTYPP= 0
##$F1P= 18.9103706918063
##$F2P= -1.10871071338519
##$FCOR= 0.5
##$FTSIZE= 0
##$FT_mod= 4
##$GAMMA= 1
##$GB= 0.15
##$INTBC= 1
##$INTSCL= 1
##$ISEN= 128
##$LB= 0.24
##$LEV0= 0
##$LPBIN= 0
##$MAXI= 10000
##$MC2= 0
##$MEAN= 0
##$ME_mod= 0
##$MI= 1.114404
##$NCOEF= 0
##$NC_proc= 0
##$NLEV= 6
##$NOISF1= 3.799351
##$NOISF2= 2.8
##$NSP= 1
##$NTH_PI= 0
##$NZP= 0
##$OFFSET= 15.70392
##$PC= 1
##$PHC0= -8858.244
##$PHC1= 26.20026
##$PH_mod= 1
##$PKNL= yes
##$PPARMOD= 0
##$PSCAL= 0
##$PSIGN= 0
##$REVERSE= no
##$SF= 200.130013532006
##$SI= 16384
##$SIGF1= 3
##$SIGF2= 2
##$SINO= 400
##$SIOLD= 16384
##$SREGLST= <1H.CDCl3>
##$SSB= 0
##$STSI= 0
##$STSR= 0
##$SW_p= 3612.71676300578
##$SYMM= 0
##$S_DEV= 0
##$TDeff= 0
##$TDoff= 0
##$TI= <>
##$TILT= no
##$TM1= 0
##$TM2= 0
##$TOPLEV= 0
##$USERP1= <user>
##$USERP2= <user>
##$USERP3= <user>
##$USERP4= <user>
##$USERP5= <user>
##$WDW= 1
##$XDIM= 8192
##$YMAX_p= 0
##$YMIN_p= 0
$$ End of Bruker specific parameters
$$ ---------------------------------
##NTUPLES= NMR FID
##VAR_NAME=  TIME,          FID/REAL,        FID/IMAG
##SYMBOL=    X,             R,               I
##VAR_TYPE=  INDEPENDENT,   DEPENDENT,       DEPENDENT
##VAR_FORM=  AFFN,          ASDF,            ASDF
##VAR_DIM=   8192,          8192,            8192
##UNITS=     SECONDS,       ARBITRARY UNITS, ARBITRARY UNITS
##FACTOR=    0.0002004,     1,               1
##FIRST=     0,             0,               0
##LAST=      1.6414764,     0,               0
##MIN=       0,             -295677,         0
##MAX=       1.6414764,     241182,          0
$$ Real data points
##PAGE= N=1
##DATA TABLE= (X++(R..R)), XYDATA
0@%%%%%%%%%%%%J1q9J56j56J56j56J71k47L10l15L73m49N05n83O68p64Q69r74
30e14J098j244J399j567J754j964K184k425K697k987L311l668M054m487M980n520
46b899O127o823P608q512R567j0827J2357j4250J6674j9911K4479l1469M3684
59B5805p1316K76253j19898k85129K71689J43778j60769j75692J84685J24658
69B14064j55335j59023J52625J39574j12179j56552Q4210J15742o0022j11911
79d8807N1570Q4291m4032r0089L3155P5393j6286p8783n030N8928J5787m7682
91a1585k1953L0849K0790k7663j6908K2451J3478k4790j1371J9351P119k2265
103b2497k493J7099p023k0779J7856K0912l5094l6234L8823M6527m1658n5699
$$ plain form
0 0 0 0 0 0 0 0 0 0 0 0 0 0 11 -78 78 -78 78 -78 93 -154 156 -159 214 -235 270 -313 355 -409 460 -514
30 -514 584 -660 739 -828 926 -1038 1146 -1279 1418 -1569 1742 -1926 2128 -2359 2621 -2899
46 -2899 3228 -3595 4013 -4499 5068 -5759 6598 -7652 9022 -10889 13590 -17879 25805
59 25805 -45511 230742 110844 -174285 97404 241182 80413 -95279 89406 214064
69 214064 58729 -100294 52331 191905 79726 -76826 7384 123126 63104 -48807
79 -48807 2763 87054 43022 -47067 -13912 61481 45195 -33588 -38618 20310 36097 -11585
91 -11585 -33538 -2689 18101 -9562 -26470 -4019 9459 -15331 -26702 -7351 -232 -22497
103 -22497 -24990 -7891 -14914 -35693 -17837 3075 -32019 -68253 -29430 17097 -24561 -80260
115h0260L9761N2058m5410n3146O3146O1564p5947q0361P9363R6451o7059r8540
127a08380O2723R5606o0609q6389O9417R7436o4712j01577N6900J07603l8437
138B9581r4627L1278Q7719k7098p5968K9240P7846k8390p8407K1581P5171j1277
150C6649p1594K134O3526J459n6817l872N2370J899n2697o140N2266J0117n1008
163b1708j2177M7802J4236m2384r967M3469O473m3746o25N1910K787n4069l915
176b1914N9008J1220n2625o369N4260J398n7880L346O9612p81p4764m207P4442
189E4746P031p0287p366O8335J159p3397k068P7047P670p8593j6673P2447J9538
202E9589o5363k1908O0470J6160n8763j6749N7347K1540n7864k4906N3174K6180
$$ plain form
115 -80260 -40499 11559 -33851 -86997 -23851 37713 -38234 -118595 -39232 57219 -9840 -108380
127 -108380 -45657 49949 -10660 -97049 -27632 69804 5092 -96485 -39585 68018 29581
138 29581 -65046 -33768 53951 26853 -49115 -19875 57971 29581 -48826 -27245 47926 36649
150 36649 -34945 -32811 30715 32174 -24643 -28515 23855 25754 -26943 -33083 19183 29300 -21708
163 -21708 -33885 13917 28153 -14231 -24198 19271 25744 -18002 -18627 33283 36070 -17999 -21914
176 -21914 37094 48314 -4311 -10680 43580 44978 -12902 -9556 60056 59275 -15489 -19696 54746
189 54746 61777 -8510 -15876 52459 53618 -19779 -21847 55200 62870 -15723 -32396 40051 59589
202 59589 -5774 -27682 32788 48948 -9815 -26564 30783 52323 -5541 -30447 22727 48907
214D8907m6453k6986M0454K5755m0350k7966L7953K9191l9000l3231L3603L2252
226C4129l3080l5133K7097K8263k8184k9269K4205K3071l0882k2979K7805J9646
238D689l0665k2703K7038J9520k9920j7214L1375J6074l6934j6182L9818J8876
250C772l8923j8884L9877J8733l9399j3988M3374J7255m3072j5946M7313K1521
262B1633m3715k1257M3135K5905m2464k4495M4629K8986m4882k6963M4054L2616
274C7182m1490l4195M0917L6396l6781l3870L5904L6964l2319l7055L3870L9476
286D4999k8522l9299K7306M1848k2683m0285K4727M0879k0427l8326K2093L9822
298E2132j9848l7745J8093L7410j5326l5318J4760L5022j3476l5965J3525L6044
$$ plain form
214 48907 2454 -24532 15922 41677 1327 -26639 11314 40505 1505 -31726 1877 34129
226 34129 1049 -34084 -6987 21276 -6908 -36177 -11972 11099 -19783 -42762 -14957 4689
238 4689 -25976 -48679 -21641 -2121 -32041 -49255 -17880 -1806 -38740 -54922 -15104 3772
250 3772 -35151 -54035 -14158 4575 -34824 -48812 -5438 11817 -31255 -47201 112 21633
262 21633 -22082 -43339 -204 25701 -16763 -41258 3371 32357 -12525 -39488 4566 37182
274 37182 -4308 -38503 2414 38810 2029 -31841 4063 41027 8708 -28347 5523 44999
286 44999 16477 -22822 4484 46332 23649 -16636 8091 48970 28543 -9783 12310 52132
298 52132 32284 -5461 12632 50042 34716 -602 14158 49180 35704 -261 13264 49308
310D9308j4367l6848J4085L1601j3620l3370J3732L1982j5964l3534J5110L1902
322D0017j7227l4018J6644L0301j5657l4270J6164L2151j5525l4575J4085L3175
334C1265j5753l5831J5978L3008j5098l6923J3543L4952j4303l4774J0614L4030
346B0708j2879l6513Q689L6973j0992l7694N681L7040p009l8977O023L6331o117
359A264l8702K482L7838l314l7692J068L5294k868l3933k80L4461j173l3156j965
373d0676L3904J706l4545j843L3222L174l4245n04L3340K031l1713l983L2501
386g631L841k9940k164L1389K559k8871k566L1711M572l1212k299L2908M951l1818
400b4570k682L4384M295l1188m964L4003O629l2313l879L2488O990l1635p238
$$ plain form
310 49308 34941 -1907 12178 43779 30159 -3211 10521 42503 26539 -6995 8115 40017
322 40017 22790 -11228 5416 35717 20060 -14210 1954 34105 18580 -15995 -1910 31265
334 31265 15512 -20319 -4341 28667 13569 -23354 -9811 25141 10838 -23936 -13322 20708
346 20708 7829 -28684 -19995 16978 5986 -31708 -26027 11013 4004 -34973 -28950 7381 1264
359 1264 -37438 -34956 2882 -432 -38124 -37056 -1762 -4630 -38563 -38843 -4382 -5555 -38711 -40676
373 -40676 -6772 -5066 -39611 -41454 -8232 -5058 -39303 -39807 -6467 -4436 -36149 -40132 -7631
386 -7631 -3790 -33730 -35894 -4505 -1946 -30817 -33383 -1672 2900 -28312 -30611 2297 7248 -24570
400 -24570 -27252 7132 11427 -19761 -24725 9278 15907 -16406 -20285 12203 19193 -12442 -19680
413a9680L4046J0755l2585q633L3264J0009l0674j0136L3545J0711l0989r236
425i603L0541J4324k9377j0160K7341J3128k5684j3101K7512J6231k5807j5972
437f27K7197J6194k5876j4601K4704J5863k5330j5131K3881J6178k3562j6183
449B707K3674J3605k2777j6369K2423J5584k4540j7012K1305J6874k3001j8270
461e797K1171J6468k4442j7086K2853J5283k3405j7932K1423J6491k3045j7028
473a5046K1361J5982k3247j8131K1328J8481k4166j9659K2389J6865k4158j9408
485b7409K1599J9168k4205k1202K1005K0342k3582k2293J9683K0673k0233k3308
497c9762J7539K1361j7425k3138J6301K3056j7738k4378J7206K5577j5516k5696
$$ plain form
413 -19680 14366 25121 -7464 -16097 17167 27176 -3498 -13634 19911 30622 -367 -9603
425 -9603 20938 35262 5885 -4275 23066 36194 10510 -2591 24921 41152 15345 -627
437 -627 26570 42764 16888 2287 26991 42854 17524 2393 26274 42452 18890 2707
449 2707 26381 39986 17209 840 23263 38847 14307 -2705 18600 35474 12473 -5797
461 -5797 15374 31842 7400 -9686 13167 28450 5045 -12887 8536 25027 1982 -15046
473 -15046 6315 22297 -950 -19081 2247 20728 -3438 -23097 -708 16157 -8001 -27409
485 -27409 -5810 13358 -10847 -32049 -11044 9298 -14284 -36577 -16894 3779 -16454 -39762
497 -39762 -22223 -862 -18287 -41425 -25124 -2068 -19806 -44184 -26978 -1401 -16917 -42613
509d2613J5041K6252j2590k4720J3723K6303j1492k5640J2183K8540p036k7884
521b9933P926K8169n197k5866R259K6477q187k6299Q710K7444m924k6872N266
534a4027K7283m663k5026N246K5862m471k5553M762K8001k270k6473M674K3659
547A7004k087k0878N986K1250n882j9355N925K2908n218j8635K876K0802M1j9360
561E377L437J9106m722j7738N144K0242m994k1316L324K0184k914j9730L495J6675
575B5570n445j9018N465K0823o487k1882J310K2712k000k2060J618K0418m605
588A6419k1282N350K3929l581k8445K600K8626j126k4847q84K5529k052k6401
601f165K995K8832k535l2067l409L0591N131l0273o171K5064K738k9014j856K8039
$$ plain form
509 -42613 -27572 -1320 -13910 -38630 -24907 1396 -10096 -35736 -23553 4987 -2049 -29933
521 -29933 -22007 6162 965 -24901 -15642 10835 2648 -23651 -14941 12503 7579 -19293 -14027
534 -14027 13256 8593 -16433 -11187 14675 10204 -15349 -10587 17414 15144 -11329 -6655 17004
547 17004 14917 -5961 25 21275 15393 -3962 1963 24871 19653 1018 3894 24696 24737 5377
561 5377 8814 27920 23198 5460 10604 30846 25852 4536 7860 28044 25130 5400 8895 25570
575 25570 20125 1107 6572 27395 20908 -974 336 23048 21048 -1012 606 21024 16419
588 16419 -4863 487 24416 20835 -7610 -5010 23616 22490 -2357 -3241 22288 20236 -6165
601 -6165 -3170 25662 23127 -8940 -12349 18242 23373 -6900 -13071 11993 14731 -14283 -16139 11900
615A1900P58l2959o400K9657P497l0152j0669K3967R617k4773j0651K4838R916
628B546k7569j3627K6585J6874k3086j8446K0014J6008j6338j3510J7589J3422
640D62j8638j4420J9220J9399j6450j9738J2572J9256r453j6824J1495J5307j2728
653a0540j6224J4437J7618j1110j7898P886J6172m985r852N221R611j0041p410
666a7115J3785J2520j0915j1406J0279J3409p582n880J0905O027j2215k262J5799
679A5349Q790j4742q395J5406O688q988m463J2662J822j6905n79J8519N486j8896
693A1754j2063J7987J0521j4972j0959J4218P708j8140r497J9789J2157k2492
705F011j6560J7995J8276j5376j8759J5018J6168j7495j5308J8639K0264j9962
$$ plain form
615 11900 12658 -20301 -26701 2956 10453 -19699 -30368 -6401 3216 -21557 -32208 -7370 2546
628 2546 -25023 -38650 -12065 4809 -18277 -36723 -16709 -701 -17039 -30549 -12960 462
640 462 -18176 -32596 -13376 6023 -10427 -30165 -17593 1663 -7790 -24614 -13119 2188 -10540
653 -10540 -26764 -12327 5291 -5819 -23717 -15831 341 -4644 -14496 -9275 336 -9705 -17115
666 -17115 -3330 9190 -1725 -13131 -2852 10557 2975 -2905 8000 14027 1812 -450 15349
679 15349 24139 9397 1002 16408 23096 14108 9645 22307 24129 7224 6645 25164 30650 11754
693 11754 -309 17678 28199 13227 2268 16486 24194 6054 -3443 16346 28503 6011
705 6011 -10549 7446 25722 10346 -8413 6605 22773 5278 -10030 8609 28873 8911
717H911k5213J7683K6995j1740k7411R577K1809j0835k0308J2354K2512j5631
729H703k7897J0254K8092p901k8295L616K2085m390k3310N606K2210q935k5267
742b5429M540K4741q32k6056l152K1458J601j5488j484J6421n27j9608L91K1621
756a803L031j9232n537J5698O867j2469m009J1248K515j3287k941J5019M573j4693
770a5020p575J1203P692r040n890R332J35r640n79J3074J974j5016l065J2903
784i512M632j0347q37J0526j763r999M385J5098j890j4096J416J5563L06j1247
798g765M473J3378m186j5380R343J9438o210j9016M853J9780k90j7927K713J6435
812A9639l117j6430N435J8426k700k0601J547J8600K158j7882r24J6738k0j6588
$$ plain form
717 8911 -16302 1381 28376 16636 -10775 -1198 20611 9776 -10532 1822 24334 8703
729 8703 -19194 -8940 19152 11251 -17044 -13428 8657 4267 -19043 -13437 8773 -162 -25429
742 -25429 -20889 3852 3020 -23036 -26188 -4730 -3129 -18617 -20101 -3680 -4207 -23815 -23424 -1803
756 -1803 1228 -18004 -23541 -7843 -976 -13445 -17454 -6206 -3691 -16978 -19919 -4900 -327 -15020
770 -15020 -22595 -11392 -3700 -12740 -18630 -9298 -9163 -18803 -19382 -6308 -4334 -19350 -22415 -9512
784 -9512 -4880 -15227 -16064 -5538 -7301 -17300 -12915 2183 293 -13803 -12387 3176 3482 -7765
798 -7765 -3292 10086 5900 -9480 -137 19301 13091 -5925 -1072 18708 18418 491 3204 19639
812 19639 16522 92 5527 23953 21253 652 2199 20799 22957 5075 4151 20889 20869 4281
826D281p58J9939J327j9244n140J9921Q201j7753r047J6261Q295j3925q839J4681
840A8200J0713j8323j3208J8704J4185j6035j7364J3621J3774j5378j2412J2795
852I272J3595j7338j5758J4126J5146j3813j8115J0338J5122j3180j3411J0062
864c954J1933j4225j2853J2351J2500j2703j2770P962J2268r054j0050Q839P017
877b739r667q537R285R936j0155p829O650Q314n595p823O114N311q305n012Q165
892a1887O139o819q641O445P043m556p745M790O530m505q284P627Q368n459j0227
907b1181O183J0950o549q173P095J1153q653r113R086J3516q177j3001R168J4738
921G042o901j3000P842J5521q559j3608J0461J4427r221j3511R757J4488q212
$$ plain form
826 4281 3523 23462 24789 5545 405 20326 28527 10774 1727 17988 26283 12358 3519 18200
840 18200 28913 10590 -2618 16086 30271 14236 -3128 10493 24267 8889 -3523 9272
852 9272 22867 5529 -10229 3897 19043 5230 -12885 -2547 12575 -605 -14016 -3954
864 -3954 7979 -6246 -19099 -6748 5752 -6951 -19721 -11759 509 -8545 -18595 -9756 -2739
877 -2739 -12406 -20943 -11658 -1722 -11877 -19706 -13056 -4742 -10337 -18160 -12046 -6735 -15040 -20052 -11887
892 -11887 -5748 -12567 -21208 -14763 -7720 -12276 -20021 -15231 -8701 -13206 -21490 -13863 -5495 -10954 -21181
907 -21181 -14998 -4048 -10597 -18770 -11675 -522 -9175 -18288 -9202 4314 -3863 -16864 -7696 7042
921 7042 141 -12859 -5017 10504 1945 -11663 -1202 13225 4004 -9507 250 14738 6526
934F526j3684R253J4276q198j3837Q184J5743q154j5208Q505J5043o263j3872
947a686N798J3391m413j1488L715J2578l165j1594L411J2217k821j1222J140J2898
961A8759j232j3015J750J1474N2j2973q87J4117J251j5713q34J1995J805j3722
975B827k306J3408l76j2637k108J3092J028j3581j778J1278J423j4063j238J3575
989H544K54j4546j846J2976P49j4196j047J2893l09j3025j075J1706K1j2350j847
1004a3098J2478R10j2015k829J1118R15j1541k495J1898m2j1198k262J3025J72
1018d964j0727k195R889K293r285l591J0790K664j0300l285R854N152j0308l601
1032a7614R463N354j0186m067R145O217r301n308J0090N771r577m653R535P399
$$ plain form
934 6526 -7158 2095 16371 8173 -5664 2520 18263 10109 -5099 3406 18449 12186 -1686
947 -1686 4112 17503 13090 1602 5317 17895 14730 3136 6547 18764 15943 4721 5861 18759
961 18759 17527 4512 6262 17736 17788 4815 3928 18045 19296 3583 2749 14744 16549 2827
975 2827 521 13929 13553 916 -1192 11900 12928 -653 -2431 8847 10270 -3793 -5031 8544
989 8544 8798 -5748 -7594 5382 6131 -8065 -9112 3781 3472 -9553 -10628 1078 1099 -11251 -13098
1004 -13098 -620 290 -11725 -14554 -3436 -2521 -14062 -16557 -4659 -4701 -15899 -18161 -5136 -4964
1018 -4964 -15691 -17886 -7997 -5704 -14989 -18580 -7790 -5126 -15426 -18711 -8857 -3705 -14013 -17614
1032 -17614 -8151 -2797 -12983 -17050 -7905 -1688 -10989 -16297 -6207 -436 -10013 -14666 -5131 2268
1046B268j0095o321J1401P046r542o048J1479P357r595o745J2487O347r624n625
1060e210J0712O801q677o248J0762P645j0458m844J0805P029j0206n568Q666P569
1074A8778q962o540Q503P496p026p526P181Q114q805m978O062O891o608o399O101
1089A2282O613o919o633O842P163o001q531O377P224n177q604N521Q918o203r222
1104C650L762Q421n342q853N379P500o121q690M171P344m590j0503N627O320n536
1119B539r104N376P133o064q692L976P944n858q711M105P197m285r526M727Q175
1134a068o240q006M884P780n368q298L729R099n664q509M589R019n814q822M323
1149a4366J0475m892j0553M059Q195l418r974M535R119l421r740L238J1102l074
$$ plain form
1046 2268 -7827 -14148 -2747 4299 -5243 -11291 188 7545 -2050 -8795 3692 10039 415 -5210
1060 -5210 5502 12303 3626 -2622 8140 15785 5327 483 11288 18317 8111 2543 11209 18778
1074 18778 9816 3276 11779 19275 12249 4723 11904 20018 11213 6235 12297 19188 12580 6181 12282
1089 12282 18895 11976 5343 12185 19348 13347 4816 11193 18417 13240 4636 10157 19075 12872 3650
1104 3650 7412 15833 10491 1638 7017 14517 8396 -294 3877 11221 6631 -3872 1755 8075 2539
1119 2539 -6565 -1189 5944 -120 -8812 -4836 3108 -2750 -11461 -7356 -159 -4444 -13970 -9243 -1068
1134 -1068 -7308 -15314 -10430 -2650 -8018 -16316 -12587 -3488 -9152 -17661 -13072 -4053 -9867 -18689 -14366
1149 -14366 -3891 -8783 -19336 -15277 -7082 -10500 -20474 -15939 -6820 -10241 -19981 -16743 -5641 -8715
1163h715j0673K385J0355j861r205J694J0487l26r927J389J1763q40r327j95J1012
1178a984K252r585o23J1356J68q942l8J1525J819j0710j088J1455L292r461j557
1193b121R358K742r069j929R466L916r840k273R194L556q645j493P090J872o587
1208E237m99P522J708q388j331P478L423p063j584M860K817n634p94O287N52o412
1224H179q41N777K175o994q64N081M99n027k65L816P96p115j647O929R93p968
1240C524j785N568L33p279q3P125j238q849j935R552J718r604l696Q610K251r023
1256d811j579Q787J648j2185l000J2379N031j3224m639R681M757r864m549J0182
1270a386K952j1106n561J1745N612j1999p896J0044O095q462o231Q330O207j0229
$$ plain form
1163 -8715 -19388 -17003 -6648 -8509 -17714 -16020 -5533 -5859 -15786 -14397 -2634 -3474 -12801 -12996 -1984
1178 -1984 268 -9317 -9940 1416 1584 -7358 -7396 4129 5948 -4762 -5850 5605 8897 -564 -2121
1193 -2121 7237 9979 910 -1019 8447 12363 2523 250 9444 13000 4355 2862 9952 11824 5237
1208 5237 4738 12260 13968 5580 4249 11727 15150 8087 6503 11363 14180 8546 7752 14039 14591 8179
1224 8179 7338 13115 15290 8296 7432 12513 13012 7985 7720 11536 12332 5217 3570 10499 11492 3524
1240 3524 1739 7307 7640 361 278 7403 6165 -2684 -4619 4933 6651 -2953 -6649 1961 4212 -4811
1256 -4811 -6390 2397 4045 -8140 -11140 1239 6270 -6954 -11593 -1912 2845 -7019 -11568 -1386
1270 -1386 1566 -9540 -15101 -3356 2256 -9743 -17639 -7595 -1500 -9962 -16193 -7863 -1656 -11885
1284a1885r135J1050R734q745j1317O923J0004m076r211L727Q619m161p925N937
1298a0461J0515m716r999K836J1918O5r706R14Q657j205o325K995P587j156q623
1313f704Q41R253K994p460j809M488J726l789R99N651j871n820K094O140J057
1328G790m568p65L314j28j84L211K110l799m181N002M667j404l711K812J996l768
1344H394p55O259J562o525m334O944M523m847n583L723L465n278j974O057K248
1359A3879q288o627P237P721o338q535M264N149n023n647N108O827q295q883N025
1374b426J2046m683j2449J485R758j052q925J556Q623m139j1226L638J1506j149
1388B563j4704j747J2513K138j1212q11R173R6j2130k67J1038K796j2435n990
$$ plain form
1284 -11885 -21020 -9970 -236 -8981 -20298 -13375 -3371 -7447 -16658 -12931 -4312 -8473 -16398 -10461
1298 -10461 54 -4662 -14661 -11825 93 158 -9548 -8634 23 -1182 -7507 -4512 3075 1919 -6704
1313 -6704 -5863 3390 6384 -1076 -2885 1603 3329 -460 539 6190 4319 -1501 593 6733 7790
1328 7790 3222 2457 5771 5643 5459 8670 10780 6981 2800 7802 12469 11065 7354 10166 12162 8394
1344 8394 7639 13898 15460 8935 4601 11545 16068 11221 5638 9361 12826 7548 5574 11631 13879
1359 13879 5591 -1036 6201 13922 7584 -951 3313 8462 3439 -2208 2900 9727 1432 -7451 -2426
1374 -2426 9620 4937 -7512 -6027 3731 2679 -6246 -4690 3933 -206 -11432 -7794 3712 2563
1388 2563 -12141 -13888 -1375 763 -10449 -11260 -2087 -1991 -14121 -14388 -3350 -554 -12989 -18979
1402a8979J1002N771q925n545Q890J971p444k291R352K764j0253l943Q073O391
1416c166o185n092N402M805n371k639O482L493n822m725N284N767j853m373P02
1431g291L614p9n27K910N99l590j301K664L335q40l408J574L008j886J281K212
1447B275m50k624j137N439K753k093k565M142K6l231L034M788j545n053n07R227
1463A2479O12o396j383P321O82n310M78P350l86r018l81R497K738q999l664Q892
1479A4512J106o781k372Q215J717r610k609Q597L860r037m482N589N652p045m946
1494B366O454M555p615n884P586O428q749p317M522O972l963o406K348O230m572
1509B955q663N002P009m873r134K723P416k072p495K27N908j469q560K394P245
$$ plain form
1402 -18979 -7977 -2206 -11131 -16676 -7786 -5815 -13259 -15550 -6198 -3434 -13687 -17630 -9557 -3166
1416 -3166 -9351 -14443 -9041 -4236 -9607 -12246 -5764 -2271 -8093 -12818 -7534 -1767 -3620 -7993 -7291
1431 -7291 -3677 -3756 -4283 -1373 -774 -4364 -5665 -3001 334 -506 -3914 -2340 668 -1218 63 2275
1447 2275 1825 -799 -1936 3503 6256 4163 1598 5740 5766 2535 5569 10357 8812 3759 3252 12479
1463 12479 13091 6695 5312 12633 13315 8005 8483 15833 15447 6429 6048 15545 18283 9284 5620 14512
1479 14512 15618 8837 6465 14680 16397 6787 4178 12775 16635 7598 3116 8705 14357 7312 2366
1494 2366 8820 13375 5760 -124 7462 13890 5141 -2176 2346 9318 5355 -1051 1297 7527 2955
1509 2955 -5708 -706 6303 1430 -7704 -4981 2435 363 -7132 -6905 -997 -2466 -11026 -8632 -1387
1524a387k359q613R83O091q1p284J379N107q88n586Q58O031j532o618J918O025
1540e956j530m122N87L030k073j565J270L428j725m277K524L660m45l952J003
1555a0143M633k264l082L494L031k338k435J759L243q24k835J876K960j18k773
1570e816K891K674r60l820K386N532r92n400J932O663j995m031J728O776j296
1585F272n935K282O042J62p561J304O235N67o596R34O423P65p125L92Q518r38
1601A1741q410K036O342R08p317O32N770K64o160O81N842L27n871r29N807J433
1617A3096o348m87M964O91n687j416O004o54n449o51M199k40l890j858L491J015
1633F780l948k477M198O49l735m595M935J810m367k975L550K076m396k413L370
$$ plain form
1524 -1387 -3746 -12359 -11376 -5285 -5366 -12650 -11271 -6164 -7052 -12638 -11780 -5749 -7281 -13899 -11981 -5956
1540 -5956 -7486 -11608 -11021 -7991 -10064 -11629 -10359 -6931 -8656 -12933 -10409 -6749 -7194 -11146 -10143
1555 -10143 -5510 -7774 -10856 -7362 -4331 -6669 -9104 -7345 -4102 -4926 -7761 -5885 -2925 -3043 -5816
1570 -5816 -2925 -251 -1211 -5031 -2645 2887 1895 -3505 -1573 5090 3095 -936 792 7568 6272
1585 6272 337 2619 8661 8823 1262 2566 8801 9368 2772 3706 10129 10894 3769 4161 12679 11741
1601 11741 3331 5367 11709 12617 5300 5932 11702 11966 5806 6487 12329 12656 6785 5856 11663 13096
1617 13096 6748 6261 11225 11916 6229 4813 10817 10163 4714 4063 8262 8022 4132 2274 5765 6780
1633 6780 2832 355 4553 5202 1467 -3128 1807 3617 -750 -3725 -175 1901 -2495 -4908 -1538
1648a538K926m363l541M460J375n448j800M653J393m091k897L480K589l953l105
1663i860L653L400n820k810M272L129n117j723M051P64l024k888N032K519n623
1678a0045n50M353J955l657k980N731K567m851k555M922L105m092k157M766K490
1693i98l206j938L453L374l087k493L058L580k242l246K917L673j842m867M575
1708G11M657l363k925K943M710l880l720M287L874k461k863J626N387k101m757
1723B125K525M638j645l343J849M554k319m229L007M771l284m569L842L575k674
1738H823l649K086M333l175l567J004M558k399n258L930K179j637m093J385L755
1753H275j228n420K228K428j023m200J739K116j348l914J055K839p06l960j67
$$ plain form
1648 -1538 1388 -2975 -6516 -2056 -681 -6129 -7929 -3276 -1883 -5974 -8871 -5391 -2802 -6755 -9860
1663 -9860 -6207 -2807 -8627 -11437 -7165 -4036 -9153 -10876 -6825 -6061 -9085 -11973 -6941 -4422 -10045
1678 -10045 -10595 -6242 -4287 -7944 -10924 -5193 -2626 -7477 -10032 -5110 -2005 -6097 -8254 -3488 -998
1693 -998 -4204 -6142 -2689 685 -2402 -4895 -1837 1743 -499 -3745 -828 2845 1003 -3864 711
1708 711 5368 2005 -920 2023 6733 2853 -867 3420 7294 4833 1970 3596 8983 6882 2125
1723 2125 4650 9288 7643 4300 6149 10703 8384 4155 7162 11933 8649 4080 7922 11497 8823
1738 8823 5174 7260 11593 8418 4851 5855 10413 8014 2756 6686 8865 7228 3135 4520 8275
1753 8275 7047 1627 3855 6283 5260 1060 2799 4915 3567 -347 708 3547 2841 -1119 -1286
1768a286L637p94n733J086M958j322n378P33K967n13l822J48M223k742k343j359
1784g540M872j008m635M10L548j20m566L97L818r81m706M83M818J71m523M86L975
1801e101j246k079l96M017L89m611j47O887j775n149K699L825p76n475K975L800
1817b163m82m007K41N165J73l826K92L528mk121l31M586O72n718L44N423J962
1834C734l948j349M054K220m183j077M630K486m993j792O144L614n133k346L507
1849E568M074l961k442M220L399m117l321M301M151m190k410L066L948l667j485
1864G134K642J696k799k659K917L266l528l010J898L485k307j974K073J88j909
1879G113j127J257J731k297j363N84N12m58j139J49m15k518k10L093Q0l367j514
$$ plain form
1768 -1286 2351 1557 -4176 -3090 1868 546 -4832 -4099 -1132 -1645 -5467 -5319 -1096 -3838 -6181 -7540
1784 -7540 -2668 -3676 -8311 -7901 -4353 -4473 -9039 -8642 -4824 -5805 -10511 -10028 -5210 -5039 -9562 -9076 -5101
1801 -5101 -6347 -8426 -8822 -4805 -4416 -9027 -9174 -2287 -4062 -9211 -6512 -2687 -3463 -8938 -5963 -2163
1817 -2163 -2645 -6652 -6411 -1246 -1073 -4899 -4607 -1079 -1083 -3204 -3535 1051 1723 -3995 -3651 1772 3734
1834 3734 -214 -1563 2491 4711 528 -549 4081 6567 1574 -218 5926 9540 4407 2061 5568
1849 5568 9642 5681 3239 7459 10858 6741 3420 7721 11872 7682 5272 8338 12286 8619 7134
1864 7134 9776 11472 8673 6014 8931 12197 8669 5659 7557 11042 8735 6761 8834 9022 7113
1879 7113 5986 7243 8974 6677 5314 5898 6410 5952 4813 4962 4547 2029 1819 4912 4992 1625 111
1896A11J305N92j856j479K428j487k755K26K849o11l976k026K190K191l756j351
1912g405K876K11m699o15M408J516n283l260M811K453l426k746L359J532l478
1927i746k813N765L621o713m851O376L795k494m395K003N602l110l396L089M547
1942b720l902m946L867N006j568l705Q83M890p84m216J352O346k050m309O26P861
1958B631o30n330j027N922J359m221J356K485J076m269j90M775K175m230r38K111
1974C055L028j946j308L561o95j761p68L555K084l039k833J899K734J345k316
1989F595n07J102m95o66K110O21j755q62Q44N24K69K51q8k084j590L641P0q41
2007G139k888R79J737j70q62P49N16l326j897M135K355m081l745K870K807k657
$$ plain form
1896 111 1416 2008 152 -1327 1101 -386 -3141 -2915 -66 -677 -4653 -6679 -4489 -2298 -6054 -7405
1912 -7405 -4529 -4318 -9017 -9632 -5224 -3708 -8991 -12251 -7440 -4987 -8413 -11159 -7800 -6268 -9746
1927 -9746 -12559 -6794 -3173 -9886 -14737 -8361 -4566 -7060 -11455 -9452 -3850 -6960 -10356 -7267 -2720
1942 -2720 -6622 -11568 -7701 -2695 -4263 -7968 -7085 -2195 -2979 -7195 -5843 503 -1547 -5856 -5230 2631
1958 2631 2001 -3329 -4356 1566 2925 -1296 60 2545 3621 -648 -838 3937 6112 1882 944 3055
1974 3055 6083 4137 2829 6390 5695 3934 3166 6721 8805 5766 2933 4832 7566 8911 6595
1989 6595 6088 7190 6695 6029 8139 8760 7005 6143 6987 7511 7780 8031 7943 5859 4269 7910 7980 7139
2007 7139 4251 5230 6967 6797 5935 6684 7200 3874 1977 6112 8467 4386 641 3511 6318 3661
2023C661l056L311J761m373l701M602L751l708n598J012N441j256l653l96K881
2038F79p98n156K282M631k276n182j672O574Q94o272j467L761J708n444r10N060
2054c588K329p218m250O407L462m237m381M583M451n085k615M135L091n358l064
2069a1338M961M406l501m106K556K825k63k154J981K171k174k376K509L798j678
2084b383l166J125K655J077j339J44J917j270q33J009L085l61j583k42K106J652
2100C593l34L40p68n52J144Q89J533r64J09j248J577q4P60J576j652k382J857
2117E394K979N9k200q29J738J253k848J003R52L20l655P96L625r8m338j459L443
2134F135J600l811m97K522N33m798j165M980J233m619l115M519J767k389l538
$$ plain form
2023 3661 605 3916 5677 1304 -2397 2205 5956 2248 -3350 -2338 3103 1847 -1806 -2202 679
2038 679 -119 -5275 -2993 1638 -638 -5820 -7492 -918 -24 -6296 -7763 -4002 -2294 -7738 -8648 -3588
2054 -3588 -1259 -8477 -12727 -6320 -2858 -7095 -11476 -6893 -2442 -7527 -10142 -6007 -2916 -8274 -11338
2069 -11338 -6377 -1971 -5472 -9578 -7022 -4197 -4460 -6614 -4633 -2462 -4636 -7012 -4503 -705 -2383
2084 -2383 -5549 -4424 -1769 -692 -2031 -1887 30 -1240 -2073 -1064 2021 1660 77 -165 1941 3593
2100 3593 3259 3599 2831 2279 3423 4312 5845 4881 4990 3742 5319 5235 5995 7571 5919 3537 5394
2117 5394 8373 8432 6232 5403 7141 8394 5546 6549 7501 7821 4166 4962 8587 8489 4151 2692 6135
2134 6135 7735 3924 3427 5949 6482 1684 519 5499 6732 2113 -1002 3517 5284 2895 -643
2149f43K812J589k909j958L673J435l640l943L170L814k688m011Q48K331k64m460
2165d844J942K957j623n793J333O267k933l548p94L732n60k988l75L534k7m044
2181g764j30M277j24m944K06K454J127k727l46L019k09j631j158K934J827l070
2197f259j787K311K634k043j228K441j41o06p26K442P44k721P42K726m06j901
2213c778J736Q37j791O87O45J416q36q20J240K514j225j415J914J319p00m85L86
2230A644K117N21k270L89K309p45q07K359M16l84j570J093K632Q4l037Q26K496
2247H073n07k103OK243J265l690K59K731J69l783l67L555L0k597l77K435J262
2264H604m571n84L530K90k748k195L035J583m057l16K403L00k267k297L279P67
$$ plain form
2149 -643 2169 3758 849 -1109 2564 3999 359 -3584 -414 3400 712 -3299 -2451 -120 -384 -4844
2165 -4844 -2902 55 -1568 -7361 -6028 239 -2694 -6242 -7036 -3304 -3864 -6852 -7227 -3693 -3720 -7764
2181 -7764 -7894 -3617 -3741 -8685 -8479 -6025 -4898 -7625 -7971 -4952 -5161 -6792 -7950 -5016 -3189 -6259
2197 -6259 -8046 -5735 -3101 -5144 -6372 -3931 -4072 -4678 -5404 -2962 -2218 -4939 -4197 -1471 -1877 -3778
2213 -3778 -2042 -1205 -2996 -2309 -1664 -248 -1084 -1904 -664 1850 625 -790 1124 2443 1743 1258 1644
2230 1644 3761 4282 2012 2401 4710 3965 3158 5517 5933 5549 3979 5072 7704 7788 4751 5577 8073
2247 8073 7566 5463 5469 7712 8977 5287 5546 8277 8446 4663 4296 7851 7881 5284 4907 7342 8604
2264 8604 4033 3449 6979 7269 4521 2326 5361 6944 2887 2571 4974 5274 3007 710 3989 4756
2280D756k274j546J858J045k880j515J841r4r97o30R27J092l139j530N8K779l079
2297c328q90J759J014k360k315J444J607k326j008J63J891j478o50n09J781p32
2313e937j392R25J086l84j809K059P39j567j585K797N73j258k182L255J083j389
2329d986r15L32K252k595n69J304K322j757j766J432J250P41k690K556J546j039
2345b582j993K447J995j568q42J613K357k447q88J637K658k335o78K192J600r88
2361B178j553K351J466j467o85J314J138j152m92J193J953p65k779J864K216j344
2377E436k130J565J178O2l425J614L531j838k645J477K835j762j994P94K197j627
2393E268k040M46L201q82l003r6K326K29k686j433L995r80l641J544J589O7l315
$$ plain form
2280 4756 2482 936 2794 3839 959 -556 1285 1191 194 -436 491 1583 -1556 -3086 -3028 -249 -3328
2297 -3328 -4218 -2459 -1445 -3805 -6120 -4676 -3069 -5395 -6403 -6240 -4349 -5827 -6477 -6986 -5205 -5937
2313 -5937 -7329 -6404 -5318 -5702 -7511 -5452 -4713 -6280 -7865 -5068 -4495 -5753 -7935 -4680 -3597 -4986
2329 -4986 -5901 -5569 -3317 -5912 -6481 -5177 -2855 -4612 -6378 -4946 -3696 -2955 -5645 -3089 -1543 -2582
2345 -2582 -4575 -2128 -133 -1701 -2543 -930 1427 -1020 -1908 -271 2387 52 -626 1566 3166 2178
2361 2178 625 2976 4442 2975 2290 3604 4742 3590 3098 4291 6244 5479 2700 4564 6780 5436
2377 5436 3306 4871 6049 6111 2686 4300 7831 5993 3348 4825 7660 5898 3904 4698 6895 5268
2393 5268 3228 3674 6875 5993 2990 2894 5220 5449 2763 1330 5325 4345 704 2248 3837 3904 589
2410E89j36K488m70l433J307J437j238k083n5J416M8k012q06J990j339k127M02
2427d022J552n91q74p90J412q08k309K069N55o32j390O14P95n8j188k66O74P43
2445d514j799R8K049k93j686j19J339R07k291O65J669m47j434M50J839M91k907
2462e983K23L142O46k403j252K996P56j921Q00K015L16j884K34L038q4k768P71
2479a358K341M97j943j13J807J512k099m27L402k6j866p47K183J562j116j197
2495B412J675J826k496j769L482J619k427j146K336J056j622j750J269K322j076
2510E711l127K685K808k168l491J514K708j675j284N76J868j52k536J302K25J244
2526F208k965K49K319l97k106m86J977q43j926K083j025m12r93k9K26N06j695
$$ plain form
2410 589 453 2941 2471 -962 345 1782 544 -1539 -1594 -178 -130 -2142 -2948 -958 -2297 -4424 -4022
2427 -4022 -2470 -3061 -3935 -4725 -3313 -4121 -6430 -4361 -3806 -4438 -5828 -5214 -4419 -4477 -5665 -5931 -5257 -4514
2445 -4514 -6313 -6215 -4166 -4459 -6145 -6264 -4925 -4018 -6309 -5644 -3975 -4422 -5856 -5406 -3567 -3076 -5983
2462 -5983 -5760 -2618 -1972 -4375 -5627 -2631 -1875 -3796 -2996 -981 -665 -2549 -2315 723 639 -2129 -1358
2479 -1358 983 1480 -463 -576 1231 2743 644 217 3619 3593 1727 980 3163 4725 3609 2412
2495 2412 4087 5913 3417 1648 5130 6749 4322 3176 5512 6568 4946 3196 4465 6787 5711
2510 5711 2584 5269 8077 5909 2418 3932 6640 4965 3681 4257 6125 5973 3437 4739 4964 6208
2526 6208 3243 3492 5811 5414 3308 2822 4799 3956 2030 4113 3088 2676 1683 1654 1880 2386 691
2543F91l76n01p3q24Q53m4o75j097J76N96q81l78J8n25p66K57J587r24j666o01
2563e153J083M05p60j64J32K54j972j01J602J151k655q59K398P19j758j876J570
2580e984J043j072l96J557J303j782k304K131K404k765j129R61K424j088r2L88
2596d401K108j259k952J410M641o00l417Q01L861j75k195M10K203K38k467J001
2612g93L463O73m282k75L640J340j719j207K299K50j203k27K310J608k993p82
2628B102J422K267r97j768K00K538j546j146K325O96q33r84k41J922m8j578q53
2645C478J993M80n94o27R05j12j407j79J942q7q44m52r52L73Q57R78k855L3J78
2664C108j09j49r67O01K92j846k021K150J183j213k970J542K523k122r97j52J026
$$ plain form
2543 691 315 -186 -259 -1083 -230 -274 -949 -2046 -1870 -1274 -2155 -2533 -2515 -3040 -3806 -3549 -1962 -2886 -4552 -5153
2563 -5153 -4070 -3665 -4425 -4589 -4457 -4203 -6175 -6276 -4674 -3523 -6178 -7037 -4639 -3920 -5678 -7554 -5984
2580 -5984 -4941 -6013 -6409 -4852 -3549 -5331 -7635 -5504 -3100 -5865 -6994 -6033 -3609 -4697 -4789 -4401
2596 -4401 -2293 -3552 -6504 -5094 -453 -1053 -4470 -3669 192 17 -2178 -1768 435 673 -1794 -793
2612 -793 2670 3343 -939 -1214 2426 3766 2047 840 3139 3389 2186 1959 4269 5877 2884 2102
2628 2102 3524 5791 4794 3026 3226 5764 4218 3072 5397 6093 5260 4276 4035 5957 5909 4331 3478
2645 3478 5471 5951 5357 4730 5635 5523 4116 3937 5879 5792 4948 4496 3544 3917 4774 5752 2897 2930 3108
2664 3108 2999 2850 1883 2484 2776 930 -1091 1059 2242 1029 -1941 -399 2124 2 -995 -1147 -121
2681a21k731L24J402J814k845k613J327K074J78l134K0J810p8k972J704K756j803
2698b888l491l06M190P47l878j209K495J164k678n63J794M56j678k059L409J672
2714b823j994l804L023K385r33k349J208K329j915j984K951K764j567k437l06
2729e452M469p49j286j74L077p79j331J20L210L09l147m98L178J123j627m48J136
2746A131N2j205J867J420r44j601O15Q08J588p00q64n24J689l03k07J406k70m06
2764C552p8N8O1J413p65j115J71J810O7j141j79R7J490l93o61m69J011j335q44
2783B750J262N10k67p41j138J156K00j208M44o91M33r90n74J853j8j545k434J164
2801A66J748j458j999J520J371k369n04Q05J759k218j685L84L247j709k143R43
$$ plain form
2681 -121 -2852 -2528 -1126 688 -2157 -4770 -3443 -1369 -1191 -4325 -4305 -2495 -2573 -5545 -3841 -1085 -2888
2698 -2888 -6379 -6685 -2495 -1748 -5626 -6835 -4340 -3176 -5854 -6417 -4623 -4167 -5845 -7904 -4495 -2823
2714 -2823 -4817 -8621 -5598 -3213 -4146 -6495 -5287 -2958 -4873 -6857 -3906 -1142 -2709 -5146 -5452
2729 -5452 -983 -1732 -3018 -3192 -115 -894 -2225 -2105 1105 1414 -1733 -2231 947 2070 443 -5 1131
2746 1131 1183 -22 1845 3265 2321 720 1335 2143 3731 3031 2167 1643 3332 3029 2822 4228 3958 3552
2764 3552 3474 3532 3593 5006 4241 3126 3297 5107 5174 4033 3854 3951 5441 5048 4387 3918 4929 3594 2750
2783 2750 4012 4522 4255 3514 2376 3532 3732 2524 2968 2277 2710 1720 1146 2999 2981 1436 -998 166
2801 166 1914 456 -1543 -23 1348 -1021 -1525 -720 1039 -1179 -2864 -2480 767 -942 -3085 -2142
2817b142L81L55k497J103O29j075j340K82J747n2k892j80K506M69k983J2K207
2834c470M3k544J02K108K42j531r46J802J767k703o03N44Q90p25r7R40J198j111
2852d094j362K465J340r77j277J241J440j361j82J493R20q42q59K351J020k48
2868A068j396Q82Q41j980J452O44J54l0m38J057O15p43p50J912n70M9O15L55K5
2887C762q26J69K156j626k37N73R22o2q54k59J661M84j636J59Q85K9j550n80J868
2906E038n46j660K030j69N34k054j5J195O26k801l59R63Q94j444j441J137J016
2923B944k248j063J608J528j920j882J187Q52r96o63Q04J53j807m52J954n58r39
2940a498j545J235J499j489r13P26P24o72j864J215j85l54n57K3R88r95j170J538
$$ plain form
2817 -2142 -1761 -1406 -3903 -2800 -2171 -3246 -4586 -4304 -2557 -2609 -5501 -5681 -3175 -2706 -5689 -5677 -3470
2834 -3470 -3427 -5971 -5869 -3761 -3519 -5050 -5996 -4194 -2427 -5130 -5733 -5189 -4299 -5024 -5121 -4181 -2983 -4094
2852 -4094 -5456 -2991 -1651 -2628 -3905 -2664 -1224 -2585 -2767 -1274 -354 -1196 -2055 296 1316 1068
2868 1068 -328 554 1395 -585 867 1511 1665 1635 1197 2254 2869 2126 1376 3288 2718 2767 3382 3737 3762
2887 3762 2936 3105 5261 3635 3398 3971 4893 4831 3977 3718 5379 5863 4227 4386 5271 5300 3750 3170 5038
2906 5038 4492 2832 4862 4693 5227 3173 3158 4353 4979 2178 1819 2782 3676 2232 791 1928 2944
2923 2944 696 -367 1241 2769 849 -1033 154 1006 10 -653 151 304 -1503 -1955 -1 -559 -1498
2940 -1498 -3043 -1808 -309 -1798 -2711 -1985 -1261 -1933 -3797 -2582 -2767 -3121 -3678 -3655 -2667 -3662 -4832 -3294
2958c294m82j172K71O55P97j506j149J090Q02m49r04o3O71m65M28R17l1l26j201
2977e411P48J039j00j217R66R79p6m67P38n48K37j60N39J621q24k12J220L6l35
2996a227n90R42J030j33l44N76J180q81n77P20J215J199k408J287N40j69j065
3013A295J082J858j196q3P62J237n90o31L88J158m83j095L63K098r95k63jJ530
3031F434j532q19J367K79Q89k969N73J242l90q59L32M13j062K58j219Q13j11p21
3049B918q7l0J76j247J97N77N96j780j376K439q87r14J57l42p97m14k91J127J079
3068A101j944j78J832m95j571q68J804j759J26m93L42j37l3n45O53l20j672N11
3086c646N04q2o9J50o28O83j428l34R89k42j51m06J528o3r84o85J130Q3m91m3
$$ plain form
2958 -3294 -3776 -4948 -4677 -4022 -3225 -4731 -5880 -4790 -3988 -4437 -5341 -5404 -4733 -5198 -4770 -3853 -3884 -4210 -5411
2977 -5411 -4663 -3624 -3724 -4941 -3975 -2996 -3072 -3539 -2801 -3349 -3112 -3272 -2733 -1112 -1936 -2148 -928 -892 -1227
2996 -1227 -1817 -875 155 22 -322 254 1434 553 -24 696 1911 3110 702 1989 2529 2360 1295
3013 1295 2377 4235 3039 2956 3718 4955 4365 3734 4122 5280 4797 3702 4065 6163 5168 4905 4904 6434
3031 6434 4902 4083 5450 5729 6618 3649 4222 5464 5074 4215 4547 4960 3898 4156 2937 3750 3639 2918
3049 2918 2831 2801 2977 1730 1927 2504 3100 1320 -56 2383 1496 582 739 397 -400 -814 -1105 22 1101
3068 1101 -843 -1021 811 316 -1255 -2123 -319 -2078 -1952 -2445 -2103 -2240 -2273 -2818 -2165 -2485 -4157 -3646
3086 -3646 -3142 -3224 -3293 -3143 -3771 -3088 -4516 -4850 -3861 -4103 -4254 -4660 -3132 -3195 -4179 -4864 -3734 -3651 -4142 -4185
3106d185P11M82l47j158J058O86J55m57J25j30K53K21J101M53j746K48J484k43
3124a289o64K8L03R59k246J758O53M03j125o04J942P93j321Q58K66J179j526k50
3142A17J710N63n97l30K025J078k296q25K148J155j065j514J081J211k23j696
3158B542J935N56k30r92k42J277j055q37J154R86r89j87o03J298j285j240Q4K002
3176D174j277M49k60Q38j751j57o29J610n04j510j02P17J9r54K21N27n02p93p92
3195f76L0M83k3r29J63L84j305j44P26m58L1r40K93q66Q87j189M65k67l56J078
3215b613n49l14N6l83P00l87m50Q42j465J013j88J163p48n17l85J512J271j702
3233c144j11Q32R09j707n98K877M12j533j342K338L21n79j557J304J553r73l56
$$ plain form
3106 -4185 -3474 -2992 -3339 -4497 -3439 -2753 -2598 -3055 -2930 -3060 -2807 -2586 -1485 -1032 -2778 -2530 -1046 -1289
3124 -1289 -1953 -1925 -1622 -663 -2909 -1151 -498 -95 -1220 -1824 118 911 -410 448 714 1893 367 117
3142 117 1827 2390 1793 1463 3488 4566 2270 1445 3593 4748 3683 2169 3250 4461 4238 2542
3158 2542 4477 5033 4803 3811 3569 4846 3791 2954 4108 5094 4105 3918 3315 4613 3328 2088 2172 4174
3176 4174 2897 3346 3086 3924 2173 2016 1387 2997 2493 983 881 1598 1617 663 884 1411 909 116 -676
3195 -676 -646 -163 -186 -1115 -952 -568 -1873 -2017 -1291 -1749 -1718 -2658 -2365 -3231 -2344 -3533 -3068 -3335 -3691 -2613
3215 -2613 -3162 -3476 -3420 -3803 -3103 -3490 -3940 -3098 -4563 -3550 -3738 -2575 -3323 -3840 -4225 -2713 -1442 -3144
3233 -3144 -3255 -2423 -1514 -3221 -3819 -942 -530 -2063 -3405 -1067 -746 -1325 -2882 -1578 -25 -998 -1354
3250a354m8J800j555l68J97J712j71j312L79Q81J658l020R43J290O92j004L58
3267A078J369L97j846j66K030N05j464n68K201Q8j085L72O41J223k160j358K222
3284C479Q99j930M18J70J047q80K28r16Q13J49r21P42M34j64j190l25K07J718
3302C978j697J98L04Q95j773J122K11p92J60j515m76J523N84k027L49N05k06j596
3320b53O36P69l32k039N36j1L1n01q97n84N52J371j223n38n57R65j20k027J547
3339b675j20L91k598J197J722m53k158m57J940k70J6j64O94K60j662LL063j107
3357b378j670o10K67K353j743p1J172L85k261N4J485J087j436n90J898J025j782
3374b815r16J643K06n39o00K000Q59r37k168J827K242o27j886MK416O57q83j9
$$ plain form
3250 -1354 -1402 398 -1157 -1525 -1328 384 213 -1099 -720 161 1819 -1201 -258 1032 1724 720 1078
3267 1078 2447 2844 998 832 2862 3367 1903 1335 3536 3624 2539 2911 3552 4775 2615 1257 3479
3284 3479 4378 2448 2866 3036 4083 3203 3431 2515 3328 3477 2556 3298 3732 3568 2378 2053 2260 3978
3302 3978 2281 2479 2783 3678 1905 3027 3238 2446 2606 1091 615 2138 2722 695 1044 1549 1343 -253
3320 -253 383 1152 820 -1219 -683 -694 -663 -1164 -2061 -2645 -2093 -722 -1945 -2483 -3040 -2075 -2195 -4222 -2675
3339 -2675 -2795 -2404 -5002 -3805 -2083 -2536 -4694 -5151 -3211 -3481 -3465 -3629 -2935 -2675 -4337 -4334 -1271 -2378
3357 -2378 -4048 -4658 -4391 -2038 -3781 -3852 -2680 -2295 -4556 -4502 -3017 -1930 -3366 -3956 -2058 -1033 -2815
3374 -2815 -3731 -2088 -1882 -2421 -3021 -1021 -162 -1099 -3267 -1440 802 175 -1711 -1707 709 1366 483 464
3392D64Q42n00q16l08K475J228j665l91N89R69j94o48J914j353o32M63J634k43
3410C828l45k068J975q9l92J563l65k70m19qJ20O61P3j34q84P98N35r1j121j56
3430C211M71m60M68N98o75p16j213J032L66L03j356N33j241J373Q00j340j134
3447A020K94P0l20j34k41O4k140M90O5J203j792M1R47M4j121r39J380Q0j027J2
3467b004m95J100n09j199n24J992n5l071K054J272j539j619J038J175j24j011
3483c519p32J914O06j645k84J979j528q38J3K342m73q10J45J162m8m91k11L26
3501b092j09j63n66J256L43N30j272Q87L2O25m66N0Q92n50r52K668m79j078R93
3520E49j102N75J050l24K77j118P98R43j29K33o90L60M40P58o66r42J678J0j066
$$ plain form
3392 464 1306 806 -10 -318 2157 3385 1720 1329 1918 2887 2693 2045 3959 2606 1974 2437 4071 3828
3410 3828 3483 1415 3390 3301 2909 4472 4107 3837 3418 3410 3530 4191 4264 4130 3246 4044 4579 4488 3367 3211
3430 3211 3682 3222 3690 4288 3613 2897 1684 2716 3082 3385 2029 2562 1321 2694 3494 2154 1020
3447 1020 1314 1384 1064 930 689 753 -1387 -897 -832 371 -1421 -1380 -433 -389 -1510 -2449 -1069 -989 -2016 -2004
3467 -2004 -2499 -1399 -1908 -3107 -3631 -1639 -1694 -4765 -2711 -1439 -2978 -4597 -3559 -2384 -2508 -3519
3483 -3519 -4251 -2337 -1731 -3376 -3660 -1681 -3209 -4047 -4034 -1692 -2165 -2975 -2830 -1668 -1716 -2207 -2418 -2092
3501 -2092 -2201 -2364 -2930 -1674 -1331 -801 -2073 -1186 -1154 -529 -995 -945 -53 -603 -1555 1113 634 -444 549
3520 549 -553 22 1072 748 1025 -93 705 1648 1519 1752 1062 1422 1862 2620 1954 1012 2690 2700 1634
3539A634O13k40m18R3K52o84J184j43l64J755p6j112N35P83j195o67R51k99Q58
3558C460m8n70O58k14P8j140Q11r2l85p07O58L57J72j008l45J63k33q27M08L41
3578A537n7l67j506J306p21J33m47R62p50r58N00j40n29p68q3Q80m76o61J80J478
3598d87n47k812K061m0r51O68j032J144N9j232R7K67N08k114J306l37P70k58Q19
3617b111J16q45k50M42P05n37l47J100J38j194M71k97Q40p24l80R11J151l78o06
3636a795Q72m55P54K74l09L12m63j6J59J406M25n74n58P62P63o48N62j66N04o12
3656A197J043q7O78k167J100J316m95r17J19M84P37k3n47Q04q60L64j49J039j557
3675B079K33M47J210j390j376R40m6P50j10O0q41J276j755J098K76n26j79m69
$$ plain form
3539 1634 2247 2007 1589 1682 1934 1250 2434 2291 1927 3682 3606 2494 3029 3812 2617 1950 2901 2602 3460
3558 3460 3412 2842 3500 3286 3364 2224 3035 2943 2558 1851 2509 2866 3038 2030 1685 1848 1615 788 1196 1537
3578 1537 1480 1113 -393 913 192 325 -122 840 90 -868 -368 -508 -1037 -1805 -1888 -1008 -1484 -2145 -1965 -487
3598 -487 -1034 -3846 -1785 -1825 -2776 -2108 -3140 -1996 -1937 -3169 -3072 -2805 -2297 -4411 -3105 -3442 -2672 -2930 -2111
3617 -2111 -1995 -2840 -3090 -2648 -1943 -2480 -2827 -1727 -1589 -2783 -2312 -2609 -1769 -2493 -2873 -1962 -811 -1189 -1795
3636 -1795 -923 -1378 -624 -350 -659 -347 -810 -826 -667 739 1164 590 32 794 1557 909 1471 1305 1809 1197
3656 1197 2240 2153 2831 664 1764 3080 2585 1668 1787 2271 3008 2985 2438 3242 2382 2746 2597 3636 2079
3675 2079 2312 2759 3969 2579 1203 2143 2097 2847 2737 2797 1956 3232 1477 2575 2851 2325 2146 1677
3693A677O63q57n05P56M16K94p79o39R25n16O21j946J100o37j73j084M64k66J02
3712c84o73J341r46K29m22p57Q31k48K86j064J631j590o5K39j29M42r79qM66J35
3732a665p60l01M62o40L88J68j55p33Q08q98o89K79m11P1J180o63K28J474k61
3751b118m38o33j13O30l33n74J527n19K67m29j06P90L69o62R32j8p6k5J267m45
3771g07m36JJ137J86q54o56J963j36L12l49K58L43o20j73J744m44M34j086P47
3790A664J90p40K40J410o36n55q72K381J87j122l8P32n29r12R7J292j38O13j294
3809A970M46R76l83j478J556K144k535o43Q65O30j218L39p26M40K70j668N58J104
3827B647k84n93o83R73m10p14l6J366r42m17j4N08k93j340k2N70n05r15M30P2
$$ plain form
3693 1677 2340 1483 978 1734 2150 2444 1665 1026 1951 1435 2056 110 1210 573 400 -684 -220 -486 -384
3712 -384 -1057 284 -662 -433 -855 -1612 -781 -1029 -743 -1807 -176 -1766 -1831 -1592 -1721 -1279 -2258 -2266 -1800 -1665
3732 -1665 -2425 -2726 -2264 -2904 -2516 -2348 -2503 -3236 -2428 -3326 -4015 -3736 -4147 -4076 -2896 -3559 -3331 -1857 -2118
3751 -2118 -2556 -3189 -3302 -2672 -3005 -3579 -2052 -2571 -2304 -2733 -2839 -2049 -1680 -2342 -1410 -1428 -1504 -1529 -262 -707
3771 -707 -1143 -1142 -5 181 -673 -1329 634 498 810 461 719 1062 442 269 2013 1569 2003 917 1664
3790 1664 1854 1114 1354 2764 2128 1573 701 3082 3269 2147 2109 2841 2312 1400 1497 2789 2651 3264 1970
3809 1970 2416 3392 3009 1531 3087 5231 2696 2053 2918 3548 2330 2669 1943 2383 2653 985 1543 2647
3827 2647 2363 1770 1087 2060 1650 936 900 2266 1324 907 893 1401 1108 -232 -254 316 -189 -1104 -674 -602
3847f02J106o89m6j442M53j72m63J261k04r42N41J00l53O4n39N65p80L06j066
3866b902p33J119K64j50j65j05l53J701n42q95l53O73j26o66P70j73M73p17N46
3885b334p0r6N79j530J202J05P19n58m8J291m23l01L80K01P2j270Q89J239k08
3904a61q06M21pP36n94J027l37rk86P24M9J223j836P60N05Q97j548K06J055l41
3924A678P9j249J226J351j749m08J441P36M04j964J042M13j205j62N19O00j97
3941B555q18P35j00R91j521m73Q86K8n86n3O58J171j445j057P85q5j00j065p9
3960D27J221N8j503L3O03k19L96n73K71K73n85j66l86n57J316o57K22k16r19Q85
3980g6r29M3L57j514J054m87O73j203l56O27R4k90K45P31o78o0r92P7J364r14
$$ plain form
3847 -602 504 -185 -231 -1673 -1220 -1392 -1855 -594 -798 -1740 -1199 -1099 -1452 -1388 -1927 -1362 -2142 -1836 -2902
3866 -2902 -3635 -2516 -2252 -2402 -2567 -2672 -3025 -1324 -1866 -2761 -3114 -2441 -2567 -3233 -2463 -2636 -2163 -2880 -2334
3885 -2334 -2404 -2500 -1921 -3451 -2249 -2144 -1425 -1983 -2031 -740 -1163 -1464 -1084 -883 -811 -2081 -1192 47 -161
3904 -161 -967 -546 -553 183 -411 616 279 270 -16 708 757 1980 144 904 1409 2306 758 964 2019 1678
3924 1678 1757 508 1734 3085 1336 928 2369 3105 3509 1545 2587 3000 1795 1633 2152 2752 2555
3941 2555 1737 2472 2372 3363 1842 1369 2255 2283 1697 1644 2302 3473 2028 971 1756 1671 1571 506 427
3960 427 1648 1706 203 236 839 620 1016 443 714 987 402 236 -150 -707 609 -48 174 -42 -961 -76
3980 -76 -1005 -962 -605 -2119 -1065 -1552 -879 -2082 -2438 -1811 -1717 -2007 -1762 -1031 -1709 -1769 -2761 -2684 -1320 -2234
4000b234l24J9M41l7o47J10m9N63n51n25R49L14L6j474J394N01m24K09M67O18
4020f44j83r75Q58O24n08r74L12J932j314m87P15J120l73m7L05qL26k093J685
4039B71P10p56Q23q7o37O18r47J55J512j91j01R57M45j89j070L09M06J025j217
4058B036q63J163R08j471M14Q39p40P84j708L24J709j30j136K33o68K82L39p88
4076A527L63N20j180J69r6N86O36j304q7J49M86l57M3n96o50J37L20l07K44j31
4096D72q75J097J000j607O85p32o96m1L79K12J35m47o09P05n16K33j082P4q3K18
4116a478j016R27J81j080N47k88Q5R72j104o66L12Q06K23m51n22R17l41j183J002
4135b157L98J06j669L65M62j47kM8R09L68q90N6l58J434p58q4K89L43J02o40L09
$$ plain form
4000 -2234 -2558 -2539 -2098 -2135 -2782 -2672 -2721 -2158 -2709 -3234 -2285 -1971 -1935 -3409 -2015 -1514 -1938 -1729 -1262 -644
4020 -644 -827 -1802 -944 -320 -828 -1802 -1490 442 -872 -1359 -644 476 103 56 361 353 679 -1414 271
4039 271 981 225 1048 961 324 942 -5 150 1662 1471 1370 2327 2772 2583 1513 1822 2228 3253 2036
4058 2036 1173 2336 3244 1773 2187 3026 2286 3070 1362 1686 3395 3265 2129 2362 1694 1976 2315 1527
4076 1527 1890 2410 1230 1399 1303 1889 2525 1221 1134 1283 1769 1412 1455 859 209 346 666 359 603 472
4096 472 -403 694 1694 87 772 40 -656 -697 -318 -106 29 -418 -1027 -322 -838 -605 -1687 -1613 -1696 -1478
4116 -1478 -2494 -1567 -1386 -2466 -1919 -2207 -2122 -1150 -2254 -2920 -2608 -1802 -1579 -2030 -2552 -1635 -1976 -3159 -2157
4135 -2157 -1759 -1653 -3322 -2957 -2495 -2642 -2644 -2596 -1687 -1319 -2209 -2153 -2511 -1077 -1835 -1919 -1630 -1287 -1185 -1825 -1516
4156a516P40r4o68P13N83N96j195L36J034q15n67J139J12N62o8j62n9nl44K72
4176E94N86L95M0o1j171K295j261J06%j22L90J62j24l51ON0J313j459J536q61
4196B063j02J52K31m6K53M6r58K97L17k92M60j061M83N86o50L69K04j457R41l47
4216A489J35j114N01j34P50j384J007M31j514l5n59P39k78J3j125J042l07p15
4234a058l08r56K240j772N44M01J70j44r21j79Q24n45k63N43o08P73j209r3J0
4253b551M06l76N43l12J44M12p97J234j829J103K81j30J13J26j61L68m94K85o93
4272b328N76J79M0p54R90p88K59P88l44J075q03r4k86k22j51O77J072o76O95r17
4292a012L2J62J038q03Q52m41k34L18R91l68j166J182N37L62q77P96p24P17k36
$$ plain form
4156 -1516 -776 -870 -1538 -825 -242 354 -841 -505 529 -286 -853 286 398 960 892 730 671 666 322 594
4176 594 1180 1575 1615 1554 383 2678 1417 1523 1523 1401 1791 1953 1829 1478 1484 1534 2847 1388 2924 2063
4196 2063 1961 2113 2344 2298 2551 2597 1639 1936 2253 1961 2421 1360 1843 2429 1779 2148 2352 895 1836 1489
4216 1489 1624 510 1011 877 1627 243 1250 1681 167 132 -427 312 34 47 -1078 -36 -343 -1058
4234 -1058 -1366 -2322 -82 -1854 -1310 -909 -739 -883 -1804 -1983 -1159 -1704 -1967 -1424 -2032 -1259 -2468 -2561 -2551
4253 -2551 -2145 -2521 -1978 -2290 -2146 -1734 -2531 -1297 -3126 -2023 -1742 -1872 -1759 -1633 -1794 -1426 -1920 -1635 -2328
4272 -2328 -1752 -1573 -1533 -2287 -1297 -2085 -1826 -1038 -1382 -307 -1110 -1204 -1490 -1712 -1863 -1186 -114 -790 -95 -1012
4292 -1012 -980 -818 220 -583 269 -172 -406 -88 903 535 -631 551 1088 1450 573 1369 645 1362 1126
4311A126P73o65R0N88j012K99J93K85M2q44K215o98n89K31l86k94J74O27k65Q16
4331B706j231J269n60L15R32p91o09j205J060k2n31j98L6M40p54Q1J73R04j518
4350D97j179J632k71k32m39J30Q75m10r21l98O01M25P51j817N08M68o97m52K4
4369i05L1n26O66j02L3k83L7R6l97l95n91J52J189j591K31N78o95p8j94J039j19
4390a824m61j47p1R48j19k88L65L92q95k37N33L14J8p33P56N75r58m77J099q67
4410b077L8M00O96N04k93j159Q41j78J099J17m21R06o67L39J40J147r99n45N36
4429D24P9J15O77j18m2k48J21P51l36j9mL3M69j350R89n26J167l16r46N30J221
4450B671r17q40K135r35k89J63K52j94M26j287O09J102j709R3M10K21j81m82N1
$$ plain form
4311 1126 1899 1234 1324 1912 900 1199 1392 1677 1719 875 3090 2392 1803 2034 1648 1354 1528 2155 1890 2706
4331 2706 1475 2744 2184 2499 3431 2640 2031 826 1886 1864 1333 1135 1171 1611 857 938 1111 2015 497
4350 497 -682 950 679 447 8 138 1013 603 -318 -716 -115 310 1061 -756 -248 220 -477 -929 -905
4369 -905 -874 -1400 -734 -836 -803 -1086 -1049 -953 -1350 -1745 -2336 -2184 -995 -2586 -2355 -1777 -2472 -2550 -2744 -1705 -1824
4390 -1824 -2285 -2432 -2503 -1555 -1674 -1962 -1597 -1205 -2100 -2337 -1804 -1490 -1472 -2205 -1449 -874 -1832 -2309 -1210 -2077
4410 -2077 -2039 -1639 -943 -439 -732 -1891 -1050 -1228 -129 -12 -433 473 -194 145 285 1432 433 -112 424
4429 424 503 618 1295 1177 1135 887 1008 1759 1423 1404 1400 1433 1902 552 1541 1015 2182 1866 920 1450 2671
4450 2671 1754 914 3049 2114 1825 1988 2240 2046 2472 1185 1794 2896 1187 1280 1690 1911 1730 1248 1299
4469A299L50L27n51N18l83k69kq01O02q67R54k47j46O42j192O0O38j62p91k9q2
4490a32O81j322L6O57Q35j865K63l70mQ11j93j398J042q12m3L7l1M29J32p85J444
4511e88n9j207n73J39J425j518J037j05m49m32M98O77q43j44j61K56J486j569
4529b130J094j673J466q73J020j17m6p11N24L00n64J039Q9K49q90M17N34K51j531
4548a552J252q95M6P51n26P28k02j28J47J268L05k06j005O29M93Q3k83P69j036
4567F38j37P77m07P63n42N84k93K19k17M14Q4J88p09M7j08P29o46o63Q41N90Q3
4588B235j132J091M47j429L75Q8J051r77q54J384N25p04j336R93m03l61l39J013
4606A667p90J478j945N23j52L88j146R27N82p63l44P4N55j203M86j419J139p07
$$ plain form
4469 1299 1649 1976 1425 1943 1560 1291 1289 488 1090 223 1177 930 784 1426 234 294 932 770 -21 -50 -132
4490 -132 549 -773 -737 -80 755 -1110 -847 -1217 -1221 -410 -603 -2001 -959 -1771 -1814 -1777 -1808 -1379 -1247 -2032 -588
4511 -588 -647 -1854 -2427 -2288 -863 -2381 -1344 -1449 -1898 -2330 -1832 -1155 -1998 -2142 -2303 -2047 -561 -2130
4529 -2130 -1036 -2709 -1243 -2116 -1096 -1213 -1259 -1970 -1446 -1146 -1710 -671 -582 -333 -1223 -806 -272 -21 -1552
4548 -1552 -300 -1195 -1149 -398 -924 -196 -398 -526 -379 889 1194 988 -17 612 1105 1188 905 1674 638
4567 638 501 1278 871 1634 1092 1676 1383 1602 1385 1799 1883 2071 1362 1409 1301 2030 1384 721 1562 2152 2235
4588 2235 1103 2194 2641 1212 1587 1675 2726 1749 895 2279 2804 2100 764 1757 1354 993 654 1667
4606 1667 877 2355 410 933 781 1169 23 950 1532 769 425 499 1054 -149 337 -1082 57 -650
4624f50l43M2J70O98j199Q71j065J624p73j2p12k03M22K13o47k57J139j143J394
4643d31j375M58o66J98p73O59R34q43k68Q15p99L3K90p62J381l2q16j11K43J53
4663a712k32M48K6R56j205j0j33M84K91J6P92o86m15r08J216K05j54M89M10J385
4683A263j588j051R83J529l80m06o57Q33m64j73J114M79J52k044J187P46j335
4700A88J437q13L08M82n02o16K029o68m21N11L85l47q5j313K018m9j669R10j22
4719A663r7p0m66M61K9M40q18N67J39l16Q80q59N75n02j154O20Lj85l59J51k28
4740D74K25Q0p41K78K26K36j118J260j150n92j93J069K79n84N18o95Q36j68r89
4759g49l69J049j385m8n43J423o60k90Q59k68K52n06K09q43P01M12o3n58J75k66
$$ plain form
4624 -650 -993 -951 -781 -83 -1282 -411 -1476 148 -625 -637 -1349 -1552 -1130 -917 -1564 -1821 -682 -1825 -431
4643 -431 -1806 -1348 -2014 -1816 -2589 -1930 -996 -1839 -2107 -1292 -2091 -2058 -1768 -2530 -1149 -1181 -1997 -2108 -1865 -1712
4663 -1712 -1944 -1496 -1470 -514 -1719 -1729 -1862 -1378 -1087 -1071 -279 -965 -1380 -2288 -1072 -867 -1021 -532 -122 1263
4683 1263 -325 -1376 -393 1136 756 350 -307 526 62 -111 1003 1482 1634 -410 777 1523 188
4700 188 1625 812 1120 1602 1100 484 2513 1845 1424 1935 2320 1973 1888 575 2593 2544 875 1785 1663
4719 1663 1566 1496 1030 1491 1520 1960 1142 1709 1848 1532 2412 1553 2128 1626 472 1092 1095 910 551 702 474
4740 474 699 779 38 316 542 778 -340 920 -230 -822 -1015 54 333 -251 267 -428 408 240 -749
4759 -749 -1118 -69 -1454 -1502 -2045 -622 -1282 -1572 -713 -981 -729 -1235 -1026 -1869 -1168 -756 -819 -1377 -1202 -1468
4779a468O57p48P46o33l8p34R72K12M94j001r7o13R41j46k87J82M19P6M75M7K67
4800b77n11N1K64n6p08R33N2k68J02p14J682o16K31j30k24P79p44J54J14O63j70
4821F07l8m00J413j834K19R24O90L01r10l25P21Q7J000j456J128l6j047o34J090
4840A500M39q01N17K47K08J34l24P70k03j812J303l78o81J378o75p31Q53o82J053
4859B115j503L94N41o0k41L99j122K82n26J075o78N40r65n70J182qn2n24n81N84
4879B82q58Q21n53L74K75j385J009p98M62n47K44p87J00O54q70p11J544j174j57
4898b075J042r13J193n36l97J570j275j71J081j072k5m10P39J35j29n42L57M8
4916a380l53O22m49N49p07N54j09O86q55N37j16l2n16L25M58m95L44PL23K20J56
$$ plain form
4779 -1468 -811 -1559 -813 -1446 -1484 -2218 -1246 -1034 -540 -1541 -1638 -2251 -1310 -1456 -1743 -1561 -1142 -1066 -591 -544 -277
4800 -277 -788 -737 -473 -529 -1237 -304 -252 -520 -418 -1132 550 -66 165 35 -189 590 -154 0 114 777 607
4821 607 569 169 1582 -252 -33 891 1581 1882 972 647 1368 1455 2455 999 2127 2091 1044 410 1500
4840 1500 1939 1138 1655 1902 2110 2244 1920 2690 2487 675 1978 1600 919 2297 1622 891 1744 1062 2115
4859 2115 612 1006 1547 1487 1246 1645 523 805 279 1354 676 1216 251 -319 863 855 803 279 -302 282
4879 282 -576 245 -308 66 341 -1044 -35 -833 -371 -918 -674 -1461 -1361 -707 -1577 -2288 -744 -1918 -2075
4898 -2075 -1033 -1946 -753 -1289 -1686 -116 -1391 -1562 -481 -1553 -1578 -1988 -1249 -1114 -1243 -1785 -1428 -1380
4916 -1380 -1733 -1111 -1560 -1011 -1718 -1164 -1273 -587 -1442 -905 -1021 -1053 -1569 -1244 -786 -1281 -937 -930 -607 -387 -231
4937b31N58K22n95m01J17L04p80k73J486q15L67N07l91K01J12M75M80j259J332
4956A416j530N94N70r03J281r88N4J058p6j54N85r89n5J869j080O9n99J000M82
4975B604l17n49k76L77k49J50M27m97K25o36L71L94P2o9r63j20j54N38p3O95j556
4996C94J247q32N58m18K85r85m92Q29J52p60L09M6Q98j004m94o3R80q14j50k97
5016f11L34M72j160J52j34k59j36J612o80m7l28j913K016j851L46M16j87Q65k43
5035a336k4l0j92Q49l17n86N23N3k56n44J054q08J91Q94O3n28Q08k82j724J97
5055a995J611j087QM90j20J17j2n37L15Q86L03o74m63L99L96J40M37L1l47l24
5075d26J025o39k40R87n06m72N6N93P41q54O90P85j312n6N67N07M57p96o6l1Q26
$$ plain form
4937 -231 327 549 -46 -447 -330 -26 -806 -1079 407 -408 -41 466 75 276 388 863 1343 84 1416
4956 1416 -114 480 1050 147 1428 440 494 1552 1476 1322 1907 918 863 2732 1652 1721 1122 2122 2604
4975 2604 2287 1738 1462 1839 1590 1740 2167 1670 1895 1259 1630 2024 2096 2027 1064 944 790 1328 1255 1950 394
4996 394 1641 809 1367 949 1234 249 -243 586 738 -22 287 333 1231 227 -267 -330 650 -164 -314 -611
5016 -611 -277 195 -965 -813 -947 -1206 -1342 270 -410 -457 -785 -2698 -682 -2533 -2187 -1771 -1958 -1093 -1336
5035 -1336 -1360 -1390 -1582 -733 -1050 -1636 -1113 -1060 -1316 -1860 -806 -1614 -1423 -529 -466 -994 -186 -468 -2192 -1995
5055 -1995 -384 -1471 -1463 -973 -1093 -976 -988 -1525 -1210 -324 -21 -695 -1158 -759 -363 -223 214 245 -102 -426
5075 -426 599 -40 -280 707 201 -271 -215 378 1119 265 955 1740 428 372 939 1446 1903 1107 1041 1010 1836
5096A836j042l60J448P69n83j324M74L56p7n1j46r0K85N39k60n26J30M65j512
5115C31L50J170n19l86P03l00j83j345J666J54n01j388K030j19r17j24r37J083
5133G68m46L76M94j441K32j12J34p16J006r12q14J155K48n94l27L14R27j030l50
5152a088R47n50k07j58L18p20J061n55P0J67j176l55J510j145R82j133L13k2J398
5171c43j260o27L42J90l34J328k48MM13j208K40j7k52L04N81j57l85O7O64o53
5191a351N56q25J406p56J002M24r68m78R40j437J517K2q54Q63K69R5M69j84k87
5210D23j66l57Q87j048M44j90P40q04J675r35N51M27k82p38m80M75Q78p14J151
5229A937p82N12l35L6K06J31n57J132o49n02J86J83L30n66j86j13N89k6m74j528
$$ plain form
5096 1836 794 434 1882 2651 2068 744 1218 1574 1497 1446 1300 1210 1495 2034 1774 1248 1378 1843 331
5115 331 681 1851 1332 946 1649 1349 1166 -179 1487 1641 1140 -248 1782 1663 746 622 -315 768
5133 768 322 698 1192 -249 -17 -129 5 -711 295 -617 -1431 -276 -28 -622 -949 -635 292 -738 -1088
5152 -1088 -141 -691 -898 -1056 -738 -1458 -397 -952 -882 -715 -1891 -2246 -736 -1881 -899 -2032 -1719 -1741 -343
5171 -343 -1603 -2230 -1888 -1698 -2032 -704 -952 -948 -535 -1743 -1503 -1520 -1772 -1468 -887 -1044 -1429 -1362 -698 -1351
5191 -1351 -795 -1620 -214 -970 32 456 -512 -990 -50 -1487 30 52 -802 61 330 425 894 710 423
5210 423 257 -100 787 -261 183 -7 733 -71 1604 669 1220 1647 1365 627 147 622 1500 786 1937
5229 1937 1155 1667 1332 1368 1574 1705 1148 2280 1631 1129 1315 1498 1828 1262 1076 963 1552 1526 1052 -476
5249d76O97J630j517R50r77J107j303K18J119p17K89l76M43r54K84O93j123J057
5267A044p24J58j042Q94q39K69j40N20m3j321J265N76p19j251R63n75P7n52M83
5286i57o5Q3N33O51j425J52j66p0P68j235o0L02K68m68R35l61j013J380k76l24
5306a348K5R4O8j052J2R5J065n60M59P26n7m13k08J002M74m70n05j038K146j201
5326f86O38K55j71L21l87M63j458J530o70j41J060j19M15j113L07N09j087o9J5
5345c88O23P42r96K78P79k23K20j005L63Q3Q40o61M75j67Rq09J190M61n38K84
5365A560K71K73q09P73o43q27O87n12N62k14o37J154J73j141L88o69k12J077n25
5384G29K64p51J176p21O93r73R60k61l32L11n86o94J159q24J9j85R2p81l64J53
$$ plain form
5249 -476 221 1851 334 1284 307 1414 111 329 1448 731 1020 644 1087 133 417 1110 -13 1044
5267 1044 320 478 -564 330 -509 -240 -380 140 97 -1224 41 617 -102 -1353 -390 -965 -888 -1440 -957
5286 -957 -1022 -939 -406 245 -1180 -1028 -1194 -1264 -496 -1731 -1791 -1489 -1221 -1689 -754 -1115 -2128 -748 -1024 -1348
5306 -1348 -1323 -1229 -1161 -2213 -2201 -2106 -1041 -1601 -1142 -416 -473 -886 -1094 -92 382 -88 -593 -1631 515 -686
5326 -686 -48 207 36 357 -30 433 -1025 505 -165 -306 754 635 1050 -63 244 753 -334 -403 -388
5345 -388 235 977 -19 259 1038 815 1035 30 393 476 1316 655 1130 963 972 163 1353 1814 1276 1560
5365 1560 1831 2104 1295 2068 1425 598 1285 773 1335 1121 484 1638 1811 670 1058 389 177 1254 729
5384 729 993 242 1418 697 1390 417 1377 1116 784 1095 509 -185 974 150 169 -16 76 -705 -1069 -916
5404i16K13p4R81r59O55j08j158J140p25Q47j058R27k17j030M30O02m44L78q96
5423a412n57J749j4o14n91R41K16p60n9N86J92j228P6o35J272j92j104N57J436
5442a41K38j349j58N51N73j397J293n34Q47j273Q38m59O23j71n6L12K04m12K88
5461a83P02Q07m50q40K71L27j42j96J127p49L57j109M53L24K93N6k91N80Q9l79
5481A047K03j28l07l64M0J066l74j13J23M7o71J318j054m82J010l13o84O49P95
5500A808j065O74j585J040O45j027O44jo0P81r97q44q24K372ln47m21L89j338
5519c59Q47Q8r23K42J016L12j327P8n2o29J3N13p85J103L30j45J71o33j45J19
5539a66r03J179n32j34q53J73M29Q30l65n99Q26q96L69n82k53P21J93r74O24n2
$$ plain form
5404 -916 -703 -777 204 -755 -100 -208 -1366 -226 -951 -104 -1162 -235 -452 -1482 -1052 -450 -894 -516 -1412
5423 -1412 -1969 -220 -234 -848 -1439 -498 -282 -1042 -1101 -515 -323 -1551 -1475 -2110 -838 -1030 -2134 -1577 -141
5442 -141 97 -1252 -1410 -859 -286 -1683 -390 -924 -77 -1350 -512 -971 -348 -519 -575 -263 -59 -471 -183
5461 -183 519 1326 876 36 307 634 492 296 1423 674 1031 -78 375 699 992 1048 757 1337 1426 1047
5481 1047 1250 1122 815 451 491 1557 1183 1070 1193 1240 569 1887 833 351 1361 1048 364 1013 1808
5500 1808 743 1417 -168 872 1517 490 1134 1133 1073 1854 857 13 -811 1561 1558 1011 590 979 -359
5519 -359 488 576 -347 -105 911 1223 -104 -26 -78 -707 -694 -181 -966 137 467 322 493 -140 -285 -166
5539 -166 -1069 110 -422 -556 -1409 -1236 -807 23 -342 -941 -115 -1011 -642 -1224 -1477 -756 -563 -1537 -913 -965
5559i65j97M43j015P93P19q41O68j348K69Q76j857J842J60j054j11O50o41J96
5577a413J286r37Q93p41M60q03Q44K42o57J120J74j127K39Q78p10n3N2M77N4j54
5597A24q64J134j077R26j25O32n39L4p09j08J462l52k79K72L23K41J227j743L27
5616I06K16l01P16o49j25K29J441j135o10Q63J52o02L40p31L15q3R51j315Q5N61
5636A224q00L28N60l76p42k05J154l77O04j591J613n99k91o0O72p75L66r80J013
5655G38k22k70J31j77k42l75K27r68Q8O37K35l29L81K92j270J86P98j591J405
5674c26J62j085l9J021m31j11m46K87k1J82n46m45O89K17m03N82J39K6o53n12
5694a713J217j55p38M53j02M90p72l13m10R19O20q2l67q4Q41l89K90P83j033l41
$$ plain form
5559 -965 -1162 -719 -1734 -941 -222 -1063 -395 -1743 -1474 -598 -2455 -613 -453 -1507 -1618 -968 -1609 -1413
5577 -1413 -127 -1064 -171 -912 -452 -1255 -411 -169 -826 294 468 -659 -420 458 -252 -305 -253 224 278 124
5597 124 -740 394 -683 243 118 750 211 245 -464 -572 890 538 259 531 854 1095 2322 579 906
5616 906 1122 821 1537 888 763 992 2433 1298 688 1551 1703 1101 1441 710 1025 942 1893 578 663 1224
5636 1224 424 752 1312 936 194 -11 1143 766 1370 -221 1392 793 502 442 1114 339 705 -275 738
5655 738 516 246 377 200 -42 -417 -190 -1158 -1070 -433 -198 -527 -146 146 -1124 -938 -140 -1731 -326
5674 -326 -164 -1249 -1288 -267 -698 -809 -1255 -968 -989 -807 -1353 -1798 -1109 -892 -1295 -713 -574 -548 -1201 -1713
5694 -1713 -496 -651 -1389 -936 -1038 -548 -1320 -1633 -2043 -1124 -504 -586 -953 -1037 -196 -585 -295 488 -545 -886
5714h86Q81k65n36J464j409M44L22k65q96J02O70M82Q90Q6j623N86O92o40K24
5733C23K8j47M94j54J129r05j118O92K25P77j131m1J260k41p20L45J008j238j19
5752D67O28m17P41p90m56J023p12J527n16r23Q07O23j566J264j029M07P80k49
5770A609n15j186Q98Q78n06j331J340p58Q88j489L28N55J53m54j329J899n76o4
5788C40o6j0m70j45m31m76J426n65L43o18K3J51M14k17m97k4J47j39o09N47k85
5809a161J3Q78J48l34n77j083K058j072j20j01K58m19J39o66J608m24l04j175
5827b334J106O29o67j43m52J618j06l37j70L98l79m24M34j2R6L16Q4m82J4O73
5847a38q54N38P67r16J78N49k51J08M01k43L59o50L09KK01n84O90N11k47o09J117
$$ plain form
5714 -886 -5 -270 -806 658 -751 -307 15 -250 -1146 -1044 -374 108 998 1084 -539 47 739 99 323
5733 323 351 204 698 544 1673 768 -350 342 567 1344 213 172 1432 1191 471 816 1824 586 467
5752 467 1095 678 1419 629 173 1196 484 2011 1495 572 1379 2002 436 1700 671 1078 1858 1609
5770 1609 1094 -92 806 1684 1178 -153 1187 429 1317 -172 156 711 864 410 -919 980 404 340
5788 340 274 264 -206 -351 -782 -1258 168 -397 -54 -672 -649 -498 -84 -301 -798 -822 -675 -814 -1423 -876 -1161
5809 -1161 -1148 -270 -122 -456 -1033 -2116 -58 -1130 -1250 -1351 -1093 -1512 -1373 -2039 -431 -855 -1159 -2334
5827 -2334 -1228 -599 -1266 -1409 -1861 -243 -349 -686 -856 -458 -837 -1261 -827 -839 -743 -427 -343 -825 -811 -138
5847 -138 -992 -454 313 -603 -425 124 -127 -19 382 139 498 -152 157 159 360 -224 466 977 730 121 1238
5868A238k64n50j38k98J243j477J568M8p63N05m89L54k26k17P59j20j34j218Q72
5887F93K15M79o17K91L17o59J422k027J200p27N87k71N30j81j50j581J482p5j5
5906I13j17K50r92L19j23j16K0Q67j231M14N96p39M84j644Q61p01J136j255O02
5925d56K20n16O92N13r20J90k83L02n47j36M87n59l25J176j212N37L44j632J748
5944c77l11K14q52N66p85m2L83k88j23k45J548n05j390P63L6P73K97p32Q29q25
5964a066m36k07J579j546P69L62m2L70m82l87P74q24n3R96r88P52K97l73L64j92
5984c33J4L94O3m43M48M67n40N20K45j277P85R3Q02l51l40R40J42r71q4m2M31
6005I63O99p10r58K20O38r6j4M73K2k03M79j235Q12q28M71L83l24k06N15o80J077
$$ plain form
5868 1238 974 424 286 -12 1231 -246 1322 1370 607 1112 623 977 751 534 1293 1173 1039 -179 693
5887 693 908 1387 770 1061 1378 719 2141 114 1314 587 1174 903 1433 1252 1102 -479 1003 928 913
5906 913 796 1046 54 373 250 134 154 1021 -210 204 800 61 545 -1099 -238 -939 197 -1058 -456
5925 -456 -236 -752 -60 453 -467 -277 -560 -258 -805 -941 -454 -1013 -1338 -162 -1374 -837 -493 -2125 -377
5944 -377 -688 -474 -1326 -760 -1545 -1587 -1204 -1492 -1615 -1860 -312 -817 -2207 -1444 -1408 -635 -338 -1070 -241 -1066
5964 -1066 -1502 -1709 -130 -1676 -907 -545 -587 -217 -699 -1086 -312 -1136 -1189 -193 -1181 -429 -132 -505 -141 -333
5984 -333 -319 75 138 -305 143 610 70 590 835 -442 343 436 1238 887 547 1487 1629 658 574 532 963
6005 963 1662 952 -6 214 852 756 742 1215 1237 1034 1513 278 1090 262 733 1116 792 586 1101 421 1498
6026A498K07j316K07N54J25p72P27m84R63j977J459k54m98q63J030m32p04R33
6044D03n28R56j63j036n23L34J013L80o60q55N37Q65j351N09L74j184l90M52l23
6063a190L40k52j56J18M46m96J113j315L44O97k97n30k56O49m67J27L4n1N01m00
6083a041n51P85N25j164J005l27O22j532J063j92Q9q90K29J243k77L72j70n80
6101g91R33l74L83r93J305r49j038Q88J146p18j04J120n10o73n31Q00j77J550
6119A267j895J109m26L5n04Q76J29K25M8r34O97M84j66K33L94Oj116K45J123r01
6139I29k70j215M45M60R33k82j64N56p34O2M02j9q19Q72k09k22N45l09J30N21
6159A612m3j364J78k8N48Qj103M81Q25m40k69l24m04J27P54o40l97J565j047m57
$$ plain form
6026 1498 1705 389 596 1150 1275 503 1230 746 1709 -268 1191 937 439 -424 606 174 -530 403
6044 403 -125 831 668 -368 -891 -557 456 836 176 -679 -142 723 -628 -119 255 -929 -1319 -867 -1190
6063 -1190 -850 -1102 -1258 -1140 -694 -1190 -77 -1392 -1048 -351 -648 -1178 -1434 -785 -1252 -1125 -1091 -1142 -641 -1041
6083 -1041 -1592 -807 -282 -1446 -441 -768 -146 -1678 -615 -807 -718 -1608 -1379 -136 -413 -41 -211 -791
6101 -791 142 -232 151 -842 463 -486 -1524 -636 510 -208 -312 808 298 -375 -906 -106 -283 1267
6119 1267 -628 481 55 90 -414 462 591 816 864 -70 627 1111 945 1178 1572 1578 462 707 1830 929
6139 929 659 -556 -111 349 1282 1000 836 1392 658 720 1122 1103 284 1156 947 725 1270 961 1091 1612
6159 1612 1569 205 383 355 903 911 -192 289 1114 674 405 81 -323 -196 558 -82 -479 1086 39 -418
6179d18P95j08j448Q90K92m28Q07j169K54M58q01J773j808m83R74q76J141r19
6197a074q85Q01O13J24p93Rj1R42j63J19q86k16J117p92J40K53r4p58M94k20L49
6218i31m40M40k4l01k55J293J74q66J351j433J019k85m79l19J003j356PJ386j8
6237c4l3n55Q61p01J110n55m62P91r00R86L97j26n20K07j62K2N64K6m96k07P67
6258I80j016Q67L44j095J648o47q41J379q49L69j84k40j92N90K50l79n14r4M4
6277D20N07J01R4O3r11N85J346p47j999J110M55J13l12J59p68K92p04l91J244
6296F57l18J89l28N57n21N90n91k03L28m2J69O1k01p53P70n96l34j54L84O0L79
6317A03j113K36L74p70p85R61J185j331L14N83p23j84j23R71o66M91J8m55m02
$$ plain form
6179 -418 377 269 -1179 -289 3 -425 382 -787 -533 -75 -876 897 -911 -1394 -420 -1296 -155 -1074
6197 -1074 -1959 -1158 -545 -421 -1214 -1205 -1216 -274 -437 -318 -1204 -1420 -303 -1095 -955 -702 -796 -1554 -1060 -1280 -931
6218 -931 -1371 -931 -955 -1256 -1511 -218 -44 -910 441 -992 27 -258 -737 -1056 -53 -1409 -1402 -16 -34
6237 -34 -67 -622 239 -462 648 93 -369 422 -478 508 905 779 259 466 304 326 890 916 420 213 980
6258 980 -36 831 1175 80 1728 1081 240 1619 770 1139 955 715 523 1113 1363 984 470 376 420
6277 420 927 1028 1122 1185 274 859 2205 1458 -541 569 1024 1137 825 984 216 508 -196 -587 657
6296 657 339 528 200 757 236 826 235 32 360 318 487 548 347 -406 364 -232 -566 -720 -336 -276 103
6317 103 -1010 -774 -400 -1170 -1955 -994 191 -1140 -826 -243 -966 -1150 -1273 -302 -968 -477 -459 -914 -1316
6336a316J045j104J156o61J89j66N30p00N92n89Q24p98o30n51J549k66K68L74
6354b54n85l46J071j295r59K064j73M96q54o47O97J72J02m65j35P04n54J866n73
6373C32M79k36j55n34k98L41K21K1n12J344j428Q39P0O40m68l25j35K39N4M33
6393I22n31J256o50j037M56J95j39K20N54j5o21j41J0J165M06j564j61p6J487
6412A736r46n01M1J326n76P8q41N18O1j027J182K2p31p51k10J539j562R99J93
6431E50k2L34j82r74k77J314l4q86J06P08n18o39N18o1j83k24j504J36J554O01
6451C17j157R51J01p96R14k066P48R22o24l92J293r44l83P55m36K67k36j29K71
6470f24p65J191o18m67J236o95R7k88J35m83R65p08P32P1j295J543k60L60Q32
$$ plain form
6336 -1316 -271 -1375 -219 -880 -691 -857 -327 -1027 -435 -1024 -200 -998 -1628 -2179 -630 -896 -628 -254
6354 -254 -839 -1185 -114 -1409 -2368 -304 -477 19 -835 -1482 -785 -613 -511 -976 -1111 -407 -961 905 332
6373 332 811 575 420 -114 -412 -71 150 171 -341 1003 -425 414 484 1124 656 331 196 435 489 922
6393 922 391 1647 997 -40 416 611 472 692 1246 1231 610 469 479 1644 2050 486 325 249 1736
6412 1736 790 289 330 1656 1080 1158 317 835 896 -131 1051 1073 342 -409 -619 920 -642 357 550
6431 550 528 862 680 -294 -571 743 709 -177 -71 637 119 -520 -2 -63 -246 -470 -1974 -1838 -284 317
6451 317 -840 111 212 -584 330 -1736 -988 -66 -690 -1082 211 -733 -1116 -361 -797 -530 -766 -895 -624
6470 -624 -1389 -198 -816 -1283 -47 -742 -645 -933 -798 -1281 -316 -1024 -292 -221 -1516 27 -233 127 959
6489I59j034K31p61M62o54j71J073l7J42n98j43M83j149R81M67QK35r48k1j49
6509f24J931j299N15n85J097j10M33j08l12M8n75P55j410L53P21o41N39L10j190
6528a52J273j248M60K99j32n78L92P79M3q5p15R86n40r87M28J77J44NR48k88n3
6549A156j479J73R9M40n02k39K13L30l05L29k13L99O41j422P21m47P31o91O47
6568E81j057n00j37J451n45l98n2M44k04J120o95j467J390j83K87n71j82L27L42
6587d9j016l75J386k60q83J28P38J42q19K44J61j059k58Q64K48R1L32k95M22r63
6607a221J318k28j183L20P45k56j33N44n38P58j100K26K00N28m88P8p6l8N44l06
6627c06J69MK85n81M49j64M04l52R27j120Q6P98j394P17Q98j663J136P1o79O07
$$ plain form
6489 959 -75 156 -605 -143 -797 -968 105 68 210 -388 -531 -48 -1197 -216 251 259 494 -454 -475 -624
6509 -624 1307 8 523 -62 1035 925 1358 1250 938 986 411 1166 -244 109 830 189 728 1038 -152
6528 -152 1121 -127 333 632 500 -78 314 1093 1136 1051 336 1322 782 -205 223 400 544 549 1497 1209 1156
6549 1156 -323 -150 -51 389 -113 -352 -139 191 -114 215 2 401 1042 -380 341 -106 625 -66 581
6568 581 -476 -976 -1113 338 -207 -605 -657 -213 -417 703 8 -1459 -69 -252 35 -536 -718 -391 -49
6587 -49 -1065 -1440 -54 -314 -1197 -1069 -331 -189 -1008 -764 -603 -1662 -1920 -1056 -808 -717 -385 -680 -258 -1221
6607 -1221 97 -131 -1314 -994 -249 -505 -638 -94 -632 126 -974 -748 -548 -20 -508 -430 -506 -544 0 -306
6627 -306 -137 -133 152 -429 20 -144 260 -92 835 -285 -199 599 -795 -78 820 -843 293 364 -315 292
6647B92k69L34Q3j078O68m2N25o62N67m79R47P36m47M4j397J249m15l0j080J498
6667A044n85N95L98m08M73j087N26n19P95p12K22n89k07K29J175r89j57L57N63
6686A124j617P25L85l34n57K00j87RO09l23n26N67m24l43Q25N11j536M88L20r07
6706i91j82j14R70M52l88O6p16L88l34K36l21M89l85n33k9M34N72m45r10J190
6726e51p85J369j68n36j021N62M29l18O65m40l42J112j016R88k73o71O73o65M81
6745e07L27p96L55j29l47J750j438J076n09N29q08k83N04p9O44j008N50J72L32
6764C35L85o74K97k58M13k36r55J226N07L9p85K84L61m54l26Jm61J573j050K47
6784D69l14J428j042J23m16P97m89k56P67j1J43o20n0K79l10o43J546l4m56q05
$$ plain form
6647 292 23 357 440 -638 30 -12 513 -149 418 -61 886 1622 1175 1219 -178 1071 656 626 -454 1044
6667 1044 459 1054 1452 1044 1517 430 956 437 1232 520 742 153 -54 175 1350 361 204 561 1124
6686 1124 -493 232 617 283 -274 -74 -261 -252 357 34 -492 75 -349 -692 133 644 -892 -404 -84 -991
6706 -991 -1173 -1287 -317 135 -253 -187 -903 -515 -849 -613 -934 -445 -830 -1363 -1392 -958 -386 -831 -1741 -551
6726 -551 -1336 33 -135 -671 -1692 -1130 -701 -1019 -354 -794 -1136 -24 -1040 -52 -325 -996 -323 -988 -507
6745 -507 -180 -976 -621 -750 -1097 653 -785 291 -218 311 -497 -780 -276 -355 289 -719 -169 3 335
6764 335 720 46 343 85 498 262 -693 533 1040 1079 294 578 939 485 159 160 -301 1272 222 469
6784 469 155 1583 541 664 248 1045 556 300 1067 1056 1199 579 529 808 498 -145 1401 1367 911 106
6804A06R74n33O85r31M35N79l23j115P82P8n61K59l70N13k9J76J27K60q85m90
6824b63Q07nk4r81L67Q2r8N50M36q91J22o67Q94l47l42j75R61o33lp5k62l74j55
6847a076J36M58o60j84j46R12%m94J67j4l35M01k43KO46n68O28j041N03N51o59
6868a016p40R04p79M78l3L17M00k60K79j68L1l03O04j628J638j045J176J99k36
6887a82K37n43J163n09K0QM93j68m90L94m41J667j834j0J91o8l05L26O15n91L74
6908C47p39R80q80K1N36k50J041o72p28Q54LJ758j619l6q35J193M15n95m9O80
6928A425m92K8k40L3M62q99R95k42m61p85R29j131J094q34L45J000r11j296J079
6947I9j27l60J019kL14j468K17Q21L22r6l34r04J327j037m00J68K77K54O0n06
$$ plain form
6804 106 1080 547 1232 301 736 1315 992 -123 659 737 176 435 65 578 549 725 852 1112 227 -263
6824 -263 544 539 515 -466 -99 -17 -115 435 871 -20 102 -565 329 -18 -360 -535 426 -207 -210 -285 -547 -921 -1076
6847 -1076 -940 -482 -1142 -1326 -1472 -560 -560 -1054 -887 -901 -1236 -835 -1078 -1076 -430 -998 -370 -1411 -908 -357 -1016
6868 -1016 -1756 -852 -1631 -1153 -1186 -869 -469 -729 -450 -618 -587 -890 -286 -1914 -276 -1321 -145 54 -182
6887 -182 55 -488 675 166 186 194 687 519 29 423 -18 1649 -185 -195 -4 -72 -377 -51 564 -27 347
6908 347 -392 588 -292 -271 265 15 1056 384 -344 510 513 2271 652 616 -219 974 1389 794 745 1425
6928 1425 933 961 721 754 1216 317 1312 1070 609 -176 753 -378 716 -118 227 1227 316 -980 99
6947 99 -28 -388 631 629 943 -525 -308 513 835 739 405 -499 828 -209 -609 -441 -164 90 150 -356
6967c56k45J86J58J37r77M51L0qK69m31J49J275j131l03L15j55n76l98L55J176
6987g9l27q37N29m21M49K97l71R36k44j144J07O28J04r29Q10L64j406J088j10
7006e56p9l0J56N1Q02o65j014K222J05j831O06N95k36m04J4O7K54J77j50l09L04
7027G9N17K01k17n08o52K082q33l45J220n49j314J720n34j92l72O79K06N9r83
7046B64N92l15j029N58Q61K66m81k4K07l67J5L46n89O07q16J158r19N58N30j102
7066C20L05n43M08P07m58p38l63J571r17k35o46K236j422j40p9J116p83k17O59
7085G81j228L72R66j556N34Rk51O14k88q49J26k41O57J85k09P02r01M69j089P58
7105d39Q1l58R52p70p46J165p09M44n2l22j34J64J66M36r06J260j179J299j16
$$ plain form
6967 -356 -601 -415 -257 -120 -1097 -646 -616 -624 -355 -786 -637 638 -493 -796 -481 -636 -1212 -1610 -1255 -79
6987 -79 -406 -1243 -714 -1135 -686 -389 -760 176 -68 -1212 -1105 -477 -373 -1302 -492 -128 -1534 -446 -556
7006 -556 -635 -665 -509 -458 344 -321 -1335 887 992 -839 -233 362 126 -278 -264 -197 57 234 84 -225 79
7027 79 596 797 580 72 -580 1502 669 324 1544 995 -319 1401 867 675 303 982 1188 1247 264
7046 264 856 541 -488 70 931 1197 716 692 899 532 547 893 304 911 95 1253 334 892 1422 320
7066 320 625 82 490 1197 739 1 -362 1209 292 57 -589 1647 225 85 6 1122 339 122 781
7085 781 -447 -75 891 -665 -131 -122 -373 241 -47 -896 -770 -1011 -354 -169 -378 324 -577 -108 -1197 -439
7105 -439 -358 -716 236 -534 -1280 -115 -824 -380 -432 -754 -888 -724 -558 -122 -1028 232 -947 352 236
7124B36j263N35O75l28q0p37J50J76k20Q17j7QN88j464L58p3N73k98L93r63L17
7145f17j8N92P39n08m59N58l49%J38J81M72k92O7q46oP83k37n84O56j10J375j149
7167C86j79M79m71O37J17q71O84q17N54j5O29l32L35l05r4l57m5o35N86J195m39
7188A042q41K16L58K36n81N74m25P68n13l19l86Q82L34r17l45M40Q63o41l1j82
7208E32j92q64P82L09n66Q97J35j336O38j2J22r32R63j417L41L64nL65l67K49
7228Fm56m46j66O25L29J62k06k29j9k56K75j145N05M14r26P43q7n91J044J37p45
7249a032P41m92K69m74k68O37m97P47K60j027Q97O25q51j38N38p49l06M66n51
7268a205J089k92o91J101o57m91M77P95O85k53n51q30J69N08l85J197m66P06r78
$$ plain form
7124 236 -1027 -492 183 -145 -225 -962 -812 -636 -856 -39 -56 -48 540 -924 -566 -639 -66 -364 29 -934 -617
7145 -617 -635 -43 696 188 -271 287 -62 -62 76 257 729 437 504 -342 -348 435 198 -386 270 160 1535 386
7167 386 207 686 215 852 969 98 782 -35 519 504 1133 801 1136 831 737 380 335 -300 286 1481 1042
7188 1042 201 417 775 1011 430 1004 579 1347 834 515 129 1011 1345 428 83 523 1386 745 714 532
7208 532 340 -524 258 567 1 898 1033 -303 335 323 445 -487 476 -941 -600 -236 -241 124 -243 6
7228 6 -450 -896 -1062 -437 -108 54 -152 -381 -400 -656 -381 -1526 -1021 -607 -1533 -790 -877 -1468 -424 -287 -1032
7249 -1032 -291 -783 -514 -988 -1256 -619 -1116 -369 -109 -1136 -239 386 -465 -603 -65 -814 -1120 -654 -1205
7268 -1205 -116 -408 -1099 2 -655 -1146 -669 126 811 558 7 -823 -654 -146 -531 666 200 906 -72
7287g2M18L41m00j84J79K4L28k33p32P57K73l37L37p9J24M45j197J01M89m7k39
7308B96M24J39k01l68j06L24k42J55K79m63N9O67n57L06p31R00n79M9P67q39M95
7329G74l48M50k06M07o44m99k32k31J340p12l61J497p94j064O37N8J145j225Q2
7348G4R4K41j425R3J120m33k53P20r04l85P37l35J372j253N68q14K86j49N79j460
7368a527R98L07j40j041J169n99q8L03n9M98j785J833j022K135j932J318j77o04
7386d13l00k2J99R26j22n02J69m49o02J094j52N56j178P29N94q61P4K20k61l47
7406f48P45p53J665k068O67Q52L28o2j120J221q29O75r75J097J60j046m16K91
7424b16J027q19J244j257Q85n10o61P75O69l70m31P90m91l04N27n14k41J55j78
$$ plain form
7287 -72 346 687 287 103 282 306 634 401 -331 426 699 362 699 620 744 1189 -8 93 582 535 296
7308 296 720 859 658 290 184 508 266 421 700 237 296 963 406 712 -19 881 302 351 1118 279 774
7329 774 426 876 670 1077 433 -66 -298 -529 811 99 -262 1235 441 -623 14 72 1217 -8 74
7348 74 168 409 -1016 -923 197 -236 -489 231 -673 -1058 -321 -656 716 -537 31 -783 -497 -646 -67 -1527
7368 -1527 -529 -222 -362 -1403 -234 -833 -921 -618 -677 -179 -1964 -131 -1153 982 -950 368 191 -413
7386 -413 -713 -735 -536 390 268 -234 -65 -514 -1116 -22 -174 382 -796 -67 527 -334 -260 -40 -301 -648
7406 -648 97 -656 1009 -1059 -392 460 788 726 -394 827 -2 673 -302 795 955 -91 -507 -216
7424 -216 811 -8 1236 -21 864 354 -307 468 1137 767 336 1126 635 331 858 344 103 258 80
7443H0K79J76Q6j32j87M13q76K09J275q03O13q87O03o83Q02l07K31n72P54n47
7463E27j557j04J501K55j49K07k39j155M38L07k03M41j81k23R1k62m68P14N0L58
7483C48m54j63o15J457q39k28N72K44o66J37Q4n75J033j44o00J96o09K43K24k15
7503e70m71R9M49l51m89j61R08K21M40m03J58o39l53J267j387L10K46O95l00j001
7523a332J522n69m6j369J175J55l55J023n33O05k40l31l83Q17J06K92n59K37N05
7542G20p67K87rM65n71p44m7J009m48O06k23K26N98q55mj91l95P92L37l00o99
7563b13O11P07m39L68K62j015Q48j68j41m22J33k46O49j2o43q74P53K13J181j762
7583b10J386J16j082K58P1o0m95Q45l07K14j078M81K44k07k81R33q9p60j78J31
$$ plain form
7443 80 359 535 621 489 302 715 -161 48 1323 520 1133 246 849 166 968 661 892 320 1074 527
7463 527 -1030 -1134 367 622 473 680 441 -714 -276 31 -172 269 88 -135 -44 -306 -774 -60 -10 348
7483 348 -106 -269 -884 573 -266 -494 78 322 -344 -207 -123 -698 335 191 -409 -213 -822 -579 -355 -570
7503 -570 -1041 -942 -493 -844 -1333 -1494 -586 -365 75 -328 -170 -809 -1162 105 -1282 -972 -726 -31 -331 -1332
7523 -1332 190 -379 -425 -1794 -619 -464 -819 204 -329 276 36 -295 -678 139 245 537 -22 215 720
7542 720 -47 240 231 696 125 -619 -666 343 -105 501 278 504 1102 247 243 52 -343 449 786 486 -213
7563 -213 398 1105 666 1034 1296 281 1129 961 820 398 531 285 934 922 279 -595 158 371 1552 -210
7583 -210 1176 1292 210 468 539 479 -16 829 522 736 -342 139 383 176 -105 828 739 -21 -199 -68
7603f8M89q00j60P30n46Q91j233M70j34j24l15M81n20L13O10o61j15m10l25P58
7623f69J572j870P3o53P24k2k74O81p02M03K46r50P77O24p68L54l83L40N64J46
7643B13j357O12j178R75M30m28K91l3m1J74M02R5l25K47L29j76m52j19J104p64
7663al47J392j366MK72K52n06L95j190R17p7M88l14K19M34q26P87l73m66R56o27
7684B3J14p7Q65J07j371Q20j26L24K72n39j85Q49j526J142k18K31O26j395O94
7703F30l20J263Oj221k15N64p77J032l81n38J42L4K14n0J240j271N9P7m02O9L6
7724A91N44o41m1R86j163j68J484o59K7q58l76L51l3k8K57j37L79O1q41J69O92
7745A96r65k87J664p66M99q75M42O05j618J449q67l27O02j95l6P4j05k83J89q4
$$ plain form
7603 -68 421 -379 -539 191 -355 536 -697 -227 -361 -485 -800 -319 -839 -526 84 -577 -692 -1102 -1427 -669
7623 -669 903 -967 -894 -1547 -823 -845 -1119 -438 -1140 -737 -491 -1441 -664 -40 -808 -454 -837 -497 67 213
7643 213 -1144 -532 -1710 -735 -305 -733 -442 -475 -516 -342 60 155 -170 77 406 230 -222 -341 763 -1
7663 -1 -348 1044 -322 -318 -46 206 -300 95 -1095 -178 -255 233 -81 138 572 -254 533 160 -306 650 23
7684 23 137 60 925 1032 -339 481 355 679 951 412 227 1076 -450 692 474 705 1331 -64 630
7703 630 310 1573 1579 358 143 707 -70 962 581 43 185 219 433 383 1623 352 411 488 86 155 191
7724 191 735 94 53 1039 -124 -292 1192 533 560 -298 -674 -323 -356 -384 -127 -264 115 176 -665 -496 196
7745 196 -769 -1056 608 -158 341 -534 -92 513 -1105 344 -523 -850 -248 -443 -479 -405 -510 -793 -604 -688
7765f88P28m63L48l37o60Q98r0l89Q83m56o1M31k38k93K44r93k97K225o59k07
7785g4o90L81j283J523m36K62o43L77k03P68n10N22K93J56L28j027j87l6K69M1
7805a69P29j011M36l94n4R34P7j102J407k96M28p56Q95j835J477n99L73M12q00
7824A52L28l24K17o29P21L02n62j83O20N22j92l75k4p12L65j40N82K18j534N12
7844a36O59k85j41l21Q33j053K88J94L94l06l00J124n17N31o71o06O72O34j082
7863h9K72p07N84m65J174p32J38n25J30r83J504k90j392R18L34k52r24J240n59
7882f24NQ31l49J42j454j32J717j038N79O50j762J017L93r0k77m82N16J52l54
7901e60J084j480P46j066J644m76k85n58J448o11q46P48m18j38R01L63j153P34
$$ plain form
7765 -688 40 -423 -75 -412 -1072 -174 -264 -653 230 -226 -287 144 -94 -387 -143 -1136 -1433 792 133 -74
7785 -74 -764 -383 -1666 -143 -579 -317 -960 -583 -786 -18 -528 -6 287 443 771 -256 -443 -479 -210 -169
7805 -169 560 -451 -15 -409 -463 471 548 -554 853 557 985 229 1124 -711 766 167 540 952 152
7824 152 480 156 373 -256 465 767 205 22 642 1164 972 597 573 -139 226 86 668 886 -648 -136
7844 -136 523 238 97 -224 609 -444 -156 38 432 126 -174 950 433 964 293 -313 359 993 -89
7863 -89 183 -524 60 -405 769 37 175 -350 -220 -1203 301 11 -1381 -463 -129 -381 -1305 -65 -624
7882 -624 -619 212 -137 5 -1449 -1581 136 -902 -323 327 -1435 -418 -25 -115 -392 -874 -358 -206 -560
7901 -560 524 -956 -210 -1276 368 -108 -393 -951 497 -114 -960 -212 -630 -768 133 496 -657 77
7919G7Ln10m48J02J068r8r7N60o99K12O5q47R94R00m81j180J019j15j55L13n35
7940A48q90J396o8n35j28R06j158Q35M98m04o97r0N89R80j578J289j623P26P25
7959I21k56O73j062P99k70j111J169r99J508o63O89n56o09L2Q31o12m66R31l79
7978E70p81J649j481M8K42j63K70j36j54p9J2N66o00o8k71k83j87j43J130k01
7998f0Q6l78N5M22l95l37J089l85j429L59R66j498R47r23R92n60o5M15J21K44
8018c34J57k79l32R1q4M3J76K78j44J07o92Q51j36o66J255o85J74p29J195q43
8038e97J82P49q33m86J022j61j21R1q74O85P76p82N81j040M30N49m79n56M64P28
8058C28p83N0J53O43p29N24o2k27K65m04P2k52k1L54K2R90j74m24k78K26J4k90
$$ plain form
7919 77 80 -430 -878 -776 292 194 97 657 -42 170 235 -612 382 1282 801 -379 640 525 370 683 148
7940 148 -742 654 586 51 -77 829 -329 506 1004 600 -97 -187 402 1382 -196 1093 -530 196 921
7959 921 665 1338 276 1075 805 -306 863 -136 1372 709 1398 842 233 265 1096 484 18 949 570
7978 570 -211 1438 -43 5 247 84 354 218 64 -15 -3 563 -37 -105 -376 -659 -846 -989 141 -60
7998 -60 26 -352 -297 125 -270 -607 482 97 -1332 -973 -7 -1505 -558 -1481 -489 -1049 -1114 -699 -578 -334
8018 -334 -177 -456 -788 -697 -781 -738 -562 -284 -428 -321 -1013 -162 -298 -964 291 -394 -220 -949 246 -597
8038 -597 -415 334 -499 -985 37 -124 -245 -154 -1028 -343 433 -349 232 -808 -378 171 -308 -864 -400 328
8058 328 -455 -405 -252 391 -338 186 124 -103 162 -242 -170 -422 -443 -89 -67 923 749 325 47 273 287 -3
8080cL70N35m61R5L67j153k15J065o80O47j73j34O10J67j245J016k53j44n92J963
8100A782j756r8P44o94P27r98P53m03l5J209q74m20P2m00Q64j96k75l23L84O14
8120F77o06k75J66j59l60Q38j326Q69K44j331J371j12q97k86J348m3J7j383J49
8139a099J088o24M90J41r42O77o41J62n78J109j10J64r41Q22L53m04n49J686j844
8158a040J166j078r9J920j233q43L06m6N57k06m14O46m89l57R82K27j37Rq19L54
8178e94l01L70P38m39L17m50k52R29k31N30o06n81J224
$$ plain form
8080 -3 367 902 441 536 903 -250 -465 600 -80 567 394 260 870 1037 -208 808 555 411 -181 1782
8100 1782 26 -72 672 -22 705 -293 460 57 22 1231 357 -63 9 -391 473 277 2 -321 63 677
8120 677 71 -204 -38 -197 -557 281 -1045 -176 68 -1263 108 -4 -901 -1187 161 118 135 -1248 -1099
8139 -1099 -11 -635 -145 -4 -946 -269 -910 -748 -1326 -217 -327 -163 -1104 -282 71 -333 -882 804 -1040
8158 -1040 126 -952 -1051 869 -364 -1207 -901 -947 -390 -596 -1010 -364 -853 -1210 -228 -1 -138 -129 -948 -594
8178 -594 -895 -525 213 -226 91 -359 -611 318 87 617 11 -570 654
8191F54
$$ Imaginary data points
##PAGE= N=2
##DATA TABLE= (X++(I..I)), XYDATA
0@%%%%%%%%%%%%%%%%%Pn1J09j39J51j55J56j60J85k35K75k99L33l85M28m76N40
34B84n99O66p42Q25r18J018j125J246j379J531j697J882k095K332k605K921l296
51a751L750m304N000n913P166q990J1902j7296L0519j04541k11219K88768J75718
64A68809j86512j70044J81811J44523j62978j43405J62692J46225j29702j52684
74a41265R9858J33772o8506j14133N5929R4592m7180q8001L8089Q0474k7497p8795
86f2663O839O6220J2192n4951k1067L8870K0390k8730j7980K3485J6792k3700
98b4303j0537K2858J2206j9741k708K1336p31j6137J3756K1530k4322k7128L9002
111E081M1407l8831n1716L9876N4886m1076n1599N4062N6124p1313p0683Q1212
$$ plain form
0 0 0 0 0 0 0 0 0 0 0 0 0 0 0 0 0 0 0 7 -44 65 -74 77 -78 78 -82 103 -132 143 -156 177 -208 220 -256 284
34 284 -315 351 -391 434 -484 534 -591 655 -724 807 -890 992 -1103 1229 -1376 1545 -1751
51 -1751 1999 -2305 2695 -3218 3948 -5042 6860 -10436 20083 -84458 -295677 -6909 168809
64 168809 -17703 -187747 -5936 138587 -24391 -167796 -5104 141121 11419 -141265
74 -141265 -41407 92365 23859 -90274 -34345 60247 13067 -74934 -36845 43629 16132 -62663
86 -62663 -55824 10396 22588 -32363 -53430 -14560 5830 -22900 -40880 -17395 -603 -24303
98 -24303 -34840 -11982 224 -19517 -22225 -889 -1620 -17757 -4001 17529 -6793 -33921 5081
111 5081 46488 7657 -44059 -4183 50703 9627 -41972 12090 68214 -3099 -73782 7430
123G430Q9293p3916r8606O4320R7401n8884q8977O4448R1161o7201r7357O3319
135g569J09019m5636j00846L7145R4272k6322p9105L1469P9373k7771p5987K7437
147A5479P9590j5807p2558R179O6692q35n8718m319N1996K142n3952p092N2180
160F3977O111n3583j5916M8059J1632m7742j6311L9097N221m4948o491M5151j288
173C2969n4797n704N4563O519n7363j2884N2777M194n7408J815O1386l342p3408
186e0683j628P3920N316p3997o656O5637K334p1082j406P3632K384p8318j4361
199g4908P4130J8182p1104k2919O2669J8039o0556j8717N8738J9390n8883k3531
211g9470N5578K5668m7727k7875M3768K8786l8905k6594M1282K9942l5213l0278
$$ plain form
123 7430 96723 22807 -75799 -11479 85922 27038 -61939 2509 93670 26469 -70888 -7569
135 -7569 101450 55814 -45032 -7887 86385 60063 -19042 12427 91800 64029 -11958 15479
147 15479 95069 79262 6704 15883 82575 81740 23022 18703 70699 72841 18889 11797 63977
160 63977 70088 16505 589 48648 60280 12538 -3773 35324 40545 -4403 -10894 34257 32969
173 32969 -21828 -27532 27031 33550 -23813 -36697 16080 20274 -37134 -35319 26067 22725 -50683
186 -50683 -52311 21609 26925 -47072 -53728 11909 14243 -56839 -58245 15387 17771 -60547 -74908
199 -74908 -778 17404 -53700 -76619 -13950 4089 -56467 -75184 -16446 2944 -55939 -79470
211 -79470 -23892 1776 -45951 -73826 -30058 -1272 -40177 -66771 -25489 4453 -30760 -61038
223f1038L7174L6931l1992l1828L0633L3746k7015k6332K8109K7538k7126k2047
235c3247L0261K2801l0881j9665K8823K1741k7954j8277K9894J7126l3808j5122
247b8308M0014J6845l9665j8273L9701J8955l8011j6373M2714J5558m1875j4233
259b2951M5659K0200m4235j9359M5023K4016l9429k5913M5248K6897m1975k7247
271a4066M6250K9610m2707l1573M1567L4127l8537l3598L5696L5784l4504l7262
283i213L3391L7113l1114m0588K7581M0321k5886m1018K3421L9333k2391m0489
295i539K0387L8668k0659l9520J7859L6792j4978l8564J3993L5850j4662l5426
307i799J1571L4582j4059l7088J2283L4255j4302l4698J3191L0881j5974l3796
$$ plain form
223 -61038 -23864 13067 -18925 -50753 -20120 13626 -13389 -39721 -11612 15926 -11200 -33247
235 -33247 -2986 19815 -11066 -30731 -1908 19833 -8121 -26398 3496 20622 -13186 -28308
247 -28308 11706 28551 -11114 -29387 10314 29269 -8742 -25115 17599 33157 -8718 -22951
259 -22951 22708 42908 -1327 -20686 24337 48353 8924 -16989 28259 55156 13181 -14066
271 -14066 32184 61794 19087 -12486 29081 63208 24671 -8927 26769 62553 28049 -9213
283 -9213 24178 61291 30177 -10411 17170 57491 31605 -9413 14008 53341 30950 -9539
295 -9539 10848 49516 28857 -10663 7196 43988 29010 -9554 4439 40289 25627 -9799
307 -9799 1772 36354 22295 -14793 -2510 31745 17443 -17255 -4064 26817 10843 -22953
319b2953J4637L1068j7876l3720J4365L0963j7546l3845J5374L1922j6422l5568
331c9601J4022L3202j6175l5428J4983L3648j6075l3821J3803L5050j4000l5366
343d5758J2726L4045j1819l5365J1844L6886j0321l6725R447L9125p401l7252
355d0568O283L8309m952l7306O452L7686k716l5635L005L6764j533l2909J380
368b5740L4308L89l2490O94L4674K387l2250j859L5322K112l2372o80L4682J935
382B1112l2419k059L4312L451l0374j495L0970N268l1414k420L1425N958l2378
395f3k579L1742N262l2112k664L3008M591l3532m903L5069M516l2587o048L2982
409C2682O345l3682n981L2604P756l3552r194L1048R740l2183j0608L1837P022
$$ plain form
319 -22953 -8316 22752 4876 -28844 -14479 16484 -1062 -34907 -19533 12389 -4033 -39601
331 -39601 -25579 7623 -8552 -43980 -28997 4651 -11424 -45245 -31442 3608 -10392 -45758
343 -45758 -33032 1013 -10806 -46171 -34327 2559 -7762 -44487 -35040 4085 -3316 -40568
355 -40568 -34285 4024 -928 -38234 -31782 5904 3188 -32447 -29442 7322 5789 -27120 -25740
368 -25740 8568 8957 -23533 -22839 11835 14222 -18028 -19887 15435 17547 -14825 -15505 19177 21112
382 21112 -11307 -13366 20946 24397 -5977 -7472 23498 28766 -2648 -5068 26357 32315 -63
395 -63 -2642 29100 34362 2250 -414 32594 37185 3653 -1250 33819 38335 5748 -300 32682
409 32682 39027 5345 -636 31968 39724 6172 -3022 28026 37766 5583 -5025 26812 33834
422C3834l1436j1040L0264J0074l0685j3044K7373J1674k9150j3713K7684J2508
434B4343k7862j6508K5461J5896k6968j6934K4893J3856k4933j7122K4977J5449
446A4548k4229j7111K1666J5581k2838j6183K1713J4853k2627j7537K2802J5390
458F028k3276j6965K2534J5849k3969j8022K3681J6258k3635j6633K1516J6859
470B25k1258j7004K2259J6147k1522j7616K2346J9603k3637j7385K3066K0456
482E680k2689j8291K4502J9528k1796j9104K3495K2068k2192k0734K2281K1718
494A4466j8478k1327J9915K3066j7338k2862J8658K2189j7774k1638J8039K5058
506B1974j7073k5095J5421K6356j4135k4031J3217K5973j1683k5840J2236K8241
$$ plain form
422 33834 2398 -8642 21622 31696 1011 -12033 15340 27014 -2136 -15849 11835 24343
434 24343 -3519 -20027 5434 21330 -5638 -22572 2321 16177 -8756 -25878 -901 14548
446 14548 -9681 -26792 -5126 10455 -12383 -28566 -6853 8000 -14627 -32164 -9362 6028
458 6028 -17248 -34213 -11679 4170 -19799 -37821 -14140 2118 -21517 -38150 -16634 225
470 225 -21033 -38037 -15778 369 -21153 -38769 -16423 3180 -20457 -37842 -14776 5680
482 5680 -17009 -35300 -10798 8730 -13066 -32170 -8675 13393 -8799 -29533 -7252 14466
494 14466 -4012 -25339 -5424 17642 304 -22558 -3900 18289 515 -21123 -3084 21974
506 21974 4901 -20194 -4773 21583 7448 -16583 -3366 22607 10924 -14916 -2680 25561
518B5561q501k7464R000K9026n974k6427R752K7465q237k5452R096K8628o749
531B9724k6843N716K7022l051k7319O783K4410n302k5843N858K6653n770k7557
544D481L141K4128k882k3673K135J9995n251k1676N259K1247p021k1292L184J9789
558B1564l085k0011J999J7188m568j7441N317J7242n846k1008L346K0004k840
571A1861k0236J556J6263n509j7430L754J9345o972k4168J840K2686l032k4033
584b4075J153J8138l758k1618L910K1650n863k6628K719K6027K23k6862l57K4280
598a1061p42k4585L157K7707j343k9373k19L3311M040k8376n439K8726O029k5050
612b3218k741L0355J580k9834k455L1098P971k8724j0245K7937J2345k6222q874
$$ plain form
518 25561 17060 -10404 -1404 27622 21648 -4779 4973 32438 24201 -1251 7845 36473 29724
531 29724 2881 8597 35619 32568 5249 12032 36442 31140 5297 11155 37808 32038 4481
544 4481 7622 31750 28868 5195 7330 27325 22074 398 5657 26904 19883 -1409 1775 21564
558 21564 18479 -1532 467 17655 13087 -4354 963 18205 12359 -8649 -5303 14701 11861
571 11861 -8375 -6819 9444 3935 -13495 -9741 9604 2632 -21536 -19696 2990 -42 -24075
584 -24075 -22922 -4784 -8542 -30160 -26250 -4600 -10463 -37091 -34372 -8345 -8122 -34984 -35341 -11061
598 -11061 -11803 -36388 -33231 -5524 -6867 -36240 -36459 -3148 892 -27484 -32923 -4197 1832 -23218
612 -23218 -25959 4396 5976 -23858 -26313 4785 12756 -15968 -26213 1724 14069 -12153 -21027
625b1027K5853R252k6154j1361K8393J4510k3967j7490K0673J8513j6875j2881
637a2561J7131J3272j8302j1416K0674J7610j6995j8801J5221K0979j0453j5981
649C78J0704J6191j1514j3220J4864J6678j2443j8294Q901J7884o001j3867N985
662A6246Q831q577q196J1268R263j3005j2812J0601J2904r313r924O972N289r738
676I809n008J3858O172j5230q740J3992R684j1649n396R278L645j3741r55J7773
690B3492L673k1390q316J9409J0804j8331j1374J4099P717j6158r495J7965R171
703B1266k3109j5724J8918J6150j8821j8755J2202J6470j6635j7254J6794J6888
715H390k1075k3479J8228K5962j6232k6256J0165K3436r854k0382J1514K1915
$$ plain form
625 -21027 4826 14078 -12076 -23437 4956 19466 -4501 -21991 -1318 17195 320 -12561
637 -12561 4570 17842 -460 -11876 8798 26408 9413 -9388 5833 26812 16359 378
649 378 11082 27273 15759 2539 17403 34081 21638 3344 12245 30129 24128 10261 16246
662 16246 25077 16500 8304 19572 28835 15830 3018 13619 26523 17210 7286 14258 19547 9809
676 9809 4801 18659 24831 9601 861 14853 24537 12888 7492 16770 20415 6674 5719 23492
690 23492 27165 5775 -2541 16868 27672 9341 -2033 12066 19783 3625 -5870 12095 21266
703 21266 -1843 -17567 1351 17501 -1320 -20075 -7873 8597 -8038 -25292 -8498 8390
715 8390 -12685 -36164 -17936 8026 -8206 -34462 -24297 -861 -10715 -31097 -19583 2332
727B332j4536k4877J4244K7799q777k9026O557K5365m447k1474M510K2859q011
740g482k3853O923K6314l691k5940p61K2217L964j8601k155J6436J82j7655K751
754b1351K0291K180j9108m876J9335P173j2233l896J2160N151j0707j610J6691
767I200M864j5185m442J3557J0803r515n728Q419L289p437P89J2825J938j6882
781F495k256J4714M415j1357m238R995M85j1455K966J3362l648j6035J164J5491
795B0098n29j3727J678J3139n201j4014P528J7343p588j8895M543K0175l909j6904
809C737J279J6950l878j6964O180J5717m222k0342K271J8725l39j8247l166J6173
823A3874k09j6912Q3J4349l22j9822m833K0110N283j9395j0363J6211J0598j7019
$$ plain form
727 2332 -12204 -37081 -22837 4962 -3815 -32841 -26284 -919 -5366 -26840 -22330 529 -7482
740 -7482 -31335 -24412 1902 -1789 -27729 -28490 -6273 -2309 -20910 -23065 -6629 -6447 -24102 -21351
754 -21351 -1060 1120 -17988 -22864 -3529 3644 -8589 -12485 -325 4826 -5881 -7491 9200
767 9200 14064 -1121 -5563 7994 18797 9282 3554 11973 15262 7825 8614 21439 23377 6495
781 6495 4239 18953 23368 12011 7773 17768 18253 6798 9764 23126 19478 3443 4607 20098
795 20098 19569 5842 7520 20659 15458 1444 8972 26315 18727 -168 4375 24550 20641 3737
809 3737 5016 21966 18088 1124 7304 23021 18799 -1543 728 19453 19114 867 -2299 13874
823 13874 13665 -3247 -3164 11185 10863 -8959 -13792 6318 11601 -7794 -18157 -1946 8652 -8367
837h367j0200J5575Q988j6909j1911J8618J3150j7818j5216J5258J5066j4123
849g889j4063J4366J2785j5462j4025J6362J3900j3304j8143J2408J6075j1964
861h954j3616J0611J1735j2002j2591J2223J2613j2326j2171R551J2310q639j0236
874b1492Q518Q536q283p342R073J0134r398p670P283R411n184o855O663P131o106
889e581n083Q417P342o630n892P117Q508m964p380O161P382m823o454P360P906
904A3386o277r063O757J1487o034r306P090R763o821j0314Q219J2466q493j1916
918I44P900J5557p739j4104P467J4534p188j4712Q264J4995p897j4818Q674J5634
932B7511q296j6264Q728J3376p653j3925P548J3054q543j4554P232J2980o949
$$ plain form
837 -8367 -18567 -2992 5996 -10913 -22824 -4206 8944 -8874 -24090 -8832 6234 -7889
849 -7889 -21952 -7586 5199 -10263 -24288 -7926 5974 -7330 -25473 -13065 3010 -8954
861 -8954 -22570 -11959 -224 -12226 -24817 -12594 19 -12307 -24478 -14927 -2617 -11256 -21492
874 -21492 -12974 -4438 -12721 -20063 -10990 -856 -10254 -17924 -10641 -1230 -6414 -13269 -6606 525 -5581
889 -5581 -10664 -2247 5095 -1535 -7427 -310 8198 3234 -4146 2015 9397 4574 -1880 5480 13386
904 13386 7109 -1954 4803 16290 10256 950 8040 17803 10982 668 8887 21353 12860 944
918 944 8844 24401 16662 2558 10025 24559 17371 2659 10923 25918 18021 3203 11877 27511
932 27511 19215 2951 11679 25055 17402 3477 11025 24079 15536 982 8214 21194 14245
945A4245j5133N283J2616n529j2808K990J2150m717j3465K848J1422l067j2995
958f160M70J2099k743j3004R93J0719k42j3621n01J2085M79j3360k207J2615R03
973a475j3601j545J2033J633j4390j067J1756J344j3044j868J2059J302j2804
986a9667j635J3213J119j4180j502J4685P39j3891j188J2984J557j3159r82J3755
1000h152J486j2627j125J4303P39j1357j770J3229Q69j0584l94J2063Q53j0499
1014a2966j078J2395K298j0178m64R840K661r678j709R734M787j0037k028R416
1028B993N130r295m182J1210M898r108l925J0852M869r355l833R673O181j0404
1042E704m866J0366N775r419m943J0829N575j0236o071J0379P426j0208o653R821
$$ plain form
945 14245 -888 4395 17011 11482 -1326 1664 13814 9097 -4368 -1520 9902 6835 -6160
958 -6160 -5690 6409 3666 -9338 -8345 2374 2132 -11489 -11990 95 574 -12786 -14993 -2378 -1475
973 -1475 -15076 -16621 -4588 -2955 -17345 -18412 -6656 -5312 -18356 -20224 -8165 -6863 -19667
986 -19667 -21302 -8089 -6970 -21150 -22652 -7967 -7228 -21119 -22307 -9323 -7766 -20925 -21907 -8152
1000 -8152 -6666 -19293 -20418 -6115 -5376 -16733 -18503 -5274 -4405 -14989 -15383 -3320 -2467 -12966
1014 -12966 -14044 -1649 649 -9529 -9993 -153 2508 -7170 -8879 855 5642 -4395 -6423 2993
1028 2993 8123 -1172 -5354 5856 10754 1646 -2279 8573 13442 4087 254 9927 16108 5704
1042 5704 838 11204 16979 7560 2617 13446 19021 8785 2714 13093 20519 10311 3658 13479
1056A3479N937q849o513R604O161j0262o194R264P309r842p518R984O791j0132
1070I219p002Q982O118r177o838P357P915r437q080Q997O213r230p047N927P683
1085A1600o773q453N881O883p496p605N482O222n754r807P627N867n873q369M780
1100e788Q006p100q051N113Q052n658q252M036Q124n637q413N466Q093n184r127
1115a6320N249Q368n365p948M908Q010n694q141N980Q293o136q279M627R094m634
1130g988q406M894P655m664q156O372P529l764q103M884R467n327p336N994Q288
1145A339m184q596O258R329l981q238M871R220k515r026M329R969l117r289M280
1160F49R932k064r770K718J1883l314r504J277J1324j301j0908J249J2065j167
$$ plain form
1056 13479 19416 10567 4054 13658 19819 9557 3363 12627 19936 10094 2576 12560 19351 9219
1070 9219 2217 11199 17317 8140 1302 8659 16574 7137 -943 8054 14267 5037 -2010 3917 11600
1085 11600 4827 -3626 2255 9138 1642 -5963 -481 5741 -13 -9820 -2193 3674 -2199 -10568 -5788
1100 -5788 2218 -4882 -12933 -7820 232 -5426 -13678 -9642 -1518 -7155 -15568 -10102 -2009 -7193 -16320
1115 -16320 -11071 -2703 -8068 -16016 -11108 -3098 -8792 -16933 -10953 -2660 -8796 -17075 -12448 -3354 -7988
1130 -7988 -16394 -11500 -3845 -8509 -16665 -10293 -2764 -6528 -14631 -9747 -280 -5607 -12943 -6949 1339
1145 1339 -2845 -11441 -5183 4146 165 -8073 -3202 6018 3503 -5523 -1194 8775 5658 -3631 649
1160 649 10581 8517 -1253 1465 13348 10034 530 1807 13131 11830 922 2171 14236 13069
1174A3069j1363R87J1453P45j2114q2J0605J016j0148o56J1244O87j0748j370
1188C325J1083L023j0187k365R192K010q408k906J0375J726j0953k932R462K163
1202A4608q806m302Q302K186p779m298P292J275p898k788O532Q84o397l671N688
1217H28K126o782j677M471O99o230j880N722J966p235n07L556P27m832M59M053
1233d536k42o979n76O567J253p324k254O654l83m608p51M464N54q130k11R378
1249g124j406q614j592Q585R01p179j429R476K60j0050r00J1746L097j0461n676
$$ plain form
1174 13069 1706 2693 14146 14891 2777 2695 13300 14316 4168 3512 14756 15443 4695 3325
1188 3325 14408 17431 7244 4879 14071 16081 7673 4767 15142 16868 5915 2983 12445 14608
1202 14608 5802 1500 9802 11988 4209 -89 7203 8478 580 -2208 4324 5208 -1189 -4860 828
1217 828 2954 -3828 -5505 -1034 -335 -6565 -8445 -2723 -757 -7992 -8499 -4943 -4216 -9048 -8589 -4536
1233 -4536 -4778 -11757 -12333 -5766 -4513 -11837 -14091 -7437 -7820 -12428 -13179 -8715 -8161 -16291 -16502 -7124
1249 -7124 -8530 -17144 -18736 -10151 -9250 -16429 -17858 -8382 -8122 -18172 -19072 -7326 -4229 -14690 -20366
$$ [...]
8191D35
##END NTUPLES=NMR FID
##END=
