##TITLE=1H_RF0607
 CDCl3, 8 sc, 
 7.07.2021
##JCAMPDX= 6.0         $$ Bruker NMR JCAMP-DX V2.0
##DATA TYPE= NMR FID
##DATA CLASS= NTUPLES
##ORIGIN= UXNMR, Bruker Analytische Messtechnik GmbH
##OWNER= root
$$ XWIN-NMR		Version 3.5
$$ Wed Jul  7 10:27:21 2021 Russian Standard Time (UT+4h)  she@DPX200
##.OBSERVE FREQUENCY= 200.131506
##.OBSERVE NUCLEUS= ^1H
##.DELAY= (6, 6)
##.ACQUISITION MODE= SIMULTANEOUS
##.ACQUISITION SCHEME= undefined
##.AVERAGES= 8
##.DIGITISER RES= 18
##SPECTROMETER/DATA SYSTEM= spect
##.PULSE SEQUENCE= zg30
##.SOLVENT NAME= D2O
##.SHIFT REFERENCE= (INTERNAL, D2O, 0, 15.7039)
##AUDIT TRAIL= $$ (NUMBER, WHEN, WHO, WHERE, WHAT)
$$ ##TITLE= Audit trail, XWIN-NMR		Version 3.5
$$ ##JCAMPDX= 5.01
$$ ##ORIGIN= Bruker BioSpin GmbH
$$ ##OWNER= she
$$ F:/spectra/data/she/nmr/H-F/1/audita.txt
$$ ##AUDIT TRAIL=  $$ (NUMBER, WHEN, WHO, WHERE, WHAT)
(   1,<2021-07-07 10:23:49.35 +0400>,<she>,<DPX200>,
      <created by zg, POWCHK disabled, PULCHK disabled
       configuration hash MD5:
       00 E9 B6 7A A2 85 ED C7 34 08 36 98 17 FE 4E 26
       data hash MD5: 16K
       CA C4 59 B4 83 A3 04 EC 31 89 B2 07 E6 60 08 CA>)
$$ ##END=
$$ 
$$ hash MD5
$$ 2F 35 5D D0 EC 79 D8 2B 2D D3 9A 3F BD 94 4F 74
##$RELAX= 
##$RELAX= 
##$RELAX= 
##$RELAX= 
##$RELAX= 
##$RELAX= 
$$ Bruker specific parameters
$$ --------------------------
##$DU= <F:/spectra>
##$EXPNO= 1
##$NAME= <H-F>
##$PROCNO= 1
##$TYPE= <nmr>
##$USER= <she>
##$AMP= (0..31)
100 100 100 100 100 100 100 100 100 100 100 100 100 100 100 100 100 100 
100 100 100 100 100 100 100 100 100 100 100 100 100 100 
##$AQSEQ= 0
##$AQ_mod= 1
##$AUNM= <au_zg>
##$AUTOPOS= <>
##$BF1= 200.13
##$BF2= 200.13
##$BF3= 200.13
##$BF4= 200.13
##$BF5= 200.13
##$BF6= 200.13
##$BF7= 200.13
##$BF8= 200.13
##$BYTORDA= 1
##$CFDGTYP= 0
##$CFRGTYP= 5
##$CHEMSTR= <none>
##$CNST= (0..31)
1 1 145 1 1 1 1 1 1 1 1 1 1 1 1 1 1 1 1 1 1 1 1 1 1 1 1 1 1 1 1 1 
##$CPDPRG= <>
##$CPDPRG1= <>
##$CPDPRG2= <>
##$CPDPRG3= <>
##$CPDPRG4= <mlev>
##$CPDPRG5= <mlev>
##$CPDPRG6= <mlev>
##$CPDPRG7= <mlev>
##$CPDPRG8= <mlev>
##$CPDPRGB= <>
##$CPDPRGT= <>
##$D= (0..31)
0 1.2 0 0 0 0 0 0 0 0.06 0 0.03 0 0 0 0 0.0002 0 0 0 0 0 0 0 0 0 0 0 0 
0 0 0 
##$DATE= 1625639028
##$DBL= (0..7)
120 120 120 120 120 120 120 120 
##$DBP= (0..7)
150 150 150 150 150 150 150 150 
##$DBP07= 0
##$DBPNAM0= <>
##$DBPNAM1= <>
##$DBPNAM2= <>
##$DBPNAM3= <>
##$DBPNAM4= <>
##$DBPNAM5= <>
##$DBPNAM6= <>
##$DBPNAM7= <>
##$DBPOAL= (0..7)
0.5 0.5 0.5 0.5 0.5 0.5 0.5 0.5 
##$DBPOFFS= (0..7)
0 0 0 0 0 0 0 0 
##$DE= 6
##$DECBNUC= <off>
##$DECIM= 32
##$DECNUC= <off>
##$DECSTAT= 4
##$DIGMOD= 1
##$DIGTYP= 9
##$DL= (0..7)
0 120 120 120 120 120 120 120 
##$DP= (0..7)
150 150 150 150 150 150 150 150 
##$DP07= 0
##$DPNAME0= <>
##$DPNAME1= <>
##$DPNAME2= <>
##$DPNAME3= <>
##$DPNAME4= <>
##$DPNAME5= <>
##$DPNAME6= <>
##$DPNAME7= <>
##$DPOAL= (0..7)
0.5 0.5 0.5 0.5 0.5 0.5 0.5 0.5 
##$DPOFFS= (0..7)
0 0 0 0 0 0 0 0 
##$DQDMODE= 0
##$DR= 18
##$DS= 0
##$DSLIST= <SSSSSSSSSSSSSSS>
##$DSPFIRM= 0
$$ [...]
##$SUBNAM2= <"">
##$SUBNAM3= <"">
##$SUBNAM4= <"">
##$SUBNAM5= <"">
##$SUBNAM6= <"">
##$SUBNAM7= <"">
##$SUBNAM8= <"">
##$SUBNAM9= <"">
##$SW= 20.0188882624521
##$SWIBOX= (0..15)
0 0 2 0 0 0 0 0 0 0 0 0 0 0 0 0 
##$SW_h= 4006.41025641026
##$TD= 16384
##$TD0= 1
##$TE= 0
##$TE2= 300
##$TE3= 300
##$TEG= 300
##$TL= (0..7)
0 120 120 120 120 120 120 120 
##$TP= (0..7)
150 150 150 150 150 150 150 150 
##$TP07= 0
##$TPNAME0= <>
##$TPNAME1= <>
##$TPNAME2= <>
##$TPNAME3= <>
##$TPNAME4= <>
##$TPNAME5= <>
##$TPNAME6= <>
##$TPNAME7= <>
##$TPOAL= (0..7)
0.5 0.5 0.5 0.5 0.5 0.5 0.5 0.5 
##$TPOFFS= (0..7)
0 0 0 0 0 0 0 0 
##$TUNHIN= 0
##$TUNHOUT= 0
##$TUNXOUT= 0
##$USERA1= <user>
##$USERA2= <user>
##$USERA3= <user>
##$USERA4= <user>
##$USERA5= <user>
##$V9= 5
##$VALIST= <valist>
##$VCLIST= <CCCCCCCCCCCCCCC>
##$VD= 0
##$VDLIST= <DDDDDDDDDDDDDDD>
##$VPLIST= <PPPPPPPPPPPPPPP>
##$VTLIST= <TTTTTTTTTTTTTTT>
##$WBST= 1024
##$WBSW= 4
##$XGAIN= (0..3)
0 0 0 0 
##$XL= 0
##$YL= 0
##$YMAX_a= 223194
##$YMIN_a= -250033
##$ZGOPTNS= <>
##$ZL1= 120
##$ZL2= 120
##$ZL3= 120
##$ZL4= 120
##$ABSF1= 10
##$ABSF2= 0
##$ABSG= 5
##$ABSL= 3
##$ALPHA= 0
##$AQORDER= 0
##$ASSFAC= 0
##$ASSFACI= 0
##$ASSFACX= 0
##$ASSWID= 0
##$AUNMP= <proc_1d>
##$AZFE= 0.1
##$AZFW= 0.1
##$BCFW= 1
##$BC_mod= 2
##$BYTORDP= 1
##$COROFFS= 0
##$CY= 11.3945322036743
##$DATMOD= 1
##$DC= 2
##$DFILT= <>
##$DTYPP= 0
##$F1P= 15.9154993809931
##$F2P= -4.1035820241983
##$FCOR= 0.5
##$FTSIZE= 0
##$FT_mod= 4
##$GAMMA= 1
##$GB= 0.15
##$INTBC= 1
##$INTSCL= 1
##$ISEN= 128
##$LB= 0.24
##$LEV0= 0
##$LPBIN= 0
##$MAXI= 10000
##$MC2= 0
##$MEAN= 0
##$ME_mod= 0
##$MI= 1.114404
##$NCOEF= 0
##$NC_proc= 0
##$NLEV= 6
##$NOISF1= 3.799351
##$NOISF2= 2.8
##$NSP= 1
##$NTH_PI= 0
##$NZP= 0
##$OFFSET= 15.70392
##$PC= 1
##$PHC0= -11917.95
##$PHC1= 18.20099
##$PH_mod= 1
##$PKNL= yes
##$PPARMOD= 0
##$PSCAL= 0
##$PSIGN= 0
##$REVERSE= no
##$SF= 200.130013532006
##$SI= 16384
##$SIGF1= 3
##$SIGF2= 2
##$SINO= 400
##$SIOLD= 16384
##$SREGLST= <1H.CDCl3>
##$SSB= 0
##$STSI= 0
##$STSR= 0
##$SW_p= 3612.71676300578
##$SYMM= 0
##$S_DEV= 0
##$TDeff= 0
##$TDoff= 0
##$TI= <>
##$TILT= no
##$TM1= 0
##$TM2= 0
##$TOPLEV= 0
##$USERP1= <user>
##$USERP2= <user>
##$USERP3= <user>
##$USERP4= <user>
##$USERP5= <user>
##$WDW= 1
##$XDIM= 8192
##$YMAX_p= 0
##$YMIN_p= 0
$$ End of Bruker specific parameters
$$ ---------------------------------
##NTUPLES= NMR FID
##VAR_NAME=  TIME,          FID/REAL,        FID/IMAG
##SYMBOL=    X,             R,               I
##VAR_TYPE=  INDEPENDENT,   DEPENDENT,       DEPENDENT
##VAR_FORM=  AFFN,          ASDF,            ASDF
##VAR_DIM=   8192,          8192,            8192
##UNITS=     SECONDS,       ARBITRARY UNITS, ARBITRARY UNITS
##FACTOR=    0.0002496,     1,               1
##FIRST=     0,             0,               0
##LAST=      2.0444736,     0,               0
##MIN=       0,             -250033,         0
##MAX=       2.0444736,     223194,          0
$$ Real data points
##PAGE= N=1
##DATA TABLE= (X++(R..R)), XYDATA
0@%%%%%%%%%%%Qj6J6j6K4l2L9m7N6o5P3q8J09j33J52j76K08k40K74l14L60m10
33b18M65n24N92o68P50q39R37j045J160j288J429j582J749j931K131k348K587
50A357k851L139l459L815m212M657n159N733o396P170q087R196j0570J2320j4639
65g986J7879k2760L1033m8683J53206j51035r3521L45061j88782j32481K54187
76A56118l7879k73606J91260J11981k26374L5721J60353j95137k0134K28243j05593
87B4953j69748J90538J2641k04006J27218J60006k12778n0756K07077p0798j38111
98a23764J56778K0200j63418R3388J14474j46398j1791J28815q6247n3567J52991
109H1461l4395j34423J21203O0082j71435L0880J53945j08622q7207J46923m819
$$ y = [0, 0, 0, 0, 0, 0, 0, 0, 0, 0, 0, 0, 8, -8, 8, -8, 16, -16, 23, -24, 32, -33, 40, -48, 61, -72, 80, -96, 112, -128, 146, -168, 192, -218, 247, -277, 315, -353, 397, -442, 495, -550, 610, -678, 751, -831, 918, -1013, 1118, -1230, 1357, -1494, 1645, -1814, 2001, -2211, 2446, -2713, 3020, -3376, 3794, -4293, 4903, -5667, 6653, -7986, 9893, -12867, 18166, -30517, 122689, -28346, -121867, 223194, 34412, -98069, 156118, 118239, -155367, 35893, 147874, -78500, -42779, 117574, -77563, -97697, 130546, 24953, -144795, 45743, 58384, -145622, -18404, 141602, -71176, -121932, 85145, 14347, -123764, 33014, 53214, -110204, -16816, 97658, -48740, -60531, 68284, -17963, -71530, 81461, 47066, -87357, 33846, 93928, -77507, -46627, 107318, -1304, -88511, 58412, 53593]
120E3593j45726P6515Q9889j26040j3331J30306n6072p9356J02068o46j06019
131g4819P6338O1376j13924L0106J17417j19455p1417J65098j3912j45047J10582
142B2343P5824j62049K4669J54836j10444r2285J46726r82j14974R6673L9431
153G9768j43923M3277J07005j17036j7988J43656q7150j16638J53530K8850j72186
164i8835P1430J19999j50994k1468J76294p9351j35231J35381L8394j28534P4434
175A519P7485j39339P132J32094r2098n7754J41975m0086j24140J28695N5586
186I1069j61707L5767J27191j17644m7710J59723l6698j39562R2600N5277j14924
197e6618L9800Q6341j07687k4073J16269n4125p8356J04188o42j14560Q3360Q0530
$$ y = [53593, -92133, -15618, 74271, -51769, -65100, 65206, 9134, -70222, 31846, 31200, -74819, 1519, 62895, -51029, -20923, 96494, -22961, -94378, 70720, 56808, -88239, 22343, 98167, -63882, -39213, 115623, 5179, -87106, 59620, 58638, -56336, 40337, 79768, -64155, -20878, 86127, -30909, -48897, 94759, 7609, -109029, 44501, 73351, -98835, -27405, 92594, -58400, -79868, 96426, 17075, -118156, 17225, 55619, -72915, 1519, 79004, -60335, -53203, 78891, -13207, -70961, 71014, 30928, -93212, 35483, 91069, -70638, -34871, 92320, -25324, -73034, 86689, 49991, -89571, 3029, 58306, -56618, -16818, 69523, -38164, -62237, 54032, -93, -78449, 25739, 25097, -89463, -6103, 74427]
209G4427j31423r856J27009p1123q0038J27930J8980j26149M7776Q1368q9830
220c0929r929R7175n1298n5250R2868j951q6152N9120M0492r4149K5642R4215
232G9854q0110n2174J10463j8223j10627P7815O7251j08795p24R7823o5346n8402
244f1195R5085o761q7559O3985M2115r0307K4478P1308q6768k1303J10670m1411
256A2337q2769J00328K5012j24889M1681J03444r2394l7955J15014l3325q9309
267f2825Q9124K9978j03573L4930P2003p8906n218Q7474o5609n9531J02696o045
279C4498r8819P7052N4212j20650Q304J11158p2216o4599J05351l750r7162O7479
291H58N3154r8545N756Q0341n8479k1490Q7713l8390p3192Q3102K2789r3905M5875
$$ y = [74427, -56996, -66852, 60157, -10966, -91004, 36926, 55906, -70243, -22467, 58901, -30929, -40858, 56317, 5019, -50231, 42637, 40686, -45466, 13654, 54146, -40003, -14361, 79854, -256, -52430, 58033, 39810, -70817, 6998, 74249, -34546, -35270, 62553, -2793, -61195, 33890, 27129, -60430, 3555, 45670, -44637, -20159, 51149, -35619, -56922, 53748, 12337, -70432, 29896, 54908, -69981, -28300, 75144, -17250, -55205, 59809, 26484, -62825, 26299, 56277, -47296, -12366, 59637, -19269, -24487, 62987, -2622, -62153, 40543, 34498, -64321, 12731, 66943, -53707, -45403, 65755, -6461, -71060, 34291, 30541, -66621, 858, 54012, -44533, -38777, 41564, -16915, -38405, 49308, 10918, -62274, 20828, 43617, -50288, -4413]
304d413P4297r3411k0905J10421l9490q5364Q2022K9136r3406L4752P3888p6636
316i109l1171P7053k7763m8298P0303j345p9540M9482M6679q2511M328Q0668n9145
329a0369m9176R5535O42r7473M6303O1083p9233l597Q6016m3221n5582O9312N307
342B5547o5228M4963L5424p0053J6464O8430o2314l3858Q3799k0944p3168P2915
354B1977L6373r7217J4812Q3385o6253m5086Q8867q895p6028N6596L1062q0116
366d0523J9178O0457o1279j3354P6107m0816n5123P9670N966r0178M9989O4259
378E4353q5926o243R3311n0645o6561Q3494J8074q0123L9159M9632p2512K69P0645
391D6927m8306l5375P2302j5955o0730O4035K1461q8197K3293P2810o5015k8807
$$ y = [-4413, 69884, -23527, -44432, 65989, 26499, -58865, 23157, 52293, -41113, -6361, 67527, -9109, -40280, 36773, 9010, -39288, 31015, 29670, -49870, -388, 46291, -36220, -31892, 48776, -10369, -59545, 35990, 36632, -60841, -14538, 46545, -32688, -36285, 49731, 6510, -49072, 20240, 25547, -39681, 5282, 40706, -29347, -12883, 55547, -6767, -40625, 43174, 22230, -50938, 21977, 58350, -38867, -24055, 59330, -6923, -52009, 36858, 27963, -48065, 8531, 39593, -40523, -21345, 39112, -22167, -35521, 40586, -230, -55353, 24317, 30283, -59895, -9906, 54353, -31573, -37816, 55495, 4850, -61711, 21783, 39857, -40266, -1107, 48525, -23987, -23718, 46927, -1379, -36754, 35548, 19593, -41137, 22898, 44359, -43838, -20545, 52265, -12750, -41557]
403d1557Q4484k4630p6312O1591L6804p4420J0188N7807m6635j9865O1436k3136
415E755m9459N1547J4286n4800L4289L9652o7145n254P2821l3876m9824O6415
427B4407J3997p3411K9265N6233o0820k1213O6814j9945m3996N1984N452o1074
439c2307K9486L7135n4419K981N6532m5936l3030P0425j1420p2040N1145M3758
451D2310p2863K026P0721m5845m4513O8349J029o1927M2068L4769o1839R340N1504
464C5129m7775j7559O5146k2788m9391O0752J2718p5671L0350N9738o3707j9431
476c2489P5464k6422n7235N6610J6449o7753K3845M9309n0394j1002N2287l2981
488d312l3147N7524n320n5689M5607L1371o7675P695O3517m6359l6505P0743q85
$$ y = [-41557, 42927, 18297, -58015, 3576, 40380, -34040, -23852, 33955, -12680, -32545, 28891, 5755, -43704, 7843, 22129, -32671, 1618, 41270, -25875, -31129, 41692, 7816, -42008, 24407, 38404, -35007, -5742, 50491, -10329, -31542, 35272, 15327, -28669, 23315, 28767, -32307, -2821, 34314, -20105, -17124, 39408, -6528, -39558, 30867, 19447, -52593, -1448, 42310, -30553, -28527, 42194, -3651, -48164, 20185, 21214, -40713, 1355, 36124, -25715, -16375, 35129, -12646, -30205, 34941, 12153, -37238, 23514, 36232, -39439, -9089, 50649, -13058, -32489, 42975, 16553, -40682, 15928, 32377, -35376, -11531, 37778, -12616, -23618, 28669, -4312, -37459, 20065, 14745, -40944, 4663, 36034, -31641, -23946, 39571, -6788, -43293, 27450, 26565]
501B6565o4800M1025L7055o3157J273N8334l3214k6319N1660j1332m4117M3706
513A6679J3940n8555K5059M8811n4975j6028O3402k8001n2999N7725J9474o6695
525c2163J9193N2727n1525k3405N7817j6195m1282M5417Q968m9973K6852L1500
537B7931n2468J936N5823l5179l1415N9871m943o0731M0706L7367o1989J965O3300
550D2174l3719l8774N1615P61m9452L3166K6827m8754Q577M2750m1992j8761N1910
563B6328j8022m2491M8605J3856o2275K0422M9470n2646k1655O4223j3765m9306
575c7256M2873J8036n3613J5492M0226l8964q723M7671k2680l2439M4670M06m7801
588c2102L5074L1994n5124J618N7604l3975m0090N3588Q634n2792K6804L4666
$$ y = [26565, -38235, 2790, 39845, -23312, -22039, 36295, 3081, -23238, 28422, 17090, -27027, 16679, 30619, -27936, -2877, 45934, -9041, -25069, 38333, 10332, -42667, 15058, 34532, -32163, -12970, 39757, -11768, -35173, 22644, 6449, -34833, 10584, 19552, -30421, -3569, 27931, -24537, -22601, 33222, -1957, -33372, 26499, 21556, -39175, 1531, 38898, -23091, -21126, 42174, 8455, -30319, 21296, 22057, -27395, 5771, 32598, -16156, -7579, 35171, -6821, -25582, 26328, 8306, -34185, 14420, 28276, -33999, -13577, 35893, -16753, -38408, 25815, 12050, -37256, 5617, 23653, -29960, -14468, 25758, -13206, -21929, 25742, 3062, -29377, 15293, 15699, -32102, 2972, 34966, -20158, -18540, 39064, 5089, -35001, 18587, 27221, -25571, 1233, 35899]
600C5899m8614o052M7222k6088k7985M3620k984l9997L2156J6325n0018J2794
612a3722M4452m1575j7926N8266j5549n2560M1968K5397n2459J0883M6050l8591
624e366k0914N0283j0832m1111L4870J3350m0856K2947L0151m7713m690N0096
636C0215k7751l3402N2051M879n7605K7292L8151n2279p737N3876k5208l5053
648c2571M5634M330m7885K2567K6423l9601O873L8985l4804j8275M8353j2587
660G442m2717M0018K0169m9607J3958M4114m0568k2307N1451o873m1838L3683
672F925K0209m2439Q948L1826l2813q753M1058j7786k8855L8820K549m7338K5037
685b612L1663m4711l760M8151k6257l4799M4735P351m8764J8929L3735l3658n263
$$ y = [35899, -12715, -18767, 28455, 2367, -25618, 18002, 15018, -24979, 7177, 23502, -26516, -13722, 30730, -10845, -28771, 29495, 13946, -38614, 3354, 28751, -23708, -12825, 33225, -5366, -26280, 24003, 13171, -27940, 6930, 20280, -20576, 2371, 32522, -15191, -19881, 30215, 2464, -30938, 21113, 25992, -31613, -4321, 33830, -18449, -26186, 27690, 2482, -32571, 13063, 17393, -30492, -7925, 18498, -21103, -14230, 24755, -10049, -28324, 20029, 7442, -35275, 4743, 24912, -24695, -10737, 33377, -7191, -29498, 21953, 15080, -26758, 6925, 27134, -15305, -6357, 25469, -7344, -16097, 24961, 7175, -21680, 17140, 19689, -27649, -2612, 29051, -15660, -19420, 28731, 2474, -32325, 12410, 19761, -29003, -10074, 23661, -9997, -15260]
698a5260L4651k3601k1907L8684r77l3481K6774J6120m0531J0305L8068l3917
710e072j9444M7452n748m0758L1883K1013m5481L243L9481k3515j8114L4323q636
723A0627l0991K7868J1322l6910J2510K7722l1935n630L7856k1829l1723L9192
735H079J1733m3062J5254L3834l6505j3962M1624j0905l0921L1737R938l5624
747a8780J4735K5021l2256l099L5156k0721j9359L9743m923m1993K8262K5250
759B7036m3505K438M3738k7564k7556M0144m18l9922K5606K2278l7771L801L2728
772B1033k6892j3943L4600j2724k7680L6096Q791m2978J6458L1967l8023r096
784b2391M6322j5549l3867L4897J0849m0084J4227K9091l0495o325L4990j5832
$$ y = [-15260, 19391, -4210, -26117, 12567, 11590, -21891, 4883, 21003, -19528, -9223, 28845, -5072, -24516, 22936, 17188, -23570, 8313, 29326, -16155, -12912, 26569, 3054, -15060, 19263, 10627, -20364, 7504, 18826, -18084, -5574, 22148, -9787, -15417, 22439, 610, -31113, 8079, 19812, -23250, -7996, 25838, -10667, -24629, 16995, 6090, -24831, 6906, 16844, -18780, -4045, 20976, -11280, -14379, 20777, 56, -19303, 20440, 15517, -26476, 1786, 27036, -16469, -14031, 29707, 2143, -25413, 14731, 14313, -25609, -3, 22275, -15496, -11695, 21033, -5859, -19802, 14798, 2074, -25606, 10490, 19281, -23697, -7239, 24728, -13295, -22391, 23931, 8382, -25485, 9412, 20261, -19823, -5596, 23495, -7000, -13325, 21665, 5833]
796E833k1286K9608l941l0726K6006J8018l6376L418L2998k6587j9416L7628k326
809A2851l6011K3014K1632l4474p20L0203j9582j7182K9517j245k4959J9635R010
822A1689l0653J0609K6685k6221q797L4405j2517k8169K9793J2545l7562R690
834h503L2386k5692j4031L2742q110k7866K3523J1036k6688J0187J9092k7387
846i311m120L0386j5718k1155L0870J458l3403J9869K2969l6282m426L6869j5469
859B537k3604L0864L613l3855J5043K1886k7121J028K7441k0502j3216L0594o848
872G860k6915K5135J2031l2894J0927L0318l0077j5720L6276o345k8999K5539
884G136J2908l3321N686K5320k2368q915K7863j1532j9693K6253K005l0083J6173
$$ y = [5833, -15453, 14155, 10214, -20512, 5494, 23512, -12864, -9446, 23552, -3035, -22451, 15177, 12851, -23160, -146, 21486, -12988, -13708, 16495, -3087, -20269, 9248, 8003, -16956, 2679, 11689, -18964, -8355, 18330, -7891, -16688, 17717, 5200, -22969, 6824, 19369, -18193, -8503, 23883, -1809, -15840, 16902, 8792, -19074, 4449, 15485, -11203, -1016, 18076, -9311, -13431, 16955, 1237, -19918, 10952, 12410, -20993, -1124, 21845, -14437, -18863, 18006, 2537, -21067, 9797, 13410, -20445, -5402, 16484, -10637, -9609, 17832, -2670, -15886, 14708, 7860, -19055, 6080, 18111, -14783, -3856, 26462, -3615, -19335, 16941, 10596, -18403, 7136, 20044, -13277, -7591, 17729, -4639, -13554, 14309, 2777, -16916, 9337, 11342, -18741, -2568]
897b568J8768k9745J125L2562j9417k2952L0776L043l1792J6692K2795k8241l527
910a2481K8064j4598j6607K4585Q5k2831J7771J1558k6013N386K2578k3119r628
923a5250L1604o775k7422K2394J1843l1367N087K7993j9851j4087K6544m253k2692
936a6232J8838P957k4934Q511J9589k0225l924K4029j5095j8447K8190N049k9072
949a5766J3623K0848k7397m622L0650j2168k1856K4223O698k4303J0656J5987
961A6573k3887j964K4699j3361j2213K3100n981k4417K1187J3400k9138L047K6927
974A7972j9700j4664K8446l457k7843J8567J5565k4310K630K1121j8354r918K3323
987I378n227j7342J9215M808k4355J1425J9152k4596n315K8803j0948k0283K3643
$$ y = [-2568, 16200, -13545, -12420, 20142, 725, -22227, 8549, 11592, -20200, -3508, 19287, -8954, -12481, 15583, 985, -15622, 8963, 9048, -13783, 3988, 15546, -10467, -5081, 17497, -5622, -15250, 16354, 9579, -17843, 4551, 16394, -14973, -9886, 18107, -1744, -15831, 10713, 6460, -16232, 2606, 10563, -14371, -5860, 13729, -6496, -10420, 13609, -1486, -19933, 8257, 13306, -15766, -2143, 18705, -8692, -13314, 17336, 5168, -16688, 7535, 14233, -10070, 586, 16573, -7314, -9278, 15421, 2060, -10153, 12947, 6966, -17451, 3736, 17136, -12002, -8955, 17972, -1728, -16392, 12054, 8597, -19246, -679, 14886, -9424, -6794, 14327, -4027, -13945, 9378, 4151, -13191, 6024, 10832, -13523, -2098, 17054, -7542, -12857, 15946, 4998, -15285, 8358]
1000H358N737k8075R489K1052k0822o217K4057r887j6986J9042J072k0428J4130
1013E22J2050k2992K379K2068j7432j3234K6139l172k4242J8703J4918k6305j70
1026a0768K3411j4477j2734K3248J43k0652J2803R276j9588N988J7318j7785o221
1039a0038K3493p698j8336J8883N621k4848R238K2566k0460j0396K3515o268j9582
1052a4310J8169Q352k1876N274J6059j6868l976J9576j1150j4234K1954K219k2314
1065a3125J2444J3387k3771K38K6969j3856j8264K3742K886k4388J2487J5672
1077A4421k2175j70K1947j3416j1452K0588m523j9183J7745R136k3418P289J9231
1090A6020k2177p760K7160q676k1654K1297Q132k5153O530J9000j9141n844K2356
$$ y = [8358, 14095, -13980, -4491, 16561, -4261, -10478, 13579, 3692, -13294, 5748, 6820, -13608, 522, 12572, -10420, -8041, 14027, -3405, -16639, 9500, 6328, -17914, 789, 15707, -10598, -10768, 12643, -1834, -14568, 8680, 8823, -11829, 974, 10250, -9338, -3350, 13968, -3817, -10038, 13455, 5757, -12579, 6304, 11925, -12923, -3685, 18881, -1579, -11975, 11540, 5272, -14310, 3859, 12211, -9665, -4391, 11668, -5200, -9176, 10400, -750, -14984, 6970, 9189, -13125, -681, 12706, -11065, -10827, 16142, 2286, -15978, 7764, 10650, -13738, -1251, 14421, -7754, -7924, 14023, 607, -10845, 9743, 5220, -13963, 3782, 12918, -10500, -3211, 16020, -6157, -13917, 13243, 4567, -17087, 4210, 12342, -12811, -6281, 12719, -6422, -12266, 10090]
1103A0090q152j4752J8452J337k0452J2364J2096k0149L048K0743j5938j3187
1115a4500K3609o84k2654J4673J3725k1412L70K0400j3363j1665J8466m73j5977
1128i485J2568P105j7874L676J3868j4553m339J9947p840j6285J6498O868k0731
1141a0577M722J7508j5020p256K0510m000j7880J2880P896j6542N620J3592j4285
1154b832m062J6678q149j2026J8094J452j9731J1072J4559k0333l124K1044j0467
1167B175j4710K0158M185k2162P499J3919j7219k097J8283j0151j0565J7680k544
1180D451j7427J3643R228k0645M619J9567j6478r611K2129n145j9913J7818R862
1193A2098k1415L616J7767j4889p100J8811n726j3960J6974L180j9365J0074J1788
$$ y = [10090, 1938, -12814, 5638, 6975, -13477, -1113, 10983, -9166, -6118, 14625, -1313, -14500, 9109, 8425, -14229, 444, 14169, -7243, -6873, 13527, 164, -11501, 6965, 6492, -9485, 3083, 10188, -7686, -4010, 9858, -4695, -9034, 10913, 3073, -13212, 3286, 10154, -10577, -5855, 11653, -3367, -10623, 9887, 5887, -11993, 887, 8783, -7759, -2139, 11453, -2832, -6894, 9784, 1635, -10391, 7703, 9155, -10576, 496, 15055, -5278, -8402, 12642, 2175, -12535, 7623, 11808, -10354, -2855, 11064, -6155, -8252, 10031, -120, -10685, 6995, 4451, -12976, 667, 9895, -10750, -6131, 13436, -3042, -12653, 9476, 4331, -15582, 2236, 12098, -9317, -5701, 12066, -2823, -9923, 8888, 3162, -10798, 6176, 9356, -10009, 65, 11853]
1206A1853j9028k99K0346j1783j2754K0129k93k2015J1946J4690j9021j975J8546
1219A0342j0047j1521J6617m95j5752J1650Q332j6536L899J4361j4225o328J8405
1232H702n078j4794J5947O044j9648L660J6842j3004p567J7265l002j4186J2342
1245C523N230j6386M823J2514j2458k865J4910p729j1559J4814J845j7500R067
1258a771J3707j7414l725J8684p971j3524J5495M068j6840P401J1999j4789k869
1271g549J5088p826q387J5392j525j4405J0734P493j7075K600J7485j2600r768
1284a0343J8602j781j7399J1734R234j7617K457J6157j1291q525J4602l633j2791
1297a0594J3766M193j6579O861J2437j6168l030J8529q612j3163J7487L470j8723
$$ y = [11853, -7175, -7474, 12872, 1089, -11665, 8464, 8171, -13844, -1898, 12792, -6229, -8204, 10342, 295, -11226, 5391, 4896, -10856, 794, 9126, -7410, -3511, 10850, -3375, -9703, 8702, 3624, -11170, 4777, 10821, -8827, -5167, 11675, -1329, -8896, 8369, 5367, -8819, 3523, 8753, -7633, -2810, 9704, -2754, -5619, 9291, 1562, -9997, 4817, 6662, -10838, -1771, 11936, -5478, -9203, 9481, 1510, -12014, 3481, 7549, -9291, -1890, 10109, -4680, -7549, 7539, -287, -8674, 6718, 5193, -9212, 1522, 9015, -8060, -5460, 12025, -575, -10343, 8259, 6478, -10921, 813, 10047, -7570, -5113, 11044, -247, -8772, 5830, 2197, -10594, 3172, 7365, -9214, -2353, 10084, -6084, -9114, 9415, 803, -12360, 5127, 8597, -10126]
1310a0126P197J3645j5759l300J8068o664j1909J3564J690j4779R006Q322j4581
1323e626J772J5183j1849q422J6663l175j5464J3766Q130j8116K500J5656j2284
1336a266q466J5826j748j3413J1008N790j5035M069J0999j2403k356J5405p182
1349A228j0940J4403J828j6312P471J2325j4666k228J7177p314j3244J3395L701
1362F824j3761O032R909j2711j681J3246p474q539J2920m68j2774J0253P335j5967
1376f856P25J4734j0068p903J5798q88j5558R432Q640j4357R01J3217r482n687
1390g352J4074l324j2394J0534N139j4040O398J1428j4364l657J6842o603j2938
1403a0257J4584M383j6433O241J2144j3688m014J4916n803r926J2784J166j3765
$$ y = [-10126, -2929, 10716, -5043, -8343, 9725, 3061, -8848, 4716, 6406, -8373, 633, 8955, -5626, -3854, 11329, -520, -8942, 7721, 4546, -10918, 2848, 10978, -7138, -4638, 11018, -1266, -9732, 6094, 4346, -9067, 1941, 7731, -7304, -3235, 7764, -4639, -6995, 8410, 1228, -9712, 4691, 6519, -9793, -2322, 10003, -4663, -6891, 10286, 2972, -10272, 3123, 6824, -6937, -905, 9004, -3707, -5388, 7858, 384, -8155, 4765, 4297, -8477, 1776, 9111, -6856, -6131, 8603, -1465, -9368, 6430, 5542, -10016, -584, 8056, -6301, -5400, 7817, -1665, -7352, 6722, 3398, -8996, 1538, 6677, -7363, -965, 10463, -3901, -7558, 9284, 2681, -10257, 4327, 8710, -7723, -1482, 10662, -3026, -7040, 7876, 2073, -7853, 4931, 6097, -7668]
1416g668P509P740j3386J252J3162r766p058J4836k332j4597J0426Q034j4180
1429f028K025J3008r561p567J3076j259j1397Q854N586j1807L362R459j0749l272
1443f270J2920m532r497J1543K889j4462M854J1327j1560m293J3842m165j0976
1456h380J0903L708j3417L881R932r727k046J1474o022q744J1695R41j2583Q108
1470b77P956j3019j79J3796q520r403J4160J304j3522P862Q447j3150l72J2513
1484G596p393o852J2624k225j1000R652M328j3554M213J1533j1257m434J4663
1497G894n193j2673J2418M693j4368M699J1072j1144l923J3013n495r049J1276
1510C220J754j1566O833P215j2751Q20J2119q054o960J3447j099j2790Q362P321
$$ y = [-7668, -159, 7581, -5805, -4553, 8609, -1157, -8215, 6621, 4289, -10308, 118, 8152, -6028, -4003, 9005, -556, -8123, 4953, 3694, -7703, 1151, 6737, -5070, -1708, 7751, -2998, -6270, 6650, 2118, -7379, 4164, 7053, -7409, -2555, 8772, -2788, -7081, 6761, 2596, -8380, 2523, 6231, -7186, -3305, 6627, -3100, -5146, 6328, 306, -8438, 3257, 4198, -8385, -277, 7679, -5340, -5519, 8277, -243, -9646, 4514, 5818, -7704, 158, 8605, -4545, -4917, 7596, 203, -6649, 5975, 3750, -7250, 2402, 6730, -6824, -2611, 8922, -2335, -6769, 7894, 2701, -9972, 2446, 7139, -7229, -2530, 8542, -2602, -6525, 6488, 993, -8056, 3220, 4974, -6592, 241, 7456, -5295, -4475, 7644, -410, -7370, 6077, 4978, -7812, 550, 7871]
1524G871j2901O84J2211p143o668J0867j505j0196P441N299j0176K309Q748q896
1538b055l700J1192l715j0008J0357L777j2018L194J0328j0137m879J2915k392
1551B859r786Q205L946j0353K645Q657q606k650J0518l845p478R324J302j1646
1565f908O220Q218j0927r62J1939o695q536J1006J905j1471N336Q199j0351j037
1579d064J0232o246o645J0640n08r729P870M623j1871K184J0487q851m711J3072
1593F483k731j1522R281N351j2320K718J0226q490l628J0697l433q936Q851K707
1607E254j0713N404P375j0349r50J0351n428q175J1256J178j1673N473Q052j0581
1621c526j809J1184n509o791R957P89j0303N476N856r910J271R694p766m583J0662
$$ y = [7871, -5030, -4346, 7865, 722, -5946, 4921, 3416, -6780, 661, 5960, -4216, -1907, 6841, -2055, -5755, 5437, 1722, -8286, 2071, 5848, -6170, -2976, 7352, -2785, -7664, 5251, 2859, -6927, 1278, 5224, -5129, -2484, 6173, -2433, -5083, 5435, 1590, -5888, 3436, 4738, -6908, -688, 7530, -3397, -4359, 7580, 885, -7651, 3355, 5260, -6211, -875, 7324, -3027, -4064, 6168, -78, -6723, 3917, 3409, -6320, 1550, 6173, -5698, -3514, 6973, -1878, -6589, 6483, 3752, -7770, 1511, 6862, -5458, -2740, 7486, -1004, -4632, 6065, 2632, -6304, 2547, 5254, -5459, -55, 7320, -3029, -3979, 6372, 944, -7231, 4025, 5203, -6470, -997, 7055, -3526, -5335, 5849, 340, -6451, 3506, 4295, -6008, -532, 5324, -4586, -3315, 6379, -1387, -5970, 4692]
1636D692k532r922Q854M973j1171K222J0071q226n232J1188j764r714P798M776
1650F013r991K147P870q318k721R951l605p348R189J157j0930N301P700j0087
1664c672j472J1081n226p248R271J377j0745M920P675q557r32R289o164n176R536
1679C957j063q935P397M676j0074J658R445q043n352J1234j201r340P207M685
1693F251j0702J468R085o839l731Q891k267p664P494K363r739L802P358p971k102
1708d303R963n086p398R385J958j0123M389P555r023j880R440m262o633Q404J308
1723C694q456M566N526r063J77Q665n778m555R445j007r428O757M757r996J105
1738c591R341n740n690R054j221q408O568M382q581J310Q058o973l319Q656l098
$$ y = [4692, 2160, -7762, 1092, 6065, -5106, -2884, 7187, -1039, -6271, 4917, 3153, -6561, 1237, 6013, -3978, -1831, 6039, -2279, -5000, 4951, 1346, -6002, 3187, 4344, -6586, -1285, 6415, -3672, -5144, 5937, 711, -6537, 2734, 4111, -6634, -1714, 5961, -2596, -3528, 5761, -403, -5579, 3957, 2894, -6041, 1356, 6032, -4042, -2384, 7061, -982, -6334, 4900, 3699, -5641, 1566, 6251, -4451, -2983, 6102, -737, -4468, 4423, 2156, -5508, 1986, 4349, -5390, -1588, 5770, -2201, -4303, 5660, 574, -6824, 2561, 4519, -5604, -1215, 6340, -2683, -4563, 4877, 615, -6018, 2386, 3694, -4762, -196, 5330, -3733, -3556, 5109, -669, -5224, 4221, 3214, -6214, 543, 5300, -4696, -3591, 5750, 10, -5680, 3374, 2153, -6255, 313, 4695, -3886, -2576, 5482, -1491, -4810, 3846, 748]
1753G48o763P906L038r866L408P556q598k296J0107k891q256Q192K577r321L217
1768a242P000q184j531Q981l637n752P692l40q808N805O021r297M32R061o442
1783b41n650R697o87r401O366N496r299R05Q467o610m272R049j315p151O436K397
1799D187r092L335P490q008k587R981l728p376Q112K178r801L972P067p483k112
1814c865Q541l620o196O989R68o995M057M941q047L21P377n252m764Q523j9q349
1830e390N412M789q409N1Q415n169m748Q324k66p423M264M177o971J056O789n736
1846h35l100P389j633o937O578K791q283K686O950o586l474Q673k302p355P100
1861A662L276q679K113O197o421j979Q029l162n706P067J308q404M306N439q192
$$ y = [748, -6015, 1891, 4929, -4937, -1529, 6027, -2571, -4867, 5240, 2349, -5907, 2285, 4862, -4459, -1242, 5758, -2426, -3957, 5024, 1387, -4365, 3327, 2987, -5821, -16, 6005, -3292, -2860, 6201, -241, -5891, 3806, 3119, -6282, 84, 5580, -3719, -2814, 5653, -957, -5229, 3820, 2505, -4646, 1790, 4187, -4905, -1570, 5920, -2088, -4675, 5306, 1578, -5798, 2314, 4492, -5309, -1337, 5730, -1753, -3865, 4676, 1056, -5140, 1849, 2817, -4178, -121, 4820, -3227, -2906, 4471, -781, -5545, 2978, 2959, -5390, 22, 4811, -3598, -3547, 4868, -301, -5049, 3275, 3009, -4414, -150, 4027, -2944, -1888, 4901, -835, -3935, 3454, 1821, -5116, 1462, 4253, -4030, -1344, 5606, -980, -4454, 4219, 1917, -5438, 1662, 4938, -3741, -1628, 4569, -1852, -3831, 4198, 1036, -4670, 2397, 3705, -4699, -393, 5046, -3146]
1876c146j30Q893m947n728Q148J14q165M712N631q202q7Q307n154m457P529j275
1892B043p180O531L186p947J345P069p289k432Q806k308p244O898K642q522K724
1907a678O389o809j994Q305k867o218O730J099p875M258N289p154j07P563n001
1922g0n012P736L57p725M677N234q046n15P875m717m198O957L39o814M522L479
1938D079o881N73O427m899l069P440j670o753N536L060p590J944O355n384k715
1953c547P200j818o763N934L021p339K406N612o277j604P051k955n089O664P80
1968C276p415M173N016p676p00P775m032m921P421J91p679M185M722o989m06P331
1984D272m345l717O523j372n874N008L255o935J191O177n379k622P240k150o003
$$ y = [-3146, -3276, 5617, 670, -5058, 3090, 3204, -4961, -249, 5382, -2820, -2907, 5400, 246, -4211, 3318, 2043, -5137, 1394, 4580, -3367, -2022, 5047, -2242, -4674, 4132, 1824, -5420, 1478, 4120, -4402, -1678, 4711, -2098, -4092, 4213, 1346, -4872, 1858, 2957, -4918, -660, 4629, -2525, -2632, 4931, -70, -5082, 2654, 3011, -4714, -37, 5197, -2849, -3364, 4511, -206, -4404, 2553, 2892, -3922, 600, 4079, -2802, -2229, 4198, -701, -3770, 3670, 2000, -4753, 783, 3843, -3747, -1803, 4552, -832, -3547, 3653, 1835, -4928, 1006, 4027, -3312, -906, 4706, -1571, -3175, 3876, 921, -4168, 2496, 3276, -4139, 34, 5050, -2626, -3326, 4449, 417, -4504, 2917, 3108, -4571, -386, 4336, -2653, -3059, 4272, -73, -3790, 2733, 1361, -4513, 495, 3750, -3185, -1994, 4183, -1196, -3818, 3422, 1272, -4731]
1999d731N399L247p190J556N891n524k323O949j855n097M900J590o565K707N303
2014D257o313j059P189l458m771O486N16p232L698N283o485j071O720l468m500
2029d208O219O67o294L268M202o075J75N844m235l560O899m03o333M806K951o992
2045c069R86O317m561l224O670p58o282M517K835o283J287N699n091j844O290
2060C489k652m956N482J807p039L218M840n824j782P141k721n533O366J388o491
2075c267K849M377o061m32O047l265l863O263k28o064M018L190o355J083N727
2090D019m199l245O209j077o109M889L235o458R17N679m559k824O333j618m827
2105c635M776J937n840K062M148n189j185O178k422m537N317J301o210K308M541
$$ y = [-4731, 668, 3915, -3275, -1719, 4172, -1352, -3675, 3274, 1419, -3678, 1222, 2812, -3753, -1046, 4257, -2056, -3115, 4074, 616, -4155, 2331, 2847, -4385, -687, 4596, -1889, -2960, 3760, 292, -4208, 2011, 2678, -3616, -348, 3854, -2221, -2046, 3798, -437, -3997, 2902, 2499, -3834, 972, 3923, -3069, -2083, 4234, -327, -3551, 3119, 2361, -3921, 596, 3431, -2852, -1565, 4134, -957, -2801, 3489, 837, -4119, 1363, 3170, -3869, -651, 4189, -1635, -3417, 3724, 1003, -4530, 1836, 3224, -3267, -418, 3959, -2102, -2534, 3513, 248, -3615, 2648, 2420, -3644, 374, 3564, -2791, -1708, 4019, -180, -3425, 2784, 1707, -4402, 487, 3722, -2736, -1819, 3860, -699, -3523, 2810, 1192, -3635, 1141, 3078, -2762, -700, 3448, -1741, -2926, 3252, 830, -3707, 1610, 2911, -3299, -991, 3550]
2120C550n030j303N996k173m564N239L34n144K861L933m898o02M985l099l261
2135c176N283J25n655L645L528n890K66N148l571l028N618j77n273L380K858n301
2151b220L79N153l924k168N424j551m546M237K266n917J589N133n149j643N920
2166B983k279m576N070J859n791J997M497n155j302N603k619l729N187O19n543
2181c179L032L452n402j80N349l330l163N401P5n928L798L073n383M33N190l534
2197b96k974N104p88m437M154K017n104R42M588m075k147N527j726m237M694J602
2213B844n564J916M158m518j787N465j570m196M576J127n495K602L389m685l23
2228b061N128k864l107M394P4m813L455L281n146j17M843l189k674M612k26m433
$$ y = [3550, -1480, -2783, 3213, 1040, -3524, 1715, 2049, -3095, -234, 3699, -1199, -1801, 3184, 85, -3176, 2107, 2232, -3423, 222, 3750, -2140, -1874, 3274, -297, -3325, 2293, 2116, -3157, 223, 3081, -2220, -1841, 3312, -612, -2780, 2644, 1093, -3453, 784, 3050, -2867, -1278, 3855, -1294, -2937, 2983, 704, -3872, 1198, 3057, -2734, -737, 3760, -1395, -2697, 2906, 287, -3442, 1745, 2364, -3179, -147, 3305, -2097, -2277, 3072, -258, -3421, 1980, 2055, -3873, -75, 2998, -2385, -1952, 3238, -296, -3270, 1834, 1046, -3391, 763, 2780, -2324, -1382, 3206, -869, -3016, 2511, 785, -3452, 1242, 2844, -2720, -804, 3354, -1164, -2951, 2514, 944, -3252, 1324, 2451, -3044, -442, 2947, -1738, -2061, 3067, 203, -2904, 1490, 1564, -3249, 206, 3487, -1659, -1776, 3067, -122, -2796, 1816, 1590, -2843]
2244b843L143K741m591J63M250l549j918M933n20m500L378J686m748J280M205
2259C110l921j715M673p25m673L940J523m542J237L950l563j704M700j904l508
2274c122L800J179m335J910L457m406o87M664k253l567M863O22m618K372K619
2289B498m504K88M437k666k674M142jm196K625K241m265P37M231l084k362M421
2305A868n74m406L679K068m933J489L737l712j726M807j373l713L665J713m590
2320b001J022L511l477r22M376j643l379L573J119m833K019L562m340n71M791
2335B807k162l316L634Q97m313K168L344m272k77L950k457k638M153j00m649L495
2351B64K641n116J064L682l074k068M715o33m137L056J699m236Q02L925l564j226
$$ y = [-2843, 300, 3041, -1550, -1387, 2863, -686, -2604, 2329, 1809, -2691, 687, 2373, -2375, -1095, 3110, -811, -2526, 2147, 1422, -3251, 689, 2212, -2330, -1093, 2857, -706, -2410, 2290, 386, -3122, 678, 1857, -2478, -568, 2889, -1517, -2204, 2460, 207, -3360, 1503, 2125, -2493, -121, 2498, -2006, -1718, 2719, 53, -2621, 1521, 1520, -2676, -51, 2190, -2075, -1338, 2893, -191, -2553, 1868, 1294, -3112, 567, 2635, -2298, -809, 2928, -784, -2510, 2297, 924, -2789, 876, 2589, -2001, -979, 2532, -945, -1867, 2509, 866, -2513, 1060, 2179, -2654, -635, 2927, -1413, -1984, 2807, 645, -2671, 963, 1860, -2453, -285, 3059, -1213, -1490, 2460, 3, -2635, 1518, 1418, -3231, 264, 2905, -2211, -1147, 2535, -539, -2607, 2108, 1475, -2662, 394, 2093, -2143, -1341, 2584, -980, -2206]
2367b206M498j510l235L091J420m474J752L558l604j280M231j997l235M270M79
2382A758m416K371K865l797o32L944k007k356L777N6m171K830J931l602J35L722
2398B408k389k285M071j54m093K650J935l922K70M218k882k116L988n07l632K828
2414C88K071m005R12L231l148j368M255j467l435L401J642m629J375K997l029
2429h09r87M036j817k760L766N33m053J396L332m251J32L998k306k811L965J42
2445A506m095K533K485l920R1L812k698k396M206k49l910K968K254m134O15L075
2461B143k499j797M081r91l493L288J500m441J000L865l368j127L938j386l033
2476b320L198P12l799J668K889l249p19L787j753k672L412L53l724K496K194m083
$$ y = [-2206, 2292, 782, -2453, 638, 2058, -2416, -664, 2894, -710, -1990, 2241, 244, -2991, 1279, 1758, -2658, -287, 2578, -1219, -1851, 2093, 86, -2270, 1507, 1563, -2608, 222, 2153, -1449, -1314, 2408, 19, -2266, 1805, 1651, -2442, 208, 2143, -1779, -1509, 2709, -173, -2289, 1699, 1192, -2440, 388, 2459, -1546, -634, 2597, -551, -1919, 2336, 869, -2566, 835, 2477, -2152, -777, 2220, -809, -1796, 2240, 423, -2337, 1429, 1962, -2091, -695, 2637, -1614, -1482, 2516, 210, -2601, 1364, 1506, -2589, -56, 2429, -1491, -1400, 2412, -286, -2682, 1524, 1275, -2635, 333, 2587, -1547, -932, 2143, -356, -2153, 1928, 937, -2556, 732, 2232, -2209, -1209, 2656, -712, -1839, 2099, 713, -2320, 878, 1590, -2209, -541, 2348, -901, -1620, 2167, 414, -2258, 1154, 1507, -2217, 279, 2473, -1610]
2492a610K36L642k362j862L675L6m074K670J920l574L09L260k111k001L477l68
2508A263l236K286J654l423N72L039k719j509L757n69l492L054J172l469J073
2523e47K870k817j462L636j137k961K866J167l533J753K342l370o29L823j640
2538C61k747L478M52l498J707K279l060k81L408k027k196L292j83l142K061K099
2554B003l376J87L325k457j781K992j09k875K548J568l473N18K986k623j373L648
2570A708r54k663K234J495l686R70K875k817p50L415j312k746K978Q15l330J452
2586c16K268k890n61L463j492k587L507J2k945J381K146l161k50L132j639k268
2602b200L392Q4l169K135J636l066L11L336k644j770L733o26l189K032J913l768
$$ y = [-1610, -1374, 2268, -94, -1956, 1719, 1755, -2319, 351, 2271, -1303, -994, 2266, 155, -1846, 1631, 1263, -1973, 313, 1967, -1456, -884, 2155, -564, -2073, 1684, 1115, -2377, 677, 1849, -1620, -547, 2323, -494, -1956, 1680, 543, -2418, 448, 1615, -1918, -165, 2177, -1193, -1822, 2001, 361, -2386, 1092, 1544, -1954, -247, 2032, -1028, -1309, 2099, 72, -2124, 1168, 985, -2157, -96, 2003, -1373, -1186, 2139, -318, -2099, 893, 784, -2091, 457, 2025, -1448, -930, 2056, -567, -1940, 1708, 754, -1909, 325, 1820, -1866, -896, 1979, -838, -1588, 1827, 515, -2231, 747, 1562, -1768, -316, 1952, -938, -1499, 1964, 472, -2115, 1392, 1404, -1541, -160, 1986, -1175, -1425, 1707, 68, -2200, 1192, 1276, -1893, 242, 1878, -1188, -877, 2459, -185, -1955, 1778, 1152, -2037, -5, 1908, -1860]
2618a860J209K886k645j511L451j019l010L262Q28l192R24K720k986r58L205j207
2634I7k252L303M90l666J512K325k772n18L473j910j923K700M11l109J576K159
2650A896l295L80K995j989j960L066p6k915K082J730l403O42L027k303j759L387
2666A505o48k845K502J318l322Q51K513k230j337L250q83k494K381Q52k995P04
2682h78K894k781n41L134j515k138K619M09k903J372K047k734k07K782j382k009
2698a831K914K19l112K084J457k792n7K887j652j807K891k57k693J648J689k931
2714a343M56K495j712j203K707o47k427J990J037l116P75K745k172r17K716r63
2730D21k495K375P84k641J175K272k339r44K777p57k677K965M36k938J336K068
$$ y = [-1860, -651, 2235, -410, -1921, 1530, 511, -2499, 763, 1591, -1601, -677, 2043, -943, -1901, 1304, 97, -2155, 1148, 1638, -2028, -516, 1809, -963, -1481, 1992, 82, -1841, 859, 1270, -1839, -263, 1896, -1399, -1019, 1976, -13, -1973, 1093, 1017, -1898, 184, 1914, -1489, -847, 2180, -123, -1882, 1505, 857, -1988, 514, 1832, -1490, -639, 1874, -356, -1693, 1557, 674, -1820, 561, 1413, -1582, -878, 2016, -765, -1306, 1828, 313, -1825, 794, 1203, -1700, -328, 1719, -1015, -1222, 1560, 178, -1831, 1083, 1302, -1810, 274, 1731, -1061, -1118, 1769, 117, -1690, 1201, 944, -1749, -101, 1588, -1343, -887, 1608, -104, -1307, 1400, 753, -1674, 316, 1353, -1763, -988, 1757, -415, -1332, 1384, 421, -2074, 301, 1085, -1556, -381, 1891, -448, -1392, 1385, 628, -2049, 916, 1352, -1586, -250, 1818]
2746A818k577o77L310j457k254K883K24k852J497J733k608L2K719j812j554K716
2762A141k08k610J844J489k760J85K728k187j217K899m75k375K156R64k746O30
2778e42K158j965r99K974r20k707K791M64k692P75K204j985r19K624p50k259K633
2795H85J94k659J416J911k620l45K577j224j627K630j03k619J569J646k704K0
2811a053K461j305j692K183K83k757J947J461k556J41K417j782j259K793o58k251
2827a627J684J191k372M21K426k083r63K286n42j882J872J173l183J096K326k277
2843d54o22K306o73k239K584O18k895J296J718k436l13K644j095j639K295j11
2859I84k552J459J747k351m49K676j531j354K272K6k325J263J784k757L04K385
$$ y = [1818, -759, -1436, 1874, 417, -1837, 1046, 1270, -1582, -85, 1648, -960, -928, 1791, -21, -1575, 1141, 933, -1677, 167, 1656, -1104, -919, 1809, -378, -1595, 1304, 829, -1546, 610, 1574, -1172, -542, 1616, -349, -1348, 1626, 706, -2001, 790, 1254, -1438, -663, 1541, -444, -1363, 1261, 511, -1748, 885, 1079, -1580, -164, 1747, -873, -1218, 1359, 135, -1492, 1138, 1035, -1584, -15, 1631, -1073, -1053, 1408, 103, -1589, 594, 877, -1880, 67, 1528, -1028, -887, 1530, -252, -1511, 1282, 624, -1627, 57, 1248, -1124, -703, 1723, -360, -1323, 963, 421, -1461, 411, 1584, -1599, -503, 1823, -454, -1076, 1230, 557, -1682, 902, 1520, -1375, -79, 1639, -797, -1110, 1534, 439, -1200, 1095, 984, -1568, -109, 1638, -713, -1162, 1514, -17, -1371, 901, 927, -1398, -135, 1649, -1108, -804, 1581]
2875A581j712j172K632m70k579K094J103k631O28K048j923r15K214l03k351K000
2891B44P02k269N90K772k718p03K405n18k339K661M47k656J179J702k074p42K346
2908A029j026j655K542J17k400J431J645k537j35K388j835j071K550J23k711J699
2924A54J069k565O78K328j901j051K446n53k253J880R26k376O86K153k410o33
2940a422K608q03j871J920Q38k540Q35J995j934j053K773j099j672K645k47k197
2956a224Q66J619k011k69K295j237j587K273O8k122J253J311j955k23K555j676
2972f4j412K332P3k416J480J604k695M49K090j756j140K103r0j815J351R47k214
2989a173M51K213j993r05K560o17k144J683Q20k190Q43J558j681q50K305m91k045
$$ y = [1581, -131, -1303, 1329, 859, -1720, 374, 1477, -1154, -526, 1522, -401, -1316, 898, 595, -1756, 244, 946, -1323, -733, 2039, -679, -1382, 1023, 505, -1834, 827, 1274, -1382, -203, 1499, -575, -1317, 1029, 3, -1652, 890, 1007, -1393, 38, 1683, -854, -989, 1399, -436, -1507, 1043, 1166, -1545, 154, 1223, -1342, -664, 1664, -237, -1288, 1158, 605, -1648, 232, 1158, -1218, -532, 1621, -789, -1422, 1186, 383, -1488, 432, 1270, -1270, -435, 1560, -374, -1427, 1346, 247, -1425, 1220, 973, -1224, -358, 1261, -750, -1019, 1276, 39, -1548, 725, 793, -1329, -76, 1235, -720, -943, 1612, -64, -1476, 856, 929, -1487, -7, 1597, -1098, -649, 1441, -315, -1455, 648, 558, -1257, 94, 1041, -1173, -722, 1491, -502, -1407, 1153, 536, -1608, 75, 895, -1295, -452, 1106, -575, -1425, 880, 389, -1656]
3006a656K315K78k266R98J567j860l62K274j160j777K508K93k494J442J331k305
3022h74j16K428j470j348K270j59j965J550J190k534J62K299j382j174K172r4
3038I55k355J721J314k493O30J785j703j005K337p49j994K344M95k323P54J710
3054A423j913q16K601j013j528J979L44k122R29J593k154n44K386j026j419K257
3070I77j35k272J418J312k230o7K486j392j572K216k32j953J390J312k076J59
3086f59K185j807j022K050j76k009J723J015k057L50J895k083o42K609r91j748
3102a367J791P44k449Q43J808j800m99K089r84j561J859N01k208J047J668j897
3118d15n69K165j068j279J796M1j997J403J311j942r2K205j535j166K224m39j976
$$ y = [-1656, 659, 937, -1329, -331, 1236, -624, -986, 1288, 128, -1649, 859, 1152, -1342, 100, 1431, -874, -990, 1438, -32, -1380, 890, 731, -1234, 316, 1506, -1028, -866, 1433, 51, -1123, 1049, 955, -1400, 321, 1635, -858, -228, 1557, -146, -1151, 1186, 437, -1557, 787, 1282, -1041, -287, 1423, -490, -1306, 1295, 282, -1246, 733, 1077, -1045, -116, 1477, -677, -1221, 1165, 139, -1280, 977, 842, -1430, -12, 1300, -930, -997, 1489, 97, -1475, 741, 509, -1444, -54, 1258, -818, -659, 1526, -281, -1303, 747, 571, -1438, 285, 1300, -757, -407, 1488, -595, -1237, 1372, 381, -1367, 424, 1168, -1281, -438, 1370, -430, -929, 1160, 176, -1385, 474, 975, -1233, -186, 1482, -415, -984, 1181, 113, -1166, 630, 671, -1326, 77, 1388, -554, -646, 1559, 24, -1142, 1082, 643, -1333]
3135a333J286J311j816jJ993j414j030K037k91j769J287R69j984M60J580j527
3151b42q84J906m62j784J770P05k256P45J994j840o68K146r62j405K071J60k173
3168a179R16J544j845l43K105j178j353J891K50k071Q69J549j651l74K087j215
3184Bj379K035l26j435J226J129j898J52J770j424j135J924J51k223J835P58k149
3201i87O57J360j529p88K577j013j533J706N36k010P05J611j770l11J766o72j839
3218a534K520N7k169J055J287j942M6J958j365j231K063Q5j820P62J436j812j74
3235g78J825j123j024J952l85j702J431P49j974L13K058j517p47J686j41k027
3251a404J481Q40j833K41J813j450o92J979p22j663J464Q13j989R44J474k047
$$ y = [-1333, -47, 1264, -552, -553, 1440, 26, -1004, 1033, 742, -1027, 260, 1229, -755, -295, 1285, -242, -1126, 780, 318, -1466, 304, 1009, -1247, -502, 1492, -348, -1016, 1130, 168, -1237, 834, 994, -1179, -263, 1281, -564, -907, 1198, 20, -1333, 558, 808, -1263, -394, 1155, -496, -870, 1217, 2, -1377, 658, 332, -1103, 123, 1252, -646, -494, 1276, -148, -1283, 641, 792, -1431, 404, 1162, -987, -330, 1030, -499, -1287, 1290, 277, -1256, 450, 986, -1024, -319, 1292, -478, -789, 977, 305, -1534, 986, 1043, -1126, -71, 1216, -726, -680, 1278, -87, -1318, 745, 830, -990, -228, 1208, -604, -778, 1047, -76, -1100, 852, 467, -1235, 196, 945, -1029, -716, 1342, -175, -922, 764, 623, -1404, 77, 917, -916, -675, 1138, -312, -1004, 975, 253, -1410, 54, 867, -1122, -178, 1296, -751]
3267g51j95J720o20j404J710N32k001O61J535j780o3J391m32j409J615K42j983
3284a232J319Q80j541j35J905j380r67J886P5j972J238J069j525l58J812j252
3300a78q18J876k19j968J510J200k516N72K123j661r75K185q67j547J678N74j943
3317i74P68J377j479p48K452r34j730J812M86j912R00J355j984m28K191j278j070
3334a196K031m22j805J524P57j682K22J659j216j089K128m25j586J142J064j973
3350h67L04J612j315m94J669p56j445J509O88j698K69J746j783l06J683o48j393
3367a225J447P53j850P17J214j696l75J846o77j161J345M08j617N27J265j600
3383f79K1J511r96r40J725N1j710O87J423j986J36J833j061r23J814m06j797J497
$$ y = [-751, -946, 774, 154, -1250, 460, 992, -1009, -348, 1187, -593, -656, 735, 303, -1106, 509, 751, -1232, 87, 967, -574, -709, 1196, -184, -1151, 735, 810, -1162, 76, 1145, -380, -738, 1074, -178, -996, 880, 661, -1307, 203, 1403, -1113, -541, 1582, -79, -1054, 1131, 264, -1283, 395, 969, -974, -206, 1171, -308, -1056, 1396, 462, -1268, 544, 1030, -882, 18, 1373, -611, -1039, 1152, -126, -1196, 835, 413, -1392, 132, 889, -793, -571, 1088, -128, -1217, 911, 486, -1100, 42, 1106, -867, -563, 1049, -266, -760, 909, 153, -1292, 217, 905, -793, -524, 1222, -561, -867, 816, 168, -1225, 222, 975, -875, -158, 1056, -640, -1015, 831, 154, -1007, 338, 746, -871, -344, 921, -679, -658, 853, -143, -1083, 642, 693, -1017, -330, 1093, -893, -757, 1076, 15, -908, 906, 500, -1297, 200]
3401B00P49j767O96J657j626q95K074p57j346J425N74j735M33J350j504m72J778
3418H34l17j517J384L51j748R16J117j473o68K272j050j102J547J8j587N62J514
3435A053j634l03J916j146r73J641j07j480R77J074j757Q2J606j028j041J968
3451H48o55j009R04Q58j940O45J531j374q56J842k14j718J259P08j592J98J870
3468A305j663o21J995n75j472J722J17j883J114J056j569j91J687r22j219J779
3484F60Q5j977J084J204j454j44J677r66j135J891k94j697J411O82k130P79J592
3501A268j557o51J700j20j473Q98O16j363M4J696j454m22J760o35j505J551O86
3518A039j907M33J662j844l25J900p09j322J628K00j740P88J021j332q2J571q94
$$ y = [200, 949, -818, -122, 1535, -91, -986, 1088, 331, -1015, 410, 984, -751, -318, 1032, -472, -944, 834, 517, -1000, 384, 735, -1013, -97, 1020, -453, -1121, 1151, 101, -1001, 546, 564, -1023, -461, 1053, -581, -884, 1032, -114, -1087, 554, 447, -1033, -56, 1018, -739, -657, 949, -79, -1120, 848, 193, -816, 88, 946, -994, -349, 1182, -192, -1048, 794, 580, -1138, 121, 829, -763, -565, 1305, -358, -979, 1016, 441, -1031, 691, 808, -1075, 39, 1095, -474, -665, 1022, 100, -1119, 660, 745, -1232, -148, 1056, -398, -542, 1135, 169, -966, 925, 631, -1066, 345, 1027, -1103, -324, 1268, -289, -940, 760, 640, -833, 65, 681, -682, -638, 1058, -396, -818, 942, 307, -1198, 353, 1039, -868, -435, 1227, -617, -942, 958, 249, -1073, 555, 755, -985, -197, 824, -508, -590, 981, 87]
3535H7r43J349j05j480J171J049j804K61J542j092j032J696m74j341J073R56j740
3552h27O9J531p62q73J366L1j493R05R07j365k05J934j415o16J550m47j472J553
3570C71O38j755M73J228j423k95J767q52j161J463L18j607O04J196j456l89J774
3587H94p25j107J766p9j817J030J361j930j46J857j385n74J601l81j326R78J200
3604A217j781L29J437j150j138K011k05j978J643L87j859O21J335j077n88J729
3620I33p65j345J654K80j704O49J037j189l49J777q91j259J787k10j354P75J042
3637H68j308k75J771r04j107J493p7j544J030J167j800m1J763j275p01J532j40
3654D52j502J317M96j358L00J271r65p41J639k50j575J209L90j465P53R94r68
$$ y = [87, -856, 493, 388, -1092, 79, 1128, -676, -415, 1127, 35, -997, 699, 225, -1116, -43, 913, -827, -758, 773, 11, -862, 504, 535, -958, -53, 854, -511, -716, 1218, -197, -813, 737, 290, -1182, 371, 1009, -746, -273, 955, -468, -763, 1004, 152, -1009, 454, 772, -835, -231, 965, -491, -880, 894, 169, -938, 828, 749, -1068, -38, 1323, -607, -753, 1104, -281, -855, 746, 365, -961, 17, 1217, -564, -235, 1202, 52, -1086, 925, 720, -1258, 385, 772, -1087, -466, 869, -208, -796, 933, 168, -1177, 477, 757, -947, -298, 739, -450, -799, 978, 87, -1172, 615, 405, -949, -174, 868, -440, -715, 1056, 152, -955, 538, 461, -1083, -53, 1114, -686, -727, 1036, -239, -940, 592, 452, -1050, 267, 763, -595, -295, 976, 11, -730, 909, 659, -916, 293, 683, -782, -29, 965, -3]
3671cn87J294l57j364J389O47j619L98J367j557m44K214j208j419J606N20j602
3688g25O00J066j369k24J586p96j149J682P2j758J039Q54j374K04J188r97q42
3705i43J718j68j806Q79J271j731N52J466j564p92J705k46j635J639K75j692Q46
3722b26J119j468m10J646l25j443J538L62j734P43J024j209l44J743q65r89J204
3739C66M95j937R76J146j683M5J325l63j420J873k16j744J213R28j537M0J420
3756I27r18r01J444M4j489J096O93j847O32J356j032p10J651l01j564J171N34
3773G86j491J82J456j312n21J768l46j604J371O84j819N84J579j897K9J299m52
3790B96j247J433J63j323P17R39j533k81J816j071r32J922n02j535J365Q56j604
$$ y = [-3, -590, 704, 347, -1017, 372, 1019, -600, -202, 1165, -392, -836, 1378, 170, -1249, 357, 877, -725, -125, 941, -428, -652, 934, 138, -1011, 671, 743, -1015, 24, 878, -496, -292, 896, -101, -943, 775, 607, -1199, -320, 951, -780, -228, 1238, -326, -1118, 587, 341, -1294, 345, 620, -1072, -226, 893, -575, -985, 661, 336, -1107, 431, 793, -941, -198, 826, -383, -727, 1016, 151, -838, 366, 861, -1076, -100, 1046, -637, -592, 733, 370, -1050, 823, 607, -1137, 76, 1004, -533, -493, 927, 9, -892, 552, 596, -893, 203, 896, -951, -319, 1037, 5, -705, 946, 645, -919, 252, 786, -705, -523, 933, -379, -900, 868, 522, -1082, 289, 973, -846, -262, 1317, -580, -551, 748, 296, -951, 482, 645, -678, 39, 978, -555, -836, 980, -91, -1023, 899, 397, -1138, 227, 1083, -521]
3807e21j28J627j127p28J547l39j401J254M02j391M38J333j169o05J353m69j003
3824i27J049M52j367N45J170j403j67J258o06p49R74M16j712Q52J394j568k55
3841f44J607p03j266J296M01j283O10J118j661r3J726j142p23J414j5j592J245
3858B95J026j648k87J444j055m84J519l08j227J069L81j391J68J282j033o90J716
3875G77m14j265J373J55j673O30J549j406p17J966o47j284J358L14j805O96J580
3892A187j893j49J659q43j148J563Q0j547Q32J047j545J87J570j032r89J533m1
3909D71j409J107P61j524O2J634j325o72J778n14j474J433K56j362L47J461j366
3926c36m64J553l13j204J223L53j627P77P75j117n46J839p88q56J401o4j459J034
$$ y = [-521, -649, 978, -149, -877, 670, 331, -1070, 184, 586, -805, -367, 966, -203, -808, 545, 76, -927, 122, 574, -793, -248, 922, -481, -648, 610, 4, -745, 229, 645, -1067, -215, 1179, -389, -644, 963, 260, -1006, 290, 691, -592, 18, 1136, -525, -618, 1108, -34, -757, 657, 642, -950, 295, 1321, -327, -614, 830, -225, -709, 810, 502, -725, 344, 725, -666, -498, 784, -249, -939, 777, 363, -902, 471, 626, -1047, -417, 1132, -274, -991, 975, 328, -956, 402, 716, -1089, -393, 1187, -706, -855, 804, -39, -1187, 376, 456, -1091, -259, 788, -757, -570, 1000, -32, -1021, 512, 471, -938, 169, 930, -594, -532, 1102, -223, -895, 883, 369, -1105, 328, 584, -778, -431, 1030, -336, -800, 753, 440, -764, 459, 812, -815, -38, 737, -380, -926, 913, 125, -731, 670, 606, -853, 181]
3944A81Q52j646P6J451p91j115J774r2j539P51J178j688J11J344q18q37J477l10
3962C59j171P44Q49j083j46J361j235m86J176P9j255J150M54j477N05J162j384
3979c98m40J449k37j365J323J77j350M62J317j266j07J226n35j357J624L80j378
3996d75K93J421j904m35K178p90j253J636k00j345P60J003j466j84J668r57j039
4013a089J761j88j283Q78O05j419J14J576j230q41J887l97j492J290N57j549M48
4030c72J583j537m12J360k22j120J133K17j465M04J316j123l71J596r98j139J358
4047B08P65k022R37J237j577j53J419l21j434J587l52j040Q34R10j591K13J188
4064H08q79p61J640j71j893J249R11j578M51J402j178q62J731m48j201J130M40
$$ y = [181, 1033, -613, -537, 914, 123, -992, 782, 690, -849, -98, 1080, -608, -497, 847, 29, -808, 669, 359, -812, -68, 781, -302, -448, 913, -322, -808, 368, 447, -808, 342, 796, -681, -176, 986, -398, -838, 611, 374, -991, 332, 509, -841, -379, 938, -328, -435, 791, 256, -1101, 523, 903, -475, -182, 1239, -665, -1100, 1078, 288, -965, 671, 471, -874, -114, 889, -577, -761, 907, -50, -1089, 672, 484, -799, 79, 684, -735, -621, 955, -275, -1116, 771, 374, -1118, 172, 729, -820, -372, 1211, -326, -738, 622, 400, -720, 413, 630, -835, -431, 885, -238, -609, 987, -11, -1150, 208, 973, -1049, -112, 1125, -452, -605, 814, 493, -941, 646, 294, -746, 88, 998, -593, -380, 808, -71, -832, 808, 637, -1256, -7, 904, -674, -223, 1179, 1, -861, 870, 422, -779, 351, 791]
4081G91j982P62J337j244k03J246l55j406J488K18j485M72J646j689k56J629r48
4098B1p82J183K28j496O53J139j439M4J398j199n48J331j08j248R67N06j300L80
4116b70J160r90q38J701l04j384R38J066j531j1J280j141k52J500n99j141J044
4133B28N44j506K73J433j401l79J750p00j378J305P35j721M22J480j483j80J434
4150H56p28r78J362J47j638Q93J061j650J30J488q89q65J243J33j666R48R50j347
4168e50q4J555j102q22J792n17j191Q02J067j701K40J325r56p16J571n53j215
4185a055J367P27k086N00J708j338m56J220k65j111J371k8j344O53R70j140l47
4202f54J306q72q61J534r9j454J153J086j697j26J596j135o47J500M4j501J040
$$ y = [791, -1191, -429, 908, -336, -539, 707, 352, -1054, 434, 652, -833, -361, 1285, -404, -660, 969, 21, -761, 422, 650, -846, -193, 946, -493, -449, 949, -250, -798, 533, 425, -823, 144, 650, -650, -270, 890, -100, -938, 763, 459, -925, 13, 1079, -452, -463, 817, -324, -576, 924, 325, -816, 228, 772, -734, -461, 972, -429, -808, 942, 242, -1136, 169, 904, -817, -395, 1085, -398, -578, 856, 128, -850, 512, 659, -979, -86, 975, -675, -545, 943, 54, -811, 432, 565, -1101, -153, 797, -550, -634, 921, -181, -1003, 789, 272, -919, -117, 950, -751, -511, 814, -142, -858, 713, 160, -1055, 312, 1039, -1047, -547, 1161, -177, -633, 587, 322, -789, 582, 554, -790, -137, 833, -307, -654, 652, -220, -1081, 453, 354, -1100, 53, 1139, -558, -684, 912, -223, -870, 630, 674, -827, 213]
4219B13O91j546J01J555j001p96J601n50j020J029N45j681M29J413j134o98J629
4236G80m65j428J377M28j196K79J191j174m36J255m81j277J567J89j528R20P67
4253G68j394J62J473q61j151J606J65j779Q73O76r35k04J567q80q37J278j16j179
4271g68Q54Q24j572J64J577j185p76J561m97j101J217L23j300J69J476j098p86
4288i18J700k62j323R54O22j591N35J128j049m19J425p05j034J462P0j515P41
4305a79J317j606o7J564p36j290J399K85j589J084Q03j298j98J419j067o84J523
4322F80j64j437J023O05j323J58J701j121j247J713N9j468J074L80j256NJ483
4339H65j005o40J506k86j400J136L66j482O04J409j581l30J628o17j162J314M69
$$ y = [213, 904, -642, -541, 1014, 13, -783, 818, 268, -752, 277, 822, -859, -430, 983, -151, -849, 780, 315, -1113, 264, 692, -504, -225, 966, -208, -644, 611, 130, -1147, 420, 609, -919, 1, 768, -626, -464, 1009, 148, -1003, 603, 768, -1011, -138, 538, -397, -601, 966, 86, -751, 527, 411, -768, 86, 910, -662, -498, 1079, -106, -882, 679, 182, -919, 298, 621, -679, -510, 966, -132, -918, 782, 520, -803, 151, 773, -818, -283, 845, -204, -623, 802, 97, -937, 525, 595, -920, -179, 1138, -468, -535, 1029, 293, -997, 402, 687, -902, 182, 985, -313, -511, 908, -159, -843, 680, 516, -921, 102, 707, -616, -458, 1243, 122, -1125, 588, 647, -821, 253, 633, -623, -618, 865, -140, -780, 726, 440, -960, 176, 542, -940, -336, 1073, -508, -838, 790, 173, -989, 325, 794]
4356G94j585P29J172j266k78J280o98j159J273K44j613J080P00j300N3J504r93
4373f3p89J613j77j834J526Q28j904L76J115p92l40J251m28j275J136L03j166
4390f20K44J293j232j69J183q53p39J176K30j579R73Q44j004k53J366m35j237
4407h12J004K03j167M75J048j320L64J070o27j142J230J21r51O27N54j074k29
4424f26J543j082p20J331J62j612R58Q81j369J75R55p69p56J267j86j210J038
4441b0N85j242N14J226j629k68J404n25r36J160L33j373O10J269j234n33J658
4458I99n08j412R41N13j633J148P01j299m1J204o59p94J415J4j742J132R29j453
4476e45J07J280o22j090J372mj391Q63R39j272J97P73o36n04J053j93j125R66
$$ y = [794, -791, -62, 1110, -156, -434, 846, 148, -1011, 262, 506, -1107, -27, 673, -627, -574, 930, -63, -852, 761, 584, -1250, 276, 1104, -800, -424, 691, -101, -441, 810, 382, -893, 243, 546, -620, -376, 917, -315, -484, 699, -154, -893, 283, 513, -1066, -93, 751, -253, -506, 860, 425, -812, 192, 395, -772, -297, 751, -569, -205, 865, 238, -904, 326, 447, -504, 123, 677, -397, -626, 917, -165, -885, 446, 608, -1004, -46, 835, -534, -359, 596, -173, -929, 338, 152, -1058, -20, 565, -677, -163, 1063, -566, -834, 570, 45, -891, 269, 602, -771, -161, 1108, -126, -659, 999, 491, -921, 20, 533, -1100, 48, 749, -550, -591, 613, -46, -840, 575, 589, -1153, -21, 908, -545, -438, 842, 220, -870, 502, 498, -893, -30, 909, -363, -166, 607, -29, -533, 520, 327, -798, 168]
4494A68P09j549L59J248j100n87J804o81j069Q96L98j280M08J246r76m12J043
4511F25l11j038J073L0j150P92P74j243m37J786j007o12J134J90j366O02Q77j171
4529d52j32J147m29r29J207j15j199R97N47j455J85J462j186l34J295k99j221
4546i11R78Q97j653J84J276r84n96J326k35j023J129K61j459N40J171j298k09
4563f06J239m95j189J440J58j639Q18J020r42l15J351n19p95R09j0j023M74R29
4581H05j257j22J453q29p20J392m79r89J243M81j578J90R51o19q13J587M2j428
4599f90R36N89j574L55R58n57o29J124k05j339Q72P13j369P71Q76j097m44J359
4617F49l70j049J275J80j565O12J086j173k05J137l92j087J310l8j177N94J027
$$ y = [168, 877, -672, -313, 935, -165, -752, 1052, 371, -698, 198, 596, -684, -276, 970, -6, -418, 625, 314, -724, 349, 379, -771, 21, 795, -448, -885, 901, -106, -718, 416, 606, -760, -158, 719, -452, -584, 563, 134, -795, 412, 297, -902, 95, 642, -813, -628, 834, -352, -686, 609, 310, -911, 67, 964, -689, -505, 771, -213, -809, 517, 282, -741, 388, 649, -810, -270, 901, -397, -606, 633, 138, -1051, 389, 547, -1092, -274, 746, -196, -511, 840, 321, -474, 435, 425, -598, -124, 805, -452, -574, 879, 50, -670, 722, 243, -746, 497, 978, -600, -410, 541, -78, -891, 696, 738, -690, 246, 835, -739, -384, 574, 17, -612, 512, 307, -1032, -160, 553, -816, -45, 831, -266, -710, 649, 279, -770, 505, 685, -880, -268, 818, -355, -560, 577, 185, -902, 408, 370, -807, -213, 814]
4634H14j354L08P76n49o44J055M0j240R69O31j378j2J379j001n26J352l93j020
4652g93P62N94j241L84R64j030k73J237n40p16J248R6j364N01J091j152k63J282
4670G87m25j070J172K71j129N23N34r81k90J499p00r75J095K97j332R27O86j409
4688e20J09J137l14j180J358j09j281O04Q06r05L18O22p48n84J022j25p05N71
4706G6N12j316M67R29j008l79J458o07j215J168N27j105N6J205q33n02J188m96
4724A25j025J029M91j278M29P68r95q3J622j112r68J383J78j279O37Q64j340j18
4742f72J538q56q16J344nj195Q58L72j118N80P70q65m86J056k3j356J187M95j329
4761e21J12J238r44m99J226l09j238J015O35j401P50Q56j293l3J184n82j004J509
$$ y = [814, -540, -232, 544, -5, -649, 406, 446, -794, 175, 806, -572, -584, 795, -206, -732, 620, 227, -793, -31, 563, -678, -294, 670, -360, -633, 604, 64, -652, 596, 692, -672, -171, 920, -232, -495, 787, 362, -708, 464, 735, -394, 129, 663, -318, -608, 891, 191, -784, 311, 608, -724, 203, 889, -520, -411, 726, 412, -768, 590, 481, -800, -196, 610, -295, 23, 645, -103, -687, 335, 210, -495, 76, 588, -728, -261, 668, -340, -719, 739, 132, -1083, 85, 612, -493, -437, 768, -65, -567, 621, 125, -900, 129, 620, -658, -229, 539, -456, -539, 1083, -29, -997, 386, 564, -715, -78, 786, -554, -672, 866, 10, -806, 538, 533, -662, 196, 568, -550, 30, 800, -65, -551, 505, 482, -874, 313, 808, -521, -409, 829, -115, -614, 612, 303, -935, 80, 715, -686, 64, 920, -373, -406, 778, 196, -808, 701]
4779G01O8j496R54M56j333M19J000o35j040J242L90j409P91M02p53J1Q70o42n07
4798e11J048m95p48O20O40j239J86J340j324l49J206p8j171R90P25j292O2R85
4816E95r52k65J136j72j033R47K19j274Q29M89q29j46J331n38j145J030M51j385
4834g12P32Q90r89j84R03n98n12R42j67r66P90L45r52L09Q83q91o51J451l76j064
4854h17Q12Q07j211j7J520j104n91J202l02q54O52N27j090M33P42j165J2J122
4872F78m29r97J303k23j056N20R45j118l08J539p42q88J245O8j333P60P15r18
4890b39l48J154p91n18J156j87o70O08O48j427K03J322j163l47J223m9j169P17
4908A23O01j354M13R14q17m44J191n61q27J126M17j436N40Q13j263qJ188p59o32
$$ y = [701, 769, -727, 227, 683, -650, -231, 769, 134, -906, 336, 726, -683, 108, 510, -243, -232, 638, -4, -511, 537, 42, -706, -86, 554, -685, -499, 841, -483, -832, 374, 296, -875, 115, 840, -452, -390, 595, -357, -622, 514, 342, -691, 256, 475, -799, 30, 519, -310, -456, 875, 337, -808, 222, 673, -712, 20, 910, -79, -263, 640, 42, -470, 472, 305, -661, 129, 474, -478, -169, 714, -177, -828, 623, 247, -817, -5, 802, -409, -426, 1094, -10, -601, 601, 299, -555, 97, 624, -466, -33, 709, -456, -444, 678, 249, -748, 555, 332, -724, -204, 741, -377, -685, 854, 112, -776, 469, 537, -796, -36, 679, -239, -587, 567, -224, -742, 414, 227, -443, 165, 813, -614, -411, 911, -252, -599, 624, 575, -594, 123, 724, -630, -217, 697, -120, -564, 627, 66, -761, 365, 782, -654, -114, 699, -564, -572, 616, -143, -775]
4927g75J012N18j404M75R29r79l80J190n21p42R55N8r59O67O21r28J13J179r48
4946H1q75J077M4r06P09P99j339k9J292r64l62Q87j60o36N17L87j007P3Q67p09
4966b54p8O94l12p80R60L47j235L15J193j027l15J303n98q38J093Q5j149O48P30
4985G82j111j45J173o33o28J094k70r14Q26N75j463K75R53l55q25J003K14j257
5003g06Q08L41q68j47J250o00p67J282l61q07P15L62j078L44J196j434O1Q53j83
5022B61q07R46K26j396O39P77o97l85J041p41o23J309j07j022N57P50j029j95
5040d96J032l67j020J476k67j332J062P20j413N9J163o76p38J032jq57O13L86
5058C76o66J09P59j125q9J350o07j022J131M03j083n7J111j011k33J272l41j091
$$ y = [-775, 237, 755, -649, -174, 755, -224, -604, 586, 65, -677, 278, 336, -623, 44, 665, -263, -150, 1029, 81, -794, 283, 327, -579, 130, 929, -410, -439, 853, -111, -473, 414, 254, -382, 135, 522, -485, -412, 455, -254, -332, 362, 50, -730, 230, 577, -658, -343, 850, -177, -492, 811, 213, -625, 468, 553, -596, 52, 782, -329, -474, 699, 66, -562, 532, 262, -652, 174, 749, -714, -439, 514, 159, -666, 337, 551, -706, 102, 443, -425, -572, 678, 78, -689, 593, 232, -575, 140, 502, -576, -232, 964, -470, -409, 444, 261, -546, 400, 626, -770, -131, 646, -51, -436, 605, -136, -759, 550, 443, -579, -22, 728, -301, -496, 536, 169, -851, 625, 358, -974, 88, 808, -605, -546, 617, -59, -797, 235, 234, -623, -10, 376, -290, -181, 578, -547, -636, 714, 107, -915, 216, 619, -464, -521, 590, -421, -654, 618, 277, -814]
5076h14J100J13j109N08N37o49j69Q25k76o15Q52q0r74M10Q00p14n44J442k37
5095D06j368J473j13j242J082O54j248M4Q84n95n25P65p4r09R57J67r26K63R94
5114F89p91n91J176k40q82R92J04q08L45P85q63l52R20l26q06R19K2o88N04M29
5134E38j074k1J053j92q90J042J60j153M13O66j028O2R66k54p76J013l50o53N70
5153I2L76r12K07P05n99n97J241n20r82J384J9r80J12J044q96m92J157p2q60N14
5173e9P07q28M2N75n53l59R14j90j015J074o3p77K77R44q70k51J038o20o71J171
5193D86J8j185N86L49m64L9M99m86m51J001K97j150R23J25j051K11Q86r48k81
5212e96J005k09r12P29L73q68J2J200p68l62R09m54n99P70Oo68M88M27q36m1J031
$$ y = [-814, 286, 399, -710, -202, 335, -314, -483, 342, 66, -549, 303, 223, -751, -341, 459, -255, -799, 643, 406, -962, 511, 398, -844, 238, 892, -356, -312, 572, -23, -548, 217, 143, -766, 191, 358, -568, -305, 689, -102, -693, 483, 243, -639, 353, 457, -351, -6, 779, -84, -436, 484, 158, -648, 271, 293, -395, 109, 538, -536, -557, 496, 304, -586, 456, 616, -537, -124, 542, -486, -424, 542, 288, -488, 525, 175, -478, 92, 468, -444, -237, 468, -131, -728, 513, -7, -989, 395, 414, -566, -454, 590, -306, -798, 359, 287, -573, -59, 648, -180, -138, 437, -116, -475, 439, 249, -766, 308, 245, -532, -255, 689, -181, -432, 606, -14, -685, 486, 504, -681, -95, 254, -210, -171, 328, -158, -609, 392, 689, -461, 462, 587, -464, -253, 633, -315, -596, 409, 200, -712, 17, 390, -478, -466, 734, -34, -396, 513, 59, -540, 230, 236, -432, 56, 483, -353, -394, 637]
5233F37m20j158J211L82j146N02Q10j358P7Q59m00n47P48K96r04M94N7n78K97
5252a41N25o47m18R97k40q65Q63K35p92J65J102q35o36J142j8r88O94J42n68J30
5272a53N86m73l44J024p72n14R19K03r88L96Q70j032l29J205l45p51Q54K13j180
5291f11M01P55q32N2O34k31o72J176k80q47R32J70j187K31J106p33p87J290j04
5310D63j213Q63N55j068M0J056p81n32J097o42m73R10j03p59P07M38q31l38J154
5329E43l59p12R64j36q55M70Q97p74n26O11Q8o23L49M57q81O13L91r96Q3R80n43
5350D1m14P53m7q39O77N54j176K52Q42o42o30R10p5p05N11M45p01L4O36q86nJ033
5372E68m82q86J167J35j059N54P24j139J04P70j85p73O51M90j351O22M72n82j00
$$ y = [637, 217, -941, 270, 652, -494, 8, 818, -540, -463, 396, -4, -551, 197, 493, -411, 83, 140, -438, -141, 384, -263, -681, 316, 76, -789, 74, 309, -483, -318, 784, -51, -687, 455, 437, -551, 143, 285, -283, -153, 433, -40, -384, 640, -132, -646, 273, 476, -512, -116, 754, -278, -607, 598, 253, -498, 356, 569, -611, -210, 545, -287, -235, 399, 168, -504, 672, 392, -455, 477, 647, -540, -309, 797, 64, -723, 567, 463, -750, 113, 668, -400, -360, 696, -85, -617, 480, -162, -635, 275, 172, -587, 120, 558, -273, -611, 543, 184, -528, 436, 300, -555, -85, 812, 38, -488, 123, 211, -412, -63, 394, -487, 126, 517, -479, -396, 584, 41, -373, 380, 333, -506, 171, 725, -451, -199, 643, 1, -629, 281, 206, -499, 12, 457, -244, -210, 426, -460, -465, 568, 86, -800, 367, 502, -557, -3, 721, -418, -314, 456, 271, -502, 149, 639, -712, -90, 382, -200, -300]
5391c00J026o59m77P29P1p79J97R02j102qR67m60n48Q27q1q18P05M95j014K04
5411a23O70o66k75P36k34o71N26N89j023J58R63r32j20Q23k77q16M35P62q53N1
5431b77Q65o24n29R35k31o86P78L46q39J54O59p54L5N79l94l01O63Rj109N04J123
5452I06j113k57R56m38m75P45K61r80N03K82n36j54O30m02k33J108p95l93Q90
5471E05L6j295L43R04l89n57P28p0p81O30N40r93L67N34p40j46R41o34j69O50
5491D04J63r91M93O59j250J84P45m55l04O60k1q24M50P10j076L81K64j87l02N85
5511B88r6p27R56Q9q58J85O55p57j40Q28k76r28J094m2m96J1P13n18l39O08k53
5532cn54M99J32l46J87N69o65p7R49p13l86Q00J08r55M42N24p33l37J099m59o61
$$ y = [-300, 726, 67, -410, 319, 390, -389, -192, 710, -392, -400, 567, 107, -441, 386, 305, -513, 192, 687, -327, -123, 547, -119, -394, 342, 108, -563, -37, 552, -471, -313, 650, -282, -402, 421, 144, -672, -237, 525, -328, -277, 588, -36, -565, 370, 139, -547, 231, 577, -262, -108, 551, -203, -168, 411, 17, -284, 379, 388, -721, -217, 906, -207, -464, 492, 54, -421, 324, 585, -395, 108, 390, -146, -300, 330, -72, -305, 803, 8, -385, 505, 541, -754, -411, 493, 104, -453, 275, 205, -576, 54, 594, -399, -32, 502, -238, -384, 557, -77, -246, 404, 567, -424, 69, 728, -522, -338, 407, -48, -352, 308, 287, -537, -87, 623, -453, -72, 192, 5, -297, 288, 192, -535, 421, 510, -348, -163, 492, -265, -405, 423, 147, -781, 313, 271, -225, -214, 499, -19, -358, 250, -3, -557, -58, 74, -272, -85, 484, -181, -258, 691, -22, -408, 392, 500, -455, -13, 511, -222, -559, 540, 81, -580]
5553e80R35J5q42N75K88o43P7N90m61m50R64m34m81O28N28j291L37J056q60l61
5573d10P77R8j022P22L16r56L48L85j83o21Q88k66o35P82K77q50M33P47j190k72
5593f32R43m14o20R71J16p53K94O13o67j06R27n99m64O42n5p47Q15k7p68M42L83
5614B94o14m41J227k70o26N70L44r61K34N35m72k57J048p24l60O41N9p25N31M79
5634E12o97k79Q84k75n27O45J13r98N98M67o39l21Q75j19p04N06K23l42KM73m82
5655h5l07P77l27p17Q95j54o96R09R7r58L15O59k48n94O76j19o70N87Q56j080
5675a84K17L71l88m37O82j05q15Q62J98r52K26Q55p34j76Q45m63m19N29M09r15
5695c94K26N86q38J43R73p56m95P67j48l20L67M81j173M71O32o63j93P96l26p47
$$ y = [-580, 355, 370, -472, 103, 391, -252, -175, 415, -46, -496, 468, 34, -447, 181, 709, -582, -245, 811, -49, -410, 367, 465, -557, 165, 481, -475, -127, 258, 75, -546, 342, 76, -559, 223, 500, -350, 83, 830, -360, -632, 311, -103, -723, 248, 364, -389, -95, 518, -149, -255, 672, 73, -391, 251, 196, -551, 264, 237, -531, -89, 294, -320, -761, 466, 196, -430, 140, 484, -477, -243, 292, -180, -437, 611, -113, -473, 168, 227, -498, 33, 512, -185, -464, 420, 145, -382, 263, 376, -622, -24, 443, -196, -517, 358, 239, -465, 41, 264, -78, -76, 397, -85, -392, 385, 58, -659, 236, 82, -614, 295, 392, -566, -251, 408, 160, -434, 242, 123, -547, 40, 896, -184, 33, 404, 16, -421, 261, 156, -659, 203, 401, -551, -325, 530, -204, -380, 465, 2, -417, 112, 521, -394, -168, 418, -420, -277, 696, -60, -555, 212, 64, -256, 111, 592, -581, -110, 522, -141, -334, 462, 136, -611]
5715f11P01M68q59MO82n62l22P74p7m78M00L13p97J9R19o16j05O06l26n76N33
5736I0M75q58J20P06o33j15P07k53n78M64L79q87L91K73n79J33P74n00m46R68
5756F31l29q00O77L18p56k9J370o37r76R17k08o68K64O20p09L57K21m34j77P59
5776D11j70q06O14K55r38O03O33q73j42R15m08j062R96M44j039M11O78p91j5P52
5796D68n38n52Q17p0o02N45O60j000O2O63l96o56R17J43q57K41P85p44p2N11p03
5817c78o6Q73j7m00Q0L21q76K79R11r37j14J065n93p91Q44M99j195K77M39l79
5837a58l44P68O3o06M77M8n93L40O18o08l65Q80l18m99P02j56q62M74P95q93K5
5858b12P34m57n58P08nm67J01O12m46l33O68j93m43N71jj040O09N02r07J31O88
$$ y = [-611, 90, 558, -301, -297, 385, -177, -499, 275, 198, -280, 120, 433, -364, -345, 574, -42, -147, 459, 133, -443, 90, 565, -293, -173, 533, -100, -215, 492, 239, -339, 125, 504, -383, 8, 281, -298, -165, 609, 109, -337, 631, 302, -498, 179, 497, -259, -288, 1082, 445, -531, 386, 178, -490, -226, 394, -315, 42, 263, -171, -348, 411, 241, -565, 49, 304, -634, -31, 602, -271, -413, 502, 94, -968, 28, 472, -567, -156, 522, -269, -284, 468, -70, -622, 195, 125, -477, 68, 728, -272, -210, 453, 57, -599, 318, 461, -396, -155, 630, -114, -186, 325, -378, -444, 429, 412, 12, 92, 413, -463, -184, 727, -210, -324, 741, 148, -643, 201, 700, -495, -218, 221, -158, -502, 266, 329, -277, 200, 248, -345, -5, 613, 5, -360, 520, 202, -297, 405, 249, -613, -139, 656, -237, -212, 522, 65, -493, 215, 210, -257, -156, 456, 10, -323, 345, 152, -291, 280, 279, -761, -152, 350, -557, -426, 262]
5879B62m85j08P49m37o60Q42L04p91K66O31p14k78P55l31m61O17Q6n80L34N90
5899E91q96l57J116l37p21Q52J00p64J57P56q65K16L82j77m43P08j81n62N82R5
5919B52p00L04L61m2r22R30j9o63N54N19p98JO34l92n33R51k43m64M58K04n69
5940a77J21K26l74j39P19j74o83P92o4o52N48N21r63p8P41k00o67O51J38n19Q2
5961a51N43k49l47P25n38j28L63K66j189N01M75o84K23N50l09o64P48K15p91N16
5981G5Q8m73K04N46n73j78O88j33o27L38J95m28J77M08m49j09O53l66o34Q55L63
6002F20r83K59L86j33o99P88K7p17O61o7n68M21K77q50J51Q49o33n4N46O1j094
6023g52R95M42j125P4O41j10p85Q19Q6p66N70M5k71j59O70n11l87J113n81n34
$$ y = [262, -223, -331, 418, -19, -679, 163, 467, -324, -58, 573, -141, -419, 336, 5, -456, 161, 247, -333, 1, 591, -305, -662, 454, 117, -604, 248, 348, -416, -259, 497, -368, -152, 230, 53, -390, 318, 137, -425, 157, 252, -448, -144, 217, 175, -747, 183, 164, -499, 55, 574, -224, -223, 411, 19, -514, 437, 194, -270, 188, 392, -177, -56, 170, -204, -343, 376, 202, -481, 311, 247, -405, 143, 664, -299, -377, 364, 164, -503, 148, 286, -233, -151, 392, 143, -204, 521, -17, -145, 218, 484, -705, -204, 271, -413, -190, 360, 51, -613, 135, 350, -441, 75, 163, -310, -106, 440, -133, -311, 377, 244, -383, -45, 150, -278, -101, 307, -142, -251, 402, 36, -598, 257, 620, -363, -104, 282, 149, -550, 238, 265, -452, 209, 142, -426, -5, 272, -578, -427, 422, -211, -265, 281, 342, -752, 243, 685, -440, -366, 275, 165, -620, 199, 285, -481, 89, 134, -137, -296, 374, -137, -524, 589, 8, -526]
6043e26O45J43m07k04Q70r00L3Q36n49l07M99J22n92L56J33m90j68Q39l55m45
6063d67R09k16o85N85J89o19j68J028p49k84O39J76o71M42j08k86j5M77r5m96
6083d14Q75n19j76O40k74n38K25N15n29k21Q69k02p25M12L74n81Q1P41p10P6K79
6104A98k6m10O53k51o14M79K39q42M10N69m64j73L08R3m75L82K14o10j57O62j02
6125H3n51N29K55o49M16L4l43K84K19l30p1L28O3p90O61k1p30M94N14n29k77Q11
6147D00M6q72M41k4k29rO23p31Q0P29o66k47O64M5n36J46O13p84k23J046m41j52
6169h1N24j06o04P0O74o07j67P56l28l72M92l52p3L85L27q80L13N08o69j95O74
6190B89q6p65Q43j6o02K91N77q22K63L51j50k03P6L13n76M11J41n36k18R69n91
$$ y = [-526, 119, 262, -145, -349, 521, -379, -346, 490, -59, -366, 133, 255, -337, 19, 152, -338, -506, 333, -22, -467, 442, 226, -459, 126, 315, -304, -472, 556, -193, -477, 162, 338, -333, 109, 1, -285, -300, 177, 82, -414, 461, -58, -234, 406, 132, -406, -181, 334, -195, -416, 453, 251, -474, -62, 312, -269, -188, 553, -157, -81, 198, 172, -238, 415, 164, -450, 29, 268, -574, -164, 405, -59, -232, 76, 169, -306, 76, 290, -320, -477, 185, 83, -468, 61, 316, -333, 83, 117, -226, 58, 277, -53, -124, 204, 267, -523, 138, 117, -613, -119, 395, -134, -411, 400, 446, -426, 15, -9, -238, -247, 376, -355, -275, 454, -212, -459, 205, 250, -286, -140, 473, -311, -534, 512, 71, -81, 443, 337, -267, -197, 477, -130, -297, 459, 131, -241, 251, -101, -174, 211, 538, -342, -29, 479, -190, -385, 289, 203, -562, 281, 265, -337, -46, 531, -291, -28, 323, 173, -30, 46, 359, -217, 194, 335, -201, -419, 550, -41]
6211d1m64P80J3p53O11N64j083J00N92l32k76M29J0n57K67L73n31J06P79q55k71
6232e39J068o06j5J16J31l24J43M05l35o71R78k7o46N41r2m20OP36m44m29P70
6253C46o06KL36M89j301P03J12k40j96N72j49p34P63J08l38J26K01m08Q9P01n60
6274A6m64P12O8m87K90ro45M15M25n54j35O09K8n07L09K30m92PM81l83j05M50
6296B59p0n49M45L04n72R9N70q29o0O29j63m95N90M14j040O00J48l75q3M40j00
6317A62p23Q98k71l84K15M46m42k21K79J10n97M87K34q83P98K57o50J92M99m06
6337@m49O81K08r04K98K88l98K57L18m34l54J045n39m32R34j58n51Q4N61p80J51
6358a74M37k51l12O61J19q00M21K48m47q6L60j47l26N78k89r1R9M91p16R7N63
$$ y = [-41, -505, 275, 288, -465, 146, 710, -373, -273, 319, -13, -289, 140, 150, -407, -140, 233, -298, -192, 587, -268, -539, 529, -77, -92, 24, 155, -169, -26, 379, 44, -627, 351, 324, -322, 219, 127, -293, -287, 449, 5, -424, 346, -260, -258, 78, 567, -734, -31, 81, -159, -355, 217, 68, -666, 97, 205, -133, -7, 194, -214, -125, 576, 16, -448, 264, 332, -155, 135, 126, -519, -104, 321, -233, -368, 241, 269, -238, 71, 301, -191, -184, 297, -86, -191, 259, 189, -360, 85, 389, -183, -84, 486, -343, -403, 226, 63, -432, 158, 572, -468, 132, 280, -95, -178, 262, 162, -561, 337, 66, -318, -103, 343, -99, -320, -41, 69, -528, -41, 193, -690, 108, 365, -285, -93, 406, 0, -449, 232, 440, -464, -166, 122, -276, -19, 299, -135, -489, 556, 17, -415, 519, 361, -190, -106, 455, -325, -174, 263, 12, -300, 361, 480, -320, 101, 349, -98, -184, 176, 29, -297, 281, -8, -99, 0, 491, -225, -128, 435]
6379D35l58n06P06j92m05K82M51m94l92P39j33n31M44J38m20K70K45n63K63M56
6399D35o18j53O95k49m42P90Q2q99K71L04m83RN82l33k21J61K45k51J3L71o36
6420c27J90N91o21j24P08j86n97L43O04o93k57Q36m38l38M08Jm24N15K06m32L6
6441AL41j86p82R05j12l69M03M13q41J0Q70q58j99O79q0o06O87J92o53J87k0L9
6463B1j46N36l36l89O90j38m27J96N67p84m16J281p98l17Q47j32o49L16O08n66
6483c6j39N20m69k93P67l88K6J46m4p16M08N32m95k76J072o19m25N50J58n03Q3
6504a41N46n67j95M95j47m44P24j46l56K99K22m04l45P56k09l45L02K75p77L85
6524g2M52m04k94O81k13m10N48J77q05N30K57m57j01K12j74j95Q96o69o05O54
$$ y = [435, 77, -429, 277, 85, -320, -38, 413, -81, -473, 266, 133, -398, 46, 184, -236, 34, 279, -284, -21, 435, -183, -336, 359, 110, -332, 458, 540, -359, -88, 216, -267, -258, 324, -9, -230, -69, 176, -75, -62, 309, -327, -137, 454, -167, -291, 417, 231, -366, -23, 581, -112, -369, 467, 29, -309, 99, 100, -324, 191, 397, -35, 1, 342, 156, -626, 279, 167, -202, 201, 614, -227, -217, 653, -205, -404, 275, 195, -411, 276, 468, -185, 2, -18, 21, -125, 411, 75, -314, 376, 238, -189, 7, 574, -210, -626, 655, -143, -460, 387, 255, -394, -78, 530, -36, -175, 345, -124, -417, 350, -38, -12, 134, 90, -626, -218, 314, -181, -457, 615, -4, -429, 121, 279, -224, -141, 405, -162, -357, 138, -9, -453, 271, 125, -231, 68, 290, -114, -459, 297, 88, -257, 45, 320, -457, -72, 380, -24, -318, 363, 150, -260, 288, 465, -340, 190, 447, -10, -111, 101, -73, -268, 628, -41, -646, 8]
6544HN59q58J90M25l87o76J016R3j013L90O93p43p7O85m84J48K84j43o4j20K52
6565A78p71N60M83q61M18M02p0p90N82K18p58J36O12o98K23M79m91k47O7L84k84
6586b28K80J91o76M48L84m99l12Q94k43p26K66O19o97k27J163p17k00M02k49k77
6606d04L36J90o37L14N34n92J7M94m85k67O07L03p16J5P43n12j53O66l70n61P06
6627B28j1p59N29Q4l55M64M34p51j19O61k17n35O61o7m69L12M06o58k93P76J31
6648D52o40n4M83l73O7P7O3k28M92l35k3p2J67k41K90J59l80k69N88k67j33N16
6670C39j74o66L70L51k03m90P19l42m68O41pj58P6L73n78J25M54j85o42O04J26
6691B65n90J90N39p56J80M37l07m2M18j17l99M71k49k22R1K39l74j33R50o29j42
$$ y = [8, 567, -291, -101, 324, -63, -739, 277, 370, -643, -253, 440, -303, -380, 305, -179, -31, 253, 110, 46, -74, 178, -593, -33, 450, -411, 7, 409, 339, -451, 131, 349, -409, -273, 339, -359, -136, 343, -148, -395, -328, 56, -228, 52, 243, -433, 15, 399, -100, -412, 482, 239, -487, -221, 398, -299, -526, 637, -80, -280, 122, -127, -404, -68, 122, -515, -201, 333, -259, -242, 252, -233, -500, 107, 410, -306, -291, 452, -60, -213, 453, 83, -478, 228, 217, -542, -13, 71, -284, 180, 614, -137, -256, 405, 188, -347, 314, 247, -222, 90, 496, -162, -455, 321, 452, -188, -242, 241, -132, -65, 12, 75, -153, 339, 4, -19, -91, 76, -165, 125, 284, -96, -365, 223, -44, -177, 339, 165, -501, -131, 220, 17, -473, 246, -96, -564, 77, 70, -88, -12, 361, -217, -92, 362, 177, -465, 139, 265, -325, -135, 404, -352, -172, 265, -42, -84, 334, 217, -182, 289, 40, -182, -91, 148, -226, -359, 591, -38, -180]
6712a80M46J42o91K29M86n73j77O29K8o77M73K31p28L30L09m06J84R9p5m06M84
6733A57j22k45N4O73p00j1L70P8q80P33K0o61O22J40m35k0L53l60K3M52k0l65
6755a44K01K85o82J47M44o46k4P06j07l28M05m6o19J58L93k78j6N32m91j77M51
6776A64R9n10J89M23o86L07L60l70m86O30J90o72L02L32m54J81K47m06N3K19L30
6797D42o60K09K64q45N93K20l80J76M60p78l99Q16M5l30p5N73m02p1J73J28l97
6818b38K56K58l61J6J92j86r0M43j91m18J81K75m87N03j69j43j78O27m34K61J17
6839B34j5l84J49M30o93J99L10j82k40O45m01l27K72K3l11J31K46j63m59Q22k9
6860B57o77L15L08l59J80P0m64M38K07l85k14K63O9n10L73O70n80j05L08k67l21
$$ y = [-180, 266, 408, -283, -54, 432, -141, -318, 311, 339, -338, 135, 366, -362, -32, 277, -129, 55, 154, 79, -327, 157, 35, -210, -156, 517, -183, -194, 176, 254, -626, 107, 127, -534, 88, 228, -207, -227, 126, -234, -211, 241, 221, -144, 57, 342, -340, -193, 251, -395, -419, 287, 180, -148, 257, 211, -408, -250, 143, -135, -151, 381, -110, -287, 164, 263, -247, -58, 365, -321, -14, 346, -24, -510, 120, 310, -362, -60, 272, -182, -1, 246, -160, -107, 112, 442, -218, -9, 255, -590, 3, 223, -157, 19, 479, -299, -698, 118, 163, -167, -242, 331, -71, -142, 31, 159, -238, 18, 276, -85, -69, 123, -63, -153, 290, 99, -319, -138, 137, -350, 153, -16, -159, -337, 290, -144, 117, 234, 219, -165, -16, 414, -279, -80, 230, 48, -192, 453, 52, -275, -3, 20, -291, -160, 86, -77, -536, 286, 257, -420, -105, 203, -156, 24, 94, -370, 68, 275, -110, -324, -61, 8, -502, -129, 541, -39, -144, 164, -103, -424]
6881d24P39j50m21J79K67n26k9N97k00r6J23k9j88L62J2k35k24O88m99k93O02
6902B55k27l75J78M54m58J72J2L0j96K05j08O4K07Mm59L14J33n81M28K98j01n52
6924c03M07p8k47L47K26l87n24J233n37m09M68p4j87M29j77k78K50k35L5k34M97
6945B22q4m16N87j13n82J63M57l39l10K98O5k10K86J59l14m8L99n44k2N63m00
6966a83j81L29L66l66Q7L74p75o9N61k88k06K02J30P6j82K89j83k38O52l17l35
6987b57M73K1m20M07N4m98J27L26n3l46L97km34K68K46o99K00O07m43k08J83J53
7009A02l03M44j47m95M18M15o41L5N44N8q32M34K33m25R9M28o02j86O39q2m51
7030c15N11k44l57M03M05l46j32M3m7o9K34j8l23N42P8k62l39N40l43k66M53L08
$$ y = [-424, 315, 165, -256, -77, 190, -336, -365, 232, 32, -64, 59, 30, -158, 204, 216, -19, -243, 445, -54, -347, 255, 28, -347, -169, 285, -173, -1, 11, 41, -155, 50, -58, 6, 213, 217, -242, 72, 205, -376, 52, 350, 249, -303, 104, 26, -221, 126, 352, -35, -559, 674, 137, -272, 196, 122, -65, 364, 187, -91, 159, -76, -41, -275, 222, 138, -278, 309, 196, -386, -223, 234, -105, -415, -117, -52, -262, 24, 183, -131, -179, 220, -324, -346, 217, -183, -364, -35, 331, -35, 52, 426, -349, -418, 143, -145, -351, -149, -19, 57, -125, 164, -19, -257, 395, 78, -257, 216, 237, -183, 224, 278, -220, -93, 233, 180, -166, 231, 229, -205, 63, 309, -390, -190, 417, -26, -234, -51, 102, -201, 243, 96, -399, 19, 434, -207, -172, 372, 430, -402, 32, 265, -160, -61, 367, -235, -421, 218, 136, -315, 196, -48, -405, -2, 403, 57, -75, -32, -79, -148, 86, 68, -255, 287, 365, 103, -236, 304, -39, -305, 148, 456]
7052D56o19N0L89o13J73L67m67m3N84k42k10M82l25o7jJ86k04l63R31k08o10M93
7074A39L8j59k74M24m6p5n1J13k19J23M16n06r8M46p90N22K02l50pN71j9p92M19
7097B7L15n24J37J97k86q8L15J79m20Q6M04k12m88P50m84l19M85J17o05M52M00
7118D38p27l4N01m57K20Q7K75p20M55J22m32L51m0k37qM52k75j85L01L5m79J99
7140a58K67k58q3N47j71m18L94J6l49k7J39n9J10L37k13l65M43o9k80K97N4m26
7162b72J46L58l54j80N05k92L6j52R2m0M7N33l79q7J87j68k84K74K49l59L90Q8
7184C38l62r4M19k78l05N18m6j88l57L62rk14L13l06NK35J28l81K36J3r8J66L5
7207A30r3k95K86R3l16L74k07k25j0K17J87l99M59l2j27P4J10l70K70L3m55K87
$$ y = [456, -163, -113, 276, -337, -164, 203, -264, -307, 277, 35, -175, 307, -18, -85, -86, 100, -104, -467, 464, 256, -354, 139, 177, 18, -256, 168, 122, 47, -4, 109, -110, 13, 429, -77, -175, 271, -519, 3, 205, -145, -152, 419, 400, -392, 27, 342, -182, -45, 152, -134, -222, 93, 272, -148, -62, 342, 130, -358, 392, -92, -411, 74, 191, -414, 38, 438, -289, -323, 178, -279, -59, 28, 303, -417, 38, 160, -272, 79, 39, -198, -206, 246, -29, -214, 87, 122, -357, -158, 109, -149, -232, 315, 144, -274, 120, 136, -213, -240, -101, -160, -50, 287, 74, -291, 152, 83, -197, 100, 154, -272, -126, 232, -122, -302, 203, -89, -53, -205, -113, -153, -106, 427, 48, -39, 148, -20, -304, -30, 219, -140, 250, 338, -24, -118, 301, 23, -282, 236, 190, 2, -355, 7, -2, -216, 97, -209, -204, 31, 159, -222, 14, 27, -71, 95, 130, 37, -258, 28, 121, -195, 179, -28, -253, -263, -46, 141, -258, 201, 169, 42, 116, 226, -144, 126, 159, -296, -9]
7229ik0M2k4K4R7l82L06k40K7k2L67k98j7K89M3m97Q3K58j02q1K42N3o43O43N9
7254A98l66J68R3j11k63M92l42M12m04K68k43J95P4j68j77K80j39j12j22M75m30
7275b22K08L58m93J95L09m13r1L65O3l18J24J11k71l1J42k85M6L37l21J32J31
7296G6K08l55k0K44j92Q0J77l5m43L41k3j22J73ok5j59L78k79k69K15J93o86O04
7319G5K93n14J79J81j44k40J90O4m20N41K94n89M7K53j8l59L69k25L7J56O0l80
7341a50O1k0M36l48R0k25r0Q2r3J08J97j01j54M3M71n77OO42j82l63K79j1j11
7364a0r6K84j34j58L23M2j82j73K70j77J79K71m37J07J65l37p8K66M6k63l9K59
7386A28k1k95M20L4l35R5n5n2n9L25j97k44N49k78m43L42J94j33j76M79p42J16
$$ y = [-9, -29, 13, -11, 13, 110, -272, 34, -206, -179, -201, 166, -132, -149, 140, 183, -314, -231, 27, -75, -156, 86, 139, -504, 139, 198, -168, 0, 93, -18, -281, 211, -131, 281, -123, 145, -98, 97, 171, 3, -174, 106, -33, -145, -267, 208, -222, -14, 344, -149, 46, 355, -58, -149, 216, 279, -39, 85, 196, -75, -106, 36, -249, -203, 134, -187, -55, 76, 284, -71, -91, 153, -39, 41, 218, 183, -260, 81, 58, -64, 109, 103, 78, -81, 297, 18, -251, -36, 157, -529, 75, 368, -146, 33, 214, 70, -170, 20, 84, -336, 205, 499, -90, -43, 210, 192, -167, 202, -23, 14, 170, 230, -150, -89, -109, 327, -21, 69, -156, -246, -164, -257, -149, 48, -53, -207, -164, 307, -270, -264, 378, 196, -167, 112, 101, -10, -106, 178, 44, -114, 209, 251, 69, -104, 166, -11, 168, 439, 2, 109, 274, -63, -141, 125, 171, -92, -131, 128, 107, -188, 232, 266, -69, 26, -29, -81, -140, 185, -12, -256, 293, 15, -428, -86, 108, -25, -201, 278, -464, -348]
7408c48N90j76j14J06L5m2o6K18k70N3K69l89j77N49l39M9K28jm75L55k65J84
7430b6j17L53k51k47K08N9J07j34J73Lk26J69O7l10K50pr5J68K97n63l4O86n33
7453cm9P6L67n66k06L11N4j95N37m19k90M29N9l03K17J98n76M85J66k21l13K38
7475dm7lj13M70n79L20j14j67K64J74o5l32L35k7j70o8K74m03L50N8j47j94J99
7498A1P1n77L72J14q4k61M99k52k26M65K34m37M2K32m50J93N9n9j70M06j68l47
7520c33L85J66k19l92O10j00k04J78m8k90K41L79l93K1K12l87n5K27K45n99L29
7541b7J06J4l45M86k98N5Mqj83M23j5k5k84K08l47J61j3J78j3q3J82l58P5L44
7565B37l46l1N00o01J17J91O2n11J86M50m38J42m7J14k48L93j38k06K83j80M6
$$ y = [-348, 242, 66, -48, 58, 93, 51, -15, 203, -67, -14, 255, -134, -311, 238, -101, -52, 176, 175, -300, 55, -210, -26, -143, 210, -41, -288, -80, -21, 86, -48, 125, 128, -98, 71, 138, -172, 78, 71, -24, 144, 441, -122, -156, 530, -3, -52, 24, 391, -175, -381, -70, -16, -211, 326, -93, -383, 46, 105, -198, 19, 217, -359, 126, 292, 71, -242, -4, -51, -54, -167, 303, -276, 44, -70, -237, 27, 201, 136, -196, 139, 112, -58, -126, 148, -255, 95, 153, 6, -188, 11, 82, -495, -123, -9, -93, -354, 145, -107, -333, 132, 366, -71, -29, 203, -247, -54, 5, -54, -224, 182, 14, -333, 52, 218, -1, -393, 217, 117, -87, 91, 43, -247, -6, 373, -20, 1, 213, -174, -229, -2, 243, -356, -27, 79, 93, -252, 234, -64, -9, -5, -13, -196, 227, 212, 187, -97, 111, -236, -75, -88, 90, 77, -6, 176, -182, -107, 237, -109, -140, 360, -241, -124, 67, 129, -382, -196, 254, -184, -42, -89, 25, -223, 170, 32, -174, 109, -71, -25]
7586b5K7K12l18l9N15l13j94J81j9k55N9J80l4l46N19k25k85K51K80l79J46K39
7608A77k70o2J06J62m81O41j92j94K36p3l36L14K33J8m80M29j60l71K22K99k62
7629d4r8L42j52k56L80J21n79L26Q3k35n9L63m89n1M89m38J00L44N9n75L71R1
7651I3J17M4m3j87k21J42L25l80OJ40k67k2L74Nl55M33j47q4k28L48k91J21L7
7674d0P2k24J02K72l17k9K91k16j60L48P1l03J28o0k02P0M92m34N3N8j69l1K64
7697C6Q1j14O3N1l20L25j67O7l27L15%O9k7m0j05K76J9m71J1L71j55l26M40m4
7721B8o9J89J05m38J20J87J47l97J6r1nJ63K25l62M1M68l64k03K76j59l4K35J35
7744B13l94L09J47k34m27K94J45m55M64n0J19n7K44j73j94M4L3j35J02J91%k94
$$ y = [-25, 2, 214, -104, -143, 372, 59, -135, 46, 27, -228, -169, 11, -23, -369, 150, -75, -360, -109, 171, -208, -62, 177, -93, -155, -49, 113, -368, 273, 81, -113, 123, 50, -286, 28, 261, 279, -201, 228, 68, -303, -81, 218, -44, -142, 200, 48, -208, 172, 293, -286, 40, 123, -112, -171, 192, -297, -348, 141, -297, -197, 147, 206, -369, 2, 93, 210, 254, 211, 24, -197, -55, 270, -110, -104, 36, -231, -253, 121, 126, -229, 204, 57, -27, -255, 93, -198, -77, -40, 32, -192, -90, 182, -135, -164, 127, -89, -249, 99, 170, -133, -5, -65, -267, -197, 295, -139, -86, -28, -197, -228, 36, 117, 3, 66, 117, -203, 122, -45, 22, -305, 10, 10, 79, 52, 12, -93, 183, 202, -269, -258, 113, -42, -368, 72, 28, -41, 148, 253, -185, -65, 122, 269, -128, -112, -203, -208, -45, 180, -182, -141, 327, -37, -240, 36, -123, -157, 78, 213, -181, 128, 275, 41, -386, -92, 53, -402, 62, 12, 131, 74, 318, 145, -49, -5, 28, -107, -5, 186, 186, -108]
7766a08K03k54L13O3k61j87M02k28N2M81o12l8K59L4j54k25M78k19m27L46L1k76
7788c27K83J91Lj30P9Q0k46j56L42m00J27N33l90J04K41k75k50M86m67n1J15K26
7810A18k12O6p7J43j15K95j93Ok4P3m3j93K95qj21j24M18l39K66j86j77o8M95
7833B95l9n32L25K82o02M82k10KK05p1k82P8Kr8KL27k00J33k90L13j59q5K69m82
7857c35K87J68o3k94j64N80j06k74J65K84l24JJ52l23jM54k32l58M35k08q2K67
7879B9l2m01L58O9k37L37Q6l53J07kQ6j25K01ln55J80J12J10%L27l30j29J93l3
7903ek1l7n7k2J83J90M4l94j28J61K59m4j39r6J46K14l10r9M99k94l34M21k78
7926a41j1L5K60j34j49K91l38m6K02J90l55N8L09k57J05J69j59k0O7j78J78k38
$$ y = [-108, 95, -159, 154, 217, -44, -231, 171, -57, -5, 476, -136, -174, 85, 119, -35, -260, 218, -1, -428, -82, -51, -327, -44, 147, 150, 20, 99, 179, -67, -223, 119, -281, -154, 379, -11, 93, 334, 59, -191, 295, -172, -223, -108, 118, -94, -28, -105, 38, -77, 218, 25, 31, 7, 80, 37, -156, 139, 131, 10, -114, 304, -35, 231, 45, -132, -200, 295, 256, -276, 49, 331, -271, 211, 1, 3, 208, 137, -145, -67, -65, -163, -161, 166, -34, 99, -191, 122, -37, -122, 147, -335, -48, 120, 57, -237, -401, 179, 73, -201, -36, 248, -76, -75, 77, -246, -247, 207, -25, -383, 52, -156, -238, 29, -3, -404, -46, 23, -214, 123, 209, -144, -37, -39, 47, -78, 123, 120, -435, -255, -143, -33, -33, 294, -36, -165, 28, -5, -26, -63, -120, -142, 41, 231, 275, -119, -247, -86, 173, 129, -10, -106, 40, 254, -56, -155, 344, 50, -284, 137, -141, -152, -117, 143, 9, -140, 151, -187, -233, -31, 159, -196, -138, 171, -86, 19, 188, 29, 9, 76, -102, 76, -162]
7948a62K27j38LJ01R1j14l01M00m44K85N1j4k01K12K91m65J67J82j90q5M36l95
7970f3J34j74J41P5n1m2K9K06K1k28j46Q9r8k85L87K82k82J92k0m46J06L73j47
7993E3l37P13l22j29L40j89k4j3J0M6j15M1j33K41m7j57K7r9L25l98P4J92p1m3
8017a5J03M1l9k86M89m37k7J82N4L1j45K61j45l76K94N3k1R2j03r6L26m9m47M93
8041B33k24k03J13K23q7j26R8J1j51L02j80n1j35J54Q2k41R5n2M2J78M7j92J56
8064I2L15n69J17j15rN7J86J16l28J4O01o30l57M35q6K25j37j65K58K00p4j25
8086B1k7J97l60K18J45J84j86j06M6K95k56l31L4M3J36n1o8K6n4O2j66L39L67
8109E08p17L50j97l52M31J10k88J60K83l8l13r2R1R1K50k22k59L16nP9l30M90
$$ y = [-162, 65, -73, -70, 31, 122, 8, -293, 107, -337, -52, -1, -15, -216, -4, 287, -178, -11, 171, -19, -104, 332, -63, 71, -103, 38, 113, 62, 20, 49, 255, 276, 48, -98, -9, -107, -392, -5, 277, -5, 187, 167, -279, -173, 200, 53, -284, 429, 107, -22, 318, 129, 105, 92, 102, 148, 33, 74, -59, 182, 135, -22, 5, -94, 231, -167, -93, 99, 28, -15, 88, 129, 90, -196, 293, -144, -171, 11, 65, 96, -49, 212, 67, -309, -15, 38, 17, 109, 6, -90, 236, 187, -260, 233, 9, -194, -81, 142, 55, -71, 27, 38, -113, 189, 9, -42, -177, -23, 59, -182, -87, -139, -97, 81, 128, -64, 92, 407, -162, -45, -160, -169, -112, 74, 190, -138, -124, 477, -153, -510, -75, -161, 64, -73, -238, 20, 220, 146, 21, -6, 191, -169, 49, 194, 378, 192, 86, 132, 427, 171, -160, -126, -83, 53, 2, -66, -40, -94, -32, -198, 141, 508, -209, 141, -56, -408, 23, 133, -155, 5, 288, 250, -63, -155, -64, 27, 277, 55, -204, 112, 107, 186, -144, 346]
8131C46o83K42J19r2l7N6L12l35j02O41l81l51J55K5J80j34K94n36K76K20Rk65
8153d1J74Rk48L39J12n77J60J79k18k36L86o7m89O07m2j86O3J26l11M3L04L2l34
8176b15J27J74m31N22O5l75k9N26l82J21r7j70k07k0L17
$$ y = [346, -337, -95, 24, -68, -105, -49, 263, -72, -174, 467, 86, -265, -110, -85, 95, -39, 255, -281, -5, 215, 224, -41, 133, 142, -106, 233, 345, -232, -72, 107, -111, -347, 39, -28, -517, 90, 48, -138, -75, 51, -260, -217, 87, 119, -215, -88, 86, -345, 177, 242, -133, -162, 364, -18, 103, 6, -164, -371, -391, -74]
8191g4
$$ Imaginary data points
##PAGE= N=2
##DATA TABLE= (X++(I..I)), XYDATA
0@%%%%%%%%%%%%%lJ1j6J6j6K1k9L2m0M8n3O1p2Q5r7J10j25J44j65J88k11K36k66
36a41K99l34L74m17M63n14N70o31O96p67Q47r35J029j133J249j376J518j676J852
55I73k053K282k545K855l223L668m219M920n845P123r013J2073j7795L1864j23320
70a02255j47778L69921p5548k32633K26557N3038k87253J29752J98772k18855
80h6282m1705K08998j25805r0328K25443m3861k11992J59684R8272k00813O4896
91d3493J94453j78279j07531K21690q960j79493J23329Q1867j68759L9847J45404
102A20075j30908o7715J44861l9685r6199J27494J0463j52911Q0271J02457j52313
113e4110j3281J71486p2838j24750J32663M0810j52900M3165J22856j05731n2042
$$ y = [0, 0, 0, 0, 0, 0, 0, 0, 0, 0, 0, 0, 0, 0, -3, 8, -8, 8, -8, 13, -16, 16, -24, 24, -29, 32, -40, 45, -52, 58, -67, 77, -88, 100, -111, 125, -141, 158, -176, 198, -219, 244, -270, 300, -331, 365, -402, 445, -490, 539, -594, 655, -721, 797, -879, 973, -1080, 1202, -1343, 1512, -1711, 1957, -2262, 2658, -3187, 3936, -5077, 6996, -10799, 21065, -102255, -250033, 119888, 44340, -188293, 38264, 91302, -195951, -66199, 132573, -86282, -127987, 81011, -44794, -135122, 90321, 46460, -165532, -5848, 92424, -108389, -43493, 150960, -27319, -134850, 86840, 77880, -101613, 21716, 103583, -65176, -25329, 120075, -10833, -78548, 66313, 26628, -69571, 57923, 68386, -84525, -4254, 98203, -54110, -67391, 104095, 31257, -93493, 39170, 79980, -72920, -29755, 93101, -12630, -64672]
124f4672J35133k3496j10429Q4019M1604j08342M2737R1778r8963j8062J21404
135I2711p8226j00648J49283L1773j64117O2975J13714j45541k8837J64676p3799
146B3964j30728J35826M6954j39146N1059P9371j29745J469J35701q3716o7101
157g6092J36979l6882j38010J26011P7435j70446K2623J54415j15381p3786J73216
168H0082l1191j63235J16771R3119j38046K1098J08841j14833l7599J44935n2064
179B7878j01531J23133R188j42352Q7055R3352j54685j1657J50963q0440r1116
190i0212J44936K868j59249O8786J01995j08733o430J06494p9558n8623J19310
201D1584j5501j02123Q4716M3230j13623M5332J03857j12423m6888J37030l0611
$$ y = [-64672, 70461, 46965, -63464, 20555, 62159, -46183, -3446, 88332, -10631, -28693, 92711, 14485, -86163, 63120, 94893, -69224, -6249, 107465, -38076, -66913, 97763, 23964, -106764, 29062, 76016, -63130, -12071, 67300, -62445, -60976, 74725, -8991, -76092, 60887, 24005, -114005, 12006, 89441, -81005, -58382, 96033, -19348, -93134, 80082, 48891, -114344, 2427, 95546, -42500, -21402, 87439, -27394, -64993, 79942, 27878, -73653, 49480, 58668, -83684, 3371, 96723, -57962, -69619, 81344, 904, -90212, 54724, 57592, -101657, -32871, 69124, -39609, -46039, 60455, -19103, -77726, 41584, 26083, -76040, 8676, 51906, -61717, -16385, 87472, -24951, -71839, 65191, 34580]
212C4580j05930J06270N1394j33527J5657J08179p3060m6785R9080k3083q1668
223d8893P5946K6734r6888L1505O6385q1051q141R8303n6081p9384R7894J7228
235D3557j15580N0384R3515r8304l6177J07675l4861q1268Q5678K7362r5488L8759
247a4748O9249q0954r883Q6971n7572m8376J05765q782j02824P3359N6454j18544
259d9885R063J20031p0319p4180J08624O02j08825O4423O1663j02587L328R2918
271E4856o0990m2133Q7156l2594p8700Q9023K9770j06113M3100Q0377j03723k4554
283f4525J22653m1288r0716R4802L2058j05690L8957P9299q7820k3449R6245l3298
295A7228n3180P7979r971q5850O4241N1013r2657J1539Q8122p3721n1315J06073
$$ y = [34580, -71350, 34920, 86314, -47213, -31556, 76623, 3563, -43222, 55858, 32775, -48893, 27053, 53787, -43101, -11596, 54789, -26262, -34403, 63900, 7819, -71565, 26329, 43557, -72023, -21639, 71876, -26428, -62605, 45070, 10209, -71059, 14619, 41981, -53507, -14748, 54501, -26453, -36336, 50635, -6937, -55313, 50452, 41670, -61154, 12205, 68659, -49885, -40822, 79209, 8890, -65290, 43334, 43936, -64889, -466, 61197, -41390, -38062, 54856, -6134, -48267, 38889, 6295, -72405, 16618, 46388, -59725, -16625, 63752, -39971, -64525, 58128, 16840, -73876, 20926, 52984, -52706, -13749, 65550, -22270, -45719, 50526, 17228, -35952, 42027, 32056, -53794, 10447, 61460, -31197, -19658, 68464, -5257, -56572, 49501]
307D9501j0615j03603O3625N9223r2589L687Q5799o0390n6020Q0747K158o6068
319d4545N2616K4559q0129K6609O8004o8943k2264Q6789l1904o6866Q0941K6337
331E1204j01043K4394Q4183o5033l2355Q7220k2089p5193O0167L1591p1214K1414
343f754N3535o1055j1149P2628m2036n5498P6449O736q2719M8431N6307r0113
355c5238j2528R3998m2620o7107Q1950J8831q7152L4570N6504p2434n365P5820
367C9229m1859l8076P3514j3903o9464O3758L3547q8791K3703Q2250p0577l7736
379d4405R4185k4146q3851P1660M4593q6530J1383O7548o0714k6023P5716k6622
391A2794n6745O3993R941p1664M1377M2321q0932N74Q4993m5583n3681P7591J642
$$ y = [49501, 38886, -64717, -1092, 58131, -34458, -30771, 55028, -5362, -61382, 19365, 21523, -44545, 8071, 32630, -47499, -20890, 47114, -21829, -44093, 42696, 10792, -56074, 24867, 51204, -49839, -25445, 58738, -6295, -38650, 48570, 26481, -48712, 11455, 43046, -28168, -6754, 46781, -14274, -25423, 47205, 5169, -50329, 26120, 32856, -49863, -1432, 54875, -35238, -47766, 46232, 3612, -63495, 18455, 37286, -49866, -15296, 41208, -31226, -36591, 39229, -2630, -40706, 32808, 18905, -50559, 13199, 46746, -42045, -18342, 63908, -6669, -44405, 49780, 25634, -58217, 13443, 58036, -28494, -17111, 50437, -10277, -36300, 39416, 12794, -43951, 20042, 29983, -41681, -304, 42017, -38915, -38341, 46652, 1069, -52612, 24979, 26621]
404B6621q4484M6091N9979p0643j2506P0517l0472l9750N7658j951n7986M0369
416C443L5497n6227J0411M9602n3493k4265P3372j4379o4433N2239L3149p4171
428b9255P682O7036m8259m0718O6994M75n8794L7656K4786o0589J2593N2185m4272
441a2480j8293N8653k6107m7853O1057J2265p4642L3297O1824o4308k1154P5596
453C7855k5378n9064O0583K4506o7999K2532N1465n5683j3805O0177l0318l6768
465c1897O0014k493o1752M3003L2358p1885Q186P1517m9146m1986P2771m281p0389
478d5980M3709L8163o6078M760O1831l9939l2277N3984j1702m5360M8154J6255
490B5520n9516K6948M6231n9739j2081P0075k7306n1846O2436J8966p0952K1997
$$ y = [26621, -57863, -11772, 48207, -22436, -34942, 35575, 5103, -34647, 23011, 21060, -36926, 3443, 38940, -17287, -6876, 42726, -10767, -35032, 38340, 23961, -40472, 11767, 44916, -29255, -21573, 45463, -2796, -43514, 23480, 23955, -34839, 2817, 27603, -32986, -20393, 31792, -12480, -30773, 27880, 1773, -46080, 14977, 27242, -47400, -14103, 47721, -16587, -37741, 37855, 12477, -46587, 13996, 38502, -29497, -6965, 44500, -11183, -24988, 35189, 4871, -31897, 28117, 25624, -36128, 6875, 39233, -32652, -24466, 47051, -2095, -44081, 28690, 24409, -45980, -2271, 35892, -30186, -25426, 36405, -3534, -35811, 18173, 6471, -38889, 9265, 25520, -33996, -7048, 39183, -20556, -32637, 37438, 10132, -41714, 20722, 39688, -31264, -9267]
502i267N2874n5369j7757O3963j9011m4968M4824P165n1974K8968L0974n3871
514b3449N246N6616m1963l5049O1912o216o0611M4780L8285o4930k63O2097l7744
527a289l9599N7782L624n1692L3938K6627n1068R946M4047m1348j5038N7391j8176
540A5145m5806M9563J3942o3635K3380N1988n4087j8939O5021k0248n4437M4605
552F492J9894n3426J7025M0246m3629j0088M8249k7023l3321N0152J011m9639
564c4057L4667K9860n8852L181N9014l7821l7217O1787M597n9314K9713L5579
576C1137n0416m09N0436k7730k5208M6620p664m2895L5860J7945m9111J8226M1775
589C8566m7495j6558N7965j9293n1146M5703K5830n6228R607M5524m0507k1814
$$ y = [-9267, 43607, -11762, -29519, 34444, 15433, -29535, 15289, 22454, -29520, -552, 30422, -23449, -18203, 38413, -3550, -38599, 23313, 17097, -43514, 1266, 39551, -25379, -25642, 36455, -1289, -40888, 16894, 20518, -31174, 2764, 29391, -21677, -11731, 32316, -9032, -24070, 33321, 15145, -30661, 18902, 32844, -30791, -7411, 44577, -9510, -28449, 36572, 16324, -38113, 6492, 26386, -27040, -10015, 30231, -13398, -23486, 24763, -2260, -35581, 14571, 15582, -34057, 610, 30470, -28382, -25201, 33813, -4008, -41225, 20562, 25159, -34155, -4442, 31137, -19279, -19688, 30748, 3018, -22190, 24430, 16766, -26129, 9731, 27676, -21435, -3209, 38566, -8929, -25487, 32478, 13185, -37961, 7742, 33572, -22656, -13049, 32475, -8032, -29846]
601b9846N0749j0889l8818L7145J3136m4958J8218K9782m3244k221N0918k7959
613B013l2829N2369J256n8425L0665M1872m9313o882N1827k6321l5325M7064M971
626B2942m8791K4496K8691m0690M576L7037l7807j9559N1329j1525m3987M1729
638H441J9712n8186J1945M9812m1860k3675N6252r396m6152L7442K0125m9801
650b5341J0409L9743l2337r883M2335k2013l1002M4623L456m7817K8591L3540
662C4304m6894l282M8322k8401l4893M8318P841m9291K1659L1722m0970o200L9038
675B1273k2391k1519L9258m475l7611K9147J6138m5040J1730M2046l6511j8754
687b6709M8517j1530m3550L6695K2158m7975O520M3616k7612k0311L6481j0214
$$ y = [-29846, 20903, 10014, -28804, 8341, 21477, -23481, -5263, 24519, -18725, -20946, 29972, 2013, -30816, 21553, 22809, -35616, -4951, 36921, -12392, -19274, 32553, 6232, -29093, 17971, 22942, -25849, -1353, 27338, -13352, -8776, 28261, -9546, -29105, 22224, 10699, -33288, 8441, 28153, -30033, -18088, 31724, -10136, -33811, 22441, 13045, -33107, 4335, 24460, -25341, -14932, 24811, -7526, -17409, 24926, 2913, -28089, 16534, 19990, -27827, 764, 34304, -12590, -15872, 32450, 4049, -30844, 17474, 25315, -23976, -2317, 29405, -11565, -17765, 21273, -1118, -22637, 16621, 12146, -25465, 3682, 19820, -25220, -13490, 28556, -7955, -26709, 21808, 10278, -33272, 3423, 25581, -22394, -15874, 27742, 130, -20181, 16300, 6086]
699F086k9519L3682J1455l8028J5040K5963l5970l103M1011k3098l0343M2709
711A5885P376m7106J8854L1646m0661r456M4771j3768l0480L0205M598l5030J9346
724c820K2686l4167M89L4288k3405j7815L6711q648l6045L2660K3312m2639K196
737a4197L9957k7078k4779M1714J862l7475K2901K0953l5634K745L1838k4931
749b124j5357L5744q816k9382L1219P545m3225J7107L5244l7365j1523M5196j6183
762H080l7712L5610J4055m1964J4233L2583l3391r610L7300j6551k5140L3323
774A0816J061l2655K6188J9709m1881L211M0452k8133k1426M4686l998m1673K6482
787B839K2854l9793J875L6277k3622j9191L4459n171l0462K3674R035l1850J5346
$$ y = [6086, -23433, 10249, 21704, -16324, -1284, 24679, -11291, -14394, 26617, 3519, -26824, 15885, 23261, -23845, -4991, 26655, -14006, -23462, 21309, 7541, -22939, 7266, 11864, -23166, -3820, 18866, -15301, -14812, 19476, -3929, -21744, 14967, 6319, -29726, 2934, 26246, -16393, -14197, 25760, -1318, -26097, 15617, 17479, -19996, 2905, 23858, -11776, -9031, 22807, -2124, -17481, 18263, 9447, -19935, 11284, 18829, -24396, -7289, 27955, -9410, -20933, 24263, 8080, -29632, 5978, 20033, -21931, -7698, 24885, -8506, -18116, 19184, 2633, -22507, 10816, 11877, -20778, 5410, 25119, -16762, -13551, 26901, -1232, -22658, 22028, 18030, -23643, 2839, 25693, -14100, -12225, 24052, 430, -18761, 15698, 10527, -19935, 3739, 12774, -19076, -3730]
800c730K6205l3124q435L6311j5903k7836L4175R075l9050J3853L0149l0567j1575
813b0452L4638r980k4549K6610Q507k8548J1111J7926k6389J318L0917j8977j9127
826a6995L1751k055l2981K2635K0684l4980j031L5992j8539k4807L0723K414l2393
839a9582J7163K1038k6938j188K4460k0289j2756L0639n712k6795K4235J2107
851A6382l4025R501K9929k9337j3879L8588m862l1943K4460J4248l4180O010K9871
864B0763k1794j1105K8625j1602k2151K6942M208l0636J6446K0701l0767n28L2681
877B1783k1597k4894L5057N201l5078J7418K1786l2227l611L1315j5220j7805
889a7872K6512j258k5205J9715J2381k9893P133K6313k3798q680L3210j1293k9189
$$ y = [-3730, 22475, -10649, -19084, 17227, 1324, -26512, 7663, 16738, -22312, -8459, 21690, -8877, -20452, 14186, 4206, -20343, 6267, 14774, -13774, -2663, 15263, -11126, -9808, 21109, 2132, -16995, 14756, 12701, -20280, 2355, 23039, -11941, -12972, 23020, 4481, -20326, 10397, 12811, -19582, -2419, 18619, -8319, -9507, 14953, -5336, -18092, 12547, 6835, -19960, 4275, 16382, -17643, -8142, 21787, -7550, -21429, 17159, 12297, -19646, 4814, 19062, -15118, -9108, 20763, -1031, -12136, 16489, 4887, -17264, 9678, 13886, -16750, -304, 20397, -10370, -10898, 21783, 186, -24708, 10349, 15550, -19528, -2110, 19676, -12551, -16162, 15153, -67, -17872, 8640, 7382, -17823, 1892, 14273, -15620, -8487, 17826, -5972, -14652, 18558, 7265, -21924]
902b1924K6633J3702l2799P743K8236k3802j3590K9164o172k3292K0700Q745k5167
915a1823R683J7786k3300l704K5740j4953j7269K8939J388l1393J4820K0220k7996
928a1862l105L1253j3014k2246K4607N488k5794J2035J6615k3152Q46K4250j5082
941H39j2343K2902n782k2333K3286J2461k9823M312K6097k1870j3329L0571m597
954A0391k7317J9249J4792k6032K252K0632j8570r120K5663o285j9589J8990L141
967H197k5816J4659J9981k6171n362K9046j2000k1491K5386N725k9160J1839K2916
980A7749k2063o350K3180j0952j6243K2336K841k1879J3245J1903k3570L541K2827
993A6565j8737j2846K7655k960k5893J7838J3280k7487J964K5770j5509j4627
$$ y = [-21924, 4709, 18411, -14388, -6645, 21591, -2211, -15801, 13363, 7191, -16101, 4599, 13344, -11823, -2140, 15646, -7654, -11358, 14382, -571, -17840, 11099, 12487, -18906, -4086, 16134, -11862, -14967, 16286, 3272, -18974, 5633, 11121, -14673, -2638, 13977, -9175, -8329, 15921, 839, -11504, 11398, 5616, -16717, 6569, 19030, -10793, -6481, 19616, -2254, -15583, 14988, 10391, -16926, 2323, 17115, -8917, -6665, 13967, -4603, -13723, 11940, 5655, -13934, 5056, 8197, -17619, -2960, 17021, -9150, -14512, 14534, 2534, -18957, 6429, 12154, -17006, -5167, 17749, -4314, -10664, 12516, 1564, -14679, 7657, 10498, -11381, 1864, 13767, -9803, -6262, 16565, -2172, -15018, 12637, 9677, -16216, 1622, 14902, -12585, -10621, 15149, -360, -14987]
1005a4987K3669k458k1574J5647Q993k0755P173J7333j9047n778K3927j0326j8727
1018a6910K3406N764k6152J1487K0680k3558p916K6403p520j8598K0249O766k3163
1031i062O354J5681j7100j828J9739j2478j2960K1870j061k2427J3479J2981k3215
1044a0027J975K4812j6196j7281K2986J830k2185J2730J5007k0947j696J9964
1056A0972j1748j0702J9205l164j7638J7381R192k3867N451J9015j9340o422K6932
1069A5267p436k3583J9406J1331k5624N107K0723j8252q116K3225p291j8239J7730
1082D248L785k1382J2013J4839k1774j170K2155j5824j3680K6112j93k5448J5529
1095g90J5471k4340r64K3461j3344j2998K2139r64j9728J4305Q717k0695N746
$$ y = [-14987, 8682, 6224, -15350, 297, 9290, -11465, -4292, 13041, -6006, -11784, 12143, 1817, -16910, 6496, 12260, -13892, -2405, 18275, -5283, -13199, 13204, 5684, -12914, 7335, 14101, -9062, -2708, 12973, -4127, -5955, 13784, 1306, -11654, 10216, 9155, -13272, 207, 13188, -10027, -8052, 16760, 564, -16717, 6269, 8099, -14086, -1356, 13651, -7296, -8992, 10972, -776, -11478, 7727, 4563, -13075, 4306, 13498, -10369, -4918, 14097, -5243, -11665, 15267, 7831, -15752, 3654, 14985, -10639, -5532, 15191, -3061, -11177, 12048, 4757, -13482, 4248, 8033, -13349, -1336, 13503, -8271, -9441, 12714, -3110, -16790, 9322, 9129, -16319, -790, 14681, -9659, -10623, 12838, -506, -13504, 8635, 7671, -12057, 2248, 10965, -9730, -3984]
1108c984J7355j6519m630K1704j0479j7995K0451O352k3833Q632J8544j9369o699
1121a0470K1567p504j6764J6473N943j8176O711J2510j6511k299J7400r659r501
1134a0280J8324j913j9123J2821J2528j9923j162K0879j0457j2809J8692J327
1146H904k0279R159J3402j5091o28J5805j0495r641J5900j831j5345J3593P273
1159A0726k0203M707J7924j6531r402K1314l595j8652J5835R961k2225J395J9024
1172A0278j3284q393J9424m175j5285J4173M654j8328Q142J4500j7808k305K1376
1185A2969j1006j5402K0267K600k1923J2313J6034k0643l603K0534j0316j2732
1197a0908J7879M52j7840J2490R091j9551L195J6600j5321o655K0975n575j8166
$$ y = [-3984, 13371, -3148, -7778, 13926, 3447, -14548, 5903, 12255, -11578, -2946, 15598, -3771, -10470, 11097, 3593, -13171, 3302, 9245, -8931, -2220, 10290, -6221, -8520, 8880, -779, -10280, 8044, 6131, -12992, -171, 12357, -7566, -8728, 12151, 1694, -11115, 7577, 8904, -11375, -2216, 11186, -3905, -4533, 11272, 777, -8864, 7036, 5205, -10140, 3453, 10726, -9477, -4770, 13154, -3377, -12779, 8535, 4940, -13712, 2123, 12084, -10141, -8746, 10278, -3006, -11399, 8025, 3850, -11435, 2738, 7392, -10936, -2794, 11706, -6102, -8407, 12969, 1963, -13439, 6828, 9428, -12495, -182, 15852, -4791, -8394, 12140, 1824, -10908, 6971, 7423, -10417, 2073, 11164, -8387, -5192, 11408, -3913, -10568, 10407, 4832, -13334]
1210a3334J6899O643k2504O478J9828j6349q492J9842m806j5774J4032N938j6646
1223h245O474J3016j4643k527J6160r424j0984J7224J038j7652J0944J1268j9162
1236f513j097J8724q856j2617J5976K201j7284Q449R923j5230k91J4901q733p943
1250h390J4194l035j4320J2328P209j6748L907J6137j3974r041J8733j863j6773
1263a1636J2401R337j6623J695J5064j1613p905J6077k471j1940J1782M122j6241
1276g951O134J1790j4612k536J7703p878j3810J5836M290j9443P320J3873j5237
1289d521l495J7914p542j3615J4411K292j4348Q898R745j6315J463J5366j2414
1302b161q317J8563k349j6328J3502Q983j9491J755J7109j1944q381J8058k426
$$ y = [-13334, 3565, 10208, -12296, -5818, 14010, -2339, -10831, 9011, 4205, -11569, 2463, 8401, -8245, -1771, 11245, -3398, -5925, 10235, 811, -10173, 7051, 8089, -9563, 1381, 12649, -6513, -7610, 11114, 2258, -10359, 5617, 7818, -9466, -1017, 8906, -6324, -6615, 8286, -447, -8390, 5804, 2769, -11551, 777, 7986, -8762, -4855, 11282, -2692, -11733, 7000, 5137, -11636, 765, 10102, -6521, -4826, 10238, -1375, -9280, 6797, 4326, -7614, 4168, 8290, -7951, -1817, 9973, -4639, -7175, 10528, 2650, -11160, 4676, 8966, -10477, -3157, 10716, -4521, -8016, 9898, 2356, -11259, 3152, 5444, -8904, -6, 9739, -6576, -5113, 10253, -2161, -10478, 8085, 5736, -10592, 2910, 11893, -7598, -5843, 11266, -678, -9059, 8999, 6573]
1315F573j5717J0939O581j4884L876J2159j2427l599J5477p383j2534J4963L021
1328G045j7149R000J2047j6584l017J7219p856j2591J5525K962j5047O857R687
1341H098j4128l49J3948q688o695J4629k531j3769J1080P090j6245K991J5322
$$ y = [6573, -9144, 1795, 8376, -6508, -2632, 9527, -2900, -6499, 8978, 1595, -10939, 4024, 7045, -10104, -1104, 10943, -5641, -8658, 8561, 705, -11886, 3639, 6601, -8446, -1589, 8098, -6030, -6379, 7569, -1119, -7814, 6815, 4284, -9485, 1595, 8685, -7560, -4569, 10753]
$$ [...]
8191I1
##END NTUPLES=NMR FID
##END=
