##TITLE=1H_MeOD
 MeOD,8 sc, 
 24.9.2021
##JCAMPDX= 6.0         $$ Bruker NMR JCAMP-DX V2.0
##DATA TYPE= NMR FID
##DATA CLASS= NTUPLES
##ORIGIN= UXNMR, Bruker Analytische Messtechnik GmbH
##OWNER= root
$$ XWIN-NMR		Version 3.5
$$ Fri Sep 24 13:13:12 2021 Russian Standard Time (UT+4h)  she@DPX200
##.OBSERVE FREQUENCY= 200.1314
##.OBSERVE NUCLEUS= ^1H
##.DELAY= (6, 6)
##.ACQUISITION MODE= SIMULTANEOUS
##.ACQUISITION SCHEME= undefined
##.AVERAGES= 108
##.DIGITISER RES= 18
##SPECTROMETER/DATA SYSTEM= spect
##.PULSE SEQUENCE= zg30
##.SOLVENT NAME= MeOD
##.SHIFT REFERENCE= (INTERNAL, MeOD, 0, 15.7039)
##AUDIT TRAIL= $$ (NUMBER, WHEN, WHO, WHERE, WHAT)
$$ ##TITLE= Audit trail, XWIN-NMR		Version 3.5
$$ ##JCAMPDX= 5.01
$$ ##ORIGIN= Bruker BioSpin GmbH
$$ ##OWNER= she
$$ F:/spectra/data/she/nmr/H-F/1/audita.txt
$$ ##AUDIT TRAIL=  $$ (NUMBER, WHEN, WHO, WHERE, WHAT)
(   1,<2021-09-24 13:11:50.57 +0400>,<she>,<DPX200>,
      <continue with go, POWCHK disabled, PULCHK disabled
       configuration hash MD5:
       00 E9 B6 7A A2 85 ED C7 34 08 36 98 17 FE 4E 26
       data hash MD5: 16K
       75 4D F6 7A 9D 07 DF 59 0C 47 F7 CB 2C E5 31 A6>)
$$ ##END=
$$ 
$$ hash MD5
$$ C7 F0 03 A5 49 B3 FF E5 74 C2 96 54 97 59 B3 67
##$RELAX= 
##$RELAX= 
##$RELAX= 
##$RELAX= 
##$RELAX= 
##$RELAX= 
$$ Bruker specific parameters
$$ --------------------------
##$DU= <F:/spectra>
##$EXPNO= 1
##$NAME= <H-F>
##$PROCNO= 1
##$TYPE= <nmr>
##$USER= <she>
##$AMP= (0..31)
100 100 100 100 100 100 100 100 100 100 100 100 100 100 100 100 100 100 
100 100 100 100 100 100 100 100 100 100 100 100 100 100 
##$AQSEQ= 0
##$AQ_mod= 1
##$AUNM= <au_zg>
##$AUTOPOS= <>
##$BF1= 200.13
##$BF2= 200.13
##$BF3= 200.13
##$BF4= 200.13
##$BF5= 200.13
##$BF6= 200.13
##$BF7= 200.13
##$BF8= 200.13
##$BYTORDA= 1
##$CFDGTYP= 0
##$CFRGTYP= 5
##$CHEMSTR= <none>
##$CNST= (0..31)
1 1 145 1 1 1 1 1 1 1 1 1 1 1 1 1 1 1 1 1 1 1 1 1 1 1 1 1 1 1 1 1 
##$CPDPRG= <>
##$CPDPRG1= <>
##$CPDPRG2= <>
##$CPDPRG3= <>
##$CPDPRG4= <mlev>
##$CPDPRG5= <mlev>
##$CPDPRG6= <mlev>
##$CPDPRG7= <mlev>
##$CPDPRG8= <mlev>
##$CPDPRGB= <>
##$CPDPRGT= <>
##$D= (0..31)
0 1.2 0 0 0 0 0 0 0 0.06 0 0.03 0 0 0 0 0.0002 0 0 0 0 0 0 0 0 0 0 0 0 
0 0 0 
##$DATE= 1632474289
##$DBL= (0..7)
120 120 120 120 120 120 120 120 
##$DBP= (0..7)
150 150 150 150 150 150 150 150 
##$DBP07= 0
##$DBPNAM0= <>
##$DBPNAM1= <>
##$DBPNAM2= <>
##$DBPNAM3= <>
##$DBPNAM4= <>
##$DBPNAM5= <>
##$DBPNAM6= <>
##$DBPNAM7= <>
##$DBPOAL= (0..7)
0.5 0.5 0.5 0.5 0.5 0.5 0.5 0.5 
##$DBPOFFS= (0..7)
0 0 0 0 0 0 0 0 
##$DE= 6
##$DECBNUC= <off>
##$DECIM= 32
##$DECNUC= <off>
##$DECSTAT= 4
##$DIGMOD= 1
##$DIGTYP= 9
##$DL= (0..7)
0 120 120 120 120 120 120 120 
##$DP= (0..7)
150 150 150 150 150 150 150 150 
##$DP07= 0
##$DPNAME0= <>
##$DPNAME1= <>
##$DPNAME2= <>
##$DPNAME3= <>
##$DPNAME4= <>
##$DPNAME5= <>
##$DPNAME6= <>
##$DPNAME7= <>
##$DPOAL= (0..7)
0.5 0.5 0.5 0.5 0.5 0.5 0.5 0.5 
##$DPOFFS= (0..7)
0 0 0 0 0 0 0 0 
##$DQDMODE= 0
##$DR= 18
##$DS= 0
##$DSLIST= <SSSSSSSSSSSSSSS>
$$ [...]
##$SUBNAM2= <"">
##$SUBNAM3= <"">
##$SUBNAM4= <"">
##$SUBNAM5= <"">
##$SUBNAM6= <"">
##$SUBNAM7= <"">
##$SUBNAM8= <"">
##$SUBNAM9= <"">
##$SW= 20.0188988654967
##$SWIBOX= (0..15)
0 0 2 0 0 0 0 0 0 0 0 0 0 0 0 0 
##$SW_h= 4006.41025641026
##$TD= 16384
##$TD0= 1
##$TE= 0
##$TE2= 300
##$TE3= 300
##$TEG= 300
##$TL= (0..7)
0 120 120 120 120 120 120 120 
##$TP= (0..7)
150 150 150 150 150 150 150 150 
##$TP07= 0
##$TPNAME0= <>
##$TPNAME1= <>
##$TPNAME2= <>
##$TPNAME3= <>
##$TPNAME4= <>
##$TPNAME5= <>
##$TPNAME6= <>
##$TPNAME7= <>
##$TPOAL= (0..7)
0.5 0.5 0.5 0.5 0.5 0.5 0.5 0.5 
##$TPOFFS= (0..7)
0 0 0 0 0 0 0 0 
##$TUNHIN= 0
##$TUNHOUT= 0
##$TUNXOUT= 0
##$USERA1= <user>
##$USERA2= <user>
##$USERA3= <user>
##$USERA4= <user>
##$USERA5= <user>
##$V9= 5
##$VALIST= <valist>
##$VCLIST= <CCCCCCCCCCCCCCC>
##$VD= 0
##$VDLIST= <DDDDDDDDDDDDDDD>
##$VPLIST= <PPPPPPPPPPPPPPP>
##$VTLIST= <TTTTTTTTTTTTTTT>
##$WBST= 1024
##$WBSW= 4
##$XGAIN= (0..3)
0 0 0 0 
##$XL= 0
##$YL= 0
##$YMAX_a= 1046065
##$YMIN_a= -1235464
##$ZGOPTNS= <>
##$ZL1= 120
##$ZL2= 120
##$ZL3= 120
##$ZL4= 120
##$ABSF1= 10
##$ABSF2= 0
##$ABSG= 5
##$ABSL= 3
##$ALPHA= 0
##$AQORDER= 0
##$ASSFAC= 0
##$ASSFACI= 0
##$ASSFACX= 0
##$ASSWID= 0
##$AUNMP= <proc_1d>
##$AZFE= 0.1
##$AZFW= 0.1
##$BCFW= 1
##$BC_mod= 2
##$BYTORDP= 1
##$COROFFS= 0
##$CY= 11.3945322036743
##$DATMOD= 1
##$DC= 2
##$DFILT= <>
##$DTYPP= 0
##$F1P= 2.36226072786647
##$F2P= -0.459571619588291
##$FCOR= 0.5
##$FTSIZE= 0
##$FT_mod= 4
##$GAMMA= 1
##$GB= 0.15
##$INTBC= 1
##$INTSCL= 1
##$ISEN= 128
##$LB= 0.24
##$LEV0= 0
##$LPBIN= 0
##$MAXI= 10000
##$MC2= 0
##$MEAN= 0
##$ME_mod= 0
##$MI= 1.114404
##$NCOEF= 0
##$NC_proc= 0
##$NLEV= 6
##$NOISF1= 3.799351
##$NOISF2= 2.8
##$NSP= 1
##$NTH_PI= 0
##$NZP= 0
##$OFFSET= 15.70392
##$PC= 1
##$PHC0= -14080.4
##$PHC1= 15.00089
##$PH_mod= 1
##$PKNL= yes
##$PPARMOD= 0
##$PSCAL= 0
##$PSIGN= 0
##$REVERSE= no
##$SF= 200.130013532006
##$SI= 16384
##$SIGF1= 3
##$SIGF2= 2
##$SINO= 400
##$SIOLD= 16384
##$SREGLST= <1H.CDCl3>
##$SSB= 0
##$STSI= 0
##$STSR= 0
##$SW_p= 3612.71676300578
##$SYMM= 0
##$S_DEV= 0
##$TDeff= 0
##$TDoff= 0
##$TI= <>
##$TILT= no
##$TM1= 0
##$TM2= 0
##$TOPLEV= 0
##$USERP1= <user>
##$USERP2= <user>
##$USERP3= <user>
##$USERP4= <user>
##$USERP5= <user>
##$WDW= 1
##$XDIM= 8192
##$YMAX_p= 0
##$YMIN_p= 0
$$ End of Bruker specific parameters
$$ ---------------------------------
##NTUPLES= NMR FID
##VAR_NAME=  TIME,          FID/REAL,        FID/IMAG
##SYMBOL=    X,             R,               I
##VAR_TYPE=  INDEPENDENT,   DEPENDENT,       DEPENDENT
##VAR_FORM=  AFFN,          ASDF,            ASDF
##VAR_DIM=   8192,          8192,            8192
##UNITS=     SECONDS,       ARBITRARY UNITS, ARBITRARY UNITS
##FACTOR=    0.0002496,     1,               1
##FIRST=     0,             0,               0
##LAST=      2.0444736,     0,               0
##MIN=       0,             -1235464,        0
##MAX=       2.0444736,     1046065,         0
$$ Real data points
##PAGE= N=1
##DATA TABLE= (X++(R..R)), XYDATA
$$ [...]
877 -101531 4413 113931 84211 -63039 -162803 -94255 75538 166701 88697 -67085 -125245
888 -125245 -35994 83982 84494 -35980 -130822 -77529 77792 166969 86000 -78606 -152594
899 -152594 -66176 71707 104375 4340 -99260 -70649 62036 146083 71553 -89746 -165781
910 -165781 -74238 81588 135243 38614 -82254 -85193 29911 114667 59800 -85170 -155422
921 -155422 -64460 97077 157079 56962 -85140 -112123 -9900 91602 66232 -58275 -129750
932 -129750 -51384 100009 157299 56866 -98065 -140361 -36728 84975 88548 -20028 -102223
943 -102223 -49261 80673 138161 43246 -105708 -151356 -44499 94445 118757 13786 -86467
954 -86467 -66081 48204 110434 36541 -99725 -142969 -35608 108912 140646 29919 -93584
965 -93584 -96090 14013 92968 45414 -75649 -120516 -23753 112911 141940 25871 -110528
976 -110528 -123730 -9944 92932 70963 -41507 -99320 -26934 97247 126159 15038 -120564
987 -120564 -134780 -15231 105950 100215 -10400 -91231 -45912 65736 103571 11428 -112799
998 -112799 -127439 -8654 119096 121813 3873 -98849 -76872 32745 89959 23869 -87719
1009 -87719 -108527 -1200 121848 123492 882 -115631 -103705 12201 92963 50359 -55857
1020 -55857 -91761 -4437 107615 110461 -10142 -127986 -114778 10702 110250 81488 -31173
1031 -31173 -89865 -26074 79859 93578 -12671 -121921 -108946 17993 126370 101949 -22186
1042 -22186 -101240 -56406 51449 85054 1773 -98948 -93536 24850 129842 103971 -25367
1053 -25367 -119180 -82726 31918 91269 29990 -69404 -80482 16864 113764 91377 -32796
1064 -32796 -128973 -92956 31303 108264 59852 -46987 -80835 -5051 87935 78280 -34029
1075 -34029 -123880 -87893 40467 125395 79557 -40852 -98069 -34640 64028 74186 -19309
1086 -19309 -105503 -75613 47539 129909 81633 -48033 -117688 -59677 52019 85689 7808
1097 7808 -80843 -67924 39510 118588 71467 -56779 -129198 -69120 52331 103709 36915
1108 36915 -62724 -72357 16091 94095 59815 -54338 -123568 -65096 60273 119797 54230 -57184
1120 -57184 -89452 -12853 71214 59314 -37358 -104909 -54388 65102 125160 57073 -65009
1131 -65009 -108664 -35995 63089 73774 -12080 -82932 -50076 57812 114296 47819 -73650
1142 -73650 -120291 -45738 68441 94156 13897 -70424 -56259 37266 94800 39789 -73110
1153 -73110 -117883 -40164 78714 112321 29264 -70493 -76257 8415 77375 42656 -57134 -101984
1165 -101984 -31346 81604 116202 31484 -78472 -97055 -13411 70595 57379 -29735 -82453
1176 -82453 -29565 71885 106084 24011 -85569 -107070 -21856 75989 79039 -5982 -72538 -39704
1188 -39704 51597 87621 19259 -84325 -105222 -17087 86625 96528 8352 -75133 -60616 27132
1200 27132 75252 22419 -70647 -91992 -7480 93458 101845 7132 -86529 -80459 8541 73715
1212 73715 40006 -46187 -77374 -8009 83491 93012 1074 -94936 -92020 955 81586 63515
1224 63515 -23770 -69327 -22282 62287 77582 -1707 -91483 -89856 4791 90569 78495 -10334
1236 -10334 -73884 -42857 38779 67292 6327 -75117 -78176 10037 95232 84037 -11433 -86767
1248 -86767 -64079 21908 67619 23718 -54643 -65720 9092 87757 77796 -17687 -95933 -74809
1260 -74809 19015 78951 45265 -35827 -64363 -4028 69705 66346 -20676 -95110 -73075 23655
1272 23655 91586 62188 -27385 -71959 -25993 47596 58615 -10250 -80636 -63607 26849 96084
1284 96084 67549 -26006 -84262 -46796 33701 62328 7755 -59610 -55430 22844 87271 61380
1296 61380 -31768 -93306 -57965 30371 74651 30131 -42416 -54765 8485 70473 51948 -33148
1308 -33148 -92478 -57128 36720 88684 46720 -36422 -65305 -12008 53117 49102 -24987 -80611
1320 -80611 -49524 40936 93777 51227 -40226 -80515 -31769 43645 55307 -6225 -63110 -44431
1332 -44431 36036 85855 46523 -44365 -90237 -41051 42219 68383 16650 -49427 -46889 21387
1344 21387 71029 38604 -44184 -88760 -42414 46859 82735 32226 -43616 -58449 -430 55164
1356 55164 38252 -34120 -78061 -35460 50677 87472 35299 -47806 -73513 -18357 47705 47422
1368 47422 -15912 -63911 -31406 47061 84284 30838 -55688 -83481 -26355 50128 62865 2485
1380 2485 -53185 -37294 33717 70528 26093 -56359 -84880 -26559 57136 77469 17101 -49886
1392 -49886 -49851 12492 58346 27704 -45896 -74806 -21307 60124 82604 21353 -55854 -66255
1404 -66255 -4731 52009 38194 -26288 -61931 -19619 55213 77018 17027 -62638 -77224 -13116
1416 -13116 55236 55212 -8879 -55409 -26620 41308 67128 13012 -64009 -77604 -11530 64977
1428 64977 68287 2714 -55471 -40460 24114 57032 16453 -54811 -69888 -5923 68134 73857
1440 73857 4826 -63156 -56706 9377 55843 27484 -38825 -59958 -6327 63534 71790 597
1452 597 -70072 -67251 2103 59189 43751 -21809 -54178 -14744 49213 60535 -857 -69579
1464 -69579 -68399 2678 66870 58245 -10487 -56525 -30279 33400 54432 2487 -60891 -61507 7797
1477 7797 72451 63573 -9755 -65168 -45759 21221 55107 14760 -46428 -53167 6869 70283
1489 70283 60067 -14106 -72944 -56539 17470 61229 31254 -31887 -50899 -995 57929 52619
1501 52619 -15460 -75224 -57195 19048 70675 46792 -23574 -55999 -17072 41530 48546 -10597
1513 -10597 -66128 -52665 21720 74607 50462 -22379 -64366 -32367 31246 49917 3282 -51532
1525 -51532 -46708 19619 71105 48048 -27113 -72534 -43130 28588 59572 19508 -40361 -44724
1537 -44724 10847 60030 42337 -27760 -73814 -43706 30875 69433 30670 -33524 -50847 -3624
1549 -3624 47467 39158 -23530 -68314 -38903 34391 73699 37287 -34306 -61317 -18510 38719
1561 38719 44220 -9810 -54689 -35791 32019 71648 34947 -38048 -69583 -28323 36203 52947
1573 52947 6166 -43718 -36409 21406 60190 31082 -38787 -72518 -29557 39008 63427 18452
1585 18452 -39450 -44036 7027 49240 29251 -33030 -65301 -26732 43614 68835 23474 -41601
1597 -41601 -54664 -6577 43087 35406 -20921 -55151 -22743 41587 66900 20649 -47675 -64244
1609 -64244 -15470 44046 45647 -6313 -47021 -26481 31941 58741 18138 -48381 -66063 -15471
1621 -15471 47760 56814 5449 -43701 -35048 17713 50045 18477 -41420 -60139 -13036 50221
1633 50221 61684 10617 -46601 -48041 3984 43633 25550 -28725 -52167 -12782 47502 61357
1645 61357 9495 -52476 -55976 -3720 45398 37414 -14559 -45575 -15590 40321 53903 5725
1657 5725 -53706 -58293 -1847 52273 48279 -6182 -45753 -25882 27748 46325 6674 -49322
1669 -49322 -53747 -464 56177 54115 -2210 -49145 -38875 13548 44403 14786 -35800 -46880
1681 -46880 -127 54444 52709 -4087 -54963 -47394 7103 47044 28202 -22982 -42949 -6374
1693 -6374 43749 47950 -5131 -56604 -49515 6986 51924 39175 -14503 -43634 -16550 32712
1705 32712 41461 -2474 -51376 -47036 10747 57462 44710 -12700 -50106 -28906 22030 41183
1717 41183 5405 -41908 -41191 10843 56758 44149 -14981 -56500 -38274 17709 46796 17203
1729 17203 -31401 -38761 4469 49352 39401 -16600 -56941 -39814 19209 52603 28297 -22512
1741 -22512 -41632 -6949 38305 35959 -12926 -52786 -37691 18687 57464 35341 -21723 -49087
1753 -49087 -19474 28411 36596 -3393 -44485 -33253 19608 56698 35397 -22866 -55249 -28155
1765 -28155 25095 42284 8575 -34376 -31670 14029 50246 31077 -25623 -57992 -29601 27197
1777 27197 50554 18121 -28945 -36985 3230 40567 27917 -22376 -53140 -27772 29112 56223
1789 56223 23390 -27954 -44378 -9313 33936 30002 -13685 -44035 -24916 28313 54790 23964
1801 23964 -31013 -52894 -17326 30207 37985 -797 -36660 -24720 21585 48286 21496 -31041
1813 -31041 -54035 -20343 32772 46055 9086 -32332 -30482 10923 39840 20212 -28885 -51023
1825 -51023 -18478 35487 51567 14085 -34359 -39340 222 34927 23802 -20537 -43589 -15757
1837 -15757 34709 50795 13164 -36906 -46513 -7624 33901 30166 -10242 -37186 -17415 27583
1849 27583 45941 11673 -37806 -49264 -9720 36503 39972 559 -33859 -23248 17808 39020
1861 39020 11687 -33754 -46820 -8909 38828 45491 6646 -34925 -33481 7590 33902 17322
1873 17322 -25776 -39899 -7501 38509 44873 4564 -39038 -39327 1348 34059 24060 -15438 -34753
1886 -34753 -9254 32678 41397 2585 -40759 -43412 -942 38607 32826 -6860 -33693 -15029
1898 -15029 22996 35621 3663 -38114 -40466 -343 41608 39377 -3436 -36727 -25857 12589
1910 12589 33297 9834 -30160 -36154 397 40589 40148 -2285 -40267 -32912 5927 34109 18565
1923 18565 -20448 -31400 -3532 33727 36410 -4112 -42060 -37886 5029 38733 27935 -11485
1935 -11485 -33604 -10300 26262 32561 -2901 -38142 -35314 6985 42540 32401 -9625 -36883
1947 -36883 -19628 17631 30655 2462 -32091 -31175 7019 42415 34872 -9383 -41403 -28210
1959 -28210 13418 34365 11809 -23517 -30450 3268 37138 30954 -10709 -42891 -31359 12008
1971 12008 37841 22305 -16696 -31733 -5941 28566 29688 -8565 -41016 -30589 12266 43137
1983 43137 28681 -14099 -36479 -14339 21386 28785 -2326 -34818 -29307 13434 43109 28572
1995 28572 -16321 -42030 -22158 18444 33084 6327 -27534 -26726 8917 39996 27333 -16711
2007 -16711 -44588 -25707 18194 39838 15202 -22288 -30262 1341 33244 25879 -15896 -43190
2019 -43190 -24948 19842 42832 21426 -21533 -36135 -7396 26588 27033 -7825 -37721 -24992
2031 -24992 20068 44896 23440 -22533 -41139 -15998 23966 31794 1103 -31493 -23915 14892
2043 14892 41261 21602 -24369 -45279 -19076 24886 38130 8201 -29091 -27499 8107 35836
2055 35836 20718 -22176 -43963 -18492 28237 43438 12826 -27375 -34184 -2 31024 22253
2067 22253 -17010 -38479 -16736 28357 44230 14365 -29820 -40052 -6740 30340 28416 -7936
2079 -7936 -34338 -18684 24227 42263 13456 -31348 -43324 -9380 32270 35995 -409 -33167
2091 -33167 -22841 16626 37672 14595 -29297 -43204 -9003 33905 40859 3655 -33047 -29570
2103 -29570 9134 34863 15921 -25064 -38167 -7882 33606 41217 4407 -35052 -35887 3893
2115 3893 33957 21437 -17738 -35554 -8302 31857 39593 3168 -38864 -37854 1716 37106
2127 37106 29636 -12403 -34865 -14061 25062 35658 2320 -36419 -37360 3029 39591 33890 -7677
2140 -7677 -36073 -22547 18989 33626 6289 -31834 -35875 1553 39283 34895 -6993 -39833
2152 -39833 -27785 13821 33743 12872 -25530 -32516 645 37321 33097 -7354 -41274 -31200
2164 -31200 11414 37981 18222 -20840 -32043 -4442 31321 29867 -7450 -40971 -30596 13176
2176 13176 41598 23531 -17282 -35187 -9163 26119 29483 -4120 -36495 -28149 13425 41777
2188 41777 25219 -16270 -38815 -16193 21942 30234 1374 -29720 -25073 11422 37220 24911
2200 24911 -17523 -41044 -19120 19723 34011 9292 -24672 -25090 5721 33215 21420 -16637
2212 -16637 -39636 -20834 21181 37745 13773 -22420 -29499 132 28447 21379 -13489 -35537
2224 -35537 -16557 22031 38466 14333 -22637 -32427 -4866 24633 22480 -7608 -30772 -15803
2236 -15803 19391 35848 13575 -24802 -34831 -9049 24084 26823 -307 -27110 -18017 13470
2248 13470 31037 11827 -23230 -34362 -10190 24845 30443 3310 -23989 -20385 8065 26540
2260 26540 12556 -18942 -30018 -7976 25960 31193 5059 -23820 -24931 2012 24156 15624
2272 15624 -13286 -26025 -8128 23718 28818 4929 -25627 -26770 -2199 24460 19069 -6554
2284 -6554 -23085 -9643 18256 26436 2329 -25989 -27237 -649 24957 23316 -3115 -22297 -12712
2297 -12712 11023 21491 5181 -21171 -24285 -285 25263 23688 -1447 -21846 -17307 6084
2309 6084 19551 8109 -14992 -20469 -700 22530 23094 -132 -22906 -20246 3305 20399 12657
2322 12657 -8062 -17251 -2196 16871 18966 -699 -22924 -20740 798 21317 16443 -3637 -17454
2335 -17454 -7848 10528 16285 -147 -18377 -18452 3444 22205 18765 -2877 -18505 -12879 5273
2348 5273 15034 3420 -12074 -15216 1438 19767 17059 -2995 -19902 -16601 2632 16341 9581
2361 9581 -7353 -13183 -2050 14869 14194 -2655 -19693 -17133 3299 19076 13663 -4017 -13309
2374 -13309 -7169 9725 13210 -170 -14767 -16235 2457 18368 15525 -2550 -16073 -11449 3397
2387 3397 13286 3882 -10688 -13081 1061 16733 16163 -1159 -17921 -15256 1711 13596 9256
2400 9256 -5707 -11533 -1951 12377 13211 -2222 -17137 -15420 2082 16052 14096 -2080 -13139
2413 -13139 -6954 7313 13163 1150 -14719 -15238 1633 18534 16504 -1670 -16311 -12893 4040
2426 4040 13113 5140 -9899 -14903 -297 16681 16254 -1077 -17735 -17184 1578 15901 11348 -6194
2440 -6194 -14968 -3992 13602 14594 -1617 -18397 -18404 1671 18816 15322 -2726 -15257 -8097 7455
2454 7455 14243 740 -15526 -16391 1762 20422 17318 -3140 -18393 -13806 5890 16637 5240
2467 5240 -12212 -15698 711 20030 18197 -3329 -22672 -17574 4440 19106 11841 -8907 -17566
2480 -17566 -2225 16718 16976 -3431 -22855 -17540 4277 23501 15667 -7475 -20003 -7801 13193
2493 13193 18885 599 -21837 -18548 5409 24266 17460 -7209 -23200 -11710 10997 19407 3663
2506 3663 -17667 -17210 4496 23785 17462 -8423 -26037 -15174 10198 22234 7430 -15125 -17493
2519 -17493 1654 21417 18476 -8840 -26490 -15550 11829 25647 12492 -13534 -21240 -2836
2531 -2836 18387 17357 -6757 -24900 -15542 12499 28043 13785 -13952 -25379 -8065 16991
2543 16991 20513 -2587 -22868 -15609 11338 27838 14205 -15588 -29116 -10641 16661 23782
2555 23782 2475 -19790 -17473 7122 25032 13453 -14820 -28423 -11116 18273 27152 5601
2567 5601 -20030 -19795 3987 23108 13274 -13269 -27335 -11003 20537 28940 6233 -20772 -23244
2580 -23244 269 22289 16131 -10426 -25839 -10486 18432 28213 6678 -22135 -27631 -2692
2592 -2692 22055 19742 -4857 -23719 -11560 14956 26416 6401 -22281 -27634 -3064 24584
2604 24584 23132 -3110 -23841 -16034 11456 25119 7545 -19883 -26955 -3379 24692 25831 -1148
2617 -1148 -24339 -19884 8471 25046 10880 -17193 -25899 -2158 24984 25348 -1833 -26081 -22082
2630 -22082 5865 24332 13604 -13412 -24582 -4046 22355 23937 -1136 -26900 -21526 5393
2642 5393 25759 18046 -11609 -23887 -7828 18447 22609 -447 -25519 -22956 5906 26871 19113
2655 19113 -8371 -25823 -12352 14449 22348 2180 -21579 -21029 4622 26621 19689 -8956 -27655
2668 -27655 -15067 12619 23339 6352 -18417 -20238 3110 24244 18810 -10161 -28002 -16228
2680 -16228 12698 24931 9001 -15205 -21049 98 21507 17145 -7391 -25587 -15821 13054
2692 13054 26653 11161 -15457 -23259 -3603 18169 17345 -5982 -23265 -14147 12205 26472 10602
2705 10602 -14727 -25387 -6573 15923 19362 -1017 -19622 -14026 8411 23697 11725 -14821
2717 -14821 -24788 -8859 15281 21679 3227 -17370 -15155 6218 20707 10550 -11859 -23993
2729 -23993 -8858 16324 22595 4984 -17547 -18222 1857 18213 11340 -9891 -21531 -7123 15853
2742 15853 24081 4910 -16831 -19923 -580 17911 14191 -5945 -18573 -8019 13816 21034 4310
2755 4310 -17000 -21143 -2340 17022 16690 -2336 -17552 -9759 9685 18047 5567 -15147 -18971
2768 -18971 -3258 16651 19091 304 -16125 -13723 4092 15881 7330 -12065 -17989 -2982 16375
2781 16375 18188 2302 -16945 -15449 2715 15914 10499 -8383 -15866 -3299 14448 17072 -432
2794 -432 -16566 -16764 623 16486 12235 -5253 -14600 -6011 10021 15548 1158 -15796 -16704 593
2808 593 16664 13617 -2615 -14236 -9323 7132 13707 3583 -12369 -14754 -200 15392 14956
2821 14956 -868 -16278 -12863 3881 13081 6439 -8711 -12651 -1662 13116 14207 -1391 -16048
2834 -16048 -13736 2681 14097 9959 -5929 -12393 -4435 10844 12740 -97 -14465 -12883 2010
2847 2010 14968 12311 -3466 -11957 -7767 6439 12141 1500 -11518 -12377 2503 15477 12250
2860 12250 -3043 -14115 -10075 5341 13237 4855 -9374 -11682 436 13278 11486 -2386 -15389
2873 -15389 -11614 4424 14238 8658 -6141 -11451 -2982 10534 11387 -729 -13939 -11736 3507
2886 3507 14361 10833 -4492 -13741 -5491 7706 11197 421 -10880 -10276 2068 15012 11471
2899 11471 -2700 -15367 -7969 5413 12322 4272 -9858 -11723 727 14009 11035 -4267 -15527
2912 -15527 -10607 4937 13857 6538 -6559 -12063 -450 10674 9763 -3584 -14929 -11764 5005
2925 5005 15119 8931 -5718 -13784 -4229 8362 11319 -557 -12427 -10614 4553 15476 10126
2938 10126 -5773 -15716 -7908 6796 12474 2354 -10353 -11150 2676 14761 10518 -5719 -16800
2951 -16800 -8680 6881 14685 5337 -9067 -11601 953 12062 10044 -5009 -15732 -9839 6826
2964 6826 15976 6679 -7848 -13078 -3571 10031 9830 -3443 -14471 -9846 7367 16147 8852 -8757
2978 -8757 -16166 -4968 10020 11974 440 -12677 -9658 5761 14504 7985 -8656 -17175 -7252
2991 -7252 9569 15205 2608 -11310 -12310 3511 14782 9181 -8095 -16331 -7253 9947 17217
3004 17217 5373 -11309 -13247 -289 12641 8990 -5828 -14654 -6864 10151 17630 5617 -11103
3017 -11103 -15198 -2873 12132 11972 -2868 -14614 -8156 8579 16534 6188 -11143 -15487 -3539
3030 -3539 11800 13460 -591 -12389 -9192 6581 14603 5399 -11912 -16597 -4171 12500 15317
3043 15317 180 -13694 -12007 3679 14088 7111 -9617 -15901 -5122 13282 17380 3328 -13052
3056 -13052 -13083 1163 12824 9301 -5613 -13630 -4641 11792 14634 2780 -14101 -15709 -552
3069 -552 13015 11741 -3481 -12266 -6572 9557 15054 3191 -14052 -15764 -1711 14246 13872 -2943
3083 -2943 -12929 -9329 6207 13693 4636 -11718 -15039 -1106 14023 14630 -544 -14375 -10688 4457
3097 4457 13942 6117 -9732 -13310 -1878 13248 14114 -326 -15634 -14229 3383 15401 9744
3110 9744 -6133 -12797 -2825 12085 13599 -528 -15031 -12943 2406 15356 11375 -4634 -14261
3123 -14261 -7255 8488 13085 1147 -13018 -13690 1971 16907 12142 -4619 -16102 -8829 7349
3136 7349 13655 4100 -10860 -11970 1465 13971 11717 -5027 -15921 -9534 6181 14165 5249
3149 5249 -8960 -12881 -372 12362 11178 -4518 -16008 -10952 5856 15933 8033 -6879 -14231
3162 -14231 -3879 9187 11209 -2729 -14696 -10785 4589 15956 8908 -6808 -14926 -6508 8879
3175 8879 12513 281 -12213 -10219 3102 16023 9089 -6884 -17119 -8032 8329 14292 3211
3188 3211 -10668 -10223 2285 13362 8791 -5592 -15227 -7959 8368 15043 5590 -8590 -12714 497
3202 497 11988 8797 -4796 -14737 -7511 8228 16062 6950 -9218 -14723 -4059 10426 10263 -3225
3216 -3225 -12814 -7851 7202 15172 7593 -9944 -14663 -4945 10374 11829 598 -10948 -9503 4601
3230 4601 14769 7754 -8478 -17093 -5633 10675 13356 2974 -11372 -11022 3224 12312 7476
3243 7476 -6451 -14905 -6072 10470 14916 2703 -10964 -12015 -69 10984 9152 -4663 -13001
3256 -13001 -5721 9153 14692 4017 -11406 -13749 -1878 11334 10870 -2351 -11138 -6707 6571
3269 6571 13819 4545 -10103 -14409 -2563 12393 12407 404 -11550 -9205 4040 11831 5422 -9578
3283 -9578 -14019 -2910 12166 15125 1308 -11781 -11167 1848 11713 6060 -6992 -12819 -4096 11167
3297 11167 14431 1599 -12580 -12389 845 12115 8832 -3353 -12080 -4581 9297 12802 1454
3310 1454 -12379 -13755 17 13395 10724 -3864 -12260 -6546 6410 12051 2317 -11440 -12738
3323 -12738 123 12815 11414 -1408 -12909 -8270 5826 12121 5065 -9064 -11929 -359 12703
3336 12703 11770 -1918 -14025 -11389 4213 13315 6952 -5894 -11367 -1521 11598 11612 -1858 -13802
3350 -13802 -11882 4085 12614 9090 -4731 -11961 -5150 9540 11298 -97 -11996 -10900 2631
3363 2631 13913 10083 -4799 -13165 -6618 7661 10744 2451 -11393 -10695 2731 13871 9965 -3598
3377 -3598 -14560 -8928 4986 12597 3754 -8377 -11029 1151 12542 9850 -4431 -13872 -9600
3390 -9600 5003 13931 6779 -6513 -11248 -1851 10795 10334 -2311 -12666 -9093 5950 13961 7856
3404 7856 -6924 -12672 -5582 9602 10417 -694 -11726 -9020 4839 13510 7835 -5878 -14314 -5899
3418 -5899 7717 11502 1715 -10125 -8877 3004 13006 8185 -7100 -14423 -6376 7979 13294
3431 13294 3839 -8500 -10020 885 10508 8029 -5212 -13116 -6472 6960 13754 5873 -8103
3444 -8103 -11498 -1602 10620 9447 -3004 -10811 -6724 7286 13384 4635 -8792 -13417 -2984 10195
3458 10195 9307 -1186 -11630 -7522 4727 12345 6553 -7786 -13587 -5005 9301 13339 1233
3471 1233 -9818 -7889 2150 11580 6286 -6802 -12869 -4615 9797 12461 2554 -9913 -10354 -489
3485 -489 10339 6589 -5126 -10951 -6098 8322 13098 2985 -10835 -13043 -926 10331 9584 -2284
3499 -2284 -11119 -5591 7041 12572 5087 -10165 -12773 -1236 10268 11016 -324 -10239 -8002 4762
3513 4762 11537 4566 -8445 -11299 -2486 10809 12061 371 -10987 -9878 3549 10474 5912 -6070
3527 -6070 -11830 -2751 10675 12644 1347 -11693 -11432 1789 11321 7228 -4835 -11589 -4038 9005
3541 9005 12375 700 -10702 -11462 1161 12070 10379 -2234 -11161 -5599 7589 10596 2814 -11076
3555 -11076 -11991 -179 10720 10044 -1571 -11278 -8344 3703 10548 3184 -7939 -10552 -952 11949
3569 11949 10336 -786 -11745 -10267 3061 12464 5588 -7491 -10563 -2182 9604 10366 -807
3582 -807 -12345 -10308 2558 13101 7726 -5986 -11657 -4249 8031 9494 -1145 -12098 -9992
3595 -9992 2456 13514 8614 -4293 -12166 -4829 7866 9845 547 -9630 -9155 1385 11830
3608 11830 9428 -4507 -13428 -7802 5561 11960 3404 -8505 -9711 1067 11804 9569 -4508
3621 -4508 -13935 -8498 5467 11545 5233 -7348 -11448 -1793 9447 10449 -3704 -13704 -8286 4369
3635 4369 13534 7472 -6048 -12191 -3403 8047 10454 -1161 -12859 -7696 4148 14415 5862
3648 5862 -7159 -12763 -4642 8059 11659 1418 -9864 -7989 3938 12950 7465 -6749 -13679
3661 -13679 -6574 7127 11630 2870 -9947 -9833 2243 10475 6859 -5919 -13468 -6063 6587 12413
3675 12413 3844 -8645 -10345 -1206 9764 8835 -4229 -12561 -5801 7056 13646 4816 -9068 -12529
3689 -12529 -1339 9309 10142 -1683 -10102 -6726 5855 12552 5669 -8806 -13449 -3547 9271
3702 9271 11314 758 -9457 -8032 3673 11090 5660 -7980 -12799 -3145 9635 12023 995
3715 995 -10627 -9577 728 10215 6096 -5942 -11754 -3326 9152 11723 1739 -9577 -11521 7
3729 7 10072 7635 -3391 -10467 -4269 8076 11646 2827 -10181 -12027 -1191 10854 9597 -2258
3743 -2258 -11052 -6775 7006 11766 2954 -9966 -12047 -304 11336 11317 -835 -10963 -8645 4138
3757 4138 10725 3618 -7714 -11200 -1501 10233 11672 -119 -11061 -9461 3163 10206 5767 -6605
3771 -6605 -9939 -2727 9292 10150 -1027 -11091 -10322 1998 10685 7827 -3940 -10464 -3503 7592
3785 7592 11285 549 -10353 -10038 898 12298 8810 -4123 -10186 -5652 5461 11075 2113 -9863
3799 -9863 -10518 1853 11537 8999 -2773 -11411 -7590 4726 11570 4455 -8056 -10245 -376 9894
3813 9894 9170 -2702 -11983 -8214 3353 11188 5271 -5729 -8964 -2296 8795 9324 -1900 -11468
3827 -11468 -8423 3276 11990 6115 -4699 -9810 -3841 7737 9056 -179 -10232 -7667 2802
3840 2802 10947 8576 -4436 -11159 -5230 5820 10364 1440 -9191 -8740 2240 11133 7655 -5126
3854 -5126 -12451 -7045 6478 11568 3841 -6871 -10119 477 10040 7441 -3548 -11256 -6884 5559
3868 5559 11466 5181 -6406 -10418 -1868 7891 8315 -3093 -12138 -7055 5754 11327 6202 -6593
3882 -6593 -11058 -3968 7539 9473 -261 -8391 -7215 5207 12209 5865 -5778 -12592 -4885 7098
3896 7098 9735 1974 -8121 -7838 1546 10633 6403 -5237 -11237 -5295 7056 11474 3548 -7950
3910 -7950 -8808 306 8179 6660 -4772 -10978 -5147 5962 12545 3627 -8977 -10300 -1333 8445
3924 8445 8140 -1476 -10896 -5232 5687 11078 3823 -8103 -12599 -2798 8353 9296 -53 -8251 -6150
3939 -6150 4820 11124 3737 -7605 -11972 -4038 8704 10371 1634 -9342 -8482 2264 10226 5080
3953 5080 -6437 -10996 -2800 8075 10453 1152 -9078 -9731 1416 10554 6645 -4250 -9880 -3717
3967 -3717 7881 10956 2406 -8362 -10829 252 10360 7904 -1921 -10260 -5052 6916 9989 1581
3981 1581 -7977 -10093 -132 9534 8899 -1354 -9218 -6790 4201 9676 2585 -6553 -10143 -885 10312
3996 10312 9492 -708 -10064 -7707 3677 9190 4656 -6381 -10027 -1733 8988 9471 -636 -10479
4010 -10479 -8877 2443 9662 7436 -4555 -9282 -3166 7368 10051 -580 -10321 -8799 1036 10903
4024 10903 7588 -3353 -10338 -5023 5713 9667 1372 -8720 -8911 1116 10922 9661 -2612 -10799
4038 -10799 -6845 5883 10247 2559 -6681 -9752 971 10338 7116 -2688 -11209 -7723 3775 10508
4052 10508 4038 -6218 -10341 -1367 8385 8386 -1505 -12067 -7733 4361 10708 6492 -5383 -9090
4066 -9090 -2745 7401 8144 -300 -9372 -8194 3539 10802 6812 -5686 -11203 -3482 6368 9459
4080 9459 566 -9016 -7465 2702 10851 6202 -3845 -11257 -5361 6481 10518 1924 -7793 -9471
4094 -9471 1692 9737 6956 -3842 -11563 -5358 5798 11029 4130 -6010 -9884 -391 8763 6304
4108 6304 -3566 -10276 -5974 6110 12112 4760 -6956 -10298 -2460 8415 8291 -1019 -9147 -6166
4122 -6166 4802 10403 4451 -6708 -11797 -3124 8422 9821 64 -8449 -6396 3661 11343 5768
4136 5768 -5191 -11051 -3353 7722 11483 3061 -7779 -9070 1475 8947 6364 -5013 -10630 -4497
4150 -4497 7294 10978 3424 -8406 -10354 388 8538 6347 -4027 -10114 -4469 6604 9867 2384
4164 2384 -8474 -10517 -1669 8860 8328 -1389 -9224 -5249 5674 9567 3930 -9045 -9928 -2402
4178 -2402 8189 9561 -784 -8778 -7257 3132 10002 4835 -6275 -9956 -2431 8535 9864 118
4192 118 -10487 -8642 2111 9649 6207 -4976 -9721 -3310 8050 10044 473 -9394 -9383 654
4206 654 8770 6963 -3565 -9631 -3375 6998 10416 1476 -8688 -9325 103 9565 9192 -1465 -8915
4221 -8915 -5668 5522 9873 1803 -6889 -9233 814 9519 8938 -1801 -9003 -6369 4013 8601
4235 8601 3214 -6293 -8982 -386 9303 9978 -533 -10864 -7508 2732 9898 5318 -5437 -8896
4249 -8896 -1426 7865 9260 -813 -11067 -7321 2345 11310 7386 -3979 -10307 -3674 7081 8427
4263 8427 -342 -9574 -8092 3032 10679 7248 -3359 -10003 -5118 6381 8483 801 -9352 -9088
4277 -9088 163 10631 7579 -3123 -10700 -6587 4946 9086 2807 -7071 -8536 -504 10100 7544
4291 7544 -3100 -10775 -6655 4172 10077 5453 -5735 -8606 -43 9129 8155 -2626 -10005 -7284
4305 -7284 4730 10568 5244 -5336 -8776 -2441 7232 7944 -680 -8925 -7190 4195 10371 4454
4319 4454 -5419 -10061 -4321 7060 9900 571 -8236 -7426 2760 9406 5693 -5953 -10596 -4539
4333 -4539 6148 9793 2781 -7521 -7203 1693 8946 5235 -4303 -8651 -4672 6456 10238 1736
4347 1736 -7881 -8407 -52 7243 6358 -3557 -8479 -4310 5626 9988 3401 -6589 -9483 -1464 7623
4362 7623 7860 -1594 -8283 -6929 4820 9286 4138 -6086 -9353 -1707 7742 8862 -185 -6544 -6273
4377 -6273 2387 8267 3259 -6114 -9755 -2555 8381 9691 238 -9230 -8083 1388 7531 5088 -4344
4392 -4344 -9241 -2672 7136 8532 1820 -7786 -7003 1454 7770 6252 -2546 -8423 -3342 5691 8951
4407 8951 882 -7568 -8220 276 7644 6568 -844 -7418 -4204 3431 8765 2186 -7312 -9200 -885
4422 -885 8981 7428 -994 -8556 -5545 3324 8142 3725 -5519 -8416 -749 7601 7668 44 -8949 -6821
4438 -6821 2450 8371 3868 -3730 -7924 -1810 6428 8203 7 -8497 -7528 760 8130 4988 -3334
4453 -3334 -7746 -3814 5237 6333 830 -7075 -8601 1222 7511 6783 -1808 -7525 -4893 3232 7099
4468 7099 1241 -5691 -7378 746 8953 6710 -2844 -6932 -5394 2752 8158 3658 -4994 -7599 -195
4483 -195 6628 7428 -448 -8504 -6546 2501 8183 3922 -4146 -7745 -3112 6277 7061 364 -8101 -6516
4499 -6516 1684 8876 5684 -3464 -8451 -3834 4372 6696 1161 -6343 -6169 1214 7861 6158 -2565
4514 -2565 -9056 -4920 3390 7593 2405 -6119 -7821 -343 6807 5602 -1651 -8309 -5484 3314 7223
4529 7223 5184 -4100 -6707 -1509 6201 6984 -1699 -8573 -5983 3096 8886 4759 -4591 -8534 -3069
4544 -3069 5699 6917 -461 -6942 -6732 2580 8942 5977 -3646 -9368 -4032 4839 7449 299 -6484
4559 -6484 -7518 1592 7426 5361 -3409 -9107 -5223 5988 9239 3220 -6350 -7590 228 7357 6258
4574 6258 -2756 -9553 -5140 5733 9410 4403 -5895 -7720 -1198 7969 6563 -2604 -8965 -6177
4588 -6177 3721 11004 3793 -4798 -9552 -2606 7187 7292 376 -8153 -5534 3656 9367 4363 -5806
4603 -5806 -10011 -3826 6468 9524 -113 -8869 -6314 1723 9702 5129 -5618 -9685 -2955 7526
4617 7526 10022 1953 -7454 -7504 624 8431 5992 -3303 -9431 -4415 6362 10126 1850 -7112 -9274
4632 -9274 44 7782 8206 -2915 -9080 -3884 5898 10715 2617 -7886 -9755 -1529 8786 8744 -1989
4647 -1989 -9969 -6237 4578 9647 2948 -7433 -9890 -1266 9007 9612 362 -9866 -7309 3678
4661 3678 10651 4141 -7089 -10496 -1443 8251 10120 -1117 -10966 -8459 1858 10271 6294 -6171
4675 -6171 -10432 -2164 8167 10230 -288 -9494 -7736 2397 10163 6139 -4327 -9142 -3205 7042
4689 7042 8571 622 -9228 -7835 814 10111 7263 -3474 -10620 -5276 6789 9533 2361 -8579
4703 -8579 -8436 1676 10400 7083 -4119 -11086 -6351 5504 10513 2047 -7364 -8790 328 10367
4717 10367 7902 -3420 -10635 -6027 5838 10385 3845 -7035 -9690 580 8654 8386 -2224 -11278
4731 -11278 -6487 5638 11045 4155 -6887 -9757 -2238 9252 8523 -2255 -9470 -6950 5092 10111
4745 10111 4790 -7008 -9869 -2046 8451 8533 291 -9942 -7021 3873 10032 4443 -5824 -11008
4759 -11008 -2614 8028 10034 1431 -8596 -6280 2204 9047 5118 -5357 -10603 -3150 7413 10312
4773 10312 1298 -8254 -8313 1520 8374 6899 -5196 -9645 -2663 7084 9972 2536 -8488 -8765 1249
4788 1249 7834 6816 -2707 -8722 -3859 5750 10496 2214 -8119 -9219 209 7779 6882 -2475 -9109
4803 -9109 -4746 5276 8752 1872 -7769 -8641 -692 8882 7628 -1417 -8139 -4799 3630 7891 2299
4818 2299 -6285 -7846 -530 7635 6371 -504 -9705 -6001 2160 8645 3465 -5272 -6965 -1255 7684
4833 7684 8679 -955 -8673 -5842 2177 8029 5558 -3992 -8043 -2082 6992 6809 271 -7183 -6558 1805
4849 1805 7688 5389 -3253 -7114 -3876 4955 6918 125 -6430 -7719 1277 8529 5408 -2678 -6992
4864 -6992 -3434 3889 6566 2043 -5621 -6518 800 7154 5380 -2533 -6965 -3897 2426 7185 3114
4879 3114 -4746 -5505 519 5215 5769 -1267 -7020 -5121 3523 6746 2883 -3331 -6685 -1914 5868
4894 5868 5314 -1095 -5944 -3194 2348 6425 3301 -2911 -6508 -3063 4139 4554 359 -4443 -4045 1889
4910 1889 6346 3984 -2609 -5255 -2833 3340 5485 1642 -3999 -4318 20 4882 3566 -2966 -5924
4925 -5924 -3766 2316 6301 2123 -2131 -5211 -1312 4309 4969 -560 -5040 -2477 3006 5662 3067
4940 3067 -2965 -5472 -2157 2810 4542 -219 -4977 -3354 1404 5293 1876 -3654 -5293 -2926 3793
4955 3793 5051 1086 -3981 -3294 1539 5016 3865 -2477 -5547 -3544 2448 4841 2451 -3614 -4921
4970 -4921 -1337 4089 3118 -593 -5020 -2747 1839 5291 2311 -3428 -5362 -994 3701 5066 -30
4985 -30 -4199 -3502 1908 4943 2857 -2592 -5603 -2314 3059 6012 1786 -3665 -3602 1076 3788 2195
5001 2195 -1959 -6488 -3399 3744 5455 1465 -4821 -4655 -290 3369 4039 -829 -5532 -2689 2467
5016 2467 6415 2761 -3132 -5260 -1739 3535 4028 -140 -5007 -3655 2454 5118 2796 -3136 -6343
5031 -6343 -1464 4293 4886 -204 -4111 -5030 724 4631 3014 -2761 -6221 -2335 4087 6471 1204
5046 1204 -4347 -4864 372 5227 3131 -1588 -6757 -3138 4243 6854 2120 -4209 -6267 -470 5759
5061 5759 4389 -830 -6108 -3986 3047 6145 1859 -4716 -6454 -1439 5349 6423 -141 -5590 -5128
5076 -5128 2243 6973 3462 -3746 -7021 -1756 5957 6410 329 -5892 -5036 1402 6761 4090 -3190
5091 -3190 -6551 -2049 5581 6818 721 -7124 -6152 290 7418 3911 -2623 -7809 -3033 4918 7303
5106 7303 467 -7851 -7239 -142 6888 4283 -2080 -7030 -2834 4765 6664 1259 -5835 -6745 489
5121 489 6874 5846 -3021 -7071 -4324 3874 7195 870 -5919 -6215 373 6532 6985 -1622 -7257 -5079
5137 -5079 3482 7666 2784 -5025 -7036 -271 6650 6466 -2046 -8275 -5309 2511 7273 3262 -4994
5152 -4994 -6991 -1196 6373 6531 104 -8009 -5277 2780 8567 3410 -3442 -6915 -2207 6753 6653
5167 6653 -1159 -7785 -6678 2975 8144 4929 -4656 -8694 -2460 5933 7153 251 -6548 -7475 2011
5182 2011 8814 5164 -3777 -8365 -3340 4962 7376 1216 -5974 -6382 1325 8039 4837 -2992 -7412
5197 -7412 -3317 7297 9231 1230 -6260 -6843 660 7590 4855 -3887 -7732 -3134 5206 8896 1983
5212 1983 -5057 -6970 -394 6379 6047 -2404 -7577 -3968 5036 7918 2482 -6799 -6315 -229 6592
5227 6592 6196 -1345 -6802 -4497 2915 7187 2651 -5458 -6991 -1242 7224 7751 -1051 -6656 -5198
5242 -5198 2568 7225 2786 -4894 -7836 -1607 6436 6865 727 -7807 -5933 2687 6307 4040 -4580
5257 -4580 -7237 -1755 6003 6929 142 -7541 -5083 704 6675 4699 -3079 -6927 -2024 5804 7081
5272 7081 788 -6327 -6709 1223 7441 5107 -2228 -6435 -3472 4725 6015 997 -6190 -5660 765
5287 765 6751 5253 -2747 -6853 -3499 3098 5861 1560 -5408 -5968 -99 5787 5441 -1256 -6349 -4386
5303 -4386 3572 6085 2832 -4276 -5667 -895 5760 5649 -426 -6671 -5266 2968 6061 3758 -4652
5318 -4652 -6011 -1503 5600 4579 -448 -5177 -3940 3041 7279 3334 -3009 -6370 -2059 4667 5230
5333 5230 642 -4581 -5227 2370 5512 4101 -2715 -6089 -1610 4093 6265 472 -4165 -4747 1197
5348 1197 4695 4242 -1387 -5972 -3580 3258 6324 1907 -3690 -4941 7 4618 4255 -1621 -6038
5363 -6038 -3487 3467 6062 2539 -3524 -5502 -71 3956 3922 45 -4635 -3326 3310 5768 2915
5378 2915 -3694 -5324 -1660 3691 4741 -310 -4357 -3637 1498 5713 3079 -3359 -4798 -2489 3222
5393 3222 5434 868 -5106 -3622 1455 4655 2361 -3038 -5514 -1974 4814 5495 1517 -3882 -4990
5408 -4990 144 5930 3798 -1776 -5363 -2018 2255 5086 1093 -3852 -5241 109 4708 4039 143
5423 143 -4258 -1744 2421 5384 2454 -2855 -5689 -1352 5501 5033 -209 -3898 -3882 2220 4925 1065
5439 1065 -2610 -4657 -1523 3851 4463 941 -4794 -4225 369 4824 2554 -1998 -5146 -1281 4651
5454 4651 4395 1264 -3828 -3854 601 5206 3054 -2162 -5290 -2705 2109 4973 -8 -4496 -3992 -507
5470 -507 4676 4778 -575 -5062 -2057 1556 5290 1332 -4226 -4235 -372 4767 5139 -168 -3807 -3407 1709
5487 1709 5079 2597 -2788 -4864 -673 3940 4285 -396 -3650 -3063 1437 4876 3477 -3152 -4567
5502 -4567 -1677 4863 4535 454 -4931 -4976 1481 5108 3605 -1457 -3744 -1968 3373 4497 666 -3778
5518 -3778 -4389 932 4358 4514 -1761 -5446 -2747 2362 4279 610 -2840 -5580 468 4379 3773 -1407
5534 -1407 -5287 -3667 888 4763 1521 -2437 -3018 -281 4402 3715 122 -6480 -3958 1236 4506
5549 4506 3659 -2222 -5194 -943 3448 3738 -288 -5971 -3703 2562 4935 3212 -2957 -5111 -1888
5564 -1888 2459 3924 693 -4001 -3092 1839 5521 3740 -2840 -5482 -2117 2893 4081 935 -4288
5579 -4288 -3706 176 4979 2986 -1991 -6090 -1144 3260 3753 1413 -4011 -4279 -711 4238 3846 -1672
5595 -1672 -4605 -2254 2973 5337 2774 -3014 -5531 -424 4246 4049 -1526 -3256 -2754 1829 6093
5610 6093 1634 -3084 -4473 -816 2977 5109 -184 -4064 -3243 1696 4798 2040 -2628 -5118 -1435
5625 -1435 4059 4932 288 -4492 -3898 863 4314 2318 -2185 -4869 -1817 3566 4690 1643 -3387
5640 -3387 -3997 358 4439 2514 -1547 -4802 -2653 3519 4886 1990 -4493 -4218 666 3716 3436 -541
5656 -541 -4591 -2527 3389 4505 728 -4249 -4608 210 4629 3738 -263 -4635 -3219 3004 4975 1701
5672 1701 -3857 -5060 14 3664 3656 -208 -3754 -3083 1277 4308 2062 -3275 -4583 -859 3704 4750
5688 4750 425 -4606 -3525 1137 4451 2624 -2562 -4410 -1780 4020 4646 106 -3893 -3493 13
5703 13 4184 3729 -946 -4017 -1532 2497 3760 620 -3317 -5396 931 4887 4207 -1353 -4140 -2540
5719 -2540 2686 3069 713 -3813 -3900 429 3882 4198 -206 -5095 -3748 1413 3547 1378 -2833 -4516
5735 -4516 -678 4736 3710 -800 -5045 -3420 1385 4516 2536 -1821 -5074 52 3031 3001 235
5750 235 -3782 -2522 686 4253 2498 -2555 -5182 -1438 3567 3716 596 -4061 -3208 1947 4552 3075
5766 3075 -1790 -4695 -2196 3153 5517 283 -3689 -3764 -289 3878 3767 -1687 -4564 -2366 2703 4339
5782 4339 1690 -2865 -3871 328 4528 2646 -1020 -5081 -3255 2794 5256 3194 -2054 -4408 -523
5797 -523 3683 2797 -972 -4456 -2082 1328 4606 2898 -3234 -3657 -1286 3310 4461 764 -3906 -3604
5813 -3604 2089 3150 2806 -2856 -5193 -2120 3340 3604 -83 -4442 -3305 1788 4443 2322 -1703
5828 -1703 -5309 -2619 3495 3900 664 -3155 -4024 186 4269 2911 -2374 -4556 -1403 3410 4655
5843 4655 1789 -4127 -4223 62 3228 3375 -2045 -3228 -1712 1787 3702 966 -3514 -3839 -794 3157
5859 3157 3163 -774 -4507 -2170 2325 4972 1460 -2934 -4075 -946 4529 3826 -9 -3941 -3718 949
5875 949 4924 2651 -1895 -3789 -1036 2690 4615 -219 -4541 -2909 -425 4951 2876 -2529 -3577
5890 -3577 -1441 2589 3606 112 -2867 -2718 -358 4161 3206 -953 -4125 -1028 2470 4202 872
5905 872 -3921 -3823 -616 4266 3955 -1803 -4243 -2894 2280 3672 906 -2560 -3752 272 3825 3411
5921 3411 228 -4665 -2295 1196 2781 1775 -2761 -3693 -743 3913 3435 -284 -3277 -2829 1193 3834
5937 3834 1823 -1918 -3929 -2013 2601 4193 -87 -2729 -3018 943 2995 2796 -1957 -3773 -1515
5952 -1515 2429 2757 -298 -3182 -3512 684 4023 1875 -230 -3902 -1081 2168 3264 1115 -3408
5967 -3408 -3037 134 3848 2941 -1577 -3318 -2570 1435 3115 810 -3289 -4092 -613 2949 2431 -1458
5983 -1458 -3605 -2780 1670 3672 1733 -2854 -4031 -1072 2910 3927 135 -4009 -2760 371 3483
5998 3483 1706 -2610 -3647 -1340 3295 3491 -160 -3107 -2026 1103 4184 2453 -2279 -3596 -1329
6013 -1329 2759 3713 804 -3267 -3374 604 3782 2403 -1536 -3444 -3029 2168 2867 323 -3228 -2990
6029 -2990 428 3466 2223 -1349 -3210 -1649 1769 3789 770 -2535 -3216 -739 2550 2742 -265
6044 -265 -3267 -1959 2457 3693 2017 -2351 -3134 -959 4147 3872 -191 -2754 -2919 1414 3430 2016
6060 2016 -1954 -2781 -729 3063 4007 -611 -3270 -2313 1509 3518 1533 -989 -3173 -485 2729 3579
6076 3579 376 -2315 -2709 541 3655 2261 -766 -3320 -972 2605 3271 220 -2254 -3697 -1101
6091 -1101 3301 2132 -747 -3781 -2201 1112 3767 1091 -2978 -3265 -565 2548 2710 -678 -3322
6106 -3322 -1491 487 3544 1160 -1608 -2772 -103 2999 3316 -1150 -3803 -2853 1692 4435 1997
6121 1997 -1926 -3372 -476 2794 3098 452 -2443 -1506 1020 3513 2468 -996 -3109 -1283 2980
6136 2980 2481 -413 -3916 -2253 233 4218 1705 -2088 -3861 -1854 2605 3574 857 -3242 -2880 -627
6152 -627 3772 1992 -587 -4252 -1452 2076 3124 1131 -2354 -3103 937 2743 2686 -1102 -3331 -1856
6168 -1856 865 3347 -179 -2068 -3736 6 3427 3013 -484 -3420 -2650 2740 5030 867 -2403
6183 -2403 -4059 -926 2127 2517 25 -3211 -2653 882 3709 2598 -1649 -3194 -1049 1911 2169 -219
6199 -219 -2132 -1755 448 2934 2304 -1757 -3406 -1443 2875 3239 -204 -2824 -2984 46 2944 1459
6215 1459 -1337 -2611 -2622 2740 2743 1016 -2107 -3405 5 3455 2737 -541 -2394 -2369 1987 3822 909
6232 909 -3354 -2729 -810 2404 2975 -796 -3015 -2377 1939 3358 905 -2717 -3456 -86 1543 2929
6248 2929 -20 -2752 -1792 1132 3606 1395 -2307 -3077 -787 2062 2354 -483 -2532 -2618 1167 2690
6264 2690 1974 -753 -3761 -1346 1965 3350 1270 -2253 -2588 -549 2915 2041 -2503 -2799 -1043 1078
6280 1078 2967 -268 -2956 -2438 -344 3016 2406 -383 -2539 -1770 2310 4127 409 -2024 -2039 151
6296 151 2573 3011 -453 -2253 -2182 1741 2193 635 -2517 -3479 -583 2677 2347 -1332 -3000 -1841 2304
6313 2304 2500 1439 -1879 -2025 -46 2269 2748 964 -2830 -2673 -101 1961 2326 -1433 -2712 323
6329 323 1623 2336 -803 -2771 -2971 1021 2782 1783 -402 -2311 -629 1000 2580 326 -1879 -3046
6345 -3046 1353 2779 2351 -479 -2131 -1800 2071 2373 1073 -2522 -2189 247 3184 2797 -647 -3549
6361 -3549 -2373 984 2470 1461 -2421 -2603 -168 2494 2912 -548 -2693 -1790 437 2172 1365 -1790
6377 -1790 -3196 -1073 1406 2271 -1152 -2769 -1907 403 3685 1559 -2069 -3948 -904 2379 3228 -505
6393 -505 -2620 -2007 975 3127 1233 -1276 -2509 -484 1896 1683 227 -1539 -2838 289 1904 1635
6409 1635 -1680 -3027 -2158 1843 2813 1040 -2335 -1899 -577 2008 1871 -1336 -2379 -1673 1709 3520
6425 3520 1193 -2327 -2472 213 2028 1612 -575 -2561 -2594 1020 2793 1426 -2118 -2007 -1244 2126
6441 2126 2783 162 -1739 -1635 933 1998 804 -2236 -3087 -1820 1750 2519 -605 -2106 -2463 94
6457 94 3114 2054 -1551 -3519 309 1198 2959 187 -2679 -3220 989 2156 1959 -544 -2170 153
6473 153 1142 1966 893 -2038 -2464 626 2053 1065 -1176 -2746 -642 598 1517 786 -2573 -2141 77
6490 77 2289 2247 -1445 -2107 -1564 968 2114 1095 -2126 -2337 834 1483 2881 -257 -2329 -1828 648
6507 648 2624 1019 -460 -1721 -797 1940 2444 646 -1755 -1434 -259 1342 1040 -603 -2621 42
6523 42 904 2196 456 -1815 -2736 954 2865 2549 -644 -2305 -1780 2018 2263 192 -987 -2208 948
6540 948 3027 1392 -847 -1737 -1927 487 2287 1120 -1593 -1501 -438 1657 2095 -697 -2357 -2254 595
6557 595 1546 2187 -978 -1375 171 2028 2138 -434 -3085 -1134 405 2503 193 -1460 -1188 -134
6573 -134 1298 1748 79 -1752 -1187 181 1032 3005 -903 -2724 17 1847 1487 152 -1290 -2303
6589 -2303 903 2221 1877 -959 -2727 9 1162 2419 289 -1233 -820 -189 3006 1423 -902 -2885
6605 -2885 -790 1301 924 264 -1850 -963 377 1833 1594 -797 -3165 -374 1736 1700 539 -1972
6621 -1972 -2095 -433 2092 1360 -511 -1396 -829 852 2939 896 -1414 -1943 -156 1717 2559 -706
6637 -706 -1740 -566 952 2237 913 -1481 -1835 -1722 1892 2271 240 -1303 -1827 15 2305 572
6653 572 -146 -1651 -344 1502 2067 268 -2084 -1114 378 1725 584 -599 -2728 -544 1490 1307
6669 1307 354 -1538 -1939 676 2059 1246 64 -1936 -138 1891 2259 1397 -2385 -2119 15 2648
6685 2648 1897 35 -1217 -950 395 1175 844 -2143 -1585 -144 2038 2203 -880 -2153 -1903 1451 1632
6702 1632 427 -2253 -1948 -804 1572 2372 229 -2392 -1959 1258 1311 647 -713 -1547 -896 903 2015
6719 2015 28 -2029 -2169 -27 3171 1063 -199 -2909 -1803 1556 1681 -600 -800 -1491 -591 2942
6735 2942 1159 -1137 -2057 -951 995 1667 -57 -1737 -2073 -619 1532 1628 -757 -2267 -1031 1082
6751 1082 2089 -413 -1175 -1895 -432 2055 1256 219 -1625 -62 1100 1832 817 -626 -2267 340
6767 340 2159 2238 -353 -2424 -593 745 763 682 -553 -1598 55 2108 2135 -405 -614 -2004 39
6784 39 1246 762 -1512 -1963 -308 1717 2460 128 -1763 -2013 -393 1315 582 -1203 -2782 -892 1091
6801 1091 2264 709 -1387 -1690 -267 1957 1520 -541 -1925 -480 700 2273 520 -2223 -1644 -142
6817 -142 1239 1941 -552 -1927 -1302 1798 1757 861 -1480 -2714 319 1736 1073 -463 -1104 -1288 1167
6834 1167 1177 809 -1316 -2668 -1452 1588 1821 293 -1651 -1397 1066 1922 283 -653 -909 -956 1747
6851 1747 1763 -1032 -2103 -1776 -1096 1798 670 239 -2079 -978 1551 678 -587 -1043 -1112 562 1738
6868 1738 915 -1728 -578 -687 -22 2098 258 -1036 -1308 -1202 1423 1634 -514 -2104 -1243 595 1446
6885 1446 450 -1168 -1454 -412 2637 1796 -562 -535 -1131 2069 1581 887 -1013 -2522 7 2130 1366
6902 1366 191 -2126 -195 776 2014 1372 -1334 -643 -412 1684 1363 -911 -856 -1821 1145 1767 1163
6919 1163 -255 -2420 454 1355 1978 51 -1647 -1649 -35 1629 859 -1109 -1878 -1048 782 1611 1465
6936 1465 -1147 -1354 849 1857 1301 -590 -773 -361 1337 1886 1324 -1952 -293 258 1439 859 -962
6953 -962 -1326 -555 1479 1888 516 -1714 -1711 -322 1179 1106 -1285 -797 -2195 1178 1768 423 -1068 -1559
6971 -1559 -97 1095 1973 -332 -1258 -775 821 616 155 -701 -1238 -1063 1080 1335 671 -1657 -1288 -409
6989 -409 1532 496 -795 -1055 -884 -34 1109 1529 -1997 -295 34 1173 1716 -371 -921 -373 990
7006 990 1159 382 54 -1790 728 1234 302 435 -1294 -1183 687 2033 178 -54 -1118 -268 316 1937
7024 1937 429 -1248 -496 -114 2110 854 -138 -894 -179 1215 1358 -524 -1283 -1530 597 1192 1131 -1184
7042 -1184 -1333 -793 1450 1036 -337 -1186 -1444 386 1251 975 -61 -523 -896 1313 601 -5 497 -626
7060 -626 -581 1251 448 296 -433 -158 568 946 -87 -128 323 -502 508 2020 51 -1104 -931 656
7078 656 1619 218 -348 -636 -262 1367 740 -503 -2192 184 197 1270 1049 -1293 -700 -947 31 1118
7096 1118 -17 -1494 -819 127 1425 541 -518 -2077 113 349 1627 -574 -496 -1221 595 2102 988
7113 988 -5 -1562 -356 597 1508 351 -804 -1074 -430 1803 1425 -598 -1485 -417 437 1130 624 -586
7131 -586 -1678 -353 979 1338 420 -1486 -1028 1218 1151 80 -531 -758 -438 532 1585 250 -1127
7148 -1127 -1257 58 1513 702 -154 -673 -1096 212 2072 -446 -692 -1942 93 1942 437 -788
7164 -788 -1452 -1026 1084 1744 58 -331 -898 531 844 950 -700 -1762 845 425 2069 541 -470
7181 -470 -1440 193 624 -232 -519 -1497 -676 1213 794 386 -1064 -2591 -432 1706 1556 -63 -689 -505
7199 -505 -130 2464 426 302 -1578 -618 350 1258 -761 -2084 -182 -43 1873 1334 -1213 -1664 -943
7216 -943 1134 1459 1011 -1120 -1777 844 2048 1379 -55 -1808 -462 803 2576 -16 -579 -1676
7232 -1676 -321 1484 1403 -74 -2206 -1374 967 2286 701 -1512 -2907 -1210 2293 1305 -1110 -2052
7248 -2052 -202 1877 2921 1039 -1930 -2364 565 573 760 -848 -2258 -390 389 1139 1276 -1551 -2209
7265 -2209 98 1155 1519 -319 -1441 -1008 1075 1178 929 -1352 -2025 -48 601 1932 -336 -1522
7281 -1522 -2395 1374 1300 752 -607 -1735 570 308 1296 679 -1586 -1061 605 1373 658 -1329 -2034 -188
7299 -188 963 1682 -1129 -2262 -1467 48 2140 1228 -1262 -1735 -698 286 2034 -46 -1611 -1389 679
7316 679 2231 2188 -469 -1760 -1380 863 811 -230 -1741 -1115 65 1038 213 -867 -1585 -293 716
7333 716 1195 524 -1331 -737 -224 1317 1953 -360 -1839 -854 960 1739 1178 -390 -936 -15 944 453
7351 453 -216 -1600 55 834 2337 240 -1452 -1600 -141 1242 1269 -491 -1360 389 676 496 -444
7368 -444 -725 -1442 -1156 1418 805 -187 -2334 -1799 932 554 445 -1669 -1409 831 1497 1059 -204 -1609
7386 -1609 -1808 1213 467 682 -1099 -1373 130 27 2056 125 -354 -329 392 2816 203 -52 -1162
7403 -1162 -430 1549 1910 426 -2220 -1416 -180 1038 895 -317 -2017 -721 1120 799 -70 -1502
7419 -1502 -1501 394 914 808 -28 -2301 -948 665 1311 123 -535 -1106 661 1001 -24 -59 -858 -1322
7437 -1322 144 960 -119 -382 -1208 656 1870 594 -580 -431 -347 250 1025 551 -437 -507 -385 1397
7455 1397 895 -253 -1227 -993 -110 1128 666 -312 -1035 -228 916 765 -318 -530 -2199 148 1616
7472 1616 437 -678 -386 -409 488 917 -98 -1312 -186 113 595 1400 -680 -1463 -384 432 976 -444
7490 -444 -700 -1479 -208 1267 1331 -719 -2200 -1156 347 1968 919 -1965 206 -539 368 303 284 -755
7508 -755 -240 -222 908 281 -319 -663 -401 799 895 212 -1230 -999 35 119 896 -705 -847 -467 471
7527 471 135 -428 -605 -300 457 485 449 361 -1721 -463 506 1201 -241 -1444 -491 -551 171 540 -471 -1705
7547 -1705 -518 696 942 1428 215 -1362 359 427 1000 575 -405 -1334 972 876 850 -859 -1471 -712
7565 -712 437 1320 40 -53 -1146 1178 210 537 -673 -799 -886 612 1764 -539 -832 -1473 555 645
7583 645 585 791 -428 -1137 46 1231 243 703 -1588 -350 1053 1491 427 -1295 -497 930 174
7600 174 1192 -931 -667 -503 1075 1226 700 -906 -1166 764 -186 1361 -836 -1051 -476 863 755
7617 755 476 -457 -1670 -529 1126 350 -51 -719 -914 -61 183 -410 -987 -700 163 542 -178 -30 -579
7636 -579 -1273 1120 2289 722 -1090 -664 49 987 633 -225 -703 -493 414 1658 551 141 -1159 537
7654 537 605 864 1003 461 -568 96 1409 496 -1094 -1071 -793 897 1826 -338 -1822 -1168 -365 1340
7672 1340 635 -701 -530 37 714 1840 204 -996 -528 81 1073 1024 -686 -1394 -1385 -152 1734 -484
7690 -484 -1171 -1208 188 1257 1470 391 -1035 -715 170 732 -26 -1071 -203 -279 727 470 -242 -1594
7708 -1594 -665 338 1924 146 -1169 -406 -1181 34 959 -292 -1699 -675 555 481 -217 -108 -1483
7725 -1483 -687 307 299 -202 -1459 -1106 977 1082 -682 -541 -1618 -267 1338 1460 -326 -1827 -734
7742 -734 481 1200 338 -217 -2617 -172 604 705 378 -1316 -840 848 -26 1563 -701 -1181 -1185 1496
7760 1496 1475 -231 -1693 -1801 -1020 1220 767 -733 -903 -642 1149 1515 456 -1420 -798 -44 1637
7777 1637 963 365 -997 -1141 1165 2095 510 -25 -1530 -968 960 2189 -35 -1000 -873 590 728
7794 728 936 -139 -1412 -160 598 704 648 -1067 -628 595 780 649 -1807 -614 -380 487 749 325
7812 325 -1115 -1034 305 1089 972 -97 -1572 -616 503 988 -264 -605 -1475 434 1100 1207 163 -1283
7830 -1283 -739 1050 1136 652 -1440 -1294 -354 313 1306 362 -711 -1196 635 1293 -180 -1498 -1751 146
7848 146 266 963 -826 -964 -805 949 660 -559 -323 -988 -216 103 698 -405 -331 -1370 -772 1520
7866 1520 1080 223 -938 906 428 1369 -460 -1115 -633 550 481 518 561 -677 -825 -25 1820 -150
7884 -150 -1383 -825 888 943 1228 -409 -1238 -1534 1040 1098 -162 -773 -420 -397 474 813 77 -1097 -220
7903 -220 524 1154 622 -9 -657 -607 619 610 -396 -1506 -796 126 -12 -276 370 -1342 155 1347 1150
7922 1150 328 -1450 -1247 413 1045 297 -369 -2140 145 1442 1011 -159 -386 -838 6 592 502 -407
7940 -407 -2424 -456 813 138 559 -737 -1306 319 781 624 -198 -1837 -1336 711 871 -114 280 -1335
7958 -1335 203 1235 367 -674 -1467 -1868 -336 1616 702 -788 -1255 -473 729 821 -888 -1641 -1758
7975 -1758 1387 562 913 -1057 -1406 -514 245 1067 549 -1595 -1050 -321 332 1458 -86 -710 -461 805
7993 805 304 83 -1120 -2160 323 756 631 -109 -221 -712 -908 1063 -689 -205 -1032 -808 1786 1057
8011 1057 -488 -364 -899 425 836 -32 -727 -441 -645 -252 143 616 -1267 -134 -12 1174 743 -1130
8029 -1130 -922 -206 786 753 570 -1198 -347 147 -5 -51 -594 -1369 85 736 1649 147 -699 -273 393
8048 393 599 1365 -443 -1160 24 44 879 395 -1122 -1188 -438 -120 393 -347 -655 -897 327 324 549 -1408
8068 -1408 -596 173 651 264 15 -1110 1017 -280 -153 1574 -316 -329 74 332 1247 1257 299 -748
8086 -748 -554 1205 333 1071 -1331 -62 771 995 1182 11 -1121 -351 1380 -418 234 -988 -1175
8103 -1175 504 1028 -822 -807 -1332 270 2153 1671 -153 -1263 239 507 1108 320 256 -53 -187 505
8121 505 1485 -313 -778 -816 -29 1449 360 -583 -1382 -300 637 601 -537 655 -333 -192 1267 251
8139 251 -351 -1498 182 1272 890 396 110 -1080 465 901 -473 -410 -538 -192 -99 1240 -474 -1106
8157 -1106 -717 658 414 1462 136 127 -362 36 1245 243 -167 -824 662 1906 909 162 -880 649
8175 649 494 14 742 -67 -1521 -205 779 2036 605 -849 -588 192 1091 -392 -187 -544
8191e44
$$ Imaginary data points
##PAGE= N=2
##DATA TABLE= (X++(I..I)), XYDATA
0 0 0 0 0 0 0 0 0 0 0 0 0 0 0 0 0 0 0 0 2 -96 108 -108 108 -108 108 -117 208 -216 216 -251 324 -330 407 -436 515
35 515 -555 639 -712 789 -878 979 -1088 1208 -1342 1482 -1633 1802 -1995 2191 -2416 2660
51 2660 -2932 3236 -3569 3943 -4374 4857 -5422 6072 -6856 7803 -8971 10461 -12447 15210
65 15210 -19346 26184 -39702 76610 -408577 -1235464 -562555 481122 917378 234484 -593660
76 -593660 -620229 245617 889391 517091 -558511 -1108444 -529600 588016 1021915 386245
86 386245 -551494 -704078 13813 685799 445691 -444307 -942913 -393509 637496 1046065
96 1046065 383587 -597874 -845937 -165090 577811 508790 -249311 -736782 -310555 594474
106 594474 939624 289249 -677404 -926598 -228679 597368 646486 -48101 -601029 -330675
116 -330675 440862 766592 194018 -684259 -891466 -183135 670686 767488 73616 -573021
126 -573021 -445572 238048 606939 172340 -576837 -752253 -93575 707088 787635 81555
136 81555 -619889 -576215 75740 525525 248855 -389436 -582783 -43026 646262 696284
146 696284 15122 -670345 -645206 12071 539662 378939 -206199 -472308 -83929 496361
156 496361 550666 -47626 -663853 -618946 43452 605980 493421 -100123 -463533 -203886
166 -203886 319865 433932 -41245 -569193 -516691 107963 645487 527647 -91853 -527922
176 -527922 -339583 183799 395284 49803 -411645 -398555 130709 598144 468214 -142670
186 -142670 -586494 -416293 131174 431145 184748 -254361 -325904 72665 465693 357247
196 357247 -181889 -578084 -401555 153290 494616 294350 -159473 -330370 -48597 304804
206 304804 265856 -157971 -486455 -317438 198369 525613 329693 -151204 -395142 -178254
216 -178254 187585 248662 -61133 -348097 -228871 207819 487158 286873 -195049 -460931
226 -460931 -257228 150196 304851 71479 -220978 -191427 142732 380773 208516 -226391
236 -226391 -466779 -255399 179319 382746 179386 -152623 -223501 21359 250758 150163
246 150163 -194184 -392728 -194218 217634 420055 217571 -150914 -296491 -103242 152434
256 152434 153026 -93877 -270725 -126209 214350 385436 184962 -189163 -360579 -177789
266 -177789 125465 216067 32272 -160728 -106998 146319 290025 123068 -212336 -369301
276 -369301 -179443 155852 297477 134133 -112276 -153792 30110 184269 86729 -180179
286 -180179 -311187 -132607 196227 345774 171303 -126027 -239986 -86138 114038 111128
296 111128 -84023 -215177 -85516 193297 323010 145252 -169646 -309725 -154620 103244
306 103244 183794 35731 -125379 -82953 123548 241829 95637 -189424 -319642 -155877
316 -155877 136496 265869 128118 -89776 -136866 14158 149549 73100 -153057 -269162
326 -269162 -114801 174075 310628 158508 -111643 -224049 -90953 96363 106361 -63405
336 -63405 -187901 -80132 172168 295080 135148 -160500 -296246 -149180 101626 185463
346 185463 43080 -121726 -89734 109887 231011 96741 -183353 -313218 -147636 144924
356 144924 270770 122832 -103538 -152002 10071 156919 83162 -148009 -269147 -110910
366 -110910 183720 313312 148328 -131896 -235630 -83252 115898 120430 -65259 -196299
376 -196299 -81604 178542 298225 122317 -178474 -300478 -131377 129251 196529 30017
386 30017 -142405 -95855 121988 240619 85695 -202148 -316599 -124362 176969 278454
396 278454 96678 -138450 -159954 32355 183578 79754 -173851 -281757 -89239 218836
406 218836 321964 113349 -177768 -244619 -47316 157495 123053 -99453 -222783 -67319
416 -67319 216193 309477 87703 -226041 -306390 -84994 176292 197598 -13452 -177792 -84047
427 -84047 161533 255061 54089 -243065 -315282 -76019 223086 271727 44120 -177532 -146170
438 -146170 78073 202419 50642 -215817 -280298 -41466 260461 306842 52700 -219110
448 -219110 -224792 10293 186239 95294 -148200 -230169 -22044 260994 296493 25792 -271268
459 -271268 -283255 -17117 217680 169191 -74666 -200162 -45244 213331 252993 -4938
469 -4938 -292148 -295232 -3892 268793 239918 -26900 -210049 -106737 138688 209899 -3314
480 -3314 -262401 -261250 27759 301601 271544 -21101 -251077 -181018 74054 198520 43670
491 43670 -195816 -213196 41517 294959 256821 -47677 -295739 -232793 52012 229130 114897
502 114897 -127688 -190004 15478 249254 215553 -73998 -315291 -241019 70060 281263
512 281263 180552 -90379 -208292 -45130 184150 183829 -69252 -291374 -212907 102063 319881
523 319881 209936 -93831 -255411 -117484 131626 183829 -21619 -232292 -173343 110243
533 110243 312835 197034 -120080 -300581 -165372 114220 218481 50072 -168263 -157493
543 -157493 79627 264222 160427 -138778 -313830 -172315 128129 266772 112801 -133099
553 -133099 -178089 15875 201310 134893 -127095 -284781 -145636 154897 301429 138956
563 138956 -139057 -228717 -52291 158159 143243 -79853 -234449 -116105 163141 298393
573 298393 127550 -167774 -275346 -95644 149471 185461 -11885 -183979 -110625 131563
583 131563 258361 99166 -186934 -292047 -103178 170855 236336 45934 -157058 -138972
593 -138972 68546 201667 81163 -169689 -265672 -80556 192513 267717 73545 -164419
603 -164419 -188779 2549 163419 95896 -118004 -214743 -58291 194016 262267 64529 -189898
614 -189898 -233379 -38575 159553 139885 -53944 -172343 -59201 161321 226258 40210
624 40210 -207828 -250319 -44076 185079 194094 -1078 -158915 -94281 104275 184388 30285
635 30285 -194476 -231587 -25352 212128 226955 20190 -174112 -147402 44726 157050 52544
646 52544 -146258 -190830 -8276 211421 224623 12611 -200551 -192849 5555 158651 99282
657 99282 -83307 -154596 -16521 177175 191829 -6114 -214778 -208061 537 183226 151358
668 151358 -33956 -145183 -54746 120183 155037 -10584 -199271 -191206 17604 210028 184750
679 184750 -17752 -167049 -107485 68097 138783 14414 -157343 -158929 30506 213992 185768
690 185768 -29102 -199240 -153871 39787 150868 63707 -103856 -133369 20423 185290
700 185290 160704 -45456 -216639 -170170 37663 181252 114659 -61379 -133259 -21319 133971
711 133971 129744 -45325 -200496 -155204 52112 204998 146363 -48080 -156833 -74410 83778
722 83778 119153 -15972 -159119 -128063 62392 207437 147240 -57631 -188935 -116538 61213
733 61213 135167 31941 -111751 -109027 48207 182822 125763 -73608 -208492 -132882 66124
744 66124 171498 81899 -80779 -118316 8249 139949 104807 -72226 -198239 -121004 82751
755 82751 200134 110920 -73491 -148051 -42850 100885 100800 -43990 -161654 -99433 90046
766 90046 202585 113247 -84660 -180845 -83701 79874 122279 4554 -118106 -85666 72638
777 72638 177629 95019 -98429 -196488 -97805 85946 156624 51306 -91288 -99055 31848
788 31848 139216 77534 -96518 -188943 -88469 103332 185826 77325 -90585 -131606 -14694
799 -14694 107803 79751 -67335 -158548 -71178 112738 192941 78536 -106580 -167826 -51053
810 -51053 96462 105181 -23602 -123854 -64077 95925 170816 62526 -121409 -185114 -64319
821 -64319 105217 141446 20884 -101242 -80076 56110 136104 50868 -116402 -176006 -55671
832 -55671 121343 168835 45087 -102501 -112851 11113 108775 56469 -86377 -147429 -40390
843 -40390 128826 174146 45488 -119362 -148373 -21491 103162 84646 -45111 -119314 -37559
854 -37559 113735 157731 31068 -135965 -166316 -29967 117592 121904 -6913 -106058 -58341
865 -58341 77376 130014 22784 -133113 -160319 -21409 137771 150113 13107 -112386 -92944
876 -92944 35975 107804 32156 -104853 -136283 -9990 142043 154332 13049 -130783 -126029
887 -126029 4724 105308 61868 -63643 -111039 -12220 125326 138352 1998 -143265 -143450
898 -143450 -2254 120324 99130 -29155 -102205 -33766 91757 114958 -5154 -140636 -138516
909 -138516 6752 141831 126646 -13268 -113204 -68515 54938 100724 6906 -117095 -117688
920 -117688 18001 149301 131739 -16099 -135756 -101375 30861 104247 38023 -81200 -100502
931 -100502 13739 135411 117468 -27173 -149773 -119248 25768 123237 75149 -48002 -95259
942 -95259 -9710 102361 98316 -29250 -143562 -115546 34892 141766 100848 -35364 -108734
953 -108734 -44865 68152 86882 -15698 -120747 -96801 42169 149000 105007 -39462 -130878
964 -130878 -76159 48140 95456 15515 -89609 -82716 37315 136614 93740 -52394 -148130
975 -148130 -92054 49451 118702 48705 -65452 -85340 13736 108782 78910 -54269 -145450
986 -145450 -88728 58022 139200 74782 -56422 -102059 -21757 80848 73290 -37901 -123201
997 -123201 -74736 65823 145887 78664 -61743 -124709 -51663 63697 84457 -6634 -94204
1008 -94204 -64777 57133 133100 69618 -71590 -141418 -64899 64949 107792 26115 -73733
1019 -73733 -70842 32615 109660 57118 -73152 -139224 -62669 76843 131320 47960 -69748
1030 -69748 -90742 1740 87334 57089 -58206 -121665 -50585 85629 139615 51944 -79201
1041 -79201 -115295 -26549 76512 71882 -28127 -96920 -44924 76083 127999 43213 -89208
1052 -89208 -130953 -39872 79027 96008 4261 -79716 -53654 51494 105665 36279 -88416
1063 -88416 -129324 -36721 89993 118284 23479 -79763 -76233 19901 87167 37861 -72877
1074 -72877 -113857 -27637 98238 126744 26244 -90021 -100838 -3588 82376 54632 -45889
1085 -45889 -94518 -24161 91495 118408 18202 -102984 -117129 -12958 89692 81161 -18257
1096 -18257 -83907 -34390 69610 100403 11623 -104051 -117308 -9596 103604 102250 -1067
1107 -1067 -85272 -58140 40321 84444 16867 -86969 -102384 -2165 108501 110437 2141
1118 2141 -97752 -83006 17078 81599 36504 -59898 -85407 -1239 100016 102594 -5950 -109428
1130 -109428 -99059 9057 92713 62241 -35445 -78102 -13494 80047 87888 -11398 -111074 -99889
1142 -99889 13975 107003 82944 -23127 -85820 -38737 55697 77476 -5480 -97275 -88218 22736
1154 22736 115945 91120 -23298 -100712 -62399 36471 77044 16103 -72715 -74391 21074 106108
1166 106108 84165 -29486 -113376 -77847 30380 89373 41780 -49480 -70153 4918 86284
1177 86284 72452 -33032 -112991 -78394 34547 103935 61508 -38200 -79216 -18841 62580
1188 62580 63558 -24254 -98326 -67824 41746 112917 68514 -39946 -94744 -41855 49114 68767
1200 68767 -4210 -77896 -58719 39863 107357 63044 -48801 -109576 -55824 46048 83175
1211 83175 20550 -60469 -57764 24583 89173 52954 -51896 -109176 -55962 52463 98821 41183
1223 41183 -50707 -69851 -258 68232 48311 -40988 -95710 -48572 57280 106126 47436 -53450
1235 -53450 -86517 -22659 55455 55501 -19704 -77056 -41410 53379 99738 42803 -60959 -99152
1247 -99152 -35746 55042 71758 3488 -62186 -42694 39097 84738 34258 -64397 -101392 -34833
1259 -34833 64033 89563 20677 -58931 -57036 16782 70580 32381 -54649 -92064 -28659 69488
1271 69488 97895 26330 -62616 -74922 -5696 59977 43282 -34469 -74117 -24023 65320 92428
1283 92428 22596 -70620 -89186 -16608 60931 61301 -9684 -61809 -29455 48713 77444 18468
1295 18468 -70617 -91029 -17812 69650 77558 5637 -59787 -44186 27832 66104 19384 -61961
1307 -61961 -80806 -11783 76768 85932 9334 -66852 -62834 8714 59504 29578 -43792 -69159
1319 -69159 -8908 73031 83013 6284 -77024 -77456 -920 64125 48241 -22478 -59561 -15811
1331 -15811 57433 71304 1360 -77261 -79456 -407 73245 66105 -8449 -60466 -32705 37780
1343 37780 60950 4744 -68172 -72034 2989 79277 74248 -3531 -68479 -52628 18432 57168
1355 57168 17416 -50682 -61378 3986 76244 71365 -8961 -78117 -64204 12054 64570 36045
1367 36045 -32364 -56042 -3567 63846 62566 -12835 -81135 -68936 13525 75595 53893 -21610
1379 -21610 -60315 -20201 45135 54840 -8955 -72878 -62362 18739 82703 61655 -19432 -69997
1391 -69997 -39590 29963 54767 4009 -56747 -53539 18506 78595 60513 -22791 -79367 -53180
1403 -53180 23228 62664 25020 -39418 -51192 8170 67458 52976 -24871 -81698 -56169 26950
1415 26950 73827 40836 -31251 -55749 -9177 51689 47409 -20389 -75317 -51068 30373 83035
1427 83035 48455 -31999 -67378 -25745 39869 49687 -7552 -62151 -43163 31255 80390 46045
1439 46045 -35506 -78434 -38271 35295 60165 11078 -47560 -41963 21853 69262 39818 -38532
1451 -38532 -81797 -41454 38990 72353 26326 -40146 -50495 3625 55919 37090 -32349 -74939
1463 -74939 -38442 42791 79518 34280 -40791 -63402 -14100 45351 41903 -18707 -62763 -33082
1475 -33082 41123 78241 33401 -46992 -73898 -24124 43996 52947 -1748 -50791 -34450 33369
1487 33369 69589 27665 -49580 -78122 -26073 49787 66882 11408 -47723 -42872 17428 57899
1499 57899 25543 -44128 -73602 -21632 54117 74604 18516 -50281 -55960 119 49788 32044
1511 32044 -30288 -61799 -19991 51718 72422 17504 -55555 -66929 -9929 48978 45232 -13314
1523 -13314 -51528 -23679 41617 65566 14025 -58409 -71601 -11639 54984 58415 -965 -49646
1535 -49646 -32792 27526 55527 11549 -53068 -66432 -6771 61481 66227 4621 -54946 -46458
1547 -46458 13779 50876 20928 -40654 -58072 -5919 60350 66240 2135 -62145 -57321 5832
1559 5832 52515 33930 -25300 -50915 -10916 50809 58608 1049 -64353 -62087 2575 58484
1571 58484 47874 -13208 -49929 -21855 35346 50537 1542 -58405 -57770 5801 63548 55032
1583 55032 -7809 -55732 -36028 22234 48119 9517 -45483 -50608 7020 62808 55158 -10669
1595 -10669 -62359 -46968 15391 52792 22372 -32646 -45701 2291 55966 49634 -13733 -67016
1607 -67016 -51856 15096 59034 35806 -23578 -48545 -9011 42263 44072 -11229 -62174 -47210
1619 -47210 18342 65004 44604 -19821 -54919 -24447 30850 44363 -2646 -49874 -42865 18674
1631 18674 64800 44921 -22267 -62578 -35395 24126 48452 11544 -38387 -39401 12346 56163
1643 56163 40052 -25098 -65472 -40860 25838 57219 24322 -30892 -41962 1444 45295 35963
1655 35963 -22956 -62105 -36512 28715 64496 32002 -29097 -51225 -12302 37689 36556 -12234
1667 -12234 -52108 -31906 28915 64045 31941 -32527 -59922 -22870 31807 43698 878 -42248
1679 -42248 -31720 22860 57343 29247 -34148 -61550 -26902 33226 53174 14262 -34830 -35426
1691 -35426 10506 45505 26203 -31413 -59029 -24556 37937 60489 20422 -35426 -45792 -3769
1703 -3769 38970 29395 -21805 -51536 -22224 36698 59988 20548 -38990 -54735 -12002 37552
1715 37552 36570 -8966 -43877 -21888 30740 55056 17424 -41357 -57980 -15234 40097 46129
1727 46129 2229 -39079 -28119 20294 46430 16287 -39687 -56501 -13810 42701 53948 9226
1739 9226 -40477 -37903 7191 40427 21090 -29052 -48275 -12544 42237 54982 10297 -43901
1751 -43901 -47988 -2481 39456 30052 -16485 -42250 -12956 35642 50740 7104 -46970 -53026
1763 -53026 -3630 43260 40019 -6389 -39765 -20007 27519 43964 6408 -43878 -50828 -2103
1775 -2103 48469 46737 -1548 -42340 -31355 15938 39528 10776 -35624 -44500 -929 47713
1787 47713 48479 -2559 -48524 -40023 7997 40670 20490 -23902 -39531 -4544 41767 44551 -3393
1800 -3393 -49060 -45500 5202 44218 32203 -14230 -37760 -11666 32163 38908 -2940 -46528
1812 -46528 -42709 7321 50169 39550 -10461 -42431 -22226 21699 36834 2342 -40298 -37935
1824 -37935 8530 50166 39627 -11157 -47864 -31565 16676 38833 12295 -30339 -34069 5492
1836 5492 43840 36906 -13097 -51495 -35159 15388 43678 22810 -21504 -34211 -3758 36035
1848 36035 33400 -11385 -48942 -35817 15876 48653 29688 -17168 -39390 -14232 26176 31583
1860 31583 -4586 -41011 -31834 15722 49587 32597 -17902 -45923 -22611 20820 34570 4287
1872 4287 -31281 -28648 13455 44915 29665 -19945 -48854 -26631 21215 42425 14709 -25348
1884 -25348 -30068 4939 37354 26248 -18583 -47983 -26227 22705 46943 21271 -24101 -36195
1896 -36195 -5648 29458 26498 -11882 -40935 -23405 22474 47618 24132 -24215 -43257 -15543
1908 -15543 25534 31525 -1482 -31962 -23507 17626 43407 21521 -24981 -47019 -19959 25767
1920 25767 37023 8753 -27031 -25579 9750 36157 20458 -23416 -45034 -19295 27550 44637
1932 44637 15396 -25227 -32966 7 30006 21281 -17968 -40328 -16578 27324 45836 15110
1944 15110 -28038 -39409 -8061 27439 26304 -8548 -34226 -17629 23919 42564 14487 -31021
1956 -31021 -43056 -11111 28186 34332 1478 -30150 -22222 15809 35759 14859 -29694 -42678
1968 -42678 -11892 31537 40984 7658 -29114 -29117 6260 30496 15751 -21617 -38547 -11839 32241
1981 32241 42937 8943 -32353 -37412 -2422 30534 23779 -12785 -33928 -13038 27766 40644
1993 40644 8886 -35106 -41331 -5743 32787 30146 -4731 -31722 -17623 21462 36413 8312
2005 8312 -33621 -41667 -4915 36079 37353 1134 -32446 -24634 12227 33061 11429 -27900 -37404
2018 -37404 -2949 36233 39688 1506 -35959 -33754 5458 32304 18760 -19061 -33931 -5969
2030 -5969 32953 38208 1274 -37909 -37953 1010 35502 27144 -11849 -32519 -12498 27012 35643
2043 35643 1421 -38086 -38135 2279 40081 33492 -6851 -35343 -19911 19033 33005 4494 -33923
2056 -33923 -35022 3339 40101 36145 -7185 -39944 -27456 14244 34125 11623 -25635 -33413
2068 -33413 2528 38551 34439 -8644 -42797 -32036 10885 39041 19356 -19349 -32630 -4271
2080 -4271 33911 32153 -8222 -41596 -33040 11976 42639 26690 -16413 -36165 -12456 26127
2092 26127 30685 -2892 -37068 -30371 12824 44523 28899 -16800 -40868 -19025 21290 32789
2104 32789 3030 -31632 -28485 11014 41752 28021 -17535 -44463 -23644 21115 38283 10368
2116 10368 -27208 -28919 4790 36964 26445 -16534 -43777 -23643 22051 42319 16495 -24800
2128 -24800 -33580 -2272 32537 26941 -13765 -41488 -22267 22009 43729 18660 -25007 -39478
2140 -39478 -9853 27726 28272 -6949 -34923 -20725 19984 42591 19011 -26979 -42525 -12780
2152 -12780 27736 34636 1474 -31617 -22651 15208 38128 17698 -26830 -43059 -12340 29759
2164 29759 38506 5754 -30010 -27554 8914 33639 17168 -22995 -39388 -11685 30784 40342
2176 40342 7053 -31960 -32539 2896 31143 20009 -16648 -35169 -11133 28605 39428 6444
2188 6444 -33296 -36361 -280 31441 25911 -10518 -32172 -13371 23041 35833 5573 -32896
2200 -32896 -37732 -2064 33370 31784 -4174 -31125 -20100 16555 31822 8063 -28925 -36043
2212 -36043 -551 34957 33300 -3615 -32793 -24330 11052 29985 11156 -23270 -30138 -1005
2224 -1005 33068 31900 -3333 -34697 -26852 7974 31427 16819 -17403 -27337 -3548 28350 29314
2237 29314 -4329 -34706 -26720 7934 33511 21938 -13614 -27334 -8655 21621 24907 -2950
2249 -2950 -30436 -26075 7820 34276 24282 -10254 -30072 -13976 16489 24863 1538 -26206 -22334
2262 -22334 7107 31642 23998 -9673 -32326 -18435 13758 26105 7905 -19166 -20402 4657
2274 4657 27870 20382 -11720 -31037 -19951 13227 29009 11945 -15479 -22229 -1028 21808
2286 21808 18245 -9796 -28928 -17345 13773 30201 15164 -13601 -24656 -6820 16483 18599
2298 18599 -4279 -23143 -14674 12310 27464 14315 -14129 -27101 -11222 13764 20131 823
2310 823 -17382 -14725 7805 23140 12321 -13252 -27370 -11551 13739 23317 8302 -13980 -15959
2323 -15959 3604 17376 11062 -10791 -23792 -11492 13266 24730 9006 -13726 -19667 -2713
2335 -2713 14635 11032 -6456 -19109 -9680 13055 24046 9780 -13370 -22208 -6446 11551 15151
2348 15151 -230 -15128 -9386 9113 19491 7437 -12355 -21954 -8382 13724 18748 4125
2360 4125 -12496 -11125 3045 14543 8895 -10835 -19406 -8931 12044 20068 8008 -11390 -15227
2373 -15227 -2732 11080 8746 -5557 -15017 -7322 10463 19746 8050 -11270 -18149 -7010 10277
2386 10277 13669 138 -11619 -8788 7297 16993 7191 -12710 -19078 -7697 11797 17254 5514
2399 5514 -10667 -11628 2852 13083 7669 -9404 -18337 -6983 11077 19630 7674 -10632 -15230
2412 -15230 -3242 9176 9165 -4115 -15176 -7175 11280 18782 8512 -11142 -18613 -6867 10502
2425 10502 14749 2208 -11801 -9965 6063 16891 9565 -11612 -20501 -9215 10886 19701 6210
2438 6210 -10581 -14123 1200 13679 9704 -8634 -20038 -9187 11300 21742 8133 -12366
2450 -12366 -17760 -2788 12385 11993 -4526 -16702 -9016 11667 21025 9106 -14557 -21887 -6390
2463 -6390 11937 16293 1477 -13902 -10913 7128 21197 8684 -13992 -22675 -8093 15665 19602
2476 19602 3674 -15143 -14935 4150 17675 9149 -12085 -23157 -8343 15378 23252 6823 -16384
2489 -16384 -19889 -845 17076 12899 -7921 -20932 -8376 16273 24283 6517 -17788 -23683 -3527
2502 -3527 18939 16623 -3471 -18782 -10365 12704 23283 6918 -18809 -24882 -4298 20644 21503
2515 21503 -288 -19225 -14372 8832 21045 6629 -17246 -24017 -4239 22073 24186 1110
2527 1110 -21770 -18107 5146 21451 9353 -14043 -22316 -4783 20999 24804 1120 -23223 -21819
2540 -21819 2679 22787 15077 -9954 -23514 -6411 19540 24549 255 -25565 -23879 1899
2552 1899 25718 19400 -7409 -22977 -10224 15819 22197 774 -23824 -23472 2747 27511 21739
2565 21739 -5630 -25169 -15392 12281 22242 4271 -21853 -22693 2978 27033 22417 -6256 -28640
2578 -28640 -16875 10387 24421 9050 -16986 -22214 373 25082 21121 -7707 -29757 -19128
2590 -19128 10497 27433 12241 -15381 -23649 -3212 20798 20712 -6058 -27651 -19901 10406 29826
2603 29826 15352 -14272 -26377 -7832 18985 22280 -2358 -24760 -18190 11335 28709 16082
2615 16082 -14122 -27570 -10750 17780 22821 1270 -22282 -18072 8678 27390 15459 -14731
2627 -14731 -28828 -12763 18070 25963 5554 -20098 -20491 4918 25054 14568 -13907 -29040
2639 -29040 -10852 18255 28022 7368 -20526 -22496 594 22190 15479 -10857 -26504 -11185
2651 -11185 17639 28114 7536 -21622 -25702 -1985 21436 18555 -6603 -22864 -12119 15396
2663 15396 27001 7178 -21384 -26416 -3451 21220 21558 -2590 -21800 -13877 11098 24836 7118
2676 7118 -20397 -26508 -3651 23274 24357 -1538 -22278 -17859 7839 22514 8955 -17150 -21832
2689 -21832 -3138 22070 23913 -42 -22094 -19162 4700 20811 11831 -12427 -22216 -4617 20304
2702 20304 22918 585 -24349 -21031 2780 21092 14077 -9579 -20750 -6282 16758 20071 482
2715 482 -22273 -20895 2054 22517 17275 -6743 -21342 -9860 11775 18508 1386 -19615 -18578
2728 -18578 2993 22910 17324 -6113 -22713 -14316 9776 19542 5838 -15903 -17337 1642 21172
2741 21172 17887 -5729 -22439 -15464 8718 20900 8790 -12950 -17532 -1110 17323 15212 -4885
2754 -4885 -21238 -14935 7974 21326 11411 -9571 -17957 -4583 14095 15162 -2983 -19128 -14264
2767 -14264 8384 20975 13168 -8613 -19979 -8459 11323 15683 1194 -15170 -13005 6374
2779 6374 19860 12219 -9408 -20127 -10965 9804 17297 4225 -12900 -13730 2433 15351 10643
2792 10643 -8079 -19361 -9690 9478 18540 7942 -10889 -14926 -807 13590 9760 -5582 -17291
2805 -17291 -8555 9672 18186 8690 -10538 -16784 -3310 11066 12015 -2559 -14240 -9477 7007
2818 7007 16774 8035 -9062 -17848 -7581 9637 13816 1675 -12269 -9911 4273 13896 8270
2831 8270 -8767 -17405 -7101 10712 15636 3712 -10070 -11391 337 12034 8936 -6262 -14664
2844 -14664 -7446 10118 16380 6055 -10711 -13983 -2607 10601 10450 -3034 -12632 -6062 9170
2857 9170 15976 5316 -10127 -15318 -4259 10811 12307 283 -10437 -7790 6055 13598 5534
2870 5534 -10098 -16207 -4233 11278 13856 3247 -10962 -9859 1980 12657 6840 -6534 -14169
2883 -14169 -5930 11081 16235 4218 -10830 -12403 -765 11011 9146 -4439 -12055 -6586 8619
2896 8619 14942 5100 -11379 -14396 -2415 11153 11456 -935 -10846 -7234 7060 13738 4638 -10303
2910 -10303 -15067 -4121 11456 14175 2135 -10740 -10485 3002 11835 5756 -7963 -14143 -3413
2923 -3413 11474 14982 2229 -11375 -12549 30 11507 8595 -4814 -12112 -4891 10839 14772
2936 14772 3324 -11788 -15688 -2002 11756 11341 -2161 -11990 -6946 7638 14070 3577 -11663
2949 -11663 -14823 -2312 13594 13099 1049 -12630 -9379 4725 12453 5965 -8684 -15010 -2489
2962 -2489 13537 14025 994 -14305 -12591 2048 13186 7555 -7940 -13982 -3590 12381 15174
2975 15174 -228 -14840 -13482 566 13406 9967 -4614 -13938 -4149 10668 14764 1417 -14025
2988 -14025 -14401 382 14077 12197 -2414 -12536 -8607 6248 13634 1914 -12358 -14552 -201
3001 -201 15719 13833 -2149 -15121 -10522 5898 13831 5383 -10184 -13406 -1155 14268 13350 -2431
3015 -2431 -16411 -13154 4304 14449 7493 -8466 -13124 -2968 12173 13094 -1589 -17306 -13530
3028 -13530 4397 16491 10630 -6409 -14331 -4512 10637 11598 -913 -15138 -12481 3915 17392
3041 17392 11153 -5311 -15827 -8430 8519 13888 1467 -12313 -11245 2199 16999 10432 -5293
3054 -5293 -16089 -10441 7100 14864 5653 -10264 -12593 -784 13917 11507 -5627 -15891 -11054
3067 -11054 7486 17034 6622 -8219 -14089 -2188 11951 12916 -4237 -15732 -9653 7625 16820
3080 16820 8034 -8108 -15141 -4658 11402 11967 -1209 -13431 -9750 6336 15864 9008 -8646
3093 -8646 -16388 -6161 9046 13911 1503 -12752 -10784 4452 14338 8413 -8798 -17468 -7212
3106 -7212 10102 15752 4382 -10476 -12737 1896 13413 8221 -7197 -16192 -7874 10480 17249
3119 17249 4847 -11278 -14531 -230 12967 10219 -4797 -14432 -6530 8736 16053 6183 -11591
3132 -11591 -15749 -3219 11283 11630 -2206 -12570 -8894 6330 15758 5921 -10767 -16550 -3914
3145 -3914 12493 14378 1056 -12537 -9009 5021 13438 5999 -10576 -15898 -2909 12392 14354
3158 14354 2242 -12343 -12440 1720 12122 6347 -7954 -12616 -4609 12212 15922 2390 -13785
3171 -13785 -13957 383 12993 10662 -4354 -13594 -5891 10323 14336 2187 -13475 -14683 -711
3184 -711 13514 12311 -2882 -12564 -7199 7115 13817 3299 -11706 -13818 -1093 14008 12861
3197 12861 -1344 -13067 -9444 3761 12936 5106 -8712 -13227 -1823 13253 12738 -1563 -14346
3210 -14346 -11868 3527 14134 7130 -6965 -11465 -2609 10476 12529 -262 -13660 -12932 3083
3223 3083 14475 8951 -4844 -12301 -4404 8745 12137 388 -12286 -12016 2175 14432 10968
3236 10968 -2824 -14105 -8310 6712 11543 2386 -10268 -11782 1642 13338 10944 -3590 -14429
3249 -14429 -9860 5766 13037 4715 -8731 -11356 319 11808 11841 -2590 -14539 -10539 5000
3262 5000 14021 8396 -7371 -12056 -1667 9973 11555 -2787 -13978 -11067 5084 15741 8703
3275 8703 -5977 -13645 -3894 9114 10714 -214 -12578 -9508 3897 14338 10239 -7116 -14005
3288 -14005 -7250 8476 12205 2253 -10921 -10835 1994 14075 9030 -6141 -15899 -8087 7437 13863
3302 13863 5116 -9769 -11077 -524 12351 9708 -4914 -14874 -7297 7117 15112 6817 -7767
3315 -7767 -12398 -2442 9646 9946 -2171 -12343 -7439 6032 15178 7132 -8270 -14462 -3679 8706
3329 8706 11264 1141 -11181 -8868 5471 13120 7266 -8216 -15354 -4777 9126 13783 3377
3342 3377 -10280 -9620 3464 11742 7217 -6620 -13660 -5744 9321 14440 4213 -9778 -12975 646
3356 646 11452 9026 -4861 -13116 -6377 8633 14690 3992 -9302 -11858 -1554 10422 9963 -3476
3370 -3476 -10280 -6434 6791 13308 4947 -9028 -15011 -2421 10254 11207 -794 -11969 -7717 5059
3384 5059 11516 4964 -8205 -13019 -2734 11278 13244 999 -11526 -10408 3146 11571 6190
3397 6190 -6680 -12277 -3446 10697 13149 1428 -12118 -13090 212 11127 7490 -4737 -11493
3410 -11493 -3931 9463 11631 1516 -12389 -12703 376 12082 11119 -2287 -12278 -5846 7593
3423 7593 11226 2543 -10601 -13075 -146 12599 12067 -2125 -11443 -7270 5196 11447 4382 -9055
3437 -9055 -11940 834 11382 11801 -1070 -11834 -10016 2849 11743 5235 -6711 -10955 -2192 10452
3451 10452 11085 -917 -13008 -11261 1685 12394 8008 -5970 -11055 -4389 8397 11699 -1219
3464 -1219 -12091 -11326 2286 12966 9907 -4435 -11830 -5529 6988 10695 1455 -10487 -11023 3009
3478 3009 12315 9837 -3767 -13167 -7735 5195 10995 4224 -9228 -10196 184 12299 10466 -3351
3492 -3351 -12717 -8568 5636 11893 5404 -6737 -10498 -1334 10130 8876 -3007 -12323 -8950 4735
3506 4735 12928 8295 -6469 -11906 -3651 7808 10512 -507 -11396 -9263 3595 13010 7786 -5407
3520 -5407 -12800 -5861 7009 12214 1620 -10516 -8801 2196 11725 8349 -5832 -13454 -7026 7249
3534 7249 11976 4303 -8103 -10731 348 11006 8417 -4641 -13096 -7308 7072 13560 6366 -7987
3548 -7987 -10591 -2327 9366 9479 -1868 -11052 -6610 6587 13545 5867 -7734 -12532 -3717 8982
3562 8982 10086 -708 -10819 -7441 4668 13104 6938 -7504 -12940 -4967 8402 11892 1388
3575 1388 -11004 -9065 2335 11666 6770 -7020 -13361 -4637 8676 13673 2804 -9270 -9800 -101
3589 -101 10082 6622 -5196 -13047 -5472 7958 13851 3773 -8873 -12439 -1294 9412 8603 -2736
3603 -2736 -11596 -5599 8236 12971 4021 -9379 -12672 -2145 10425 10516 -1753 -9955 -8058 6166
3617 6166 12504 3914 -8428 -12701 -2342 10390 11542 458 -10772 -8953 2990 10720 4907
3630 4907 -6484 -13097 -1854 9430 12765 936 -11348 -10155 1482 11567 7439 -5329 -10731
3643 -10731 -4869 8895 12462 1118 -10732 -11509 392 11808 8297 -2937 -10798 -4894 6306
3656 6306 10953 1571 -9054 -11868 21 11665 10335 -2898 -10896 -7864 4917 10815 2880 -8853
3670 -8853 -10978 -896 10408 11734 -1429 -11258 -9138 3708 10845 5447 -7759 -10006 -1045 11144
3684 11144 9915 -1966 -13081 -9379 2508 12259 7030 -5538 -11332 -2506 9783 11449 -1581
3697 -1581 -12502 -10709 2540 12335 8468 -4171 -12321 -4794 7122 10464 1005 -11162 -10299 2489
3711 2489 12890 8531 -4055 -11437 -6141 5597 11249 2631 -9185 -9211 952 11610 9445 -3571
3725 -3571 -13058 -7634 5074 11968 4432 -7899 -9496 -998 11139 9077 -3234 -13824 -8374 5352
3739 5352 12845 5935 -6626 -11487 -2701 9284 9796 -1977 -11405 -8753 4926 13432 7530 -5650
3753 -5650 -12055 -4399 8118 10291 -537 -8810 -8175 3976 12514 7664 -5402 -12248 -5006 6596
3767 6596 10523 2790 -8974 -8542 2257 10250 6943 -4458 -12361 -5946 8609 12515 3617 -8186
3781 -8186 -9746 -53 9925 8215 -3735 -11288 -5958 7465 13088 4603 -9076 -11408 -1590 9102
3795 9102 8469 -2429 -9521 -6953 6201 12844 4956 -8022 -12416 -2762 9488 10399 -4 -9486
3809 -9486 -7110 4133 11874 5232 -7795 -11632 -4295 8471 10937 719 -9635 -8297 1912
3822 1912 9941 6788 -5523 -10675 -2729 7690 11823 1643 -9791 -9848 1355 9366 7390 -4195
3836 -4195 -10663 -4627 7545 12186 2328 -8697 -10508 -314 9809 7855 -2515 -10658 -5523 5669
3850 5669 10696 1749 -8303 -10607 -1766 10044 10027 -1029 -9713 -6326 3907 10700 3951 -7044
3864 -7044 -10676 -2011 10043 11039 -391 -10278 -8623 2213 9956 6010 -6155 -9609 -2057 8433
3878 8433 10993 487 -10267 -9478 1907 10470 6784 -3848 -9427 -2733 6573 10208 1196 -9646
3892 -9646 -10093 1501 10885 8829 -3161 -10918 -4969 5670 9359 403 -8609 -9541 260 10643
3906 10643 9197 -2907 -11266 -7178 3554 10001 3438 -7741 -10366 -737 10309 9189 -2121
3919 -2121 -10888 -7547 3705 10592 5722 -6437 -9590 -1407 9075 9895 -425 -11508 -8368 2880
3933 2880 11255 6017 -4816 -9656 -2930 7068 8869 -862 -10598 -8855 3524 12198 7616 -3515
3947 -3515 -10302 -5600 5888 9509 2564 -8483 -8939 2370 10884 8152 -3435 -12376 -6539 5741
3961 5741 10164 3142 -7289 -8365 550 10846 8536 -3505 -12713 -7095 5405 10352 5096 -6003
3975 -6003 -9661 -1907 8665 8811 -2714 -10759 -6924 5000 12001 6454 -6912 -10851 -3842 8163
3989 8163 8510 -500 -9632 -7112 3730 10700 6144 -6147 -12263 -4071 6904 9197 1306 -8209
4003 -8209 -7435 2329 10701 6656 -5664 -11776 -3786 6521 10749 3487 -8577 -9158 149 9006 6777
4018 6777 -3829 -10532 -5182 7150 11296 3790 -7800 -10085 -89 9549 8306 -2691 -9912 -6246
4032 -6246 5653 11521 4270 -8494 -11037 -1819 8756 7884 -1497 -8815 -6000 4573 10100 3721
4046 3721 -7066 -11647 -3505 8266 9509 405 -8109 -7251 2388 9960 4943 -6302 -10812 -2662
4060 -2662 7895 11733 697 -9322 -8713 1864 8870 5635 -4945 -10024 -2890 7202 10262 1666
4074 1666 -9346 -10632 -524 10072 7720 -2474 -8717 -4469 6643 10153 1782 -9735 -11119
4087 -11119 -736 9986 8468 -1016 -8306 -6440 5035 10094 2489 -9372 -9422 -1112 8964 9925
4101 9925 -842 -9759 -7647 2887 9210 2725 -6819 -9926 -1540 9328 8525 -299 -10773 -7442
4115 -7442 1443 8945 5687 -4868 -9347 -2782 8642 9612 502 -9942 -8781 1253 10330 6985
4129 6985 -3068 -9633 -3893 6424 9542 1029 -10021 -8824 420 10445 7840 -3439 -10024 -5496
4143 -5496 4795 8975 1792 -7989 -8899 1207 10456 8588 -3277 -12013 -6391 4213 10490 3619
4157 3619 -5660 -9347 -394 9243 8597 -1866 -10892 -7414 3875 10221 5778 -5647 -10389 -1825
4171 -1825 7923 8096 -1121 -9599 -7852 3459 10147 6090 -5141 -10103 -3653 5906 8749 -414 -8432
4186 -8432 -8013 2780 10750 6510 -4624 -10718 -5388 6367 10476 1980 -7198 -7726 1492 9886 6787
4201 6787 -4003 -11033 -6338 5404 10876 2822 -7238 -9342 29 9680 8162 -2659 -10692 -6693
4215 -6693 5267 10668 4929 -6457 -10376 -1562 7804 6888 -2244 -8666 -6326 4953 11200 4612
4229 4612 -7059 -10928 -2510 6678 8850 832 -8585 -6535 3892 9460 5935 -5622 -10269 -4237
4243 -4237 7644 9952 1846 -7766 -7969 1999 9123 5368 -5284 -10357 -4080 7017 10914 2689
4257 2689 -7985 -9063 -851 8570 6517 -4429 -9832 -4353 6479 10553 2228 -8696 -10072 -1113
4271 -1113 8715 7657 -2336 -9343 -5307 4805 9639 2723 -7628 -9816 -1589 9437 8994 -850
4285 -850 -9477 -5158 3774 9150 3881 -6252 -9531 -2615 9267 9428 -450 -8732 -6848 2115 8516
4300 8516 4451 -5724 -9143 -1626 8760 10244 128 -9564 -8376 1210 9068 6020 -3868 -9376
4314 -9376 -2364 7469 10321 1838 -9881 -8864 1025 9539 7087 -4236 -9917 -4412 5653 9491
4328 9491 586 -8510 -9206 3 8431 7590 -1645 -10061 -5372 3518 8153 2161 -6477 -8848 602
4343 602 7783 7320 -1835 -9386 -7164 3896 8803 4088 -5424 -8915 -1392 7835 8192 -819 -9241
4358 -9241 -7259 3509 10092 4843 -5185 -8972 -1624 7227 8018 -538 -8147 -7435 2686 10125 6673
4373 6673 -3098 -10017 -2886 4994 8226 -181 -8540 -6571 1772 10806 6072 -3282 -9765 -5068 4389
4388 4389 8529 2224 -7558 -6992 -104 8660 5941 -2897 -10076 -5080 4731 8709 3900 -6097 -8408
4403 -8408 -93 8143 6905 -3119 -8843 -5661 3887 8921 3764 -5470 -8751 -1117 6595 6189 -1514
4418 -1514 -8361 -4959 2019 9427 4980 -4485 -8454 -3688 6373 7500 868 -8713 -6038 2546 8935
4433 8935 5981 -4256 -9746 -3878 6045 8459 2347 -6309 -6274 1817 7648 5337 -4649 -8399 -3506
4448 -3506 4980 7654 2693 -5843 -7532 -549 6011 5642 -3287 -8102 -4461 4673 8928 2725 -5878
4463 -5878 -8192 -1051 5789 6993 -1038 -7228 -5492 3184 8821 3167 -5803 -8805 -2857 6535 8236
4478 8236 858 -6794 -5496 2593 7214 3659 -4160 -8886 -2405 6368 8606 1765 -7052 -6242 1181
4493 1181 6441 5819 -3190 -7867 -2029 3883 9451 1503 -7687 -8294 -70 5954 4879 -1386 -6827
4508 -6827 -3872 3928 8176 2720 -5767 -7616 -1785 6739 7211 -1307 -7829 -5324 2244 7735 2915
4523 2915 -6412 -8605 -1840 6960 9476 1377 -7560 -6344 1660 7846 5060 -3711 -8001 -1169 6422
4538 6422 8610 1052 -7425 -7191 852 7526 4856 -3945 -8692 -2201 6123 8624 1158 -7900 -8271
4553 -8271 8 8482 6511 -2044 -8369 -4336 3610 8382 1869 -6508 -8455 -870 7972 7666 -1023
4568 -1023 -8525 -6733 2938 6371 2044 -6441 -7657 -501 8890 8199 -789 -8465 -6999 1589 7843
4583 7843 5233 -4498 -7739 -1024 7087 7981 529 -8028 -7729 1691 8886 4878 -4317 -7891 -2963
4598 -2963 6646 8179 671 -9037 -7581 1342 9253 7311 -3214 -9558 -5516 4720 7988 2036
4612 2036 -7069 -6887 1127 9824 7681 -2982 -9941 -5272 4119 8972 3043 -6899 -9222 763 9402
4627 9402 7838 -1431 -9860 -6720 4388 9339 4755 -5781 -9076 -1070 8511 8248 -1503 -9873 -6993
4642 -6993 3677 10897 5743 -5130 -9857 -3646 7815 8189 -1264 -9663 -7285 3722 10656 5273
4656 5273 -6549 -10826 -3771 6644 8335 965 -9448 -7999 2930 9888 6205 -5504 -11862 -4329
4670 -4329 6376 10030 1256 -9047 -7986 1313 10138 6407 -4411 -11181 -4851 6419 10326 3294
4684 3294 -8393 -8285 287 8942 7094 -3808 -9879 -4207 6887 10826 2664 -7728 -10051 -138
4698 -138 8695 7773 -2706 -10338 -5706 5477 10614 3241 -8325 -10931 -954 8727 7987 -1792 -9725
4713 -9725 -6282 4930 9553 3289 -6219 -11021 -1241 10141 9680 -1068 -10220 -7186 3864 9532
4727 9532 4962 -6539 -10515 -2047 8913 10240 45 -9083 -8639 2844 9972 5116 -5908 -9612
4741 -9612 -2831 8520 9933 -718 -9576 -8352 2231 9835 6645 -3925 -10480 -3035 7627 8489
4755 8489 418 -9580 -9163 2168 9131 7007 -3125 -9221 -4717 6118 10311 1642 -8394 -8642
4769 -8642 1271 10413 6272 -3406 -10902 -5170 5271 8677 1834 -7405 -7689 1599 9376 7168 -2386
4784 -2386 -10094 -5404 4448 9212 3011 -6445 -7907 194 9126 6695 -3563 -8268 -5764 5063
4798 5063 8777 5376 -6043 -8515 -686 7136 7585 -3050 -8500 -5935 4178 9667 4858 -4541
4812 -4541 -7573 -1606 6167 7978 -450 -7258 -6480 2783 8800 4111 -5253 -8981 -2635 5799 7973
4827 7973 -84 -6996 -6456 2576 8349 4123 -3730 -7863 -2841 5716 8135 1814 -6342 -6862 1532
4842 1532 7217 4131 -3967 -8472 -2440 5174 7881 1730 -5866 -7255 -69 6934 5615 -2780 -6795
4857 -6795 -3875 5246 7717 1918 -5863 -6983 -236 7278 6024 -1048 -6568 -3583 2998 7745 1982
4872 1982 -5616 -6033 -737 5347 6197 -650 -5877 -4628 1612 6127 3329 -4361 -5511 -1052 5684
4887 5684 6836 -385 -5918 -5527 1413 6136 3841 -2774 -4921 -2362 4538 5655 364 -5644 -4558
4902 -4558 -35 5384 3768 -1478 -6328 -2141 2884 5094 583 -4639 -5688 325 4890 3780 -369
4917 -369 -5829 -3177 2543 4277 1877 -5012 -5328 -137 5310 5266 185 -4608 -4034 840 5601 2171
4933 2171 -3245 -5415 77 3967 4827 -28 -5791 -3999 664 5345 3080 -1559 -5412 -2569 3699
4948 3699 4197 566 -4304 -5645 -408 4801 3089 -765 -4004 -2797 1818 4242 1603 -3767 -4194
4963 -4194 223 4368 5010 -878 -4342 -4168 576 5116 1525 -3267 -4103 -1009 3872 3925 43 -5033
4979 -5033 -4715 533 5013 3982 -2529 -4877 -1178 3516 4765 410 -4782 -4812 100 4662 3955 -889
4995 -889 -4779 -3075 1884 4603 1621 -3916 -4797 505 5021 4715 -1068 -4243 -3840 1885 5473 1980
5011 1980 -2898 -4653 -1 4851 5128 -210 -5299 -5042 2249 6083 3644 -2072 -4619 -2931 4409
5026 4409 4824 596 -5578 -4696 1103 6258 4887 -1762 -6108 -3114 3439 4735 1600 -4211 -4521 449
5042 449 5417 4496 -2411 -5799 -4366 2781 5008 798 -3977 -6051 68 5522 5178 -970 -6675 -4882
5058 -4882 2205 6088 3344 -3987 -5900 20 5597 5981 -1731 -7063 -4787 2292 7430 4817 -2720
5073 -2720 -7064 -2033 4680 5174 -631 -6489 -5051 1829 6767 3801 -3056 -7281 -3097 3882 6096
5088 6096 737 -5776 -5276 792 7135 5904 -3248 -7278 -3509 4016 6836 1495 -5217 -6617 43
5103 43 7534 5589 -2991 -7549 -3589 4539 7805 2916 -5829 -5994 -720 6990 5144 -2194 -7540 -3932
5119 -3932 2938 8693 3089 -6065 -6597 -1615 6111 6324 -1696 -6424 -4461 2876 8037 3767 -5192
5134 -5192 -7902 -1846 5728 6817 86 -6851 -4993 2804 7883 3887 -4210 -7309 -2000 5616 7204
5149 7204 1083 -7381 -5531 1426 8468 3723 -4266 -7963 -2892 6648 8101 599 -6963 -6554 -171
5164 -171 7036 3991 -3099 -7043 -2238 5154 7454 764 -7340 -6856 -81 7401 5767 -2887 -8051
5179 -8051 -3840 4191 7443 1102 -7460 -8280 623 7200 7099 -1514 -7698 -3839 3861 7793 1717
5194 1717 -6903 -6689 282 6422 6134 -1234 -6477 -4967 3497 7924 2425 -4784 -7657 -43 7779
5209 7779 6460 -2433 -8469 -4876 3520 7675 4509 -3704 -7551 -1085 6749 6334 -740 -7181 -5493
5224 -5493 3102 7656 4007 -3916 -7565 -2328 5087 6459 -77 -7379 -5520 2234 8043 4075 -3716
5239 -3716 -8400 -2644 5298 5461 573 -6664 -5978 2551 7578 4906 -3142 -7772 -4221 3979 7008
5254 7008 1172 -5348 -5062 1671 7887 5574 -3379 -7706 -3109 4988 7337 2008 -5593 -5906 958
5269 958 6573 5917 -2329 -6940 -3669 4816 7661 2175 -4313 -6432 785 5929 5482 -1417 -6394 -4276
5285 -4276 2915 7769 3273 -5184 -7385 -1247 6011 5839 -1104 -5627 -4590 2915 7652 1760 -4496
5300 -4496 -6990 -1857 5304 5628 -172 -6386 -4470 2069 5883 3961 -3727 -6055 -1908 5614 7549
5315 7549 -262 -6639 -5872 386 4874 3228 -2711 -5533 -2295 4180 6121 1081 -5523 -5041 892
5330 892 5690 2901 -2678 -5950 -3317 4486 6030 1562 -5456 -5108 78 4929 4517 -1531 -5455 -3809
5346 -3809 3223 6164 1620 -4515 -5252 -510 5164 5175 -751 -5537 -4825 2214 5265 2831 -3701 -4959
5362 -4959 -590 5668 4752 -344 -5989 -4395 834 4686 2972 -3384 -5011 -1744 4616 5565 -499
5377 -499 -5172 -4580 1492 4593 3221 -2141 -5054 -1681 3014 4604 575 -5863 -4631 855 4982
5392 4982 5497 -2378 -5146 -3762 2666 4618 1055 -3972 -4895 95 5938 3387 -1742 -5284 -2455
5407 -2455 2091 5607 1754 -3923 -4459 74 4384 3388 -924 -5067 -4501 2180 5358 2377 -2259 -4168
5423 -4168 -1239 3532 4214 -1414 -5516 -4041 2372 5109 3040 -2240 -4834 -1349 3195 4808 625
5438 625 -4193 -3593 971 5758 4275 -2266 -5572 -2739 3579 3705 110 -3545 -3380 433 4470 4188
5454 4188 -1880 -5520 -2746 3065 4966 2093 -4296 -4972 -860 4350 4143 -1167 -4422 -2259 3702
5469 3702 5724 2661 -3475 -4941 -436 4573 4409 -565 -3641 -3783 2923 4906 2892 -3194 -5641
5484 -5641 -2426 4276 6033 -7 -4291 -3518 1925 3872 2671 -2754 -5867 -2125 3413 5782 880
5499 880 -4769 -4261 -648 3719 3464 -1875 -4330 -2241 2571 4587 1388 -4149 -4848 438 4062 3197
5515 3197 -1035 -4944 -3020 2248 5032 1263 -3990 -5937 -589 4140 4826 -839 -3763 -3073 2640
5530 2640 4542 526 -3145 -4672 -1555 4342 4147 845 -4709 -3497 1945 4022 1699 -2163 -4935
5545 -4935 -962 4323 4990 455 -3706 -3070 696 4357 2516 -2023 -4478 -1256 3958 5197 692
5560 692 -3731 -4977 310 4741 3209 -2248 -4934 -2009 3172 4771 1215 -4801 -4470 -508 4313
5575 4313 4812 -1303 -4360 -2496 1961 5163 1192 -3050 -5569 -546 5185 4335 -1329 -4532 -2945
5590 -2945 1455 4321 1295 -2744 -3395 -892 4429 4710 -593 -4209 -4595 1368 4712 2347 -3227 -4927
5606 -4927 -1289 3892 4493 -321 -5526 -3878 2108 4885 2995 -2149 -4809 -1731 3779 4911 -6
5621 -6 -4859 -3607 1181 4277 3642 -1433 -5126 -2430 2748 5258 604 -4335 -3386 -416 5479 4376
5637 4376 -1590 -5230 -3040 1970 5109 2167 -3239 -4421 439 4696 3811 -955 -4523 -2398 1885
5652 1885 4433 2572 -2202 -4389 -199 3672 4329 -477 -5393 -3352 1965 5140 1939 -2315 -4114
5667 -4114 -341 3719 4079 314 -5023 -2787 1641 5943 2030 -2307 -5169 -2447 2536 3545 110
5682 110 -3575 -3439 1039 4109 2603 -1673 -5089 -2243 3541 4226 530 -2824 -3373 785 3897 3133
5698 3133 -2332 -4923 -2792 2404 5684 866 -2727 -4115 -223 4153 3189 -459 -4826 -2636 1902
5713 1902 4760 517 -3486 -4498 -343 4243 4736 -1009 -4232 -2089 432 4441 1842 -2976 -4850
5728 -4850 -1345 4333 4279 -537 -4255 -3521 1698 4799 1653 -1851 -5228 -1398 3693 4675 434 -3839
5744 -3839 -2891 425 3831 2101 -1523 -4375 -2065 3519 4857 564 -4551 -3545 409 3683 4204
5759 4204 -1783 -4045 -1002 2432 4634 476 -3691 -4009 -167 4412 3558 -1026 -4484 -3150 1325
5774 1325 4999 2059 -2729 -4097 -56 4669 3093 432 -3794 -2653 2087 3407 1905 -2486 -4246
5789 -4246 -875 3381 5654 85 -3915 -2913 1277 4704 2837 -2266 -4422 149 2725 4583 -789
5804 -789 -4064 -3732 1063 5122 2701 -1671 -3974 -2030 2584 4050 1057 -3707 -3825 -21 4772 3524
5820 3524 -1284 -3467 -1638 3601 3834 1325 -4032 -3626 344 3814 3098 -1451 -4316 -2207 2112 3290
5836 3290 281 -3734 -3719 -631 3129 3867 -761 -3851 -3182 1295 3852 1569 -2358 -3798 -735 2979
5852 2979 3591 98 -4942 -3361 1198 4903 2019 -2166 -4469 -1472 2684 3946 395 -3351 -3296 791
5868 791 4200 3027 -3350 -4051 -972 3318 3677 292 -2139 -2201 991 4329 2231 -2194 -4775 -2086
5884 -2086 1618 3082 1179 -2149 -2048 -357 2884 1704 -1147 -4922 -1916 2405 5134 1505 -2141
5899 -2141 -4994 -685 2793 2833 -750 -3387 -2388 2066 4209 1857 -2219 -3754 -629 3295 3577 -1027
5915 -1027 -3964 -2779 1586 4746 2576 -2014 -3992 -499 2672 3523 -574 -4020 -3768 1112 3526
5930 3526 1323 -1813 -3666 -513 1719 4521 375 -3826 -2424 458 3268 1684 -1738 -4147 -1283
5945 -1283 3395 4574 1096 -3126 -3947 242 4138 2731 -1501 -2312 -1842 2354 3401 753 -2391 -4075
5961 -4075 -613 3380 3035 -706 -4421 -2431 1029 3835 108 -2521 -3016 -1337 3695 3722 -676 -2953
5977 -2953 -3105 756 4120 1317 -2432 -3374 -969 4120 3480 -790 -4119 -2577 879 3595 2967 -376
5993 -376 -3652 -1428 2532 2208 275 -3671 -4258 378 3442 2668 -1048 -4258 -1934 2869 3320 334
6009 334 -3291 -3602 -26 3482 2860 -295 -4037 -1610 2392 3930 557 -3484 -2631 -460 2712 4094
6025 4094 -1723 -3905 -2546 1846 3558 620 -2552 -4599 8 3590 2918 -212 -3639 -2575 1297
6040 1297 3616 2245 -2069 -3819 -1671 3443 2869 -327 -2796 -2009 347 2876 1809 -1911 -3569
6055 -3569 -1299 2209 2897 -487 -2555 -3106 1327 3455 2259 -1806 -4020 -1679 2195 2910 889 -3034
6071 -3034 -3355 129 2779 3456 -1463 -3184 -2148 2145 2662 -325 -2539 -3056 265 3841 2800 -1063
6087 -1063 -2829 -2380 1620 3830 1361 -1849 -3214 -598 3383 3195 -210 -3099 -2980 1570 4106 1646
6103 1646 -2371 -3005 -1530 3189 2729 -1369 -3612 -2432 385 1677 2221 -2136 -3755 -1655 2938 4316
6119 4316 435 -3053 -2981 801 3961 3480 -2259 -3693 -1256 2071 2806 1630 -2285 -2654 800 2584
6135 2584 3234 -1541 -3470 -1166 3347 3864 902 -3359 -3059 -743 2398 2076 -1058 -3938 -2083 1277
6151 1277 3384 1498 -3234 -3300 -223 2723 2736 -1120 -2961 -2517 1509 3965 2703 -2532 -3988 -117
6167 -117 2672 2855 -291 -3310 -3021 1688 3565 1138 -1787 -3241 -986 3416 2868 -119 -2457 -2332
6183 -2332 628 3459 1664 -1572 -2871 -1952 2234 2698 327 -3593 -3491 -229 3272 2370 -1640 -3082
6199 -3082 -1401 2743 3068 403 -2448 -3060 425 2888 2350 -942 -3658 -2240 1994 4033 859 -2648
6215 -2648 -3037 -247 3526 2616 -405 -3829 -2264 658 3723 763 -1280 -2829 -593 2400 3748
6230 3748 -371 -2866 -3625 659 3946 1221 -2468 -2834 -1500 2631 3092 91 -2322 -2449 352 2618
6246 2618 2088 -1084 -1720 -1751 2206 2711 704 -3024 -3092 606 3458 2191 -1233 -2699 -1526 1537 2285
6263 2285 1504 -3240 -2385 578 2552 2954 -818 -3107 -643 1493 2503 1357 -1140 -2374 631 3053
6279 3053 3065 -1094 -2270 -2110 1244 2649 253 -1458 -3356 -152 2694 2912 -997 -2923 -2212 1041
6295 1041 3890 947 -1574 -3300 -768 2352 2612 -285 -2549 -1719 1431 3224 1013 -1198 -2730
6310 -2730 -1260 1951 2896 -267 -2733 -1966 1327 2554 2603 -1195 -2544 -1129 1825 3689 297 -2421
6326 -2421 -1569 826 2393 1565 -1156 -2943 -1636 1140 2704 218 -2780 -2739 364 2369 1785 -583
6342 -583 -2883 -1697 881 2830 415 -1927 -3273 -1340 2286 2124 213 -2504 -2065 912 3020 829
6358 829 -3538 -1496 5 3257 1938 -364 -2234 -2760 1197 2381 2079 -1650 -1895 -63 2276 2990
6374 2990 659 -2477 -1489 379 1757 1375 -1456 -2816 -426 2467 2502 -715 -3023 -2188 1048 2698
6390 2698 1301 -1160 -2233 -1068 2032 2193 -34 -2387 -2658 185 2559 2612 -708 -2819 -2169 1721
6406 1721 2966 1439 -1495 -1488 294 2830 2592 -969 -2554 -2672 1036 2443 1525 -1268 -2831 -571
6422 -571 1858 2482 242 -2031 -1873 1467 3068 719 -719 -3228 -1016 1397 2769 -637 -2822 -3234
6438 -3234 687 1348 1446 -1395 -2578 -223 1742 3054 424 -1748 -2112 197 2217 2120 -898 -1170 -1196
6455 -1196 2092 1169 563 -1790 -2711 456 2810 1513 -456 -2134 -1148 531 2961 1198 -1765 -1838
6471 -1838 -970 1411 2026 -678 -2871 -2011 1143 1731 1166 -1106 -2453 -975 3034 2791 -1075 -2615
6487 -2615 -1850 213 3222 1377 -823 -2260 -823 2121 2360 -639 -2191 -858 829 2698 1074
6502 1074 -1056 -2650 -522 1392 2900 105 -2278 -1364 -387 2214 2169 -2108 -2240 -610 1820 1417
6518 1417 202 -1439 -1637 89 2631 2444 298 -2088 -1706 1640 2104 963 -2696 -1295 413 1226
6534 1226 1574 -40 -1594 -1136 1586 1686 1930 -2422 -2720 -157 1788 1702 -774 -2065 -936 1366 3006
6551 3006 1051 -1104 -2187 -120 2413 2311 163 -1752 -643 392 2412 1454 -977 -2292 -870
6566 -870 1954 2313 288 -2173 -2269 13 2054 1221 -873 -2248 -1462 1795 1990 -218 -1904 -1948 -1039
6583 -1039 2293 2332 -736 -2485 -732 1472 2468 877 -2166 -1725 301 3465 1375 -958 -1640 -1572 1637
6600 1637 2723 1153 -1982 -1169 -84 2474 2190 -235 -2222 -2037 691 2073 1359 -1459 -1848 -342
6616 -342 2252 1620 -299 -2172 -2053 302 2145 1153 -1373 -1644 -71 1689 2676 -667 -1968 -1678 139
6633 139 1955 1720 -1306 -1540 -68 1827 2029 93 -2071 -1291 740 1736 1453 95 -2357 -1062 1244
6650 1244 1092 235 -434 -1929 869 1189 1288 -64 -2551 -2015 978 2382 1092 -919 -1819 -51 1606
6667 1606 2138 -2131 -1582 -1047 306 1655 627 -812 -2153 -927 1553 104 -234 -1997 -1056 -314
6683 -314 1441 1165 -937 -1613 -103 1604 1748 313 -1936 -747 1166 2276 1694 384 -1121 -887
6699 -887 1230 1790 592 -2006 -1597 -260 1180 1173 -625 -1684 -1562 1699 979 -114 -1539 -906 -36
6716 -36 1768 665 -886 -1323 -1238 748 2318 265 -1345 -2072 11 1831 1418 -1056 -1821 -894 826
6733 826 2398 -4 -1895 -1814 466 1572 1466 807 -1806 -1972 1436 1649 949 -1086 -2366 -511 1300
6750 1300 1473 -1055 -1847 -1707 521 2671 974 -1805 -2331 -609 1746 2317 -80 -1559 -1521 677 3396
6767 3396 707 -1045 -1820 -758 896 2051 284 -672 -1897 535 2889 1214 -1334 -2200 -7 1325
6783 1325 2217 -576 -2025 -2238 848 1893 2007 -1211 -2282 146 -60 1513 -190 -1488 -1770 238
6799 238 910 930 -200 -2326 -880 962 1784 -435 -1310 -757 -1379 1993 1763 -1241 -2469 -856 1045
6816 1045 2076 1020 -780 -1224 -287 1001 1530 -430 -924 -539 1088 1806 1403 -1424 -2575 -538 1505
6833 1505 1539 -320 -937 -1057 13 1391 1193 -82 -1440 -424 1429 1592 291 -1577 -2678 314
6849 314 1660 1955 -228 -1907 -1225 1837 1651 617 -1534 -1182 -663 1726 1846 -774 -1755 -955 -104
6866 -104 939 453 -1284 -1443 -383 1557 851 -526 -1964 -791 719 2163 412 -1341 -855 165
6882 165 1492 1344 -1583 -1003 -613 2098 1842 -167 -1269 -1192 -760 1866 1636 -699 -1711 -780 758
6899 758 1099 1175 -666 -1599 -412 1176 941 -737 -1509 -1272 38 1419 -20 -1388 -2238 -1027 1405
6916 1405 1370 1242 -1109 -1509 121 1931 1456 -96 -2007 -285 1109 2158 -307 -1587 -1418 -322
6932 -322 1582 2310 -1468 -2188 -963 654 2637 332 -904 -1183 -327 700 1372 -300 -1525 -1108 1277
6949 1277 1509 627 -46 -1435 326 1166 1800 -666 -1383 -339 267 1868 -77 -177 -1235 -237 903
6966 903 954 -394 -2507 -787 233 1042 -318 -1341 -1401 -193 1547 1322 -42 -1817 -483 561 1730
6983 1730 1184 -828 -1876 -1536 1200 1740 -1560 -1359 -865 -131 1806 1624 -157 -1075 -851 368 942
7000 942 434 -778 -691 225 1761 1346 -895 -1421 -142 422 653 290 -1127 -1042 -346 958 912 -271 -651
7019 -651 -1210 763 926 1346 158 -1241 -325 974 899 -644 -989 -1206 1498 1313 539 -345 -1042 -1299
7037 -1299 1711 882 52 -883 -894 -313 1061 2138 152 -758 -1712 -112 669 -347 -878 -863 -309 1770
7055 1770 374 793 -739 -386 -383 452 279 219 -1064 268 1858 884 -728 -1835 -588 -607 1239 435
$$ [...]
8191D26
##END NTUPLES=NMR FID
##END=
