##TITLE=1H_MP0607
 CDCl3
 8 sc, 
 7.07.2022
##JCAMPDX= 6.0         $$ Bruker NMR JCAMP-DX V2.0
##DATA TYPE= NMR FID
##DATA CLASS= NTUPLES
##ORIGIN= UXNMR, Bruker Analytische Messtechnik GmbH
##OWNER= root
$$ XWIN-NMR		Version 3.5
$$ Thu Jul  7 13:45:14 2022 Russian Standard Time (UT+4h)  she@DPX200
##.OBSERVE FREQUENCY= 200.1313499994
##.OBSERVE NUCLEUS= ^1H
##.DELAY= (6, 6)
##.ACQUISITION MODE= SIMULTANEOUS
##.ACQUISITION SCHEME= undefined
##.AVERAGES= 8
##.DIGITISER RES= 18
##SPECTROMETER/DATA SYSTEM= spect
##.PULSE SEQUENCE= zg30
##.SOLVENT NAME= CDCl3
##.SHIFT REFERENCE= (INTERNAL, CDCl3, 0, 15.7039)
##AUDIT TRAIL= $$ (NUMBER, WHEN, WHO, WHERE, WHAT)
$$ ##TITLE= Audit trail, XWIN-NMR		Version 3.5
$$ ##JCAMPDX= 5.01
$$ ##ORIGIN= Bruker BioSpin GmbH
$$ ##OWNER= she
$$ F:/spectra/data/she/nmr/H-F/1/audita.txt
$$ ##AUDIT TRAIL=  $$ (NUMBER, WHEN, WHO, WHERE, WHAT)
(   1,<2022-07-07 13:44:08.34 +0400>,<she>,<DPX200>,
      <created by zg, POWCHK disabled, PULCHK disabled
       configuration hash MD5:
       00 E9 B6 7A A2 85 ED C7 34 08 36 98 17 FE 4E 26
       data hash MD5: 16K
       0B B6 85 D1 5D 0D EF FB D4 3E 78 C7 81 9F 6A E3>)
$$ ##END=
$$ 
$$ hash MD5
$$ 71 91 1F 19 0D 10 3E 8B 92 36 4A 89 55 3F 44 D7
##$RELAX= 
##$RELAX= 
##$RELAX= 
##$RELAX= 
##$RELAX= 
##$RELAX= 
$$ Bruker specific parameters
$$ --------------------------
##$DU= <F:/spectra>
##$EXPNO= 1
##$NAME= <H-F>
##$PROCNO= 1
##$TYPE= <nmr>
##$USER= <she>
##$AMP= (0..31)
100 100 100 100 100 100 100 100 100 100 100 100 100 100 100 100 100 100 
100 100 100 100 100 100 100 100 100 100 100 100 100 100 
##$AQSEQ= 0
##$AQ_mod= 1
##$AUNM= <au_zg>
##$AUTOPOS= <>
##$BF1= 200.13
##$BF2= 200.13
##$BF3= 200.13
##$BF4= 200.13
##$BF5= 200.13
##$BF6= 200.13
##$BF7= 200.13
##$BF8= 200.13
##$BYTORDA= 1
##$CFDGTYP= 0
##$CFRGTYP= 5
##$CHEMSTR= <none>
##$CNST= (0..31)
1 1 145 1 1 1 1 1 1 1 1 1 1 1 1 1 1 1 1 1 1 1 1 1 1 1 1 1 1 1 1 1 
##$CPDPRG= <>
##$CPDPRG1= <>
##$CPDPRG2= <>
##$CPDPRG3= <>
##$CPDPRG4= <mlev>
##$CPDPRG5= <mlev>
##$CPDPRG6= <mlev>
##$CPDPRG7= <mlev>
##$CPDPRG8= <mlev>
##$CPDPRGB= <>
##$CPDPRGT= <>
##$D= (0..31)
0 1.2 0 0 0 0 0 0 0 0.06 0 0.03 0 0 0 0 0.0002 0 0 0 0 0 0 0 0 0 0 0 0 
0 0 0 
##$DATE= 1657187047
##$DBL= (0..7)
120 120 120 120 120 120 120 120 
##$DBP= (0..7)
150 150 150 150 150 150 150 150 
##$DBP07= 0
##$DBPNAM0= <>
##$DBPNAM1= <>
##$DBPNAM2= <>
##$DBPNAM3= <>
##$DBPNAM4= <>
##$DBPNAM5= <>
##$DBPNAM6= <>
##$DBPNAM7= <>
##$DBPOAL= (0..7)
0.5 0.5 0.5 0.5 0.5 0.5 0.5 0.5 
##$DBPOFFS= (0..7)
0 0 0 0 0 0 0 0 
##$DE= 6
##$DECBNUC= <off>
##$DECIM= 32
##$DECNUC= <off>
##$DECSTAT= 4
##$DIGMOD= 1
##$DIGTYP= 9
##$DL= (0..7)
0 120 120 120 120 120 120 120 
##$DP= (0..7)
150 150 150 150 150 150 150 150 
##$DP07= 0
##$DPNAME0= <>
##$DPNAME1= <>
##$DPNAME2= <>
##$DPNAME3= <>
##$DPNAME4= <>
##$DPNAME5= <>
##$DPNAME6= <>
##$DPNAME7= <>
##$DPOAL= (0..7)
0.5 0.5 0.5 0.5 0.5 0.5 0.5 0.5 
##$DPOFFS= (0..7)
0 0 0 0 0 0 0 0 
##$DQDMODE= 0
##$DR= 18
##$DS= 0
##$DSLIST= <SSSSSSSSSSSSSSS>
$$ [...]
##$SUBNAM2= <"">
##$SUBNAM3= <"">
##$SUBNAM4= <"">
##$SUBNAM5= <"">
##$SUBNAM6= <"">
##$SUBNAM7= <"">
##$SUBNAM8= <"">
##$SUBNAM9= <"">
##$SW= 18.0517283424941
##$SWIBOX= (0..15)
0 0 2 0 0 0 0 0 0 0 0 0 0 0 0 0 
##$SW_h= 3612.71676300578
##$TD= 16384
##$TD0= 1
##$TE= 0
##$TE2= 300
##$TE3= 300
##$TEG= 300
##$TL= (0..7)
0 120 120 120 120 120 120 120 
##$TP= (0..7)
150 150 150 150 150 150 150 150 
##$TP07= 0
##$TPNAME0= <>
##$TPNAME1= <>
##$TPNAME2= <>
##$TPNAME3= <>
##$TPNAME4= <>
##$TPNAME5= <>
##$TPNAME6= <>
##$TPNAME7= <>
##$TPOAL= (0..7)
0.5 0.5 0.5 0.5 0.5 0.5 0.5 0.5 
##$TPOFFS= (0..7)
0 0 0 0 0 0 0 0 
##$TUNHIN= 0
##$TUNHOUT= 0
##$TUNXOUT= 0
##$USERA1= <user>
##$USERA2= <user>
##$USERA3= <user>
##$USERA4= <user>
##$USERA5= <user>
##$V9= 5
##$VALIST= <valist>
##$VCLIST= <CCCCCCCCCCCCCCC>
##$VD= 0
##$VDLIST= <DDDDDDDDDDDDDDD>
##$VPLIST= <PPPPPPPPPPPPPPP>
##$VTLIST= <TTTTTTTTTTTTTTT>
##$WBST= 1024
##$WBSW= 4
##$XGAIN= (0..3)
0 0 0 0 
##$XL= 0
##$YL= 0
##$YMAX_a= 514792
##$YMIN_a= -601898
##$ZGOPTNS= <>
##$ZL1= 120
##$ZL2= 120
##$ZL3= 120
##$ZL4= 120
##$ABSF1= 10
##$ABSF2= 0
##$ABSG= 5
##$ABSL= 3
##$ALPHA= 0
##$AQORDER= 0
##$ASSFAC= 0
##$ASSFACI= 0
##$ASSFACX= 0
##$ASSWID= 0
##$AUNMP= <proc_1d>
##$AZFE= 0.1
##$AZFW= 0.1
##$BCFW= 1
##$BC_mod= 2
##$BYTORDP= 1
##$COROFFS= 0
##$CY= 11.3945322036743
##$DATMOD= 1
##$DC= 2
##$DFILT= <>
##$DTYPP= 0
##$F1P= 2.36226072786647
##$F2P= -0.459571619588291
##$FCOR= 0.5
##$FTSIZE= 0
##$FT_mod= 4
##$GAMMA= 1
##$GB= 0.15
##$INTBC= 1
##$INTSCL= 1
##$ISEN= 128
##$LB= 0.24
##$LEV0= 0
##$LPBIN= 0
##$MAXI= 10000
##$MC2= 0
##$MEAN= 0
##$ME_mod= 0
##$MI= 1.114404
##$NCOEF= 0
##$NC_proc= 0
##$NLEV= 6
##$NOISF1= 3.799351
##$NOISF2= 2.8
##$NSP= 1
##$NTH_PI= 0
##$NZP= 0
##$OFFSET= 15.70392
##$PC= 1
##$PHC0= -18057.62
##$PHC1= 11.00069
##$PH_mod= 1
##$PKNL= yes
##$PPARMOD= 0
##$PSCAL= 0
##$PSIGN= 0
##$REVERSE= no
##$SF= 200.130013532006
##$SI= 16384
##$SIGF1= 3
##$SIGF2= 2
##$SINO= 400
##$SIOLD= 16384
##$SREGLST= <1H.CDCl3>
##$SSB= 0
##$STSI= 0
##$STSR= 0
##$SW_p= 3612.71676300578
##$SYMM= 0
##$S_DEV= 0
##$TDeff= 0
##$TDoff= 0
##$TI= <>
##$TILT= no
##$TM1= 0
##$TM2= 0
##$TOPLEV= 0
##$USERP1= <user>
##$USERP2= <user>
##$USERP3= <user>
##$USERP4= <user>
##$USERP5= <user>
##$WDW= 1
##$XDIM= 8192
##$YMAX_p= 0
##$YMIN_p= 0
$$ End of Bruker specific parameters
$$ ---------------------------------
##NTUPLES= NMR FID
##VAR_NAME=  TIME,          FID/REAL,        FID/IMAG
##SYMBOL=    X,             R,               I
##VAR_TYPE=  INDEPENDENT,   DEPENDENT,       DEPENDENT
##VAR_FORM=  AFFN,          ASDF,            ASDF
##VAR_DIM=   8192,          8192,            8192
##UNITS=     SECONDS,       ARBITRARY UNITS, ARBITRARY UNITS
##FACTOR=    0.0002768,     1,               1
##FIRST=     0,             0,               0
##LAST=      2.2672688,     0,               0
##MIN=       0,             -601898,         0
##MAX=       2.2672688,     514792,          0
$$ Real data points
##PAGE= N=1
##DATA TABLE= (X++(R..R)), XYDATA
0@%%%%%%%%%%qJ6j6K4l2M0m8N6p2Q8j04J27j51J76k09K44k84L30l83M43n08N80
32C09o60P49q47R55j074J206j354J512j682J873k081K307k556K826l120L443l796
49a990M184m608N074n593O168o809P526q337R262j0327J1572j3043J4818j7013
63i116J9804k3495K8631l6347M9417p7433K48496j69468m5111L58819k67643J48086
75B24640K90152l99704m61181J47019l076k5077K91654M6264l49523n4184J19282
86a73734J6232J49958K46843p0827k30757m3379J13829L6790M7984J32569q1677
97A43831l22067j9088K10567K104P1360K09025j87747k52149J67757P7865r6010
108E448J64470l7842m03124l1831J86155r6704R2190K57831j89887j99022K25814
$$ plain form
0 0 0 0 0 0 0 0 0 0 0 0 -8 8 -8 16 -16 24 -24 32 -40 48 -56 71 -80 96 -113 131 -153 177 -206 237 -271 309
32 309 -351 398 -449 506 -568 638 -716 796 -886 987 -1094 1213 -1343 1483 -1637 1806 -1990
49 -1990 2194 -2414 2660 -2933 3235 -3574 3952 -4385 4877 -5450 6122 -6921 7897 -9116
63 -9116 10688 -12807 15824 -20523 28894 -48539 199957 30489 -14622 344197 76554 224640
75 224640 514792 115088 -346093 -199074 -202150 -227227 64427 110691 -238832 -293016 -173734
86 -173734 -157502 -7544 239299 168472 -62285 -105664 8165 44955 92939 225508 143831
97 143831 -178236 -197324 13243 15347 86707 295732 107985 -144164 23593 101458 5448
108 5448 169918 132076 -271048 -302879 -116724 -213428 -121238 136593 -53294 -252316 -26502
119b6502J04258l1784J99943L9464k50759n4778Q7382j1410N9381N5093j52278
130A8010j62326l2879J3065O6963R7318K4476p3500r3392M2725J56142O4689K0227
142A41518L1964j56557j91140R3845J31580l2148L4123K55j87231l0116J80074
153A6167O5463L1729N1292j55874j46756J05061P1717n557R1380n2779k18801
164a46958j9177J07904K4736O2027M6964j07898q7617L5446P5187J15944P6687
175A83245o8495j02668n1966k8136N1550R7583q664j00184q4737l0157O5514J20189
187D3074N9122p729o3748j14042j3324J20060O4598j3047k2412r4180q5588N8244
199f8972Q8207L5928J0929q0110j06112K9691Q1449M6055P4586R687j21636o3934
$$ plain form
119 -26502 77756 45972 245915 285379 34620 -20158 67224 55814 115195 170288 18010
130 18010 -144316 -177195 -164130 -97167 151 24627 -48873 -142265 -99540 56602 121291 141518
142 141518 173482 16925 -174215 -80370 51210 19062 53185 53440 -133791 -163907 16167
153 16167 81630 113359 164651 8777 -137979 -32918 38799 33242 124622 71843 -146958
164 -146958 -166135 -58231 -33495 28532 75496 -32402 -120019 -84573 -9386 106558 183245
175 183245 114750 12082 -39884 -68020 -16470 81113 72449 -27735 -112472 -142629 -77115 43074
187 43074 102196 94467 30719 -83323 -96647 23413 88011 74964 52552 -41628 -127216 -68972
199 -68972 19235 55163 66092 -14018 -120130 -90439 -8990 37065 111651 121338 -298 -64232
211f4232N2781L6066K9041L0239p0751j05083j4393L4855O4279Q5697j2797r4757
223b9055l4825R542K0802P8941N4737o1905q9974k4059L4111O0494N1865Q216
235G8890n0910p9670k2656O0892O5093J8655k0353n7753n1916J1779M7160M1000
247D0211J9617n0146r0795j1891N1022K7072M4062M5413o0152q1576K7967N5607
259A6411K3034L4757j0686q2848m5138K4091M4385N7042J8942o6578o8040k16
271e4844K5220L5754N2461m833q5422n2751L1992M5239K9681K3781k1112o6184
283d1018l1036M0586O0330L2076k210l7427m8199o214L4752L6032K5825j7323
295D6174p4939m2586L0764L0723J9341K9524k2544p1909j2500N6354M2097J6977
$$ plain form
211 -64232 -11451 24615 53656 83895 13144 -91939 -106332 -71477 -7198 78499 65702 -29055
223 -29055 -63880 -54338 -33536 45405 100142 38237 -51737 -75796 -41685 18809 70674 78890
235 78890 27980 -51690 -74346 -13454 51639 70294 49941 -7812 -59728 -47949 -789 40211
247 40211 59828 9682 -81113 -93004 -41982 -14910 29152 74565 14413 -67163 -39196 16411
259 16411 39445 74202 63516 -19332 -64470 -40379 4006 61048 79990 13412 -54628 -54844
271 -54844 -29624 6130 58591 53758 -31664 -84415 -52423 -7184 22497 46278 25166 -41018
283 -41018 -72054 -31468 28862 60938 58728 21301 -26898 -33112 1640 37672 63497 46174
295 46174 -28765 -71351 -40587 -9864 9477 39001 16457 -55452 -67952 -11598 30499 47476
307D7476J016m5056n3350N500M0918L4639J7715l0517n8558q417L4172K6205K9642
320D1385J6631m3393n3593R933M0290J7558N093p247m2844m3678R142L8900K4408
333A2585L781j9080l1265n391K4853L2946L2019N920m0115l9097J0316K6931P665
346B2068P381n867n0439l7124K9263M0277J2658N504j4328l4087n748K5979K6792
359B2329J5469j3303m0759k2043J5571J8447J1192J3984j1854m1622q679L6575
371d693K6543P357P023j1123k9917p437K3852J9301n530k0056k6410k0405M922
384c6573K0059J5621R501j1626k9483L480L5008J3897K037R596j8276l5467M250
397a7976K9771P351o743n703j4570j2245J0086K0876J4363j945k1065j6912O190
$$ plain form
307 47476 48492 3436 -49914 -44414 -3496 31143 48858 18341 -40217 -48634 -14462 11743 41385
320 41385 58016 14623 -38970 -29037 11253 28811 33904 26657 -16187 -59865 -50723 -11823 12585
333 12585 16366 -2714 -33979 -39370 -14517 18429 50448 56368 16253 -22844 -12528 14403 22068
346 22068 29449 23582 -26857 -63981 -34718 5559 18217 23721 9393 -24694 -30442 -4463 22329
359 22329 37798 24495 -16264 -38307 -22736 -4289 6903 20887 9033 -32589 -41268 -4693
371 -4693 21850 29207 36230 25107 -4810 -12247 11605 30906 25376 5320 -21090 -41495 -36573
384 -36573 -16514 -893 8608 -3018 -32501 -29021 5987 19884 21921 31517 13241 -22226 -17976
397 -17976 11795 19146 12403 6700 -7870 -20115 -10029 10847 25210 23265 2200 -14712 -8522
410h522J0619N409Q373m851k6076k1340L815J8056P161m550K494q33j0583J5126
424e702L5724R271j0980n572r544r263O495Q551j762r644j8865j3030J0919J0779
438b623o174l96O8j6967n210J9072J1911J05p23k158L841N877J56R569P090j8265
454E173q017J6669K112o304J0110k87j4247l205j739o987j814j0541j5847O001
468b8923J0134m861R424J8403p003r017J4856J0986k952l61L185K207k150Q28
482A4756J5349M195k1488j0165j44j5169m057R588p979p604M146p154L699K2559
496E32m671j4424J5778J469j9392K2076L0285j5475m054K1967r309j2855J5362
509B7289k778k1998o507o810r989O525M699o637Q78M718k178Q97Q680M135j0418
$$ plain form
410 -8522 2097 7506 15879 11028 -15048 -36388 -32573 -14517 -7356 -11906 -9412 -10245 -20828 -5702
424 -5702 30022 39293 28313 22741 13197 3934 10429 18980 17218 7574 -11291 -24321 -13402 -2623
438 -2623 -8797 -9193 -9125 -26092 -31302 -12230 -319 -214 -937 -3095 746 6623 6779 16348 23438 5173
454 5173 -2844 13825 15937 9633 19743 19456 5209 2004 265 -6722 -8536 -19077 -34924 -28923
468 -28923 -18789 -23650 -14226 4177 -2826 -11843 3013 13999 11047 10686 13871 16078 13928 14756
482 14756 30105 34300 12812 2647 2503 -12666 -16723 -7135 -15114 -22718 -18572 -25726 -22027 532
496 532 -4139 -18563 -2785 -1316 -20708 1368 31653 16178 12124 34091 24782 11927 27289
509 27289 24511 2513 -3994 -10804 -20793 -14268 -9569 -16206 -15328 -10610 -12788 -11891 -3211 924 -9494
524i494p058J5193J0867p530R222J5108j8963j2713K1984J504j9013R293J612
537A0012k2661Q398K0817r755N00O854l0929j7371K0881k737j0180K0727K25k4137
551b9356J0824L0404Q065L862P849j1922k1097j320J5605R624l806j0503j6352
564h123j5976K216J7989P716j882m261k0223r956K8954K2185l452R583l772m0358
578a9360o093L2685J221j1056O040j8629k7103J8717L4148J3725Q788p199k7534
591a650p773J5891J0034N747k654k7367k7644N300K3398J3170L44p072j6463j7164
605c3903J0605L6976J6913j2294p156j0313j7502J3920K7530p088j9803j3544
617a5659k0066L447L6499J9729m145m94j3574j8979J9495L1569q087k2492j4178
$$ plain form
524 -9494 -16552 -1359 9508 1978 11200 26308 7345 -5368 16616 18120 -893 8400 10012
537 10012 -12649 -4251 16566 6811 7311 14165 -16764 -34135 -13254 -15991 -26171 -5444 -5219 -29356
551 -29356 -18532 11872 19937 23799 31648 19726 -1371 -2691 12914 22538 18732 8229 -8123
564 -8123 -24099 -21883 -3894 3822 1940 -2321 -22544 -32500 -3546 18639 15187 24770 20998 -19360
578 -19360 -25453 7232 8453 -2603 3437 -15192 -42295 -23578 10570 24295 33083 25884 -1650
591 -1650 -9423 6468 16502 22249 19595 -7772 -35416 -30116 -6718 6452 6796 -276 -16739 -33903
605 -33903 -23298 13678 30591 18297 11141 828 -16674 -2754 24776 17688 -2115 -15659
617 -15659 -35725 -32278 4221 23950 19805 19311 5737 -13242 6253 37822 29735 7243 -6935
630f935k5050j1750K6707K4252n949j5522j2551n054J5071L0067K0334n263j7192
643A1165j1471j087J7184K4766k866k7997k1214j6575r348K2244K9190q551k1719
656a6279k542k93O300L1410J9084k0855k6879j4093n111J8633K7722L032j5271
669D858j4562j2254Q011L3285K1871j0192k0714j5380p721R501K5724J0958k4612
682H773l5435j5916K048J4635K4920J0290j9080k0552K699K2156L1920K3782o917
695D3323k9084k0547m029J2860K7100O891l0876l1144q484O422K4109K8807k070
708B3278l2409k6215J009K2220K8234J4909j3943l2224k0279Q645K8521K5959
720B7705Q67k4200k5687l346K1451L1539K0551q307l4814k7879L087J8980J5773
$$ plain form
630 -6935 -31985 -43735 -17028 7224 1275 -14247 -26798 -31852 -16781 13286 33620 28357 11165
643 11165 -306 -1393 15791 40557 37691 9694 -11520 -28095 -37443 -15199 13991 5440 -16279
656 -16279 -18821 -19114 -12814 18596 37680 16825 -10054 -24147 -29258 -10625 17097 20129 4858
669 4858 -9704 -21958 -13947 19338 41209 31017 10303 -5077 -12798 -3297 22427 33385 8773
682 8773 -26662 -42578 -40530 -25895 -975 9315 -9765 -30317 -27618 -5462 26458 50240 43323
695 43323 14239 -6308 -10337 2523 29623 36514 5638 -25506 -33990 -27568 -3459 25348 23278
708 23278 -9131 -35346 -34337 -12117 16117 31026 17083 -15141 -35420 -26775 1746 27705
720 27705 28572 4372 -21315 -24661 -3210 28329 48880 40573 5759 -22120 -19033 -53 15720
733A5720N153j9758l6907j6551J8007L0039K1412P33k1217k3725o82K4888L2464
746B9576J5547j4837l2102k0124O805K3805K2052K370k4764l3927j0904K0305
758a6198K9252J4343q135k5227k5731k307K7017K7749L307j8964k6652j6499J0707
771b7338K9804K4968K644k1482k5455l368K0931K6138J3033r976k9718k8060M98
784b7381K6609K3368J426j9504k9397j7062J2683L2242K4019n455k7251k3174
796b8877q55K2738L0899J3014j6459l1548j9975R987L0907K3745p71k2324k8266
809a7785j1966J8358L2551J4604j5314l0035k3846j941K3739K9460P454k0974
821D305k9543j3191J5614L2121K3207k145k5468k8697m008K5436L1555J0796j7410
$$ plain form
733 15720 20873 1115 -35792 -52343 -34336 -4297 17115 17848 -3369 -27094 -27776 -2888 29576
746 29576 45123 30286 -1816 -21940 -15135 8670 30722 33092 8328 -25599 -36503 -16198
758 -16198 13054 27397 19262 -5965 -31696 -34003 -6986 20763 24070 5106 -21546 -38045 -27338
771 -27338 2466 27434 30078 8596 -16859 -20227 704 26842 39875 29899 181 -27879 -27381
784 -27381 -772 22596 24022 4518 -24879 -41941 -29258 2984 27003 21548 -5703 -28877
796 -28877 -29732 -6994 23905 36919 20460 -11088 -31063 -21076 9831 33576 32805 10481 -17785
809 -17785 -29751 -11393 21158 35762 20448 -9587 -33433 -35374 -11635 17825 25279 4305
821 4305 -25238 -38429 -22815 9306 32513 30368 4900 -23797 -27805 -2369 29186 39982 22572
834B2572l0624k0489M440K7786K7237j644k8363k7787p619J7049K9498J7678j1224
847A8510l1317k4625L328K6766K8513P182j7917k5284j3342J2127L3276K3666
859D0883p656k6431k3759o635J7779K8213J1340j7676l2648k0407N678K5311K4085
872A8077L022k0033k5985j0033J7707L1090J7767q462k5029k0793p38K0991K8189
885B5770R824j9444k8076j1853Q690K3193K3175p28k6737k6676o764J4741K5786
898A0901J3265j3782k6560j9615J291K5093L0073O349j9960k2820q291J1842K9247
911A7033K3716o027k8921k5042l142J8161K3948R474j5468l0086j9516R162K6674
924c4K1987R72k2147k5885n281J6172K6004J8946r643l0749j8602N957J9225K3060
$$ plain form
834 22572 -8052 -28541 -24101 3685 30922 29278 915 -26872 -34491 -17442 12056 29734 18510
847 18510 -12807 -37432 -34104 -7338 21175 28357 10440 -14844 -28186 -16059 17217 40883
859 40883 33227 6796 -16963 -23598 -5819 22394 33734 16058 -16590 -36997 -31319 -6008 18077
872 18077 21099 1066 -24919 -34952 -17245 13845 31612 23150 -1879 -22672 -23410 -2419 25770
885 25770 35594 16150 -11926 -23779 -15089 8104 31279 30551 3814 -22862 -29626 -14885 10901
898 10901 24166 10384 -16176 -35791 -34500 -9407 20666 27015 7055 -15765 -24056 -12214 17033
911 17033 40749 34722 5801 -19241 -22383 -4222 19726 29200 13732 -16354 -35870 -26708 -34
924 -34 21953 22925 778 -25107 -30388 -14216 11788 30734 21091 -9658 -28260 -22303 -3078 19982
938A9982J1780j7491k9893q211J5212K2996J8372l253k7581k5281l385J6242K4314
951A3803J0219j6451k7043j3802P931K3227K2554L960j8982k4452l990J9019K1821
964A7814J0991n317k3837k4395K466K2768J7151L197j1401k3742j3250J3373K2625
977H443J4479M28k0354k5396j090J8211J5750R362o589k6461j8642J0139K3854
990B134J7202L215j3899k1807r383J5145K5388J1708r550k1644j9137j951J8870
1003c709K0958L163j4299k1209j4060J0319K7004J3707m745j2456k0997j1387
1015b7711J9372K5019K693r715j4770j8414J17K4198K0654J091j2361j8242j0583
1028a8652J1472K1929J1165n221j8532k2237n878J6622J9784L620j1747j5577
$$ plain form
938 19982 31762 14271 -15622 -23833 -8621 14375 32747 29494 1913 -23368 -26753 -10511 13803
951 13803 24022 7571 -19472 -33274 -25343 -2116 20438 24398 5416 -19036 -23026 -4007 17814
964 17814 28805 23488 -349 -24744 -22278 490 17641 20838 9437 -14305 -27555 -14182 8443
977 8443 22922 23350 2996 -22400 -23490 -5279 10471 19833 13244 -13217 -31859 -21720 2134
990 2134 19336 22551 8652 -13155 -22538 -7393 17995 29703 20153 -1491 -20628 -22579 -3709
1003 -3709 17249 20412 6113 -15096 -29156 -18837 8167 21874 17129 4673 -16324 -27711
1015 -27711 -8339 16680 19373 9658 -5112 -23526 -23409 789 21443 22534 10173 -8069 -18652
1028 -18652 -7180 14749 25914 20693 2161 -20076 -25954 -9332 10452 14072 2325 -13252
1040a3252j2397K125K3468K2457l880j7027j0437o069O678K4454J3010j3048j7908
1053a826j2030l719J5624K1030K04j4470j3029j1491K792K3574J4830j1551j6304
1066f366j0387q026R216K3744R160j3621j5011n455M324J6348J9789K531j6040
1079A0206j4959l879O115J6309J0757j2285j9649r475l502P619K0596N881j8943
1092e209j4047R31L098J3307K1391l81k0202r719K019N589J5493J0286j0681j6112
1106d237o138R10J1300J7367P98j6913j2233k274J215R710J3930n034k0655q708
1120b0962N092N738J0752J1356o523j5694j685R194J0169J1432K822j3820j1677
1133c806P53L006P149R429q619j9745m338N587K569R177Q907r922j4969K207R734
$$ plain form
1040 -13252 -25649 -23524 -56 22401 18521 1494 -8943 -15012 -8334 16120 29130 16082 -1826
1053 -1826 -13856 -17575 -1951 19079 19283 4813 -8216 -19707 -16915 6659 21489 9938 -6366
1066 -6366 -16753 -24779 -15563 8181 17341 3720 -11291 -16746 -12422 3926 23715 26246 10206
1079 10206 -4753 -8632 -2517 13792 24549 12264 -7385 -16860 -20362 -12743 7853 13734 -5209
1092 -5209 -19256 -18325 -15227 -1920 19471 19090 -1112 -10831 -8812 -3223 12270 22556 11875 -4237
1106 -4237 -10375 -9465 1835 19202 20000 3087 -9146 -11420 -10205 -495 13435 8401 -12254 -20962
1120 -20962 -15870 -10132 620 11976 5453 -10241 -11926 -2732 7437 18869 21691 7871 -3806
1133 -3806 -3053 -47 7102 16531 7912 -11833 -16171 -10584 -8015 1162 10069 147 -14822 -12615 -2881
1148b881O281O988P03j2183j1016K561Q722Q776N692n820j2309k782N950O114
1162D796P149L237j1459j4954J219R051K958K835O68j2969j2536N430J1700N677
1176B802L411k138r323k920P880R618O616m36j1414j1637Q62O790L628M293j024
1191G008j2898r167P627J0441L131O18l421j0975o278P564J0695K826k932o578
1205b339p596M42Q389O727L410k755r581m210P984Q577K045O69m129j1432n757
1220i556O915N890k391l611l571m804O28Q209P063J87n139m833l76M318M447K383
1236E759L02l582n706O08O826L311l257j897j294m374j42O603L281m173m198j296
1252c229j247o14J995J987j960m150j478L677M840K483J079J962j348l120J912
$$ plain form
1148 -2881 3400 10388 11091 -1092 -12108 -9547 -825 7951 13643 7823 -4486 -7268 -1318 4796
1162 4796 11945 15182 3723 -11231 -10012 -961 1997 4832 5500 -7469 -20005 -14575 -2875 2802
1176 2802 6213 4075 -5248 -8168 -288 9330 15946 15510 4096 -7541 -6679 111 3739 8032 7008
1191 7008 -5890 -15057 -7430 3011 6142 6760 3339 -7636 -13914 -6350 4345 7171 4239 -2339
1205 -2339 -9935 -9493 -1104 5623 9033 6278 -3303 -7513 471 9048 11093 11762 7633 -3799 -9556
1220 -9556 -2641 3249 858 -2753 -6324 -11128 -10500 -2291 4772 4959 -180 -5013 -5389 -1071 3376 5759
1236 5759 6061 2479 -3227 -2619 4207 7518 4261 2364 1070 -3304 -3446 3157 6438 2265 -1933 -3229
1252 -3229 -4476 -5090 -3095 -1108 -3068 -7218 -8696 -5019 -179 2304 3383 5345 3997 877 2789
1267B789M688J89l601k022p4k563j690L855K021m904m060k9N20k45J621K630k96
1284a171k902n05L561L440l5r30P16p45k150K300N544K71l875j149N58j300j705
1301g7J113M59m638m181J795K676r41l01J781l2j241J257L412K044j257j400J896
1318B365J983j233j88K269p64m250K94K911j665l842j40P42j895k98J972J229
1334e10k525k886J993L504j33k98J680J40j155J222M511K114l284l599N25N11
1350A810j449P54J766l183n679Q94M518O82o80J14j782k081N28L313M739o98n428
1367a862j012K324k5J456M607r25o408j806L634L208J190k07j835l586l032J392
1383b887N765R89n013l430o53m09K349N400K558l347n032m12M632L157j92J032
$$ plain form
1267 2789 7477 7666 4065 2043 1969 -594 -2284 1571 3592 -1312 -5372 -5401 -4881 -5126 -3505 -875 -1171
1284 -1171 -4073 -4578 -1017 2423 2388 1458 2174 1429 -721 1579 7123 7394 3519 2370 2928 1628 -77
1301 -77 1036 1495 -3143 -7324 -5529 -2853 -3794 -4095 -2314 -2346 -3587 -2330 1082 3126 1869 469 2365
1318 2365 4348 3115 2927 5196 4432 182 476 3387 1722 -2120 -2260 -1518 -3413 -3711 -1739 -510
1334 -510 -3035 -5921 -3928 -424 -557 -855 825 965 -190 1032 5543 7657 4373 774 1299 1810
1350 1810 361 1115 2881 -302 -5981 -5087 -569 113 -567 -453 -2235 -4316 -3788 -475 4264 3566 -1862
1367 -1862 -2874 -550 -575 881 5488 4563 -1845 -3651 -17 3191 4381 4174 2339 -1247 -4279 -2887
1383 -2887 2878 3867 -1146 -4576 -5229 -5638 -3289 2111 4669 1322 -3710 -4122 510 3667 3475 4507
1399D507j810p192j044O993L226j573j272k800l005J054L995M419R27n425n587
1414d587J049K563p2L070J464p000n872K968N336K872J321r04k947l306R86P439
1430D380N925k965m952l005k232Q35N192L202l065o744n437K430O702K635j05
1445B796j67o990o954N733R301P07k174k102n294j714O023P236L544l566q541
1460b162k928M444M329L691K370n828j0074l017N647O579J027m567n111m919j640
1475a2159Q051J1804M35p845l680r96J111Q092P362l229q286o343r90Q174P940
1490I441j603m153n164q888J96J1796N959m895n627m007k556L432R215N513m417
1505D242r552m212L825O505O375M439m102q923l454M088P370M696m537r083m371
$$ plain form
1399 4507 2697 -4495 -5539 1454 4680 3107 1835 -965 -3970 -2916 1079 5498 6425 1000 -4587
1414 -4587 -3538 -975 -1047 2023 3487 -3513 -9385 -6417 -1081 1791 3112 2208 -739 -4045 -3059 4380
1430 4380 10305 7340 2388 -617 -2849 -2014 3178 6380 3315 -3429 -8866 -6436 266 2901 2796
1445 2796 2629 -4361 -11315 -5582 3719 4426 2252 150 -5144 -6858 -835 6401 9945 6379 -2162
1460 -2162 -5090 -646 3683 7374 9744 3916 -6158 -9175 -3528 3051 4078 -489 -5600 -10519 -12159
1475 -12159 -4108 7696 8131 286 -3394 -4390 -3279 4813 12175 8946 660 -5683 -6673 1501 9441
1490 9441 7838 3685 -1479 -10367 -10171 1625 7584 2689 -2938 -6945 -9501 -6069 3146 8659 4242
1505 4242 -5310 -9522 -5697 808 7183 11622 7520 -1403 -4857 -769 6601 11297 6760 -2323 -6694
1520f694k836J596J1073N985j0030q092O64K20M182J0252K179q292o135l85N139
1535a174R126M549l987o440o176l019O318J0013M81q374p097j799J710N627P943
1550G701J35j2133r910K794O476N263O796r07j0756m711N353P930Q031J807j0293
1565C576q703J70K530P047R984l869j5730o029L640K844O362O054o688j2875l595
1580a5282P462J0473P141k63p410r698k830P542J0857N156m606j1369o274M416
1594d685P466O986M752p855j6763l737R321N933L597L167r161j3260J543J0834
1608a862P343L709l952j1465n467M600Q325R733L966r494j1471m18N795N496M363
1623I201r50j0604j1050K234J1866O921j40k873q538q832M044J1647M532k545
$$ plain form
1520 -6694 -9530 -7934 3139 9124 -906 -8998 -8334 -8114 -3932 6320 8499 207 -5928 -6313 -1174
1535 -1174 7952 12501 8514 2074 -4102 -7121 -803 9210 9691 1317 -5780 -7579 -5869 -242 7701
1550 7701 7836 -4297 -14207 -11413 -4937 326 7122 6215 -4541 -9252 -3899 4031 12062 13869 3576
1565 3576 -5127 -4957 -2427 4620 14604 10735 -4995 -11024 -7384 -4540 1822 7876 1188 -11687 -15282
1580 -15282 -7820 2653 9794 9531 2121 -7577 -10407 -2865 7992 13148 8542 -2827 -9101 -4685
1594 -4685 2781 9767 14519 6664 -10099 -13836 -4515 1418 5015 8182 -979 -14239 -12696 -1862
1608 -1862 5481 9190 5238 -6227 -11694 -7094 1231 10964 14930 5436 -6035 -6453 -658 4838 9201
1623 9201 8251 -2353 -13403 -11169 697 7618 7478 4605 -3933 -12765 -8721 2926 7458 4913
1637D913o041q102n65R459P746K360j535j0671j0111O215J0994K383O53k099j0315
1652d716n498Q603R898J223n056q223p656l6Q127R316L016o079r593l818N846
1667d646Q888M420j869o516r497k829J1119J3091J03o273n355p781k243J1277
1681A889R722l855q739p331l718O235J0831M626l366r540j0748J7J1978R249M80
1696G730l120o535p077L600J3276P820m577r784p725l011M033J0846P190n824
1710F842j1657o176J449P593Q172L21p052q872n241N278J4021P612m442o919n324
1725d395l256O094J2579L167q331r136m075K734P871P043m77q831j1487m218O803
1740g915R439L370k701o510n886R85R438J0592J661q654q847j919K869P204Q593
$$ plain form
1637 4913 -1128 -9230 -9795 -336 7410 9770 8235 -2436 -12547 -6332 4662 7045 7698 5599 -4716
1652 -4716 -10214 -1611 8287 9510 4454 -3769 -11425 -11461 -3334 5982 8998 2919 -6674 -10492 -4646
1667 -4646 4242 8662 6793 277 -9220 -12049 -930 12161 12264 5991 636 -7145 -9388 1889
1681 1889 11611 7756 -983 -8314 -12032 -5797 5034 9660 6294 -3246 -13994 -13977 -1999 7250 7730
1696 7730 4610 -1925 -9002 -5402 7874 15694 11117 1333 -6392 -9403 -5370 5476 12666 6842
1710 6842 -4815 -10991 -9542 -1949 6223 6544 -508 -9380 -14621 -9343 4678 12290 7848 929 -4395
1725 -4395 -7651 -1557 11022 14189 5858 -3278 -7353 -4619 3252 10295 9818 987 -10500 -14718 -7915
1740 -7915 1524 4894 2193 -4317 -10203 -9218 220 10812 12473 3819 -5028 -6947 -4078 3126 11719
1755A1719j62j0579q607Q28O526O346K672m766r478o460J960R872Q664j507q154
1770a126o147k788L250R642O794l558r399n097L085Q125P075K798m664j0762o929
1785i701M600Q748L298k346o180p434k206O939R787M118n324r050m289K583O200
1800b57P188K895o591r843k128N911O812L668j846o842p012r70Q167J0170J574
1815A0896n938o460m600L15O465O658j492q505p565r30O600P799L885j359o754
1830i85p310J396R758O430r54m575o656m720L124Q591N322k777q747o414P45N422
1846b350O852M146l329r422m987L875P102M276j150o024p124l044N245J0366M976
1861I408m239n729k789J91N519P592J543p252q201l563L395O017K669j893n243
$$ plain form
1755 11719 11557 978 -7629 -6801 -275 6071 8743 3977 -5501 -11961 -10001 -129 8535 7028 -1126
1770 -1126 -7273 -10061 -6811 2831 9625 6067 -3332 -8429 -5344 2781 9856 12654 7990 -2772 -9701
1785 -9701 -5101 3647 6945 4599 -1581 -9015 -11221 -4282 5505 9623 4299 -4751 -9040 -6457 -257
1800 -257 6931 9826 3235 -6608 -8736 -2825 3987 7655 5809 -1033 -8045 -9015 -848 9322 10896
1815 10896 4958 -1502 -6102 -5787 678 7336 5844 -2661 -10226 -11156 -4556 3243 7128 5769 -985
1830 -985 -8295 -6899 2859 9289 8335 3760 -2896 -7616 -4492 4099 9421 6644 -2103 -8517 -7772 -2350
1846 -2350 4502 8648 5319 -4103 -9090 -5215 1887 6163 5013 -1011 -8135 -11179 -5934 4432 9408
1861 9408 5169 -560 -3349 -3158 2361 9953 11496 4244 -3957 -7520 -4125 1892 4561 2668 -2575
1876b575p249k042P611Q192J077k986m040l306J440O795O253j56o785o800r99
1891e570L999M647L493o94o847n901J569O265M393N02m005n750l884M00O450N867
1907D934k642o116k592r0L018P253M857k317n884l356J884N554L645p31l838o117
1923b538n232K306P123K180l541l911l409j106M722O756L096l398o255k173L019
1938b361M341L416J144m508o666j375M692N655K482k283m519l195q32L626O328
1953E945J48o505n142j064Q93L886N342o81n262l621N80M682N616J339k185l117
1969H54l518M89N785L972k469m809l582j716J577M280K922j564n455k712K687
1984c259L703K272J057k054n580j767L209L762K346p03l699j831Q37J645M016
$$ plain form
1876 -2575 -9824 -11866 -4255 3937 5014 2028 -2012 -5318 -3878 2917 9170 9014 2229 -4571 -5570
1891 -5570 -1571 3076 6569 5875 -972 -6873 -5304 961 5354 5856 1851 -3899 -7783 -7383 -933 4934
1907 4934 2292 -3824 -6416 -6506 -3488 3765 8622 6305 421 -2935 -1051 4503 8148 7417 3579 -2538
1923 -2538 -7770 -5464 1659 3839 298 -3613 -7022 -8128 -3406 3350 6446 3048 -3207 -5380 -2361
1938 -2361 1980 5396 6540 2032 -4634 -6009 -1317 4338 6820 4537 18 -3177 -4009 -383 5945
1953 5945 6093 -412 -5554 -6618 -5725 -1839 3503 2822 -2440 -6061 -5481 -799 4817 6156 3971 854
1969 854 -2664 -2175 3610 7582 5113 304 -3278 -4994 -3417 863 3785 2221 -3234 -5946 -3259
1984 -3259 444 2716 3773 1719 -3861 -5628 -2419 1343 3689 2986 -713 -2544 -1707 -62 3954
1999C954K920l895n107l12J738P18K676R93m304m384k22K450L039J027j012j686
2015a407k042K73M149M296J17k714k954j551O74K194J769L68l349m277J102L634
2031B82J057Q74O66m054m109J877L574J267P66j565l071j021J805K366K843o4
2047C493l940k333J271K013K097K090q15l779l135O49L095O44j325q32k116k539
2063e462K498M941Q71r10r38k215n04K469J212q7l83k883k070K627K403j002K17
2080G84M90l415j327L491K260q87l48q0j087j88J406Q83j084k354j341L00J014
2097a483J262N40j31J99l31n12K302O81l035j255J845r93j036L314R10l083j84
2114i90J911p53P0J521r35j298N53k54K54J901r51k397L0j96j750M99K286J24
$$ plain form
1999 3954 6874 2979 -2128 -2440 -702 16 2692 3685 -619 -5003 -5225 -2775 264 1291 279 -1407
2015 -1407 -3449 -3176 973 5269 5386 2672 -282 -1833 -1159 1035 2804 3172 -177 -4454 -3352 282
2031 282 1339 2213 2879 -1175 -5284 -3407 167 1434 2200 635 -2436 -3457 -1652 714 3557 3493
2047 3493 -447 -2780 -1509 504 2601 4691 3876 97 -3038 -2389 706 1350 25 -807 -2923 -5462
2063 -5462 -2964 1977 2848 1938 1000 -1215 -1719 750 1962 1875 1492 -1391 -3461 -834 1569 567 784
2080 784 1274 -2141 -3468 23 2283 1396 1048 968 -119 -307 1099 1982 898 -1456 -2797 -2497 -1483
2097 -1483 -221 319 188 387 56 -456 1846 2527 -508 -1763 82 -911 -1947 1367 2277 -806 -990
2114 -990 921 168 238 1759 824 -474 79 -175 79 1980 1029 -1368 -1338 -1534 -3284 -2785 -499 -375
2132c75j397J060K194M0K76J771J05k647j120O26q66k56R79o13j167N72k84p69
2150a871J974O1k222P61J779j344L33L025n71k109Q17L86j898j20J011n25J4Q64
2168C65K93N30O30j58p74J45p07j697o13O52m59j012J404J568r32n96J901K24
2186G64j287J503J720j562n61J095j75j68Q15j221j652o19j396l84K062Q05j391
2203a652M12J349m21O44K168l1k464j418L58K25M88J200M23j204j131P31J320
2220I97O80J57r68j445m99M56J197J435l37k900j328L88k37P14J897o01k040K97
2238b137K099J810J408N41j271j848r06L05J286N54j490j759p07K32J210J839
2254A166K81j624k066m67J435J719P61P0q32k279k11K346J433l35j175j371j116
$$ plain form
2132 -375 -1772 -712 1482 1522 1798 3569 3674 1027 -93 533 -333 -589 390 -223 -1390 -818 -1102 -1871
2150 -1871 103 164 -2058 -1297 482 -862 -529 2496 1925 -184 633 1019 -879 -999 12 -513 -499 365
2168 365 658 1188 1818 1660 886 1031 324 -1373 -1986 -1334 -1793 -2805 -1401 167 -765 -1361 540 764
2186 764 -523 980 2700 1138 577 1672 1497 1329 2144 923 -729 -1348 -2744 -3128 -1066 -261 -1652
2203 -1652 -1240 109 -312 332 2500 2469 5 -1413 -1055 -830 -342 858 1281 77 -1054 -323 997
2220 997 1677 1834 866 -579 -1078 -622 575 2010 1673 -1227 -2555 -2167 -2404 -1690 207 -394 -2434 -2137
2238 -2137 -38 1772 3180 3721 2450 602 -304 1 1287 1841 351 -1408 -2115 -1883 -673 1166
2254 1166 1447 -177 -2243 -2710 -1275 444 1205 1275 443 -1836 -2047 299 1732 1397 222 -1149 -2265
2271b265R12K745J993K63j654k345k31J144N51K36q38k851j990O51K359J806L51
2288H37j292j512p09Q23L050K132q66j786q89P6J022K230P08j994k881j864M98
2305b417K030J729k73j246k052j097J837L007Q02j597k205j476n0K202K721J147
2321C062j883k371m98J412K097J630n7k335k751k07J832K367P38j970k942j856
2337c732k26K015L105r3k575j699J63J689L061K583p40k862k139J55K485K266
2353C456K34k025k736j966N83L115J851j200k666k362l41K117L031J882j455l156
2369a638j551J150K589K054M16k163l150o12K322L001J779r13k813k121k88K009
2385G1K772N51k814l472j221P95K641K514l14l077k592J92K605L635J643j155
$$ plain form
2271 -2265 -1353 1392 3385 3648 1994 -351 -582 562 1113 1349 511 -2340 -4330 -3679 -1320 486 837
2288 837 -455 -1967 -2676 -1853 1197 3329 2463 677 -212 -136 886 3116 3824 1830 -1051 -2915 -2417
2305 -2417 -387 1342 1069 -177 -2229 -3326 -1489 1518 2320 723 -1482 -2958 -3008 -806 1915 3062
2321 3062 1179 -1192 -1690 -278 1819 3449 3392 1057 -1694 -1901 -69 2298 3036 1066 -1876 -3732
2337 -3732 -3958 -1943 1162 1069 -1506 -3205 -3042 -1353 1708 4291 3551 689 -1450 -1295 1190 3456
2353 3456 3690 1665 -1071 -3037 -2454 661 2512 1312 -1354 -3716 -4057 -1940 1091 2973 1518 -1638
2369 -1638 -3189 -2039 550 2604 3020 857 -2293 -2905 -583 2418 4197 3284 471 -1650 -1938 71
2385 71 2843 3394 580 -2892 -4113 -3318 -677 1837 1523 -1554 -4146 -3954 -1349 2286 3929 2774
2401B774k612j958O40L260K706n20l278l010j411J394K909J961j181l513k434
2416d273O69K925K720J100j937l389j509J419L033K374k67k856k819k75K213L437
2432B565J998j715l430j692Q70K203K661M09l085l743j334J588K889J828r81k653
2448a622k523Q2L105L758J269j599l200j665J161K758K454J05l321l722p35K147
2464a548K727J560o32l353k788R03L256K562Q96k107l666j548J604L001K367o29
2480B605l511k796L16K695K875J822j531l620j916J466L201K226l07k820l533
2495b828j340K273L325J392j472l057k265N84L422L161N17k126l460j554K020
2510a408L535J414p30k834l297m05L211L211P28k030k887k084J032L627K751l82
$$ plain form
2401 2774 162 -1796 -1156 2104 4810 4290 1012 -1998 -3409 -2015 894 2855 1674 -1839 -4273
2416 -4273 -3604 -679 2041 3141 1204 -2185 -3694 -2275 758 3132 2865 9 -2810 -3085 -872 2565
2432 2565 4563 2848 -582 -2274 -1404 799 3460 3869 784 -2959 -4293 -2705 184 2012 1031 -1622
2448 -1622 -4145 -4063 -958 2800 4069 2470 -730 -2395 -1234 1524 3978 4083 762 -2960 -3695 -1548
2464 -1548 1179 2739 2107 -1246 -4034 -3131 125 2687 3583 1476 -2190 -3738 -2134 867 3234 2605
2480 2605 -906 -3702 -3386 -691 2184 4006 2475 -1145 -3061 -1595 1606 3832 3525 705 -2828
2495 -2828 -4168 -1895 1430 2822 1350 -1707 -3972 -3388 34 3195 3712 1586 -1874 -3428 -1408
2510 -1408 2127 3541 2811 -23 -3320 -3725 -514 2697 3425 1395 -1492 -3576 -2544 1083 3834 3452
2526C452l180l112q23K071L156J571j347l341k267K87L643L216K66k127k968j530
2542c033Q55M036K286j214l106k393q85K198L403J180k001l245k098Q20L013L071
2558B887J49k266k722j432J706L628J847j346k832j938o32K537L607R15k370l118
2574a380j716P04K719K714j80l157k753n66J816L260J746j492l104j807L36K355
2590e05L595N30k672k798o03Q89L177K503j016l552k307MK067K815J263k259l132
2607b001j491R04K680K661m77k811k657k3J951L054K101j272l561j606J062K077
2623E91K157Q26k654l652m73J938K315J844o34l134k379K94K180K743J343k048
2639A257l367j045J624K038K220N12l123k978k7K169K284J211m47k934k192Q40
$$ plain form
2526 3452 272 -2840 -3663 -1592 1564 3135 1788 -1553 -3820 -3533 110 3326 3592 1465 -1503 -3033
2542 -3033 -2178 1858 4144 2930 -176 -2569 -3454 -1256 2147 3327 1326 -1919 -4017 -3197 -184 2887
2558 2887 3036 770 -1952 -3384 -1678 1950 3797 2451 -381 -2319 -2951 -414 3193 4108 1738 -1380
2574 -1380 -3096 -2392 327 3041 2861 -296 -3049 -3615 -1799 1461 3207 1715 -1389 -3196 -2860 -505
2590 -505 3090 3620 948 -1850 -2453 -1564 1613 4116 3100 -452 -2759 -2755 -688 2127 3390 1131 -2001
2607 -2001 -3492 -2588 92 2753 2276 -535 -3192 -3215 -1264 1790 3891 2619 -942 -2548 -1486 591
2623 591 2748 3574 920 -2732 -3205 -1267 1048 2892 2258 -876 -3255 -2961 -781 1962 3305 1257
2639 1257 -2110 -3155 -1531 507 2727 3239 116 -2862 -2889 -720 1564 2775 2328 -606 -2798 -1958
2655a958K435J958L05k101k871j216J630K368J595k2k504k527L80K307J759J220
2671B758n66k810k217J559K362J261J65j671k867j131J724K306J194n82k333j862
2687b710M07K333K033P75j115l061j746J477K601R75p4j854k459o78K307K896
2703B107N79j409j890j745L17K857J920m8j803k921r20J686K138R29m83k109k420
2720c215L37K998K085K81j172k060j530J025K352J712q79k433j741l73J617K187
2736A191J214r93k064j829J088J970J911l95j337j783j140P50K344J032j305k030
2752a376r52j07J449K562P31j582j567l41Q15K015Q35m31j348j741r91J339K086
2769A396M2j175j296j037J3J624J821K73j616j329k76P11J480J208j78j814j651
$$ plain form
2655 -1958 477 2435 2740 639 -2232 -3448 -1818 550 2145 2123 -381 -2908 -2528 -221 1538 2758
2671 2758 2192 -618 -2835 -1276 1086 2347 2512 841 -2026 -3157 -1433 873 2067 1485 -848 -2710
2687 -2710 -2303 30 2063 2838 1723 -1338 -3084 -1607 994 1969 1895 41 -2418 -3096 -789 2107
2703 2107 2686 1277 -613 -2358 -2041 816 2736 2688 885 -2036 -2956 -1270 868 1797 1314 -795 -3215
2720 -3215 -2878 120 2205 2486 1314 -746 -2276 -1251 1101 2813 1934 -499 -2240 -2613 -996 1191
2736 1191 2405 1412 -652 -2481 -1393 577 2488 2093 756 -1027 -2167 -1417 927 1959 654 -1376
2752 -1376 -2328 -2435 -986 1576 2307 725 -842 -1183 -368 1647 2482 2051 703 -1038 -2029 -690 1396
2769 1396 1438 263 -1033 -2070 -2057 -433 1388 1661 45 -1284 -1560 -849 631 1839 1661 -153 -1804
2786a804k5J752J269O12p98j295q96N96J576J539m27j838j436n80O02J186J139
2803A172q46j797j068O23J326J384M84n33j075r03J051J930Q26o72j372j151n01
2820a122P37J217N50r78k091n49Q76J216P95L87r14j567l08J433J321L85o53q45
2838a10r20l7J141J458J54j170j040j96N26P76J075k21j505j393n4R41O72J76
2856B73n31q52r71P07J452J092j30r37k34k44N79R75P62o06j362p82L62M95M31
2875D79j6m99r91o73Q76J308J22l72m14m41j67K89J103O27q35q04k45M19K20R03
2895H89J94p65q40j2N89Q01n5k96l53p69m13P46Q36j43o36n38n2M3N74P16J16
2916F32o64p42L34P85K32J84O8m40r80K90Q13K93l95l42k45l64N8L70N82k22r56
$$ plain form
2786 -1804 -1829 -77 1192 1804 1006 -289 -1185 -589 987 2526 2099 261 -1175 -1755 -1153 33 1172
2803 1172 326 -1471 -2539 -1916 -590 794 1278 745 -330 -1233 -182 1748 2574 1902 530 -621 -1122
2820 -1122 -385 832 1382 404 -1687 -2236 -1360 -144 651 1038 124 -1443 -1751 -318 1003 1388 735 -110
2838 -110 -1030 -1067 74 1532 1686 516 -524 -720 -194 582 1657 1436 -69 -1462 -1516 -575 97 273
2856 273 -258 -1110 -2081 -1374 78 1170 1040 103 -131 -375 204 1179 1941 1335 -27 -809 -447 48 479
2875 479 463 -36 -1027 -1700 -824 484 606 234 -180 -621 -788 -499 604 1231 396 -408 -653 -234 -14 889
2895 889 1083 318 -522 -534 55 856 801 505 152 -617 -1030 -284 552 409 -227 -765 -817 -774 -200 516 632
2916 632 -32 -774 -440 345 577 761 829 389 -591 -301 512 805 410 68 -177 -541 -483 -113 469 247 -709
2937g09JK72L27J60K81o1p30l03M88Q78k65r3l3J4m19K24O95l5o83q8K65q6j7
2960H3J56P6o65m37J74K58K11j71j97J74j60PN75M53k40m09M84L30m98K92K67
2981G63j53p27k9K87j82k41N7j02j14j08Q7L77M8j15l04O30j1l06K61M12n72n2
3003i4L65K92k89j13J36j69k57L08K75k59n31r7K02J43j28j22L7j37l40L61O34
3024B17J89m62J88L85l30k2Q20P0q83k44p1RN7J89j62n08l29j22O42N71k95k19
3046c10Q5n0m0N99Q19m17p99m9L88j90J36N56l63p74m31Q40K38N8o0j42n22j13
3068e41J42O30L89p66n64N3K31J30N48O41n95q81K53N38M52J03K23o56p86j37
3088e93N72N20k12m12n01l39L45K96O00M42r39p60N29P33K82J4L82r51j092N53
$$ plain form
2937 -709 -708 -436 -109 51 332 271 -459 -762 -274 604 339 246 213 227 -192 32 727 692 9 -79 186 100 83
2960 83 239 315 -350 -787 -613 -355 -144 -315 -512 -338 -498 -491 84 537 297 -112 372 702 204 496 763
2981 763 610 -117 -146 141 -41 -282 -225 -327 -441 -549 -462 -85 -37 -152 -456 174 163 -143 118 530 -42 -94
3003 -94 271 563 274 161 297 128 -129 179 454 195 -336 -433 -231 -88 -216 -338 -301 -438 -778 -417 217
3024 217 406 -56 132 517 187 165 985 1055 172 -72 -143 -134 -77 112 -50 -558 -887 -1009 -367 204 -91 -310
3046 -310 -225 -275 -315 284 1103 686 -113 -162 226 36 172 728 365 -409 -840 0 238 296 236 94 -428 -541
3068 -541 -399 231 620 -146 -710 -657 -426 -296 252 893 298 -583 -330 208 660 763 986 330 -456 -593
3088 -593 -21 499 287 -125 -626 -965 -620 -324 276 718 -221 -981 -452 281 563 577 959 8 -1084 -531
3108e31R52K25l21m3o54n95M90J011M48j92q27o47J94N04M29M02k92j252o33M26
3128i06J085J99J02l71q23o15J047J169J68m57n82n20j64O67J044N9r24r37l94
3147a153O11J089j8K8l34j101k98J233J040k79n53p36m20j76R06J116l29q19p64
3166i57K68O63P33L10k55q27p05J44J633K45n32o30m05p55L1J653O54j028r90
3185g50r4J2M26J317K51p97q95m72O37R27N64m15o58p13l33O96J236L07r43p82
3205d79l13j82N87J425J17j203j133LO70Q13P92j39j016j152m4J306J133L14o93
3224H06r84o00K5J107J116k29j522j000k6L83J090Q80l95j450p73M86R01J250
3242A065P9n92j106o35O53J447R84o06j441o04j63N93J149O91p89j741p61Q07
$$ plain form
3108 -531 421 646 325 282 -372 -967 -477 534 982 790 -37 -684 -490 14 443 845 553 -699 -1332 -906
3128 -906 179 378 480 109 -714 -1329 -282 887 1055 598 16 -504 -668 -1 1043 1102 178 -759 -1153
3147 -1153 -542 547 529 557 223 -878 -1176 57 1097 818 265 -471 -891 -1067 -161 955 626 -193 -957
3166 -957 -689 -26 707 1017 762 -65 -770 -626 1007 1252 720 90 -315 -1070 -1039 614 1268 240 -750
3185 -750 -844 -832 -406 911 1162 365 -530 -1002 -365 562 1126 711 53 -660 -993 -297 939 1246 303 -479
3205 -479 -792 -974 -387 1038 1155 -48 -1181 -1178 -508 305 1097 958 -58 -1210 -1254 52 1185 1499 806
3224 806 -178 -778 -753 354 1470 1241 -281 -1281 -1307 -924 166 1046 651 -799 -1572 -1086 -185 1065
3242 1065 1144 552 -554 -1189 -536 911 1895 1289 -152 -756 -919 -326 823 1514 725 -1016 -1777 -970
3260i70R43O79M38j135j223l78R01J507O80n58j091o85O7R34J372M85j603j271
3278i08j26N35P82Q92j98j036j343k05J368Q97Q7n37r13q31L09J452J118p8j222
3297D3r58P0O91Q14R26l30j560q19L31J051N65J15m96j282j058Q57J351O59q1
3316H89j116p45j59Q23J490N53q52j363q16O06Q42R22J98r18j384o64J118J431
3334H55L26m84q53j016k00J040J682K48j084j208o83M85Q48J182Q2j189j267r4
3352a330J264J020K80m98r09j257J21J425J176j95j039q84n50O44J161J143l79
3369A193j436j187L85J150Q25L22n11j368j031O31J508Q79m94j194q84k73R40
3386e45J544P22r02j360m72L10O53J294R3r55j518m70R55J131N00l80r06q40j97
$$ plain form
3260 -970 -27 652 1090 -45 -1268 -1646 -745 762 1442 884 -207 -892 -825 109 1481 1966 363 -908
3278 -908 -1034 -499 283 1175 977 -59 -1402 -1607 -239 658 745 208 -705 -1536 -1227 225 1343 1265 43
3297 43 -915 -845 -154 660 1586 1256 -304 -1123 -792 259 824 939 443 -839 -1897 -1040 311 970 889
3316 889 -227 -972 -1131 -308 1182 1735 883 -480 -1296 -690 152 1074 1272 354 -1030 -1694 -576 855
3334 855 1181 697 -156 -1172 -1372 -332 1350 1598 514 -694 -1377 -892 -44 1138 1220 31 -1236 -1330
3352 -1330 -66 954 1234 736 -173 -1430 -1309 116 1292 1097 58 -826 -1376 -732 429 1572 1193
3369 1193 -243 -1430 -1045 105 930 1252 741 -627 -1658 -1027 481 1360 866 -328 -1212 -1485 -545
3386 -545 999 1721 819 -541 -1013 -703 -50 1244 1337 382 -1136 -1606 -651 480 980 600 -306 -1146 -1343
3405a343J016J481K72q15j265m12M20R46J006j7j332j178RR73R07K95k50q28j148
3424a263K98J097J012l1r14r08o17L60J146J149l18j255q51L51P31J037L77l25
3442A076j400q21N20J138P38k22r38j135m30N32J269P92m54j342m88K00P74J238
3460A047N21j060j231m92O15J171N64q6r29j177j71R81J200K25o15r68p91M31
3478g65R43Q50R3j129j163q4P58R14M62n8j145r91K92J129J103K2p04q96o24K81
3498g12R35R63k36j339o96O3O57P21P55n13j219p72O98J026N34J8n28q06o64O69
3518d46J089N61o24r12p09O4R07Q75K18n04j152n19P21P88L57K6o56r08m61R86
3538b99R66J31m79o57o02PR44J183o4p42j099j46N02Q48L46j1j067q44O5R41Q47
$$ plain form
3405 -1343 -327 1154 1426 611 -654 -1066 -646 300 1306 1289 -43 -1221 -1212 -239 668 963 713 -115 -1263
3424 -1263 -965 132 1144 1113 199 -709 -1326 -966 180 1329 1011 -244 -1095 -744 -13 1024 1401 1076
3442 1076 -324 -1145 -625 513 1251 1029 91 -1044 -1474 -942 327 1119 665 -677 -1165 -965 -191 1047
3460 1047 1568 508 -723 -1215 -600 571 1135 1049 120 -1057 -1228 -247 953 1178 563 -405 -1196 -765
3478 -765 178 1028 1121 -8 -1171 -1255 -497 417 879 821 -324 -1315 -1023 106 1209 1231 527 -369 -993 -712
3498 -712 223 1186 950 -389 -1085 -1022 -365 356 1111 598 -621 -1393 -695 331 865 883 355 -451 -1115 -446
3518 -446 643 1204 580 -332 -1041 -977 -70 805 1023 519 -633 -1152 -431 357 714 740 84 -824 -1285 -299
3538 -299 667 798 319 -338 -940 -933 11 1194 1130 388 -711 -857 -355 493 839 828 -239 -1083 -1018 -77 770
3559G70Km21q03n38O8J254P72l87q02n53k15N69Q22N69m16j013o50K77Q86N74
3579G65l1l30p29p03M24J393J26m13p29n98o1L53J050K71n99p85k63K38O45O84
3599G08M9n15o10j53M54Q75R3m88m45m90k42N55Q99pn87p01l6J86O02N45l14o41
3621b63q13M57M85N54R0j73o86j38J39Q99L33k70o01n15J24J19P07M97n18r77
3641e50k61L81L32M23K20n81n39k61M74O87M17k45n47m53rM53P29K66p67l63m96
3662f90N53K05M80Q9p20p18n6O14M04qJ00m30n48K65M94N09J9m28n16l9P9N73
3684B31L42R3p34n25J82J61N17K21k94m18l34J20N21L28p5j13n32j67J41M43M68
3705E76l6o33k63K68K50K48J26j33o61m10M25K89Q4P7k88m50j18M23L22J07j41
$$ plain form
3559 770 772 351 -452 -990 -922 332 1104 717 -85 -638 -853 -284 538 1107 691 -322 -972 -695 191 765
3579 765 734 404 -325 -1028 -604 789 915 502 -227 -825 -886 -533 517 788 189 -596 -859 -621 24 708
3599 708 757 242 -368 -521 -67 808 901 413 -32 -522 -764 -209 690 683 96 -605 -641 -455 147 692 378 -263
3621 -263 -1076 -619 -134 420 510 337 -349 -487 -348 551 884 614 13 -502 -378 -259 448 945 427 -550
3641 -550 -811 -430 -98 325 545 -36 -575 -836 -362 325 742 497 -50 -503 -512 -59 670 936 169 -194 -690
3662 -690 -137 68 548 637 -83 -801 -857 -243 161 153 253 -177 -725 -460 34 543 562 134 -382 -421 -342 231
3684 231 573 666 -68 -593 -411 -250 267 488 194 -224 -558 -438 83 411 336 223 -309 -476 -335 108 576
3705 576 540 -93 -356 -88 162 410 536 403 -258 -668 -243 46 130 207 -81 -531 -649 -226 96 203 62
3726F2k34j11L01K06J83J49j64p71R4K62J13Q3Kk89j98q7M43K82K1l82O9j18l8
3749a22L13K06k13k23l40J34K68J75l2ll08j98K22N62j34k83J38l13p5R7M08k73
3771Fj55p1m5R0M45l7M7j9k10k19K90l1J46l34J5j38k54J79K18M0o1j86L79j54
3795e9mL69k1j15m6N0N0K11k45l05Pj19K9N2J80j77j82M29j05J18l4J59p1k03
3819c2j79J10J03q0r8K09p5N4J47L9n0q0j36J54J1m6L9N5l09RN2o6o4m1J61j09
3845b22q8L84J93k6j9r5O7j33K40J0l28j38q1M1m3K63J23k23K2l6K1R4J05P9l49
3870a39R8n9P2J30J93l36q5j17P8L23p9K07l29J9k35K72L19j37l29j79L1L5J72
3893g5J50J06n19j44K07M47J11J23l44k21j15L01K81k4l8m31j43MKL29J71n2l38
$$ plain form
3726 62 -172 -283 18 224 407 556 392 -379 -285 -23 90 173 175 -114 -312 -399 44 326 347 -35 34 -84 -122
3749 -122 191 397 184 -39 -379 -245 23 198 166 163 -145 -343 -121 441 307 24 162 -151 -226 -129 279 6
3771 6 -149 -220 -265 -175 270 233 280 261 51 -168 122 91 237 -97 -82 -220 -474 -295 -77 -37 -98 -284 95 -59
3795 -59 -63 306 285 170 124 174 224 435 190 -115 -108 -227 -198 -146 34 -143 -325 104 -1 117 83 242 171 -32
3819 -32 -211 -101 2 -78 -176 33 -42 12 159 198 148 68 -68 86 97 51 90 145 -164 -155 -103 -169 -233 -274 -113 -222
3845 -222 -310 74 267 241 222 127 194 61 301 311 -17 -155 -236 -195 -238 25 148 -75 -53 -89 -68 26 131 210 -139
3870 -139 -41 -100 -28 102 295 -41 -126 -243 -165 158 79 286 -43 -24 -259 13 332 195 -134 -313 -282 -247 -75
3893 -75 75 181 -338 -482 -275 172 283 406 62 -159 -274 27 308 284 246 -185 -328 -324 -322 7 178 126 -212
3916b12R7p2L98J04J0j66l79p9J93J48J8r1j26p6J19K77L23j42k49k28q0J68L18
3939B73J1j59k76j47j46M39K33r5m8k26k80P2N83R4K5k29k56p3L17K13K5q1n25
3962b56r4J6L17L74n8j58m55j76L32L56nk4l36l53K00J30M33J37k55m30k02K98
3984b09K85N15j45k15m47r0M63K96k1j23l17n64J23K67L76J68l42m05j43K21L71
4005F4K79n1m74l00J28L89N05q4k51l18j43L1M58K57j50l62l84j94N18K62J82
4026C62k66n11j45J05N66L36p4l25n24m8M56M64J77l06k83l79nL52N36Jl67l56
4048b34l78M21K03M11k04l39m93L5M56L27L90k73m48l40J10M31N18J41o84k48
4068a98j24J0N03L98k67m00n56O8M85K65J92k09m53m08L42N95K12M2m69m25r1
$$ plain form
3916 -212 -115 -187 211 315 325 159 -220 -299 -106 42 60 -31 -157 -233 -114 163 486 344 95 -133 -213 -45 273
3939 273 284 125 -151 -298 -444 -5 228 133 85 -141 -421 -349 234 328 353 124 -132 -205 112 325 350 269 -256
3962 -256 -350 -334 -17 357 299 141 -314 -490 -158 198 193 169 -167 -520 -320 -190 243 380 125 -305 -507 -209
3984 -209 76 591 446 231 -216 -306 157 453 432 309 -8 -572 -449 -182 194 362 20 -385 -528 -307 64
4005 64 343 292 -182 -482 -354 35 540 456 205 -113 -256 -225 233 490 340 -22 -406 -600 -82 180 362
4026 362 96 -415 -560 -455 111 447 373 48 -476 -524 -68 396 573 267 -16 -395 -400 -48 488 489 122 -234
4048 -234 -612 -191 12 423 219 -120 -613 -578 -122 205 595 322 -126 -466 -356 75 593 734 50 -198
4068 -198 -322 -312 191 589 322 -78 -634 -566 -81 184 376 167 -286 -694 -352 243 455 497 28 -397 -488
4089d88L64N44K58r9n35n89K18L23N01J34m68o02k28K79N33L22j41m52l71j28
4109f25L45P50J04j62n99m07L81L00N87j51m37n08j41M97M01K04q5n42m30P8N02
4130F2M49Nm42o88p6K14P40L54k38m31n31M4O14L67N6l42m80l07M09L49K22J57
4152E07m09n74k05N74M29J53mq33j87J10M26N79on83m49j01K43N89L48k19m12
4173b4n95mN48M96J17l56k79n32J71O70L87J2m21o67o8K22O21J70j58m96m20m9
4195f55N54O43J26n35m40k96N3O25M85n3n25j66m71L29P45R9l6o58n08J68O02
4216H6L50J27m45m45l62M08M93L07o2n90l01q0N56M89J40m67m18l34J32M84M73
4237E41k9m94m79j48O19L56L01n08m41l91J15N53N66J8m27n73n2K14N59M53l21
$$ plain form
4089 -488 -124 420 678 579 44 -545 -327 -4 497 631 163 -439 -667 -388 145 467 326 -126 -497 -625
4109 -625 -280 470 574 412 -187 -594 -213 87 674 523 86 -422 -563 -66 335 539 454 -88 -518 -440 62
4130 62 511 516 74 -614 -690 -476 264 618 380 -51 -582 -538 76 443 499 157 -323 -630 -221 128 350 507
4152 507 98 -476 -681 -107 322 475 471 -362 -549 -439 -13 566 560 -23 -472 -573 -330 259 607 388 -24
4173 -24 -619 -623 -75 421 538 182 -97 -629 -458 212 599 611 190 -477 -545 -323 298 468 310 -186 -606 -655
4195 -655 -101 542 668 133 -307 -603 -550 75 560 507 -18 -184 -655 -326 419 518 482 -176 -684 -516 86
4216 86 436 563 118 -327 -689 -281 212 519 457 -133 -434 -514 42 531 671 204 -214 -548 -416 68 541
4237 541 512 18 -461 -609 10 366 667 159 -282 -673 -558 -5 561 579 152 -421 -473 -259 300 753 432
4258D32n43m27l5N13N09K53l32o27k91K20M02L47r6l31m70j94L74O78J14k59n07
4279b70l11K46L38M10N0j74o11LJ42L65L96m4p00l56M2M80K75K08k84n16k12J97
4301c26L84M17M9m61n10r1M35M92J74k19l63m73j06N46M48J76m65l78k15K69N66
4322C49K00j61n38k94n2L11L83L01l82l67k18K7P65K05k08k38n56q9M47M25J54
4343D64k57l43k69J33M19L81m2l76m95k38M15M09K94p5m52m53j12K95N25m4j08
4364G1n27J6N2M84M45Q4l36n68l1L7N01J74k12k62l61n1L94M07k1j22l88l22K17
4387c19M17L59k00k92l72O2K20M33Ml6n91k64L56M12L85k8l15l67l54K61N14L6
4409C21k63l27l49J64L06K42L15j92l91j32J85L39K76Rl78k45k81L33N93j45l27
$$ plain form
4258 432 -111 -538 -573 -60 449 702 370 -257 -548 -328 74 421 325 -6 -476 -670 -296 382 496 237 -270
4279 -270 -581 -335 3 413 463 289 -322 -319 -177 188 584 540 -160 -516 -474 6 281 489 205 -311 -523 -326
4301 -326 58 475 524 63 -447 -538 -103 389 563 344 -19 -492 -598 -52 396 572 107 -271 -486 -217 349
4322 349 549 388 -150 -444 -496 -185 198 499 117 -250 -468 -441 324 529 321 83 -473 -562 -115 310 464
4343 464 207 -136 -405 -272 147 528 486 110 -385 -623 -208 201 495 420 -32 -485 -597 -302 223 179 71
4364 71 -456 -440 -388 96 541 625 289 -279 -310 -273 228 402 190 -72 -433 -484 -90 317 296 174 -214 -536 -319
4387 -319 98 457 257 -35 -407 -345 -125 308 312 276 -315 -579 -223 189 574 546 231 -136 -490 -229 285 321
4409 321 58 -269 -618 -454 -148 94 409 217 -174 -306 -121 218 494 503 125 -120 -401 -68 525 380 53
4430E3k19j45k29N98J97K89n99j96j58K19L94O9j19l66j89P1K21K85J91j12l97
4451a42p5Q4L73L58k05l03l53j59J76L28Q5p0m90k01J57L37M59j57j6l21j12L29
4473H2K25N6j52k21k98J33J09K78L8j21l97m3K9K55J78j9j32l24o4K57K34K00
4495C03k57k25k79K04K00L64J89l74k41l6J12K87K22k5n08j72N9L7P2K84l56j06
4517b46r9J33N00l6P0k87j29N8p2L15N3k9l96j22J16J53J55p8O5l35PJ43K26M1
4541B06J41l82k25J2K26K74J8l73j34O6J07l0J79J63k50j04n7L61m0j7m6k5k65
4564a95j1J83J37j0j84M1j08Q0J25O9J13l23q3j4K18L6J4j29j4j34L8K82l0J9
4588A20o0j45J76j40J95k7j53q8J04j28J40J75j89k11K1j19K33K36j17L3j2nL1
$$ plain form
4430 53 -166 -311 -540 58 255 544 -55 -251 -409 -190 204 273 154 -212 -401 -330 -109 176 367 255 -142
4451 -142 -217 -133 240 598 393 90 -263 -422 -246 82 167 97 -393 -594 -437 -100 359 202 186 -135 -247 82
4473 82 307 363 211 -10 -308 -175 -66 212 250 129 -268 -311 -282 -27 151 132 0 -324 -388 -131 103 303
4495 303 46 -179 -458 -254 -54 310 499 125 -116 -152 -40 247 469 444 -64 -236 -177 -140 -68 216 -140 -246
4517 -246 -345 -212 288 252 322 35 -94 -36 -108 207 260 231 -165 -287 -171 -18 137 59 124 -211 -204 -61 165 206
4541 206 347 -35 -260 -248 -22 252 270 -103 -237 -171 -64 -94 85 248 -2 -106 -163 198 158 141 95 70 -195
4564 -195 -206 -23 114 104 -80 -39 -147 -67 58 127 240 -83 -166 -180 38 74 88 -41 -55 -189 -151 131 101 120
4588 120 60 -85 91 -49 146 119 -34 -122 -18 -146 -6 169 -20 -231 -210 -329 -96 140 23 56 44 39 70
4611G0L6Q7L9o3k40NJ3J48r4R4j26j86J6J51r4K8N4j96J65n4P6L08j72j71J19
4636A3k5Q7M1oJ59k28j71K61M4j43N6j69k1r0Q3J24q3q4K9pJ01o4J56K1o9o7K31
4663A79O4j26L3J6j30P8j6J13k44j3n7m6J30k25J64K7j06m8q0K47l3Q6l3K15k65
4688g0R6J15n1p5J3J33k61J26j9N5j77J67q3kJ55k03K08j58j26J9R3J29k9r4j01
4713a40K28k53J34k2K07j51l5P2j4j3O5j75J99j68k7OK38j94j87L4J95k86M03
4736A16K04l9j46j20m0j18J86Q8m7r4k02J7O9J59J96k66k0N8K4K26j28Jl77J43
4760a10L9J20j19M5J2j11o8R2K52Q3n0o3%j16J77N9P5k81j43l4p8J34K99q1k64
4785a31o1m9K79J26QJ27k91k34N6L18R0j62l01K04j04K2K10M7O0l40N3K5J11J56
$$ plain form
4611 70 106 193 232 169 -71 -66 -53 95 1 95 -31 -217 -201 -50 -144 -116 -62 -258 -93 -147 -71 237 65 -106 13
4636 13 -12 75 116 110 269 41 -130 131 175 32 88 -81 -102 -192 -109 15 -68 -152 -123 -130 -29 -93 63 84 15 -52 179
4663 179 243 117 150 166 36 114 98 211 -33 -46 -103 -149 -19 -244 -80 -53 -159 -207 -287 -40 -73 13 -20 195 -70
4688 -70 26 141 90 15 28 161 -100 26 7 62 -115 52 -31 -33 122 -81 127 -31 -157 -138 -45 84 55 -39 -140
4713 -140 88 -165 -31 -53 154 3 -32 40 26 13 78 -97 102 -66 -93 -87 151 -43 -230 -196 -1 -287 116
4736 116 320 281 135 15 -25 -143 43 131 84 -10 -212 -195 -126 33 229 -37 -57 1 25 251 123 124 -253 -110
4760 -110 -71 49 -70 -25 -13 -124 -192 -100 152 235 185 122 122 6 183 242 317 36 -107 -141 -219 -85 214 133 -131
4785 -131 -192 -241 38 164 172 299 8 -226 -170 148 238 76 -225 -21 -125 -103 107 154 214 -126 -73 -48 63 219
4809B19o5p8l13L9K5K75o7Oj33k51J63J12K16K09k05l37J7J74mK09j59j44j03
4832a95L9J48L53k36R1j69j50J73j35L98o0m33P7k39J36L60Pr3j58j95J16J10
4854e5J87K10k75J7l70J45L54M4N1l20L9k06j3L73M2k90p7j0n3L45pK75l93p6
4878f3k41K58K91r8n1k16j51Q0P3L47L6k7l01j29J49OL32k1j06n11n8K42L91L8
4902B70q6k22j79p5K37L74j77l8j36k84J99K43J41j41j96k12RL20J34J50k80j65
4924a14j34J13L29J63k24j12k01j86K36J44K90k16j60j31J61J34J68N0j36l74
4944b00q2J93K98j5n8l29K2o5J33L42j16kk79j35R1K95P8Q9l43l6j79K12L24k2
4968B16k6k86k59R1M09Q8l9L3k65l7p7J37K55p8k05l34Q2K47J80Q7N9l12j71N2
$$ plain form
4809 219 154 76 -237 -198 -173 102 35 41 -92 -343 -180 -68 148 357 152 -185 -168 6 2 211 52 -92 -195
4832 -195 -156 -8 345 109 200 31 -119 54 -81 317 257 -176 -99 -338 -202 158 165 72 -86 -281 -165 -55
4854 -55 132 342 67 84 -286 -141 213 257 308 -12 27 -179 -192 181 223 -67 -144 -154 -207 138 131 406 13 -63
4878 -63 -304 -46 245 147 96 -120 -271 -191 -118 229 265 238 -63 -192 -43 -37 295 274 168 -343 -401 -159 232 270
4902 270 184 -38 -217 -292 -55 319 142 104 -32 -316 -117 126 267 126 -70 -282 -273 47 181 331 51 -114
4924 -114 -248 -135 194 357 133 21 -180 -366 -130 14 304 88 -72 -203 -42 92 260 310 174 -200
4944 -200 -282 -89 209 194 136 -193 -171 -236 -103 239 123 121 -158 -293 -202 93 171 260 -83 -119 -298 -86 238 216
4968 216 190 -96 -355 -264 145 233 194 227 -38 -75 -152 -15 240 162 -43 -377 -295 -48 132 219 278 -34 -205 -153
4992a53L81J5K05l37k71j04J83M01j23P6m61r3J14J19L39j02q8l91j04L11K08
5013A25Ro7j13k55j34M07L60j21N1l34j00M2L36K21l7m10k55M7P5K19J76j01l98
5036b57k18M9L65J79L05l58j44l1j46M13K74j07l71j22O6N0K13K63l13j99k20
5057c09J85K29Q1M2k60j15j99J69J73K34m6l31j42K08JK64Q2j44j40k55R1L19
5079A37J61r3l2n00o4K57L21q1p6k47jL9J17L80j44J50m29n5K2K72J31j75j90
5102a00k38J60K01J03L8L3l14k12K19K35Q8Q3l76j61NR6J04L30r6j88j58n7L04
5125I9J78J35k89l08k7K6M36n4j17k83j41L0K03K06K61l78r4k19OM14J50j12o6
5148E6l19j79M50J97K0nk90j18l8K05K87L2l50k86K34mM3K40J47m84k13K59L03
$$ plain form
4992 -153 228 243 448 111 -160 -264 -81 320 197 273 -188 -281 -167 -48 291 189 101 -290 -394 -83 125
5013 125 134 67 -46 -301 -435 -28 332 211 262 -72 -172 -130 206 427 390 -20 -275 -228 -153 66 242 141 -257
5036 -257 -475 -426 -61 118 423 65 -79 -110 -256 157 431 324 -47 -169 -103 -53 160 423 110 -89 -309
5057 -309 -124 105 186 228 -32 -147 -346 -177 -4 230 184 -147 -289 -81 -80 184 266 122 -18 -273 -182 137
5079 137 298 205 173 -327 -391 -134 187 106 30 -217 -218 -179 -62 318 174 324 -105 -160 -138 134 265 90 -100
5102 -100 -338 -178 23 126 164 197 -117 -329 -110 125 213 296 -80 -241 -236 -140 -36 294 198 10 -148 -205 99
5125 99 277 412 123 -185 -212 -186 250 196 79 -204 -345 -315 -112 94 355 -23 -117 -336 -330 84 234 122 56
5148 56 -263 -442 8 205 225 220 -70 -188 -226 -21 266 298 -52 -338 -104 -108 -65 175 322 -162 -375 -116 187
5171A87p6K17j53m38j9K43J34J67q8j13k76q9K93J93N0M1l92N5j09K97K18o7j98
5194G7k95qP5K75P0j70j20k42J03K0K27L02k12j75j92L17L8R1P2j49k82q2L8L80
5218A58j87J59k65r1N1J87K41P1l02j59o7J2P7L26k4k80r4j8K56J79K3j34p1k10
5242a62M6K80K02j60j95j03j16N0K19KJ32l34j63K96j8L11n4p3m51J05Q0K02J18
5265B14l6k09k37m1K18L07N2k35m0k39J71J86K4M9k24k29M3K79p4O2nj30r5j22
5289c11P3M18J44k80O2j40J24k1J46M9k01k24k5P0J00J72j22n4p6PK18P4j46j16
5313e9j88J96o6J92K14l72LO1j64R0R6J95j11r5m0Q8O0J54Rl41j03j90J45K81
5337E5J6j18L5j57N0L32j20K18l07O0q2qO8J51k0j25k75j11K64J94O3j54p0n4
$$ plain form
5171 187 111 328 175 -263 -282 -39 95 262 174 61 -215 -304 -11 182 232 273 -119 -64 -173 124 342 275 77
5194 77 -218 -226 -151 124 194 24 -96 -338 -235 -215 12 314 102 -73 -265 52 90 181 253 104 -178 -260 -222 158
5218 158 -29 130 -135 -226 -175 12 253 324 22 -137 -204 -192 -115 211 187 -93 -187 -205 51 230 253 119 48 -162
5242 -162 -116 164 366 206 11 -92 -208 -158 61 63 195 -139 -302 -6 -24 287 233 160 -291 -186 -106 96 214
5265 214 178 -31 -268 -309 -91 216 268 33 -7 -246 -75 111 135 184 -40 -269 -226 53 -21 41 36 -94 -189 -311
5289 -311 -238 180 324 44 106 -34 90 69 215 264 63 -161 -186 -116 -16 156 34 -20 -96 -89 129 203 57 -59
5313 -59 -247 -51 -117 75 289 -83 -80 -19 -183 -93 3 198 87 -8 -48 40 100 254 263 -78 -181 -371 -226 55
5337 55 71 -47 -12 -169 -119 213 93 311 4 64 -18 -26 42 193 173 48 -227 -338 -74 120 183 29 -41 -95
5361i5j3K09p1J7ll17J58J39p7K70m23J07q7J33K71j46J44j74K0n6r6J00J72j23
5385E9k19J25mq1K21o4j0k26O7R7r6L13k12J20j12m3P6k4pm4q1J76j22J55J72
5410B36r4nj02k0l9o0M9K6q5NM3Q3j6J8N1j74Q8j84K08K68l8k06M8m6j3L6O4j63
5438b2r1N5o0J3Q0l8l3P2rN0N3m5Jj93N1M7N2Q7J32j63N3j39Q3J40o1Pj17l1j10
5467a36J42j2Q2o6j79p4J16o1K10M6j45J03N8J49q6j82K12j67q3j9j5L28k61q3
5491a23l0J57oK0OQ9j16k00J50o0P0j8p0M2m7J93N0K2L7k99K0J61J59o5R8j31
5517A09n5j69P6J9J4j08J0q0L4J14J15j06Q7Jj50K03M0j9k38R6j0J55k11K26k31
5542g8k1J0j05K09Q2J4l8qk00M0J27pl6m8r2J54kJ61j71J11p1Q8j60K63j52mj06
$$ plain form
5361 -95 -108 101 30 47 44 -273 -115 24 -53 217 -206 -99 -186 -53 218 72 216 42 62 6 -90 10 182 59
5385 59 -160 -35 -39 -120 101 37 27 -199 -132 -35 -131 182 -30 90 -22 -65 11 -13 -20 -64 -145 31 -91 64 236
5410 236 142 137 35 15 -24 -84 -35 -9 -94 -89 -46 37 21 39 90 -84 4 -180 28 296 258 52 100 54 41 77 141 -22
5438 -22 -113 -58 -118 -105 -25 -63 -96 -24 -33 17 70 25 26 -167 -116 -69 -17 70 202 39 92 -47 36 176 115 122 5 -26 -136
5467 -136 6 -6 76 10 -169 -243 -127 -188 22 68 -77 26 84 233 147 -35 177 10 -73 -92 -107 221 -40 -123
5491 -123 -153 4 -2 18 24 113 -3 -203 -53 -113 -43 -61 -131 -89 -136 57 107 129 166 -133 -113 48 207 142 240 109
5517 109 54 -115 -39 -20 -6 -114 -104 -184 -150 -36 79 -27 60 61 -89 114 154 135 -103 -7 -17 138 -73 153 -78
5542 -78 -99 -89 -194 15 97 111 73 65 -135 -95 32 25 -11 -59 -151 3 1 162 -9 102 31 119 -41 222 70 66 -40
5569d0j7n5P4qr8J25n0J18j49O3J40j12Ln8K0j23L00j94P8j25p8N3O3Q9r9J86
5595A06k6j04J11k8J90r3k44J00j17r2J72M5j08j8P6J15Q6q2O1j42j17O1l5J87
5619A04Mr2J4q3Q5j57J86R5j05k89K49j8K6O1OO0j69k13L3J17K01p4j05nL4L9
5645DR6r6qK3P7j7J2j05OL0j27r5J35oK22j45j62M2K7J0J36R4j98m9j15K27J74
5672A92j65r5j1M2o9J17J66l2n3j72j03J12L4J26k3k38O9m8O2P4mJ80j96j45M45
5697B65k41J96k49k5K1j7O5J47N1j14j39r3k9K23P6j47l5JlO6o7J35j08jk42K12
5723e2nJ84J20k05j76N1K0J87J98j47k21q2K0K00m9m4oq0j15P9J40k2l0q0L2Q9
5749FL7K5J47j51q8M7k11J32P8l6N5j9n6Q5J9K56j20j65j02j01K36k06O7L3j70
$$ plain form
5569 -40 -57 -112 -38 -46 -144 -19 -69 49 -100 -37 103 -9 -6 -64 -44 -167 133 -61 17 -108 -186 -133 -70 19 -80 106
5595 106 80 -24 87 59 249 156 -88 12 -105 -197 -25 20 -88 -106 -30 85 171 89 150 8 -109 -48 -83 104
5619 104 108 16 30 -53 32 -125 61 156 51 -238 11 -7 19 80 86 146 -23 -236 -203 -86 115 41 -64 -69 -35 4
5645 4 100 4 -4 19 96 79 91 -14 -8 22 -105 -200 -65 -71 151 6 -156 -114 -87 -77 59 153 -45 -94 -209 18 192
5672 192 27 -68 -79 -37 -106 11 177 145 92 -80 -183 -71 -37 89 66 -172 -103 -151 -89 -15 -19 161 -35 -180 265
5697 265 24 220 -29 -54 -33 -50 15 162 213 99 -40 -133 -162 61 137 -10 -45 -44 -47 19 -48 87 -21 -22 -264 -52
5723 -52 -57 127 247 42 -134 -83 -63 124 322 175 -46 -128 -108 92 43 -1 -7 -87 -202 -123 17 -5 -35 -115 -83 6
5749 6 43 68 215 64 -24 23 -188 -56 22 -14 41 22 -34 51 70 326 206 41 -61 -162 74 -132 -65 -32 -202
5774b02R7J34l4J48k8j4l1j97J32J77j0r6j42jm8O2J56o2r0q8nn7R0K41p3k0m
5801C5r0nK10j41k2J1k47K18J21l4k4k5j29K3K15M8k4mk22m3j6J38m5J1O5j87
5827a63Lp1K67JJ25j10j3j16J73N1N7k13J26k90n3K15K6K18k11n6M7r5J40J36
5851A94k47lK1J98k11J8j4O6j12m0K11Mk1M0p6r5P4j13L96k01j2l1k28J7P9J27
5877D1l8j17Kk4J44J07P3q8j22l3r1J39J14N2l34J03R6L5j03K20p6j9j59k1J59
5902F0J37j58j53J07n6J56k2o3l2n1K9kQ7O0N5j66J16j10O7j21J88n0j40j01J6
5927a47K27q7J25j07l3l4J05j07k8K12n0k32o6K43J0OL7j01j17P5J51N8n3J29
5951B16l91J54kOR0j36k20J93l5Q5k3QQ2kl6p2J11N5n8j41M3R4r8M3J09o4Qn6
$$ plain form
5774 -202 -105 29 -5 143 115 101 70 -127 5 182 172 76 -66 -67 -115 -53 103 41 -49 -137 -142 -199 -109 132 59 39 35
5801 35 -55 -60 150 9 -13 -2 -249 -31 90 56 32 7 -122 -99 116 164 140 136 -86 -129 -145 -7 -52 -41 24 -163
5827 -163 -160 -231 36 37 162 52 39 -77 96 147 204 -9 117 -173 -226 -11 15 233 22 -34 13 -82 58 194
5851 194 -53 -56 -35 163 -48 -30 -44 22 -90 -130 81 85 64 104 28 -67 7 -106 290 89 77 46 -182 -165 -86 41
5877 41 3 -114 -112 -136 8 115 188 100 -22 -55 -146 -7 107 159 -175 -72 24 59 -44 176 100 81 -78 -99 60
5902 60 197 39 -114 -7 -63 93 71 8 -24 -75 -46 -48 39 99 154 -12 104 -6 61 -60 128 78 -62 -163 -147
5927 -147 80 -7 118 11 -22 -56 49 -58 -86 126 76 -156 -222 21 31 37 74 -27 -144 -69 82 140 87 216
5951 216 -175 -21 -23 -17 73 -63 -283 -90 -125 -40 -63 -55 27 25 -11 -83 28 83 25 -116 -73 21 -77 -34 75 11 19 -37
5979c7j33K02j6Q8L3j49r2K9J12m9K74k19j85q9N1J33K00k41N1N5p0K78J8j31
6003A13j80R7nk9M1P5jj84j33J37l8J0L5J05j7p4J15j4Mk7k1J76l08P4M9N0j34
6030h4J06q9o0K15M7k1K5m6l0j07LMJ89j37j34N2r9J55j4L3j53J60j01K06N4j11
6056F3j59J16k60J25O1J4Q9j32mPJ32N9k7K1j10l9%N6Nj92J32n9J01M8j6J37q
6083A60k85J04J97j69j68L49j56jPr7q8J09J26k14KJ38j13OR7j4J9l4M7L7N4J39
6109B52l46m9Q5L1J32j38J33pk3k86K83O3p7o2j00q1K88j19o2P9k77K98m0L1R1
6134I9j44O3Q0j47r9K99n7n1q5j6j27K64q5M1j18JL5K0o8J51j09pN0Jo5J18R8
6161A42k0j25j06O2j52K30m5O9k1q9O7L3K2k21J26nJQ3j48R3n0O6k8o8J14j15
$$ plain form
5979 -37 -170 32 16 104 137 -12 -104 -75 37 -12 262 43 -142 -231 -180 -47 153 -88 -37 18 -52 226 244 113
6003 113 -67 30 25 -4 37 112 111 -73 -206 -69 -107 -97 -62 43 26 -48 67 53 57 30 9 185 -123 -49 0 50 -84
6030 -84 22 -67 -127 88 135 114 139 93 63 -44 -41 -37 152 15 -119 -67 -166 -11 -25 8 -145 15 -86 120 174 63
6056 63 -96 20 -240 -115 -54 -40 49 -83 -87 -80 52 111 84 105 -5 -44 -44 12 17 -175 -43 -102 -1 47 31 168 160
6083 160 -125 -21 176 7 -161 188 32 31 38 -59 -147 -38 88 -126 -124 14 -99 -93 4 -10 9 -25 22 59 113 252
6109 252 -94 -143 -58 -27 105 -33 100 93 70 -216 67 130 53 -9 -109 -190 98 -21 -83 -4 -281 17 -23 8 99
6134 99 -45 18 98 -49 -148 151 94 43 -42 -58 -185 79 -6 35 -83 -82 -47 -27 -95 56 -53 -60 -10 -9 -74 44 142
6161 142 122 -3 -109 -47 -199 31 -14 55 34 -55 12 45 67 -154 -28 -33 -32 51 -97 -4 -54 12 -16 -84 30 -85
6187h5P6P2j4n2N3mK0j03J25m6l6o7l6j7J51r8K77j83J0p8k2jN8o4P0J35j30n6
6215d5n5J47N2j8p8q2Q3m8M4j9P4n2O7j98P2k0J10J27n2p9k5P3j42N0Q7j95Q3
6242c9J28j47J28R4q7mP7n6M2k5n6l7K4m1k7j23J52j19qqJ06L6j58J03R4q5Pj7
6270d6J39L3l6j01K2k46K62j03Q2P1k3k97K32N7J9j33N2q4J34o9%%M6N0n9R5j07
6297a0l4R7M8r8j7J05j44K28p0j44P6j85K70k07J63r0k7k3J5k0R0N4k6R2Pl1k24
6324a05K07j41j2q5J19J08q0n0K1o0P0r3J31M5j51O5n5j02N0J75k7o2k1M7k5l1
6350f2J31n3p1%NJ12J45j93j7r6P8r4J35K6o9l3p0J81j82N4O3N5lkp7K7q2P7K6
6379A1J5k6K3q5J27k03L27k84J54%J57j49O6j59l5P9q1K4NO8j82R7N8N5j06K38
$$ plain form
6187 -85 -9 63 49 -3 50 46 66 -37 88 42 6 -61 -97 -114 37 -61 216 33 43 -35 -57 -58 0 -64 6 141 11 -45
6215 -45 -100 47 99 81 3 -79 4 -44 0 -19 55 3 70 -128 -56 -76 34 161 109 30 5 78 -64 -14 73 -122 -39
6242 -39 89 -58 70 164 77 73 150 94 136 111 55 18 42 1 -26 -149 3 -116 -124 -132 -26 10 -148 -45 49 -36 -29 -46
6270 -46 93 126 90 -11 11 -235 27 -76 6 77 54 -243 -11 46 65 -68 -16 -100 34 -35 -35 -35 11 61 2 97 -10
6297 -10 -44 53 101 3 -14 91 -53 175 105 -39 37 -148 122 -85 78 -12 -39 -62 -47 -67 23 77 51 143 150 119 -105
6324 -105 102 -39 -51 -136 -17 91 11 -39 -18 -78 -8 -101 30 75 -76 -11 -66 -168 -118 57 30 -32 -53 -6 -31 -62
6350 -62 69 16 -55 -55 -50 62 207 14 -3 -99 -21 -115 20 46 -23 -56 -126 55 -127 -73 -10 45 42 40 -37 -10 -92 -15 11
6379 11 26 0 23 -62 65 -138 189 -95 59 59 216 67 133 -26 -61 18 -63 -39 -34 34 -148 -51 7 62 -44 194
6405A94j83K6k4m2PJ67k56J23n9L9k3j4J13m8j1j13J80j26N0M7q6N0m2J21j78
6430h8P1k6m8P6l2J16r3K7O2O3j21K07k82R8j25rP0j2kl8R6P1p8L7l7L3N9Kj22
6459b5O3l0L0K3j48K54k04q0J66k4p8M8L9J65k50p5N3O1k2P1k04J01m0P0O7N9
6485I0j03N4M2r0J78j54r0J1rM8K4m4j16o1R6NQ9m6K3M9l5n1J26J71j10r0l1J53
6513A29k98J38O7n9KJ17j55L9P0M4N5j36j74K02J8k1k2J04p7r3Qj23J37j5J41
6538I8j81j41J92Q2M4J54j92J24l55J50rM4j80L1J17o3J1L1P2q8K7o5J10k1K0
6563A2l6N4j17M6J3o3LK09j68Np4R6Q4l4j52J44O3j07P3K6k2k21rL0N3N4O9J4
6591D5j18R2o3NM7M7m4oM3j2o6R1Kj09j23J04N4J54j17L6r5l4M8J7J16k7j90M6
$$ plain form
6405 194 11 37 13 -29 -22 145 -111 12 -47 -8 -31 -45 68 20 9 -104 76 -50 0 47 -39 11 -31 90 -88
6430 -88 -17 -43 -91 -15 -47 69 -24 3 65 128 7 214 -68 30 -95 -104 -34 -46 -48 -86 10 81 3 40 3 36 95 97 -25
6459 -25 38 8 38 61 -87 167 -37 -117 49 25 -53 -5 34 199 -51 -126 -73 -12 -34 37 -167 -66 -106 -36 31 90
6485 90 -13 41 83 -7 171 17 -73 -62 -71 -23 1 -43 -159 -220 -124 -119 -30 -76 -53 -4 -39 -90 36 207 97 7 -24 129
6513 129 -169 -31 36 -23 -21 96 -59 -20 50 94 149 13 -161 41 59 38 16 120 43 -50 -42 -165 -28 -43 98
6538 98 -83 -224 -32 50 94 248 56 180 -175 -25 -34 10 -170 -139 -22 -85 -74 -43 29 -59 -32 -97 13 -8 12
6563 12 -24 30 -87 -41 -28 -91 -88 121 -47 -42 -116 -20 64 30 -122 22 85 -22 51 77 55 -166 -175 -145 -92 -38 31 45
6591 45 -73 19 -44 -39 8 55 11 5 48 36 -30 61 63 -46 -169 -65 -11 143 26 62 -33 -67 -19 -2 114 87 -103 -57
6619e7k09K59O5NOo7j16J67k1o3K32j59q1j06k5R2J09O0l8n7r6Q5m7K63k47J4
6645c2J61n2j84J31RJ03q0L0p5PP4k16J92j42N7k8Q3j07k2m9j17J34K6J28q1J22
6671G2q1r7J17K0r2J15j16M5j01l1J48o3P1L1j68K48k5j23j83J40q1J8M5J46N7
6696A12K2m7j09o0J05J60j77J22n2p7j89K43n8j59J75j45J46j27J80j43R0j12
6718a00J36j3m9N6jL2q6Q0k76J94L3mpl4l8L3J33m5N3Mj18p8J36J1L2r4lN3j02
6747f2J27pk40M2JQ8o3J75j2l4o1j07J64J55k3j40jK5K8m7LJ22j10l8O9j27O2
6774a1J12j23J24k60P3l2J81m7J14j51j09M7K26n9J2q0n1%Pj55K12J7K0j12k7
6799g2j4K20n1j31K3m4k2R7J20k5k8j28M2o6R0l6n8J32Mk01M5J72K1pm8p3JL5
$$ plain form
6619 -57 -266 -7 58 63 69 2 -114 53 32 -31 201 42 -39 -145 -170 -78 31 91 53 -4 -100 -15 -62 201 -46 -32
6645 -32 129 77 -107 24 33 136 56 86 11 18 92 -124 68 -74 -17 -45 38 -69 -91 -140 -257 -123 -97 31 -50 72
6671 72 -9 -106 11 31 -61 54 -62 -17 -118 -149 -1 -64 7 38 -130 118 93 -30 -213 -73 -154 -136 -91 55 112
6696 112 134 87 -22 -82 23 183 6 128 76 -1 -190 53 -5 -164 11 -134 12 -115 65 -78 12 -100
6718 -100 36 23 -26 30 29 61 -25 55 -221 -27 6 2 -5 -39 -77 -44 89 44 97 101 -17 -95 41 52 84 -10 -13 40 -62
6747 -62 65 58 -182 -140 -139 -51 -114 61 49 15 -46 -153 11 166 143 3 2 27 55 8 11 133 23 -15 54 -73 -11
6774 -11 101 -22 102 -158 -85 -117 64 17 131 -20 -129 -82 144 85 97 17 -34 -34 -27 -182 30 47 67 -45 -72
6799 -72 -86 134 83 -48 -25 -69 -91 6 126 101 73 -55 -13 -79 11 -25 -83 49 53 -148 -103 69 90 83 35 -38 -37 -2
6827bj2k2J66j32j38Q7Q8j64J79j79K38J7Op7r4P3m9O8k3o4J7nK2m4K0l0l9L10
6855B17j5k04j4KP3o1P0L5o3k16R2K16j15Q2j34J13L6k72K88j31k3l7P0n6l4K44
6881A63j69nQ4l7n7J04q6P1L5k52J21K85j86m6qj03N7J32m2J24j00r0j0j55R9
6906g1J14r7k8ML9k0k6R6J03j33o5o5K28p7k0J12J0j45JN9P6j9l5K8n2p2L9p3
6934h9j4J88j42r8K24o3L7k6Ppj28JM1J24j48M7J2N2j45J78j13k7k7J88K11j82
6960A01jo9n3j35J15m5J03j52O6k3l6J24J25p3P7j14J45j84O3L6q4J4k2oj54M5
6986a37J22J36j33P1l8k0jJ6j36L8L8K04j48j20k7J95m8j84J33J78j39J15k7K
7010I0k9j06J19oo4n1j04K31p1JQ5j47j22J51j4O1k1nm4M7J5j04J44l1KO3k22
$$ plain form
6827 -2 -14 -36 130 -2 -140 -53 35 -129 50 -129 109 126 132 55 -39 34 -15 53 30 -34 -17 -22 0 -44 -24 -54 -93 217
6855 217 202 -2 -16 -14 59 -2 68 103 40 -176 -84 132 17 99 -35 78 114 -158 130 -1 -24 -61 9 -47 -81 163
6881 163 -6 -11 73 36 -21 83 -3 68 103 -149 -28 257 71 25 17 -86 -29 103 61 185 85 -5 -15 -170 -71
6906 -71 43 -54 -82 -78 -39 -59 -85 11 114 -19 -84 -149 79 2 -18 94 104 -41 -40 19 95 76 41 69 17 -55 -16 -89
6934 -89 -103 85 -57 -155 69 6 43 17 24 17 -111 -110 -69 55 -93 -46 -34 18 -127 51 -62 -89 -116 72 283 101
6960 101 100 31 -22 -157 -42 -87 16 -136 -70 -93 -129 -5 120 47 124 10 155 -29 34 70 -14 0 -22 -28 -182 -137
6986 -137 -15 121 -12 59 21 1 0 16 -120 -82 -44 160 12 -108 -135 60 12 -172 -39 139 0 115 88 90
7010 90 61 -45 74 68 4 -47 -151 80 9 10 95 -52 -174 -23 -37 24 3 -2 -46 1 16 -88 56 25 27 90 -132
7037a32O8N7P8j9Q7k08J08kj13j8K0N8p1J43Q8k02J0L6m5J3m1N7K22j08q9n4J32
7064G5j74J84j88J79k4j20J45k98L39J5k97O9Q9pp6J63q6R4j05m2M6p0J11K9j57
7089a06J33J02k40K20l2j72J18m3O2r6K03K4k88K16r8N1j65L2J53k01K29j11q
7112a7RJ37j46l4N6K8j6j10Q4rON1j56J4J17Q4j35NOKMM5J25j91J11k37J41m1
7140f7J39r4N8r5J42p2L6j15J25K3m4j36M2K6l6R9j48Q0J92j47M6r4R2Rj47p1
7166a57J91L4l1J07r8o3J2M2J4l4J4Nr6J00P2k5j51Q6Mn1J90r0n5j13M1J12l7
7193B3m5L5j23R7j0m8p9J90n8Np3Q4k4M5k4J8J6R1k60N6N7l3j03J64l5j47L59
7220A78j34L8r6k8KP4j86Q7N2j6M5m3P5j41n1J58j35K13k53K63jp0L2k37O3M3
$$ plain form
7037 -132 -64 -7 71 52 139 -69 39 37 -76 -94 -74 -16 -87 56 144 -58 -48 -12 -57 -44 -85 -28 194 86 -3 -57 75
7064 75 -99 85 -103 76 52 -68 77 -221 118 133 -164 -95 -6 -13 -89 74 -12 82 -23 -65 -19 -89 22 51 -106
7089 -106 27 129 -111 109 77 -95 23 -20 42 -54 149 173 -115 101 3 54 -111 -79 74 -127 102 -9 -17
7112 -17 -8 129 -17 -51 5 33 17 -93 -9 -18 -12 39 -117 -103 14 98 -37 -32 -26 -24 -20 25 150 -41 70 -167 -26 -67
7140 -67 72 -22 36 -59 83 11 47 -68 57 80 36 -100 -58 -32 -68 31 -117 -37 155 8 54 -40 52 61 -86 -157
7166 -157 34 68 37 144 46 -17 -5 37 51 17 31 36 -60 40 112 87 -64 22 26 -25 165 75 20 -93 -52 60 23
7193 23 -22 13 -110 -13 -23 -71 -150 40 -18 -13 -86 -2 -26 19 -5 13 29 120 -140 -84 -27 -60 -163 1 -34 -181 178
7220 178 44 82 -14 -42 -40 34 -152 -65 -13 -29 16 -27 48 -93 -144 14 -121 92 -161 102 101 31 63 -174 -111 -68
7246f8J24p5J7o2J59p0L0q3P1j4m3J61j8j39K3R7k67J26J7k05J78O8o3n6J10m9
7272c1J06l3r0P8j14N4m5R8J45j26l0P8j08o9Q1jL4k1n7J39j28J01m1r0P8n8r8
7299a48K67j28N4o0R2j53RJ29j23O7N9j21r8J00J01J74k16k08R0m1K34M9j98j3
7323h2KJ93m7o0L9j15o1J50p6J19L4m3j99L1J21J7J60Ml62R5P0m1O2L0j29Q2k
7350hK8j42J26J1%o4n9J50nJ53m8n3q5r7R7mM0N4j75k3J42j39J6J24P3q5j25J13
7378A5Pp4K7N2l2j9Q5k1j55K11m6k13J81j0Q6r3J20p8l8k5K0R7L6j79k52J87J53
7405D2j47K45j8j50q9N2nJ34R8j44j56R7J62k23J96j70Q1n8O7l4J68l3mq9j88
7430a66r3K26J07q1J72k34O0l2J28Mn8J2j27J51j27Q3P4k44Q8j60J83P2N8j58
$$ plain form
7246 -68 56 -19 -2 -64 95 25 55 -28 43 29 -14 147 129 -10 13 110 -157 -31 -14 -219 -41 27 -36 -92 18 -31
7272 -31 75 42 -48 30 -84 -30 -75 23 168 42 12 90 -18 -87 -6 -7 27 6 -51 88 -40 61 20 -70 8 -50 -148
7299 -148 119 -9 45 -15 77 -76 -67 62 -61 6 65 -56 -154 -54 47 221 5 -203 -113 -154 80 129 -69 -82
7323 -82 -80 113 66 6 45 -70 -131 19 -57 62 96 53 -146 -115 6 23 183 187 -175 -80 -10 -51 11 41 -88 -6 -8
7350 -8 20 -122 4 15 15 -49 -108 42 37 190 142 89 4 -93 4 0 40 94 -81 -104 38 -101 -85 39 112 27 -98 15
7378 15 22 -52 -25 27 -5 -24 61 40 -115 96 50 -163 18 8 94 1 121 43 5 -20 0 97 133 -46 -298 -111 42
7405 42 -105 140 122 -28 -117 -65 -70 64 162 18 -138 -41 121 -102 94 -76 5 -53 14 -20 148 115 111 22 -166
7430 -166 -259 -33 74 -7 165 -69 -9 -41 87 91 33 45 -82 69 -58 25 99 -145 -57 -217 -34 38 96 -62
7454f2M7l5j19J22mN6J15k19K3RJ35J0O7j0o2j6j68K31O3l3p8l6q8q8K28j1k2
7481E5j16k9mJ47P5o5j70J6m5P1J03l4R7j1j10P4j3O4J14k66O4k5k0M8Q0l6j13
7508d9L5k35K25K29K7n9l47P8R0n9J69L2q7p9j16N5J59P8p6p3n6K4M2Q5N0k11
7534f9n5R2k8O1q8j4J51j32n2J86j97L58r5j54j10j3J71Q1m0n8m5J39j02J42j20
7559IJ49k4k99K15j04J71N5k42J19j45O5J39Rj10K0n1N9k04K56O2O6j75k39J57
7583d2N5J29p9Ml22R5qK17J62j64J9k63J12L9J01J77j87j1k20J47k3J54Q3l21
7607a46L78j98J0m1l6K37l82J89j04o0K37J36k79j63K43n6NJ00K1k30R5P3j13
7630h4Q9J11r0j9p4q7J77J08K5j46j9M2j37k1J88j45M5O8j38J04K26r5j22j56
$$ plain form
7454 -62 -15 -50 -169 -47 -51 5 120 -99 -76 -67 68 78 145 135 73 57 -111 120 183 150 72 36 -52 -140 88 77 55
7481 55 -61 -90 -94 53 128 63 -107 -91 -136 -65 38 4 101 90 -20 54 41 105 219 -47 17 -8 -28 20 100 64 -49
7508 -49 -14 -249 -24 205 232 173 -174 -96 -6 -65 104 136 49 -30 -146 -91 68 146 70 -3 -59 -35 7 92 142 -69
7534 -69 -124 -32 -60 1 -87 -101 50 -82 -134 52 -145 213 118 -36 -146 -159 12 93 53 -5 -50 89 -13 129 9
7559 9 158 134 -165 50 -54 117 172 -70 49 -96 -31 108 117 7 27 -24 35 -169 87 149 215 40 -199 -42
7583 -42 13 142 63 67 -255 -160 -168 49 211 47 66 -197 -85 -46 55 232 45 34 -186 -39 -62 92 175 -146
7607 -146 232 34 44 3 -33 204 -178 11 -93 -153 84 220 -59 -222 21 -35 -30 70 91 -139 -44 29 -84
7630 -84 5 116 26 7 -67 -154 23 131 156 10 -9 33 -104 -125 63 -82 -37 31 -107 -3 223 128 6 -150
7654a50K07k05R6J39N7k54j43J44R9L3J86o4j31n9j96K33L9K30l72R6j43P2O9
7677a7O5p4j15M4p5J32O7P7q2K9M2l20J38K21k3p4q3q2N9k9K56K4l49p8J51R2
7703dO4O3j76R8j16N5k5K65j74j22n9K9P0QJQ6k8j44j01L20Jm8m3k69j4K30J24
7730I1j6J13k86n8J64M2M1%r0jK4k14K50Ok3j38O7j52K94N3r8n9j03L0j8J59o5
7757A3K8q5j22J74j97L11j54L2J6p7L2N6p5J42o0p9J09k25K64Qnn2j62L3j7J52
7783F0N1k26J95k14Q8N7O3j28M9L2j7j08o0J62n6J50k45P9l8J56j15J67j02j16
7807a16J45l8jL5r5n0Q0j90K20j1J24j77J08k8n4J44j46O4j39KM8kRP2r3L3q5
7834a41K1K15j36L7j25QK42j54k2K7Qm7J1o2J77O2n5r0n3N5mN5Q4J2j2l25R2Q3
$$ plain form
7654 -150 57 -148 -52 87 144 -110 -253 -109 -10 23 209 145 14 -45 -241 -8 31 261 -111 -15 -158 -86 -17
7677 -17 48 -26 -141 -97 -172 -40 27 104 22 51 93 -227 -89 132 109 35 -48 -130 -71 -100 156 180 -169 -247 -96 -4
7703 -4 60 123 -53 45 -71 -16 -41 224 50 -72 -131 -102 -32 -24 -23 63 35 -109 -210 110 111 63 20 -249 -263 -33 91
7730 91 75 188 -98 -156 8 50 91 91 1 0 24 -190 60 66 43 -95 -28 -180 114 167 69 10 -93 -63 -81 78 13
7757 13 41 -44 -166 8 -189 122 -32 0 16 -61 -29 27 -48 94 34 -45 64 -161 103 111 106 54 -108 -75 -92 60
7783 60 111 -115 80 -134 -46 11 74 -54 -5 27 10 -98 -158 4 -52 98 -147 -68 -106 50 -65 102 0 -116
7807 -116 29 -9 -10 25 -70 -120 -40 -230 -10 -21 103 -74 34 6 -48 96 -50 14 -125 -123 -75 -77 -68 4 -89 -56 -141
7834 -141 -120 95 -41 -4 -129 -121 121 -33 -55 -28 -20 -67 -56 -118 59 121 66 -24 -77 -22 -26 29 113 125 113 -212 -120 -37
7862c7J01j44R7n1K9rJ14r2J7j46K7O7r6K25L6j7q6o2J18R1k2j9n5k88M1J4J98
7889E1r1N9j73N6J70j49j9K35p1k17Q3J47m3no6q4K59j61JM7l4j4P1p9k2MJ55
7916A10j59M3l0q8J24RJ28j94%J90k01Q9k3MO6j42j03J53M1r0J09q5l5J25P1m0
7942G2m1r2R3r8O0Q9L8j70N3J82k85J24r4J25K5k16O4j9J08N1j7%j16K3P4J6N3
7969A02j11KJ7j15J34n0J32j06N1k07j6J23Q0K8j08rq5k0QJ81n4l2R7q9L1r2J39
7996C1j85J32l9N5P5j54P5P7j24p8J19J22j79J09J9l1j51J05Q6Rp3Rpj07J30o
8022A9m9J6M8Q3j96j7k4J83j23q2J93Rq3k7P2Lk1J66l6r8j4R0j00J98r9k33K40
8049A18q1rk3Mj06p0N3J01M9l3R4j09K05j94Q2j99K23j72oJ05j50J87j36J77l2
$$ plain form
7862 -37 64 -80 17 -34 -5 -14 100 8 25 -121 -94 -27 -123 102 138 121 35 -27 91 182 160 141 86 -202 -161 -147 51
7889 51 -40 19 -154 -98 72 -77 -96 139 68 -149 -66 81 38 33 -33 -117 142 -19 -18 29 -5 -19 52 -27 -49 -45 110
7916 110 -49 -6 -36 -124 0 9 137 -57 -57 133 -68 21 -2 2 68 -74 -177 -24 17 -73 36 -49 -84 41 112 72
7942 72 31 -61 32 -66 -6 83 121 -49 4 186 -99 25 -69 56 81 -135 -71 -90 18 69 52 52 -64 -41 33 49 102
7969 102 -9 -7 10 -105 29 -21 111 5 56 -151 -167 -44 36 64 -44 -53 -138 -158 -150 31 -23 -55 42 -47 -16 -108 31
7996 31 -154 -22 -61 -6 69 -85 -10 67 -57 -135 -16 106 -73 36 55 24 -127 -22 64 73 0 9 2 -105 25 19
8022 19 -30 -14 34 117 -79 -96 -120 63 -60 -142 51 60 -23 -50 22 25 4 170 134 36 22 112 12 210 111 -122 118
8049 118 37 28 5 9 -97 -167 -114 -13 36 3 97 -12 193 -1 81 -118 105 -67 -73 32 -118 69 -67 110 78
8074G8n2N9m7M8l9o0K1j80Q0K17k4j32l8K8J3j00K25k2j48o7O6P3Q7q9p1Q0%R0
8102I6k69K06L1R5j58m9pL3j26J33o8J8R5Q1o8j8k8J07o2n6Rj8n7J36N7j98J25
8129D0p0J0K3Q7k11J47J1n0k1O7j48L9o0K06L3j22J72j74r2k4J85J40j63j23J48
8154E0o5j11J20J14q2k30J12mJ20J14J8j09k55K57n8Q9J62k49O1j17R0J15p1o
8178F5j46on7p6K29N8jo1n4q7J31K2j2
$$ plain form
8074 78 26 85 38 86 47 -13 8 -172 -92 125 101 -31 -69 -41 -28 -128 97 75 -73 -140 -74 -1 86 -3 -74 6 6 96
8102 96 -173 33 64 159 1 -48 -55 -22 -148 -15 -83 -65 30 111 43 25 -3 104 42 -14 -5 -23 -80 56 113 -85 40
8129 40 -30 -20 3 90 -121 26 37 -13 -34 33 -115 -76 -136 70 103 -19 153 -21 -113 -137 48 188 25 -98 50
8154 50 -15 -126 -6 108 26 -204 -92 -96 24 138 156 47 -208 49 -9 80 242 -7 54 -63 27 142 71 65
8178 65 -81 -87 -144 -220 9 67 66 5 -49 -136 -5 17 5
8191E
$$ Imaginary data points
##PAGE= N=2
##DATA TABLE= (X++(I..I)), XYDATA
0@%%%%%%%%%qJ6j6K4l2L7m5N6p2Q8j04J28j52J76k13K53k96L44l97M58n25O00
31C20o85P78q82R98j126J266j417J583j765J967k188K428k690K975l285L627m001
48b097M409m859N351n894O499p170P920q765R724j0825J2102j3602J5397j7591
62i401K0339k3903K8729l5659M6509o6010J11701m13021k61182P17662m9124P9047
74A45687L30753k50705m36564K94279J91981j08355R6486k5110m25496q7282K17173
85e7153M4017J8169J17899j46274k49039K6921K24272R9899J5604N4024p4198
96G4141k61210J0099K65889J681j02027Q5651j49203k28360K41580K53385p4591
107A17035R1138M5023l17848k7190K78767q6474j16485J14394k19641k84196K18731
$$ plain form
0 0 0 0 0 0 0 0 0 0 0 -8 8 -8 16 -16 21 -24 32 -40 48 -56 72 -80 96 -117 136 -160 184 -213 245 -280 320
31 320 -365 413 -469 529 -597 669 -748 835 -930 1037 -1151 1277 -1413 1562 -1723 1904 -2097
48 -2097 2312 -2547 2804 -3090 3409 -3761 4159 -4606 5118 -5707 6395 -7207 8190 -9401
62 -9401 10938 -12965 15764 -19895 26614 -39396 72305 -340716 -601898 115764 66640 145687
74 145687 476440 225735 -210829 83450 275431 167076 263562 238452 -187044 -274326 -57153
85 -57153 -13136 5033 122932 -23342 -272381 -245460 -21188 78711 94315 148339 74141
96 74141 -187069 -176970 88919 90600 -11427 74224 -74979 -303339 -61759 191626 117035
107 117035 208173 253196 -64652 -91842 186925 100451 -16034 98360 -121281 -405477 -186746
118a86746J83987r7892R1870O4039k14252p015K27941O8557K8258N6562j16347
129I8962j22874N2424O9638K0600o854r4795j52313r8116N3200J58915N7361l4274
141A874J3843o2112r1944J54008J80961q0836q6986k4049j50164k5102K08308
152C7801O6198o9523k339r7669r7385J61897J41649m6077J0719l6544j78038J6200
164i3111J76360J7661m0148k0538j32510r7603P1807R4144O0374K0904q2903p5527
176a01090M0680P4990Q3288P5324n0786j39936p4609J2456O9224Q0757n032p4564
188i298o4668m5886M5762J47494N5610p3215n7429n3837l5017R2647J03129j4458
200I0834n4350q2589q3451M8461J00695J0203m697k0096r9052k0406J21776Q1582
$$ plain form
118 -186746 -2759 -100651 -8781 55258 -158994 -166009 61932 130489 158747 215309 98962
129 98962 -23912 28512 98150 118750 111896 17101 -135212 -233328 -180128 -21213 36148 1874
141 1874 15717 -46395 -138339 15669 196630 115794 28808 4759 -145405 -170507 37801
152 37801 103999 34476 32137 -65532 -162917 -1020 140629 94552 105271 68727 -109311 -93111
164 -93111 83249 100910 60762 40224 -92286 -189889 -118082 -23938 36436 57340 -25563 -101090
176 -101090 -60410 14580 97868 173192 122406 -17530 -92139 -79683 -10459 70298 65266 -9298
188 -9298 -73966 -119852 -74090 73404 129014 55799 -1630 -55467 -90484 2163 105292 90834
200 90834 36484 -46105 -129556 -81095 19600 29803 25106 5010 -94042 -114448 7328 88910
212H8910N268j880o7652q9597J9490O8567L5179J8459n3777j08911j3903O5348
224c4499M4454M8762J7846q4580q4976J6940O8994N3037J3653l3155o1031m7050
236h1605K1939Q5994N5350k2581n2537m8588j8062M6405O6880K4140j5087n4948
248G300o8487J1885P1427J6116j4989n449o6996o9045N6982R0151J3731k505j9558
261B0563o8744j8961O1377N1881J9285j6467p2070m8841M0251N9674K7558J3361
273F8867l0739q3444l0793O2837N6601J502j6601l8193n6481o735N9749N3177
285C9747k942l6545m0809k3131K5763N9241L5162M58k8486n6156j4788N7408L9921
298E4843j0695j3229l7942o4415L643P3219L6902j4990k1630l4559k7696L2907
$$ plain form
212 88910 94178 92298 24646 -64951 -45461 23106 58285 76744 22967 -85944 -99847 -34499
224 -34499 9955 58717 76563 -8017 -92993 -76053 -7059 45978 59631 26476 -34555 -81605
236 -81605 -59666 26328 81678 59097 6560 -42028 -60090 -13685 53195 77335 62248 7300
248 7300 -61187 -49302 22125 38241 23252 17803 -49193 -118238 -61256 28895 42626 40121 20563
261 20563 -48181 -67142 -5765 46116 65401 48934 -23136 -71977 -31726 27948 55506 68867
273 68867 38128 -45316 -76109 -13272 43329 44831 28230 -9963 -66444 -73179 -13430 39747
285 39747 36805 260 -40549 -63680 -37917 21324 56486 56944 28458 -27698 -42486 14922 54843
298 54843 44148 30919 -7023 -71438 -67795 5424 42326 27336 5706 -28853 -56549 -23642
310b3642N6572J6808j6814m2156m7590J0138N3507K3200j708r196m3612l6736
322f1229L4553N9866J4807j3160j4118k8345k0788K6885M1628J633k9885l6046
334b4199k9095M281L3174K5549P439j2853l5694j7773L6622M7278Q785q375j1370
347B3769l6312k2090L8229L7405j4520k6058k1518k3535J0085M0905K5341j517
359C0184k1013l1681n358L1243K3466l219q449k0402l6306j947M0597K0003j4559
372B559j0735q971j4042J2788M0281K3847j0064k0700j3982l691J3213J7049k659
385B4893j7215k5064k8157N400L7194J1247j2075J342o820j8938J7163L7771J684
398B8425k2453j2335q899m405J6165K0624L944j2310j9730q542J6345J8823L681
$$ plain form
310 -23642 32930 49738 32924 -9232 -56822 -46684 6823 30023 28315 19119 -24493 -61229
322 -61229 -26676 33190 47997 34837 20719 -7626 -28414 -1529 40099 41732 11847 -24199
334 -24199 -53294 -49013 -15839 9710 17149 4296 -31398 -49171 -12549 34729 43514 35139 23769
347 23769 -12543 -34633 3596 41001 26481 423 -21095 -44630 -34545 6360 31701 30184
359 30184 9171 -22510 -27868 3375 26841 23622 15173 -5229 -41535 -43482 -2885 17118 2559
372 2559 -8176 -17147 -31189 -18401 21880 45727 35663 14963 981 -2710 10503 27552 24893
385 24893 7678 -17386 -45543 -40143 -2949 8298 -3777 -2435 -9255 -28193 -11030 26741 28425
398 28425 5972 -6363 -15262 -19667 -3502 17122 21066 8756 -10974 -19516 -3171 15652 19333
411A9333J953m219j7350p443J5285J7042n249k3594j6353q990j2547Q508K8573
424e051L752j6600J040R491O759J6716J3839m063j0962j0759l097J5547J2785
437B9397j0699j0336k191j4417p774J4626M355j3857r071k629L097Q715K416N033
451c335O214j3372p597J9137O260j0059P832P517o867O163J3228J591J34n847
465B0999j5547j602L169j5099q235P026j0042j3139J4428J3058p483m941K515
478a4893J572J088M736J6234J0822j0903m47J7025q7l308Q735r938j8323j030
492A283m922m310J3817n931k2704P239N754k1890Q261K4821j9926j5579K5608
505h479O160o930K5107J4612j3628J742O890o415J331m58j5242q616J346l380
$$ plain form
411 19333 21286 17067 -283 -7726 7559 24601 19352 -4242 -20595 -29585 -42132 -33624 -5051
424 -5051 -1299 -17899 -16859 -7368 -609 16107 29946 25883 14921 4162 1065 16612 29397
437 29397 18698 8362 6171 -8246 -16020 -1394 2961 -10896 -19967 -22596 -19499 -10784 -8368 -3335
451 -3335 2879 -10493 -18090 1047 7307 -2752 5080 12597 5730 11893 25121 26712 26846 20999
465 20999 5452 3850 7019 -8080 -16315 -9289 -19331 -32470 -18042 -4984 -12467 -17408 -14893
478 -14893 -13321 -12233 -7497 8737 19559 8656 8209 25234 25147 21839 30574 20636 2313 1283
492 1283 -3639 -7949 5868 -63 -22767 -15528 -9774 -31664 -23403 1418 -18508 -34087 -8479
505 -8479 -2319 -9249 15858 30470 16842 18584 25474 19059 20390 19932 4690 -3926 -2580 -5960
519e960j527N760J154j0905q011R955P186j3096j569J4073r463q189K8622J3016
533B1046j9654K854Q249j9992K150K4500p147p422J4031j2411j0223K7711L602
546B7294k5456K81p679l4030R03K8376J927p698O155j933p158J3854K5721R239
560B9796r515j2927q665l296J0489J8446J244j6310j3695j5760p801K4262J8004
573A4272j6275n262L825j9574P510M6740P745k6033n944j5357k7528J4010K8819
586F948m136j1913p688j2766J0148L4650J7729k687r007k2376j7044J5952K6711
599B4521L390j5347j7096j4877q643J2181K7244K510k7338j2032O331L753K3668
612H265L1863r271k8716j0399q330K239K4438L512k6258j2307j388q0K9867L8129
$$ plain form
519 -5960 -7487 -1727 -573 -11478 -19489 -9534 -2348 -15444 -17013 -2940 -12403 -20592 8030 21046
533 21046 1392 4246 12495 -7497 -5347 19153 12006 4584 18615 6204 -4019 23692 27294
546 27294 1838 2119 -5560 -39590 -38687 -10311 -8384 -16082 -9927 -11860 -19018 -5164 20557 29796
560 29796 20281 7354 -1311 -4607 5882 24328 25572 9262 -4433 -20193 -27994 -3732 14272
573 14272 -2003 -7265 -3440 -23014 -15504 31236 38981 12948 7004 -8353 -35881 -21871 6948
586 6948 2812 -9101 -16789 -29555 -19407 15243 32972 30285 21278 -1098 -18142 -2190 24521
599 24521 27911 12564 -4532 -19409 -28052 -15871 11373 13883 -13455 -25487 -19156 -15403 8265
612 8265 40128 30857 2141 -8258 -16588 -14349 10089 13601 -12657 -24964 -26352 -26432 3435 41564
626D1564p094k5950l705l123j57K4499J2799k6912l0748j2410Q61J3670J8680
639A974K127j9981j9925J092J7911K6879K4738k752k4076q646O420N314J6160
652B7235J1783k7866l8315m154J1243R857K3788J2316k5169k3273M543J2752J7690
665A2430J4973j4234l0392j4181R19J5336K8613J0199k2404k1960j18J3391K2387
678A4959K5277M221k6571k6884K081J7314J2076M117j4862l6650k6436P331K4537
691a9490K0353O392j5542k2457J340K4438K8071K2274l465l5767k6181Q403J9300
704G669J7426J0008j9146l7407j5067J8778K8861J6569n094k6701k8594l146K5501
717a0343K9772R936j8951l3079j8966J0282K8421K3566K843j9040k5810m255K9181
$$ plain form
626 41564 34470 8520 4815 1692 1535 26034 38833 11921 -18827 -31237 -30376 -16706 1974
639 1974 4101 -15880 -35805 -34713 -16802 10077 34815 32063 7987 -659 5761 11075 27235
652 27235 39018 11152 -27163 -31317 -20074 -10217 13571 25887 718 -22555 -18012 -5260 12430
665 12430 27403 13169 -17223 -31404 -30485 -15149 13464 23663 1259 -20701 -20819 -7428 14959
678 14959 40236 44457 17886 -8998 -6917 10397 22473 26590 11728 -24922 -51358 -44027 -19490
691 -19490 863 7255 -8287 -30744 -29404 -4966 23105 45379 41914 6147 -20034 -11631 7669
704 7669 25095 35103 15957 -21450 -36517 -17739 11122 27691 22597 -4104 -32698 -35844 -10343
717 -10343 19429 29365 10414 -22665 -41631 -31349 -2928 20638 23481 4441 -21369 -25624 3557
730C557L3780J0730r922k6602l0905m213K5515K1857k845k2317k9568j6105J3308
743c3730L1112K2755k420k4935k4762Q43K7392L0073J1738j2767k8925k2380O937
756a9069L0588K3085m424k4344k5515j0363J5227L2913J8929j3987k9503k1037
768b7500j636J9616K4987N557j8815k8759j5638J4182L2275K3150n27j9459k3568
781a6135q672J9817L3520J4172j5790k8148k1211m25K3048K6168L566k5241l3168
794b8499j1723J6491K9770K1252m837k8062k6321j643K4766L1212R006j8633k7632
807a4853j5902Q680L0642K8565o92k7868k6975o057J7126K8100J6769j3096l3778
820i339k5509J999K5581K6820M568k0808k8950j4643J5036L4656K3363o542k8061
$$ plain form
730 3557 37337 48067 38145 11543 -19362 -23575 1940 23797 20952 -1365 -30933 -47038 -33730
743 -33730 -2618 20137 17717 -7218 -31980 -31137 -3745 26328 38066 25299 -3626 -26006 -19069
756 -19069 11519 34604 30180 5836 -19679 -30042 -14815 18098 37027 23040 -6463 -27500
768 -27500 -29136 -9520 15467 21024 2209 -26550 -42188 -28006 4269 27419 26892 7433 -16135
781 -16135 -24807 -4990 28530 42702 26912 -1236 -22447 -22872 176 26344 29910 4669 -28499
794 -28499 -40222 -23731 6039 27291 22454 -5608 -31929 -33572 -8806 22406 31412 12779 -14853
807 -14853 -30755 -22075 8567 37132 36440 8572 -18403 -24460 -7334 20766 37535 24439 -9339
820 -9339 -34848 -32849 -7268 19552 24120 3312 -25638 -40281 -25245 9411 32774 26232 -1829
833a829k4062k85K2903L0204J3394j8612l4377j7228J1496K7478K2833j52k5289
846F474l0592r224J9290K9089J3404j3692l0677k1290L155K3906K9710Q944k1966
859F531k7853p809J5172K8831K3265k505k7381k6809l440K0672K5421Q431j6795
872A5731k9654j9988N207K6101K4944L21k3696k5633p146J6033K7306J8645o154
885B2017k7946k2604M263K3256K2895R507j3877k8845j4161J3428K6584K0237
897C4754k045k6013k7376o899J4196K4370J4790j3748l1884j8828O956K3110K5082
910A6465R417j8208k8038q423J8319K9066J8332n885k5288k5451m552K1885K6034
923B3673O533j6985k8040j7419R650K6172J9727J365k1582k9515n779K1537K3369
$$ plain form
833 -1829 -25891 -26176 -3273 26931 40325 21713 -12664 -29892 -18396 9082 31915 31763 6474
846 6474 -24118 -33342 -14052 15037 28441 14749 -15928 -37218 -34063 -10157 19553 28497 6531
859 6531 -21322 -29131 -13959 14872 38137 35632 8251 -18558 -21998 -1326 24095 32526 15731
872 15731 -13923 -33911 -28704 -2603 22341 22662 -1034 -26667 -33813 -17780 9526 28171 22017
885 22017 -5929 -28533 -24270 -1014 21881 31388 17511 -11334 -25495 -12067 14517 34754
897 34754 32709 6696 -20680 -27579 -13383 10987 25777 12029 -19855 -38683 -31727 -8617 16465
910 16465 25882 7674 -20364 -28787 -10468 18598 36930 31045 5757 -19694 -24246 -2361 23673
923 23673 30206 13221 -14819 -32238 -22588 3584 23311 24676 3094 -26421 -32200 -10663 12706
936A2706J0243o293k5776k4914N986K8605K1644M846j4154k5769j1331J5792K5824
949A7409J6508n183k6749k5215j172J8524K0499P297j3972k6074j7036R995K8012
962B843J8932k079j5254j9679r722J6327K7787R074j2699j9341j7655j731K1968
975a229K1845J041j3530k0154j4119J2644K7517J1589n171j5636k3306q764J9572
988g701K3001L709j3295j9621j4427M602K4465K2649L02j9569j9431n152J3392
1001g076K3306J3634j0202k3011j6819j183J7458K3709K157j8508j6456r244L033
1014a9202K5256K1985r072k1586j3301o496Q757K4347J1254j3991j9988j1911
1026b3948K613K0412K2092K996j4339j6944q957Q691K2522J4003r391k1844j5437
$$ plain form
936 12706 22949 16656 -9120 -34034 -28048 557 22201 27047 12893 -12876 -24207 -8415 17409
949 17409 33917 28734 1985 -23230 -24402 -5878 14621 21918 7946 -18128 -35164 -25169 2843
962 2843 21775 19696 4442 -15237 -24959 -8632 19155 28229 15530 -3811 -21466 -23197 -1229
975 -1229 20616 21657 8127 -12027 -26146 -13502 14015 25604 20433 4797 -18509 -27273 -7701
988 -7701 15300 19009 5714 -13907 -28334 -23732 733 23382 23684 4115 -15316 -20468 -7076
1001 -7076 16230 29864 19662 -3349 -20168 -21351 -3893 19816 21973 3465 -12991 -22235 -19202
1014 -19202 6054 28039 18967 -2619 -15920 -22416 -13659 10688 21942 7951 -12037 -23948
1026 -23948 -21335 -923 21169 24165 9826 -7118 -16075 -7384 15138 29141 19750 -2094 -17531
1039a7531k724R688J9732J0516j6114k3627m787Q088J3221K0087N324k0342j7460
1052a5929P34R428J7369J4154r937k1710r009K187J1082K1451P287j9939j8971
1065a1803j676M475J1513J6720k943k4043j6630K214J1013J3878R341p258j8875
1078a4074p662J0444J6666J5576M991j5528j7889N05Q892R433J1746m205k5750
1091f855j4941Q373R035P144R534q884k3517m307J4182J1796J0394L400j5481
1104a27j5823K498J0339J1352J0252n413j8719o926R482R792Q694O579j0403k1407
1118i830m776J2469P022J715N71j2937j7278J944J4696Q692L280k597j2264n760
1132a5053J1291J2292O541M491q938j7098M81J2533K693J48J23j3773j4733O168
$$ plain form
1039 -17531 -20255 -10567 9165 19681 3567 -20060 -24847 -16759 -3538 16549 21873 1531 -15929
1052 -15929 -15195 -5767 11602 25756 15819 -5891 -14900 -12713 -1631 19820 27107 7168 -11803
1065 -11803 -13479 -9004 2509 19229 16286 -7757 -24387 -22173 -11160 2718 12059 4801 -14074
1078 -14074 -21736 -11292 5374 20950 25941 10413 -7476 -6971 1921 11354 23100 18895 -6855
1091 -6855 -21796 -13423 -4388 2756 12290 3406 -20111 -24418 -10236 1560 11954 15354 -127
1104 -127 -15950 -13452 -3113 8239 18491 13078 -5641 -12567 -3085 6707 15401 21980 11577 -9830
1118 -9830 -14606 -2137 4885 6600 7171 -5766 -23044 -21100 -6404 2288 5568 2971 -9293 -15053
1132 -15053 -3762 8530 15071 19562 10624 -6474 -5993 6540 9233 9381 9504 -4269 -19002 -12834
1146a2834J4539M540m88l241j0880o505Q294J1229L279k562r086r977K177J2144
1160F29P484K108j519j0601r276P865J4279K877l540l035j0367q867Q605J1504
1174H146j952p180p558q584O26J1634R753K084l553q498m698Q191J1857K116k474
1189I910n135j0951n397J1044J1297j775n895m790o701j091J1020R611l015q614
1203d82o503l487M075R379L447l686o536q444p86J0765Q859j032k592j932m428
1218c383J366J1464O521o356p761l967l087R14O241K941m730p001k835L149N814
1233g10L179q36k892l504k707L325Q105K605n057k869Q09r70J131O570J988n496
1249B671l933J686K316R47J572L66m001n617k004K011K050j559k591k95J8p51
$$ plain form
1146 -12834 1705 6245 5757 2516 -8364 -14869 -6575 4654 7933 5371 -3715 -13692 -11515 629
1160 629 8113 10221 8702 -1899 -11175 -3310 10969 13846 10306 7271 -3096 -11963 -3358 8146
1174 8146 6194 -986 -8544 -17128 -16502 -4868 4885 6969 3416 -5082 -9780 -1589 10268 12384 9910
1189 9910 4775 -6176 -11573 -529 10768 8993 3098 -1692 -8393 -9484 1536 11147 8132 -482
1203 -482 -6985 -10472 -6397 2982 6429 2743 -3793 -12237 -13023 -2258 6601 5569 2977 1045 -3383
1218 -3383 -2017 9447 15968 9612 1851 -2116 -5203 -4289 1952 4893 163 -6838 -9673 -6524 -710
1233 -710 2469 1633 -1259 -4763 -7470 -4145 3960 6565 1508 -1361 -552 -1522 -391 6179 8167 2671
1249 2671 -1262 424 2740 3687 5259 5625 1624 -3993 -5997 -3986 -1936 -3495 -6086 -6381 -6363 -7114
1265g114M130O453J074l252r39K032K37j72L535K004m633l517K016J620j024q76
1281A574p32k716m110l90L393K630j300k093L78K06j305K052M305l82l938M44
1297a984M088J972L46K051J011l611l530J893K066k831l124k9j032j869N04K236
1313a843L67k301j633J967K392n41l16K880R85k167J679M446m86l887O01J587
1329C730j561q03R19O5k786k645J362K706j768l207m6l41j565J604M157J960k850
1346a069j652L333L213q3K00J089k722m582K007M870l61l415j379j733j419J288
1362b415K975K063k182n313k92M321J376k37K193k074n707k02N754L327n32j410
1378A645j656j520J6L674M921l46o202l581J221J250J215K406j193n413m227J852
$$ plain form
1265 -7114 -2984 3469 4543 1291 352 2384 2621 2449 5984 7988 3355 -162 1854 3474 2450 1574
1281 1574 842 -1874 -5984 -6374 -2981 -351 -1651 -3744 -3366 -3160 -4465 -2413 1892 1510 -2428 -1984
1297 -1984 2104 4076 4422 6473 7484 3873 343 2236 4302 1471 -1653 -1682 -2714 -4583 -4079 -1843
1313 -1843 -1476 -3777 -5410 -3443 -1051 -1592 -1908 972 1957 -210 1469 5915 5429 1542 2143 3730
1329 3730 2169 1366 2285 2350 -436 -3081 -1719 987 -781 -3988 -4034 -4375 -5940 -4336 -179 1781 -1069
1346 -1069 -2721 612 3825 3742 3942 5031 2309 -2273 -266 4604 4243 828 -551 -2284 -3703 -2415
1362 -2415 560 2623 441 -4872 -5164 -843 533 296 2489 415 -5292 -5494 260 3587 3055 1645
1378 1645 -11 -1531 -1515 2159 7080 6734 532 -3049 -1828 -578 637 3043 1850 -3563 -7790 -5938
1394e938O012L246j966r59j181m057J073P701K670m940l114j424j132K795M147
1409B933K020j477n028l222M217N133l1r1n5o573m830M744N381j15l032l428l200
1426f654j169K797O615L878m855n091R96K872L547M897R75n498o488k151M505
1441h24P005K57m387k332m022l628P026Q752l014p207k870k554Q23P143N157j378
1457C947o200o572J036Q096N428Q45n19n502o263K936R517N364k925p568n781
1472d161k100J089O365O564n366j1668k763M704M414O824M179o365q507j460M676
1487c575Q872O293n061p078k431j921L853J1116K762j0311q228r55J285N026O911
1502F558R76q294r413q86P324O064J436j547o235o825K321R805Q129K351o090
$$ plain form
1394 -5938 74 3320 1354 395 -786 -4843 -3770 3931 6601 1661 -1453 -2877 -4009 -1214 2933
1409 2933 4953 3476 -1552 -4774 -557 4576 4545 4454 4399 -2174 -7004 -2260 3121 3006 -26 -3454 -6654
1426 -6654 -7823 -5026 1589 5467 612 -4479 -3483 -611 2936 7833 8808 3310 -3178 -5329 -824
1441 -824 6181 6438 2051 -281 -4303 -7931 -905 7847 4833 -2374 -5244 -7798 -6975 168 5325 3947
1457 3947 -2253 -8825 -7789 307 5735 6580 6061 559 -5704 -2768 6749 12113 9188 1620 -4161
1472 -4161 -6261 -5172 1193 7757 2391 -9277 -12040 -7336 -2922 3902 8081 1716 -6791 -8251 -3575
1487 -3575 5297 11590 6529 -549 -2980 -4901 -1048 10068 12830 2519 -5709 -6664 -5379 -353 6558
1502 6558 7534 -760 -10173 -11059 -3735 2329 3765 2218 -4017 -10842 -8521 1284 9413 11764 5674
1517E674q085n78L614L064O733J345j3140r263M841M661K257N027k411j1584n349
1532a3194M335P057O849P37o716n277l4L718Q248P460l814j1258n264K973N967
1547A787N478L890l632j1428o557P303Q561K11j851n917j1358k018J0313Q849
1561C631L179k338r883n741O637P597N045M440o253j3818p04J1567O083J911l79
1576A0974j0424j2877J81J0410P851K97o379q272m852M129J1077Q384j762r566
1590h29j0540j154R775R877L174r48p946j1546K465J4822N685l955l888r333r886
1605a4227O167J3944M191l674p548r873j851Q912P932K865k653j0673p200P193
1619f495J2108N492j11m876j0158o581O136J2251L106o744o152m887j861Q108
$$ plain form
1517 5674 -2411 -2989 625 3689 10422 11767 -1373 -10636 -5795 -1134 1123 6150 3739 -7845 -13194
1532 -13194 -8859 -1802 5047 5784 -932 -6209 -6243 -2525 5723 13183 9369 -1889 -7153 -4180 1787
1547 1787 7265 11155 7523 -3905 -10462 -3159 5402 5613 3762 -2155 -13513 -15531 -5218 3631
1561 3631 6810 4472 -5411 -11152 -4515 3082 8127 12567 6314 -7504 -8208 3359 9442 11353 10974
1576 10974 550 -12327 -12146 -1736 6115 6412 33 -8239 -13091 -8962 2115 10499 8737 -829
1590 -829 -11369 -12523 -2748 7129 10303 9355 1409 -10137 -7672 7150 12835 8880 4992 -4341 -14227
1605 -14227 -8060 5884 10075 6401 -1147 -11020 -12871 -3959 3973 6838 4185 -6488 -13688 -6495
1619 -6495 5613 11105 10994 6118 -4040 -10621 -4485 7766 10872 4128 -2024 -6911 -8772 -664
1633f64J1410j46r553q076m338K864J0882N629l168n074p172m201R752J2022k193
1648G974o975l869o212l81J2412J0416l080q114o187k633M009Q421M074m500r630
1663d275p816K026J0032Q815k39o776p751n150J795J1128R190n384j0432k631
1677g468N56M295J2384O684r343j1874l662K306Q149Q704m50q467q359m522N373
1692e694J1982M226q106r160n502j446P979J3649M248q677r245k102M398P515
1706D065P644P15j0492j0854r2Q203R236M401m831j0706p407k29O994J0205P45
1721G597j0535q519J65L928Q520J0030j340j1941p761K232P766Q552L830m428
1735H096q686n969K656R775O500m060r756q246l251M397R886O427l217j0193n767
$$ plain form
1633 -664 10746 10600 1047 -7029 -11367 -8503 2379 8008 4840 -234 -7406 -11607 -1855 10167 7974
1648 7974 999 -2870 -9082 -9463 2949 13365 10285 2171 -4016 -6649 -2640 5781 9855 5355 -4275
1663 -4275 -12091 -10065 -33 8782 8543 1767 -5984 -11134 -9339 1789 10979 5595 -4837 -7468
1677 -7468 -6912 -2617 9767 16451 7108 -4766 -8428 -6122 2027 10731 10281 1814 -6545 -11067 -5694
1692 -5694 6288 10514 2408 -6752 -12254 -13700 -5721 7928 12176 3499 -5746 -7848 -3450 4065
1706 4065 11709 12424 1932 -8922 -9014 -811 8425 12826 7995 -2711 -10118 -10347 -3353 6852 7597
1721 7597 -2938 -11457 -11292 -7364 1156 11186 9846 -2095 -9856 -7624 142 8694 12524 8096
1735 8096 -590 -6559 -3903 5872 12372 8312 -1444 -9690 -12941 -8544 1342 7769 4552 -5641 -11408
1750a1408M034P782N730K813m802j1057m124P626J0290M808k006p213q247j863
1764g637N934Q895L533o872j0272l073L480O265P318R27q999j0449j836O706R027
1779B947L873k143n733o079L67R883R485q63p940p376m437J910Q193O976j725
1794G338q661p691J53P152O538K411k523q356p151L233R967O141r69n631p284
1809e333l945L016Q394O493l365q439l773J949N617P653M100n527r862m995K655
1824e362P380M550k128o179o330l010N584J0618L537n711o567l428N51O753Q336
1839H594J553o765q633k674N207O831L333j360o260p802m10Q321Q186J010n162
1854C969o995m352R71O077O403p24r082o872J093N087O748N776j220p607m881
$$ plain form
1750 -11408 -7374 408 6138 8951 4149 -6908 -11032 -3406 6884 11692 9686 2473 -5774 -7637
1764 -7637 -1703 7192 10725 3853 -6419 -9492 -6012 253 7571 8498 -501 -10950 -12786 -6080 2947
1779 2947 6820 4677 -1056 -7135 -6768 3115 12600 11737 3797 -3579 -8016 -6106 2087 9063 7338
1794 7338 -1323 -9014 -8861 -1709 4829 7240 4717 -3639 -10790 -7557 2410 8551 7582 1951 -5333
1809 -5333 -9278 -6262 2132 8625 5260 -3179 -6952 -5003 614 8267 12367 6840 -3022 -8017 -5362
1824 -5362 2018 6568 4440 -1739 -8069 -11079 -5495 5123 8660 2949 -3618 -7046 -6495 258 8594
1839 8594 10147 3382 -5251 -7925 -2718 4113 7446 6086 -174 -7976 -8386 -65 8121 9131 3969
1854 3969 -3026 -7378 -6407 -330 6073 5349 -3733 -10605 -9512 -4425 2323 8099 6879 -728 -5609
1869e609K734P020O193l72n838n979m261J099P475M667m857p270l794j39M221
1884d710P249L952l482o860l292L742O459L582n82l720o614l151N041P757K349
1899G720k951n087l641N10L841N640K219o033q352j635K838L095L951P20n616
1914b781n723L81N564O919K800k511l802k934lN035O893r38p401m965j579R73
1930d072M437M107j545n997m848Q18N893M891O73j688m998m423J821O342M345
1945E756j172m898m175j65L207N163M530j453p344l543K698L170K567J473m144
1960A670p135k213K743M789L170j828m417k248M1L135O448K991l968m776o38J981
1976b55K899K836l3m287n522j106M367M057K46j291k729l795L79M704L416j147
$$ plain form
1869 -5609 -2875 4145 10338 9966 4128 -1851 -6112 -5013 2462 7129 2272 -4998 -8792 -8931 -4710
1884 -4710 2539 6491 3009 -3851 -7143 -3401 3058 6640 6058 2338 -4276 -7427 -2386 5371 7720
1899 7720 4769 -318 -3959 -3449 392 6032 8251 2218 -6134 -7769 -4931 -1836 2115 2835 -2781
1914 -2781 -8504 -8123 -2559 4360 7160 4649 847 -2087 -2090 2945 9838 8900 1499 -3466 -5045 -4072
1930 -4072 365 4472 2927 -3070 -7918 -7100 -1207 3684 4357 2669 -2329 -6752 -4931 1411 5756
1945 5756 4584 -314 -4489 -4654 -1447 3716 8246 6793 -551 -4094 -1396 1774 4341 5814 1670
1960 1670 -5465 -7678 -4935 -146 3024 1196 -3221 -5469 -5428 -2293 4155 7146 3178 -1598 -2236 -255
1976 -255 2644 5480 5447 1160 -4362 -5468 -1101 2956 3202 1911 -818 -4613 -4234 470 3886 2739
1992B739l138l831j251K965K765K567R83m007m070K535M110J205R28k36m240l410
2008c386K110L628J363j359l396k690j202R23L602K694j570l062q59J359K884
2023A039K799M61j499l606l169K035M501N58j590j66k652k631L302M436p36k023
$$ plain form
1992 2739 -399 -4230 -5481 -2516 249 2816 3799 -208 -4278 -1743 2367 3572 4500 4264 24 -3386
2008 -3386 -1276 2352 3715 2356 -1040 -3730 -4932 -4009 -407 2287 717 -2345 -3204 -1845 1039
2023 1039 3838 4299 2800 -806 -3975 -1940 2561 3119 1529 1363 -1289 -3920 -618 3818 3082 1059
$$ [...]
8191H1
##END NTUPLES=NMR FID
##END=
