##TITLE=1H_MEA 2811
 CDCl3
 8 sc, 
 28.11.2024
##JCAMPDX= 6.0         $$ Bruker NMR JCAMP-DX V2.0
##DATA TYPE= NMR FID
##DATA CLASS= NTUPLES
##ORIGIN= UXNMR, Bruker Analytische Messtechnik GmbH
##OWNER= root
$$ XWIN-NMR		Version 3.5
$$ Thu Nov 28 13:58:28 2024 Russian Standard Time (UT+4h)  she@DPX200
##.OBSERVE FREQUENCY= 200.1315
##.OBSERVE NUCLEUS= ^1H
##.DELAY= (6, 6)
##.ACQUISITION MODE= SIMULTANEOUS
##.ACQUISITION SCHEME= undefined
##.AVERAGES= 8
##.DIGITISER RES= 18
##SPECTROMETER/DATA SYSTEM= spect
##.PULSE SEQUENCE= zg30
##.SOLVENT NAME= CDCl3
##.SHIFT REFERENCE= (INTERNAL, CDCl3, 0, 15.7039)
##AUDIT TRAIL= $$ (NUMBER, WHEN, WHO, WHERE, WHAT)
$$ ##TITLE= Audit trail, XWIN-NMR		Version 3.5
$$ ##JCAMPDX= 5.01
$$ ##ORIGIN= Bruker BioSpin GmbH
$$ ##OWNER= she
$$ F:/spectra/data/she/nmr/H-F/1/audita.txt
$$ ##AUDIT TRAIL=  $$ (NUMBER, WHEN, WHO, WHERE, WHAT)
(   1,<2024-11-28 13:57:11.21 +0400>,<she>,<DPX200>,
      <created by zg, POWCHK disabled, PULCHK disabled
       configuration hash MD5:
       00 E9 B6 7A A2 85 ED C7 34 08 36 98 17 FE 4E 26
       data hash MD5: 16K
       AE B1 98 4A 4D CD 83 EE 99 8B 13 3B 16 90 C2 1E>)
$$ ##END=
$$ 
$$ hash MD5
$$ 5C FA EB 69 72 25 F2 08 EF 1B 58 70 22 07 B9 DA
##$RELAX= 
##$RELAX= 
##$RELAX= 
##$RELAX= 
##$RELAX= 
##$RELAX= 
$$ Bruker specific parameters
$$ --------------------------
##$DU= <F:/spectra>
##$EXPNO= 1
##$NAME= <H-F>
##$PROCNO= 1
##$TYPE= <nmr>
##$USER= <she>
##$AMP= (0..31)
100 100 100 100 100 100 100 100 100 100 100 100 100 100 100 100 100 100 
100 100 100 100 100 100 100 100 100 100 100 100 100 100 
##$AQSEQ= 0
##$AQ_mod= 1
##$AUNM= <au_zg>
##$AUTOPOS= <>
##$BF1= 200.13
##$BF2= 200.13
##$BF3= 200.13
##$BF4= 200.13
##$BF5= 200.13
##$BF6= 200.13
##$BF7= 200.13
##$BF8= 200.13
##$BYTORDA= 1
##$CFDGTYP= 0
##$CFRGTYP= 5
##$CHEMSTR= <none>
##$CNST= (0..31)
1 1 145 1 1 1 1 1 1 1 1 1 1 1 1 1 1 1 1 1 1 1 1 1 1 1 1 1 1 1 1 1 
##$CPDPRG= <>
##$CPDPRG1= <>
##$CPDPRG2= <>
##$CPDPRG3= <>
##$CPDPRG4= <mlev>
##$CPDPRG5= <mlev>
##$CPDPRG6= <mlev>
##$CPDPRG7= <mlev>
##$CPDPRG8= <mlev>
##$CPDPRGB= <>
##$CPDPRGT= <>
##$D= (0..31)
0 1.2 0 0 0 0 0 0 0 0.06 0 0.03 0 0 0 0 0.0002 0 0 0 0 0 0 0 0 0 0 0 0 
0 0 0 
##$DATE= 1732787830
##$DBL= (0..7)
120 120 120 120 120 120 120 120 
##$DBP= (0..7)
150 150 150 150 150 150 150 150 
##$DBP07= 0
##$DBPNAM0= <>
##$DBPNAM1= <>
##$DBPNAM2= <>
##$DBPNAM3= <>
##$DBPNAM4= <>
##$DBPNAM5= <>
##$DBPNAM6= <>
##$DBPNAM7= <>
##$DBPOAL= (0..7)
0.5 0.5 0.5 0.5 0.5 0.5 0.5 0.5 
##$DBPOFFS= (0..7)
0 0 0 0 0 0 0 0 
##$DE= 6
##$DECBNUC= <off>
##$DECIM= 24
##$DECNUC= <off>
##$DECSTAT= 4
##$DIGMOD= 1
##$DIGTYP= 9
##$DL= (0..7)
0 120 120 120 120 120 120 120 
##$DP= (0..7)
150 150 150 150 150 150 150 150 
##$DP07= 0
##$DPNAME0= <>
##$DPNAME1= <>
##$DPNAME2= <>
##$DPNAME3= <>
##$DPNAME4= <>
##$DPNAME5= <>
##$DPNAME6= <>
##$DPNAME7= <>
##$DPOAL= (0..7)
0.5 0.5 0.5 0.5 0.5 0.5 0.5 0.5 
##$DPOFFS= (0..7)
0 0 0 0 0 0 0 0 
##$DQDMODE= 0
##$DR= 18
##$DS= 0
##$DSLIST= <SSSSSSSSSSSSSSS>
$$ [...]
##$SUBNAM2= <"">
##$SUBNAM3= <"">
##$SUBNAM4= <"">
##$SUBNAM5= <"">
##$SUBNAM6= <"">
##$SUBNAM7= <"">
##$SUBNAM8= <"">
##$SUBNAM9= <"">
##$SW= 24.0689530833862
##$SWIBOX= (0..15)
0 0 2 0 0 0 0 0 0 0 0 0 0 0 0 0 
##$SW_h= 4816.95568400771
##$TD= 16384
##$TD0= 1
##$TE= 0
##$TE2= 300
##$TE3= 300
##$TEG= 300
##$TL= (0..7)
0 120 120 120 120 120 120 120 
##$TP= (0..7)
150 150 150 150 150 150 150 150 
##$TP07= 0
##$TPNAME0= <>
##$TPNAME1= <>
##$TPNAME2= <>
##$TPNAME3= <>
##$TPNAME4= <>
##$TPNAME5= <>
##$TPNAME6= <>
##$TPNAME7= <>
##$TPOAL= (0..7)
0.5 0.5 0.5 0.5 0.5 0.5 0.5 0.5 
##$TPOFFS= (0..7)
0 0 0 0 0 0 0 0 
##$TUNHIN= 0
##$TUNHOUT= 0
##$TUNXOUT= 0
##$USERA1= <user>
##$USERA2= <user>
##$USERA3= <user>
##$USERA4= <user>
##$USERA5= <user>
##$V9= 5
##$VALIST= <valist>
##$VCLIST= <CCCCCCCCCCCCCCC>
##$VD= 0
##$VDLIST= <DDDDDDDDDDDDDDD>
##$VPLIST= <PPPPPPPPPPPPPPP>
##$VTLIST= <TTTTTTTTTTTTTTT>
##$WBST= 1024
##$WBSW= 4
##$XGAIN= (0..3)
0 0 0 0 
##$XL= 0
##$YL= 0
##$YMAX_a= 556443
##$YMIN_a= -367864
##$ZGOPTNS= <>
##$ZL1= 120
##$ZL2= 120
##$ZL3= 120
##$ZL4= 120
##$ABSF1= 10
##$ABSF2= 0
##$ABSG= 5
##$ABSL= 3
##$ALPHA= 0
##$AQORDER= 0
##$ASSFAC= 0
##$ASSFACI= 0
##$ASSFACX= 0
##$ASSWID= 0
##$AUNMP= <proc_1d>
##$AZFE= 0.1
##$AZFW= 0.1
##$BCFW= 1
##$BC_mod= 2
##$BYTORDP= 1
##$COROFFS= 0
##$CY= 11.3945322036743
##$DATMOD= 1
##$DC= 2
##$DFILT= <>
##$DTYPP= 0
##$F1P= 15.6554695791079
##$F2P= 12.8336369535428
##$FCOR= 0.5
##$FTSIZE= 0
##$FT_mod= 4
##$GAMMA= 1
##$GB= 0.15
##$INTBC= 1
##$INTSCL= 1
##$ISEN= 128
##$LB= 0.24
##$LEV0= 0
##$LPBIN= 0
##$MAXI= 10000
##$MC2= 0
##$MEAN= 0
##$ME_mod= 0
##$MI= 1.114404
##$NCOEF= 0
##$NC_proc= 0
##$NLEV= 6
##$NOISF1= 3.799351
##$NOISF2= 2.8
##$NSP= 1
##$NTH_PI= 0
##$NZP= 0
##$OFFSET= 15.70392
##$PC= 1
##$PHC0= -26720.89
##$PHC1= 20.58745
##$PH_mod= 1
##$PKNL= yes
##$PPARMOD= 0
##$PSCAL= 0
##$PSIGN= 0
##$REVERSE= no
##$SF= 200.130013532006
##$SI= 16384
##$SIGF1= 3
##$SIGF2= 2
##$SINO= 400
##$SIOLD= 16384
##$SREGLST= <1H.CDCl3>
##$SSB= 0
##$STSI= 0
##$STSR= 0
##$SW_p= 3612.71676300578
##$SYMM= 0
##$S_DEV= 0
##$TDeff= 0
##$TDoff= 0
##$TI= <>
##$TILT= no
##$TM1= 0
##$TM2= 0
##$TOPLEV= 0
##$USERP1= <user>
##$USERP2= <user>
##$USERP3= <user>
##$USERP4= <user>
##$USERP5= <user>
##$WDW= 1
##$XDIM= 8192
##$YMAX_p= 0
##$YMIN_p= 0
$$ End of Bruker specific parameters
$$ ---------------------------------
##NTUPLES= NMR FID
##VAR_NAME=  TIME,          FID/REAL,        FID/IMAG
##SYMBOL=    X,             R,               I
##VAR_TYPE=  INDEPENDENT,   DEPENDENT,       DEPENDENT
##VAR_FORM=  AFFN,          ASDF,            ASDF
##VAR_DIM=   8192,          8192,            8192
##UNITS=     SECONDS,       ARBITRARY UNITS, ARBITRARY UNITS
##FACTOR=    0.0002076,     1,               1
##FIRST=     0,             0,               0
##LAST=      1.7004516,     0,               0
##MIN=       0,             -367864,         0
##MAX=       1.7004516,     556443,          0
$$ Real data points
##PAGE= N=1
##DATA TABLE= (X++(R..R)), XYDATA
0@%%%%%%%Qj6J6j6J6k4L4m2N3o3P4q8J04j22J44j68J92k23K58k94L35l78M30m88
$$ 0 0 0 0 0 0 0 0 8 -8 8 -8 8 -16 18 -24 29 -34 40 -48 56 -66 78 -90 102 -121 137 -157 178 -200 230 -258
31b58N46o12O86p67Q59r57J061j179J307j446J602j773J963k177K413k677K977
$$ -258 288 -324 362 -405 454 -503 558 -621 686 -760 842 -931 1032 -1145 1268 -1409 1568
48A568l319L716m179M726n388O210p260Q660j0627J3621j8803L0294j03336M7058
$$ 1568 -1751 1965 -2214 2512 -2876 3334 -3926 4734 -5893 7728 -11075 19219 -84117 -37059
62c7059J31909j33946j68069j40260k0439P6145J69211J18225k5700j70313j49835
$$ -37059 94850 -39096 -207165 -347425 -367864 -291719 -122508 -4283 -29983 -200296 -350131
73c50131j4330J36151J74393J03527m8539j53940j28967O542J21622J48676Q0473
$$ -350131 -364461 -228310 -53917 49610 1071 -152869 -281836 -275294 -153672 -4996 75477
84G5477l9545j37896j23871p979J22168J53288P1251n6995j24264r7724L997J15700
$$ 75477 35932 -101964 -225835 -233814 -111646 41642 112893 55898 -68366 -166090 -162093 -46393
96d6393J52433P0053n5073j17713q4153N176J01827J35992O7505o0886j40922
$$ -46393 106040 176093 121020 3307 -80846 -75670 26157 162149 229654 168768 27846
107B7846j03171J2241J00324R8922L1187n8566j27398j16196j4327R5648J15790
$$ 27846 -75325 -63084 37240 136162 167349 108783 -18615 -134811 -149138 -53490 62300
118F2300L4464p4056j28321q7118J1877Q8707J03801M6941m8258j17414r4749
$$ 62300 96764 22708 -105613 -192731 -180854 -92147 11654 58595 10337 -107077 -201826
129b01826Q759J02054J14150L7137o3750j11717q0336M709Q6398J04853L7750
$$ -201826 -193067 -91013 23137 60274 -3476 -115193 -195529 -190820 -104422 431 38181
140C8181n9271j09123p9434O207R2150J11427L8602n8246j00005o3710J9179R4904
$$ 38181 -21090 -130213 -209647 -203440 -111290 137 38739 -19507 -119512 -183222 -164043 -69139
152f9139J06764M3874m8341r8634o4954K3861R2918R2738L2959m9095j01962p4858
$$ -69139 37625 81499 33158 -65476 -130430 -106569 -13651 79087 112046 62951 -39011 -113869
164a13869J6655Q9579Q4015J6083o0375r5739o7499J0466Q3782R5924K2152p0873
$$ -113869 -97214 -7635 76380 92463 32088 -63651 -131150 -120684 -36902 59022 81174 10301
176A0301r8419m3647K6949P9438Q4424K9130n6493r4938n3592L0459Q8132P6272
$$ 10301 -88118 -131765 -104816 -25378 59046 88176 31683 -63255 -116847 -86388 1744 78016
188G8016J2901o3613r2090n4286L1782Q6113O5568k093n7233p8840m9945K3395
$$ 78016 90917 27304 -64786 -119072 -87290 -1177 64391 62298 5065 -73775 -123720 -100325
200a00325Q6550P5491K932o4369p5046k9531L5146P5352O6866P240n9775p6822
$$ -100325 -13775 61716 64648 279 -74767 -104298 -69152 6200 73066 80306 20531 -56291
212e6291k8455L6160O5738N0808K824n6640p7790l5762L1864O7079M4925j1719
$$ -56291 -84746 -48586 17152 67960 70784 14144 -63646 -99408 -67544 -465 44460 32741
224C2741n4290o0503k9726K2016O4099N3858m823n2922n5762j8573K9970O0837
$$ 32741 -21549 -82052 -111778 -89762 -25663 28195 23372 -29550 -85312 -103885 -73915 -13078
236a3078M7559j356m6595n3590j8129L0982N5892M0878k175m2172n4143k1564
$$ -13078 34481 33125 -13470 -67060 -85189 -54207 1685 42563 40388 -1784 -55927 -77491
248g7491L0255N3940L6140l802l8532m7234j7462K9239N4374M0365k855m0663
$$ -77491 -47236 6704 42844 39042 510 -46724 -64186 -34947 19427 59792 56937 16274
260A6274m2968r406K8306M6898L7786K53m0867m5870j5478K5069M3814K9157j1174
$$ 16274 -26694 -36100 -7794 39104 76890 77143 36276 -9594 -25072 -3 43811 72968 61794
273F1794l9676m4007j9334K0751M3410K5939j3996m0080l8202j6480K0069M1923
$$ 61794 22118 -21889 -41223 -20472 22938 48877 34881 -5199 -43401 -59881 -39812 2111
285B111K9442r643m0459l7371p438K4530L6692K2527n023l5427m0414p982K8593
$$ 2111 31553 21910 -18549 -55920 -63358 -38828 -2136 20391 15368 -20059 -60473 -68455 -39862
298c9862L6823J5609q158l2061l1302p708K5387L8743J9756j2402l0748k3150
$$ -39862 -3039 12570 4412 -27649 -58951 -66659 -41272 -2529 17227 4825 -25923 -49073
310d9073j207K3522L7599K4161j2249l2874j9021P010K4351K7863J6556r239k7925
$$ -49073 -50280 -26758 10841 35002 22753 -10121 -29142 -22132 2219 30082 46638 37399 9474
323I474k2858K185K6572K5321N342j2155k3446j9859j794K0913K3292L873j5937
$$ 9474 -13384 -11199 15373 40694 46036 33881 10435 -9424 -11218 9695 32987 36860 20923
336B0923j9248j4233j550J5249K0474P485j2910k4150j1033O994J2541J0167O644
$$ 20923 1675 -12558 -14108 1141 21615 29100 16190 -7960 -18993 -11999 542 10709 17353
349A7353p169j8186j4585K747J2484J0877L419q181j3317r991k30J2618J3052
$$ 17353 10184 -8002 -22587 -19840 -7356 3521 6940 -1241 -14558 -24549 -24779 -12161 891
362H91L011r192p890l984n40Q316J4165O099o127j0445m291M123O754Q198M575
$$ 891 3902 -5290 -13180 -17164 -17704 -9388 4777 10876 4749 -5696 -9987 -5864 890 9088 13663
377A3663k311o881q970J029Q466P104J365k402o600p038P66N712N099O9l501m420
$$ 13663 11352 4471 -4499 -3470 4996 12100 13465 11063 4463 -2575 -1809 3903 9002 9071 5570 1150
393A150l551l302J006O434M919m650r018k580L217Q39J182R49j32l747l536k045
$$ 1150 -2401 -5703 -4697 1737 6656 2006 -7012 -9592 -6375 -5536 -4354 -3405 -3537 -7284 -10820 -12865
409a2865L670L392o37m50m27k367r14K965K733r75j125L409K991j210o16J474
$$ -12865 -9195 -5803 -6440 -6890 -7317 -9684 -10598 -7633 -4900 -5875 -7000 -3591 -600 -1810 -2426 -952
425i52K598J099j044M316M535j385n321j91O210N261O80O06l214l813j699L695
$$ -952 1646 2745 1701 6017 10552 9167 3846 3655 9865 15126 15806 16412 13198 9385 7686 11381
441A1381N631L813j846o079n925l881R61J0042O540o211j2963o899m79M410O617
$$ 11381 17012 20825 18979 12900 6975 3094 4055 14097 20637 14426 1463 -5436 -5915 -1505 5112
456E112N077k807j1793j2644j760J0699J3274K336n428j0743j1777j231J2610
$$ 5112 10189 7382 -4411 -17055 -18815 -8116 5158 7494 2066 -8677 -20454 -21685 -9075
469i075J4599M260r050j2867r630N06J1683J5103Q358j0595j8598q826P797J3936
$$ -9075 5524 9784 734 -12133 -21763 -21257 -9574 5529 13887 3292 -15306 -24132 -16335 -2399
483b399J3210O269o764j6498j1469O776J9171J5765M129j1055j5772r688M013
$$ -2399 10811 17080 10316 -6182 -17651 -10875 8296 24061 28190 17135 1363 -8325 -4312
496d312J9712J7916J63j5534j7504q962N595J5600J7506J757j6537k1532r626
$$ -4312 15400 33316 33479 17945 441 -8521 -2926 12674 30180 31937 15400 -6132 -15758
509a5758Q795J7679J3579J767j3280k1948j1362R984K1989J5378k950j3726k0231
$$ -15758 -6963 10716 24295 26062 12782 -9166 -20528 -10544 11445 26823 23873 10147 -10084
522a0084j1006Q902K0950J5746j240j8130k0595q980Q186J7085J8142J606k0204
$$ -10084 -21090 -12188 8762 24508 23268 5138 -15457 -24437 -16251 834 18976 20582 378
535C78k3628p011J0547K0684J7238L40j5571k2288q894J0332K4837J9014p81j6179
$$ 378 -23250 -30261 -19714 970 18208 18548 2977 -19311 -28205 -17873 6964 25978 25197 9018
549I018k1567r416P316K4547J9357k873j8890k3361j1572Q719K2893J9431K25
$$ 9018 -12549 -21965 -14649 9898 29255 26382 7492 -15869 -27441 -18722 4171 23602 23827
562B3827k1011k8311j1001J5679K5724J8339K40k0688k5210j0666J4438K9082
$$ 23827 2816 -25495 -36496 -20817 4907 23246 23486 2798 -22412 -33078 -18640 10442
574A0442K1526k104k3555k6884j0409J5397K9392K3658p156k7313k6263q386J6444
$$ 10442 31968 29864 6309 -20575 -30984 -15587 13805 37463 30307 2994 -23269 -31655 -15211
587a5211K9345K0952l771k7529k9990o363K2566L3213J8239o779k5709k7249p169
$$ -15211 14134 35086 31315 3786 -26204 -32567 -10001 23212 41451 34672 8963 -18286 -25455
600b5455K2883L4944J8015j0808k8758k8026o746K1103L3421J7010j4510l4830
$$ -25455 -2572 32372 50387 39579 10821 -17205 -23951 -2848 30573 47583 33073 -1757
612a757k8081k196J9620K7399J6214j0211l4228l1177j664K5460L1233J4356j2888
$$ -1757 -29838 -32034 -12414 14985 31199 20988 -13240 -44417 -46081 -20621 10612 24968 12080
625A2080l1275k7209r67K6401L3228J3450j5875l0330k4123k915K3898L3937J5343
$$ 12080 -19195 -46404 -47371 -20970 12258 25708 9833 -20497 -44620 -47535 -23637 10300 25643
638B5643j8215l3765k2878K925K5629L0947J4515j3532l0919k3632N419L0198
$$ 25643 7428 -26337 -49215 -46290 -20661 10286 24801 11269 -19650 -43282 -37863 -7665
650g665L2102J3304j2290k9364k3218M710L0053L1692J1100j5886l0326k2571
$$ -7665 24437 37741 25451 -3913 -27131 -22421 7632 39324 50424 34538 4212 -18359
662a8359K243K5276L0413J1367j9580l4489k2970M107K4754K8162J0335j8374
$$ -18359 -16116 9160 39573 50940 31360 -3129 -26099 -21992 2762 30924 41259 22885
674B2885l3777k3720L838K7859K9445Q132j8724l2293k2835K645K8072L0637P514
$$ 22885 -10892 -34612 -30774 -2915 26530 34662 15938 -16355 -39190 -36545 -8473 22164 29678
687B9678k1524l3670k3638L774K7906K9862P505k1878l5991k1843P565L0054K9457
$$ 29678 8154 -25516 -49154 -45380 -17474 12388 19893 -1985 -37976 -59819 -52254 -22200 7257
700G257R158j8147l3765k1874J0629L4526L2849Q062k0443l2225j8843J0564L4405
$$ 7257 16415 -1732 -35497 -57371 -46742 -12216 20633 28695 8252 -23973 -42816 -32252 2153
713B153L3030O245k4436l3812j7102J0508L0959L1667N530k6546l5537j6731J3500
$$ 2153 35183 41428 16992 -16820 -33922 -23414 7545 39212 44742 18196 -17341 -34072 -20572
726b0572L2761K7369L361k3242l4091j7981J4609L5448K6357j248k5391l1238
$$ -20572 12189 39558 42919 19677 -14414 -32395 -17786 17662 44019 42771 17380 -13858
738a3858j6555J2785L2804K5007k816k8742l3246j3397J3063K9575K3784k002
$$ -13858 -30413 -17628 15176 40183 37367 8625 -24621 -38018 -24955 4620 28404 26402
750B6402k9429l4030j1224J8077K9500K1955j322k6290l1307j0755J8977L3447
$$ 26402 -3027 -37057 -48281 -30204 -704 21251 19929 -6361 -37668 -48423 -29446 4001
762D001K2424m153k5561k7791j0674J6986L3214K2787o432k7963k6957p974J6075
$$ 4001 26425 22272 -3289 -31080 -41754 -24768 8446 31233 24801 -3162 -30119 -38093 -22018
775b2018K9606K0456m319k6800k7829q205J9335K9728J9633l974k4230k7493p121
$$ -22018 7588 28044 23725 -3075 -30904 -39109 -19774 9954 29587 25613 1383 -26110 -33231
788c3231J8324L0694J8806n088k4669k6309q472J7603K8836J8063p047k7025k6231
$$ -33231 -14907 15787 34593 29505 4836 -21473 -29945 -12342 16494 34557 27510 485 -25746
801b5746o328J6377K6917J8269o073k6322k6065n773J8467K7969J8039o189k4994
$$ -25746 -32074 -15697 11220 29489 23416 -2906 -28971 -34744 -16277 11692 29731 23542 -1452
814a452k4732n469J9736L0158J5461q439k4949k3269m878J8713K7260J6726j0664
$$ -1452 -26184 -31653 -11917 18241 33702 25263 314 -22955 -27833 -9120 18140 34866 24202
827B4202k6097k4304k692J9951K5666J4290p683k8134k3547j234K1970K6643J2235
$$ 24202 -1895 -26199 -28891 -8940 16726 31016 23333 -4801 -28348 -29582 -7612 19031 31266
840C1266r425k5168k3130j269K1537K6449J2109j1935k5998j9602q25J8016K5820
$$ 31266 21841 -3327 -26457 -27726 -6189 20260 32369 20434 -5564 -25166 -25991 -7975 17845
853A7845J1623j3596k6141j9517J105J8605K3564J0096j1224k4451j9920K658
$$ 17845 29468 15872 -10269 -29786 -28681 -10076 13488 23584 12360 -12091 -32011 -29353
865b9353K1467K3576P138q509k2442j7167R79K1627K3580O892j2948k0993j5434
$$ -29353 -7886 15690 22828 14319 -8123 -25290 -24311 -2684 20896 27788 14840 -6153 -21587
878b1587J909J9561K1044P793j3251k2438j4365N118J8878J8621N958j0765k2660
$$ -21587 -19678 -117 20927 28720 15469 -6969 -21334 -16216 2662 21283 27241 16476 -6184
891f184j3544N356J9438J7372N099j0828k0018j3954K998J8605J9206K934j3727
$$ -6184 -19728 -14372 5066 22438 27537 16709 -3309 -17263 -14265 4340 23546 26480 12753
904A2753k0459j1344L447J6362J7870K751j3101j9978j1007M103J6428J5618L554
$$ 12753 -7706 -19050 -15603 759 18629 21380 8279 -11699 -22706 -18603 -2175 13443 16997
917A6997j0985j8597j2272N477J7997J4892K353r996j8306j0612N598J7389J4319
$$ 16997 6012 -12585 -24857 -19380 -1383 13509 15862 5866 -12440 -23052 -17454 -65 14254
930A4254L885j2686j6389q318M988J4799J5261L436j2669j7244p878N413J5350
$$ 14254 18139 5453 -10936 -19254 -14266 533 15794 19230 6561 -10683 -18561 -13148 2202
943B202J4611K583j2263j5112q683P595J6370J2161j214r918j3127p653N347J5174
$$ 2202 16813 19396 7133 -7979 -16662 -9067 7303 19464 18250 8332 -4795 -12448 -7101 8073
957H073J3639k115j2625j4145o532P937J4162Q752K05j3034j4813m441Q223J2613
$$ 8073 21712 19597 6972 -7173 -13705 -5768 8394 17146 17351 4317 -10496 -14937 -6714 5899
971E899R607n57j1468j4670m152Q386J4420P426k602j1180j0381m176O237J2625
$$ 5899 15506 14949 3481 -11189 -15341 -6955 7465 14891 12289 1109 -9272 -13448 -7211 5414
985E414R317l223j2114j0013j251O266J0863P448k392j0553r221j559O660R676
$$ 5414 14731 11508 -606 -10619 -11870 -5604 5259 12707 10315 -238 -9459 -11018 -4358 5318
999E318N753j994p476r290k870P404J0575M109l208o794p472k289N128R107N314
$$ 5318 11071 9077 1601 -7689 -10559 -3155 7420 11529 8321 1527 -5945 -8234 -3106 6001 11315
1014A1315k650q499o811j090N221O857M865k162p997o988j29N098N968M365j263
$$ 11315 8665 166 -6645 -7735 -2514 4343 9208 7046 -951 -7939 -8068 -2970 2998 7363 6100
1029F100o631o508j640N835P115L282l434n557l965j461L570O709L923k455n790
$$ 6100 -531 -7039 -8679 -2844 4271 7553 4119 -1438 -5403 -6864 -3294 3415 7338 4883 -907
1044i07m623j084M388O227L194j721n790m352O4N296L965J532Om596n081j137
$$ -907 -5530 -6614 -2226 4001 7195 5474 -316 -4668 -4604 692 4657 6189 6195 1599 -3482 -4619
1060d619M953O482J031m056l635k391m1K939M418J538l216m046k427J276L417
$$ -4619 334 6816 7847 3791 156 -2235 -2276 663 5081 6619 3403 -643 -3070 -1794 1623
1075A623K625O3j887l998j400J443K440J741m70j697j581k155P99L306K351j502
$$ 1623 4248 4311 2424 -1574 -2974 -1531 909 2650 2180 483 -1098 -3253 -2454 852 3203 1701
1091A701l611K2J049L34J022J047j341j194m49N12J572P76r10n66j263j23J005
$$ 1701 -1910 -1888 -839 -505 517 1564 223 -971 -1420 -908 664 1440 530 -36 -1299 -1422 -417
1108d17K370P1j760r06k68K126k81K152j689k12j140o21J425K525l99o83l075
$$ -417 1953 2024 264 -642 -910 1216 935 3087 1398 1186 46 -575 850 3375 2976 2293 -782
1125g82j71K77K966J976k43k201k582j29N89J766K671J914l177o741J78K866L486
$$ -782 -953 -676 2290 4266 4023 1822 -760 -889 -300 1466 4137 6051 2874 -3867 -3689 -823 2663
1142B663J718j591k977k698j598K510M414K305r10m756l822J85L490L758K116
$$ 2663 4381 2790 -187 -2885 -4483 -1973 2441 4746 3836 -920 -4742 -4557 -1067 2691 4807
1157D807j603n400l165N27M029K840K603k220l641n238m84M736O767J235m393
$$ 4807 3204 -2196 -5361 -4834 -805 2035 4638 2418 -1223 -6461 -6945 -2209 4558 5793 1400
1172A400l927k672p86K818O797L248m241n520l289O56M503N197K071k636n845
$$ 1400 -2527 -5199 -5985 -3167 3630 6878 2637 -2883 -6172 -5516 -1013 4184 6255 3619 -2226
1187b226m983J031N772L950J859j682p133l843P56N478N135K574k914o206l528
$$ -2226 -7209 -6178 -406 3544 5403 3721 -3412 -7255 -6499 -1021 4114 6688 3774 -2432 -5960
1202e960M99N620M917M944m259o646n515J099N422P596K802m093p750n662K251
$$ -5960 -5461 159 5076 10020 5761 -885 -6400 -5301 121 7717 10519 6426 -1324 -6986 -4735
1217d735M869P717J848l377q486n300K06P255Q971J498n493q252n547J137P920
$$ -4735 134 7851 9699 6322 -2164 -7464 -7258 -3 8968 10466 4973 -3279 -8826 -7689 231
1232B31R273J787n515j0513o232K137Q754Q060K721o221j1434n893L300Q826Q699
$$ 231 9504 11291 5776 -4737 -10969 -8832 -78 7982 10703 4482 -6952 -12845 -9545 -719 7980
1247G980J356p029j0117o722K820J0282J0312R96q582j0126m551L352R884R678
$$ 7980 9336 2307 -7810 -14532 -11712 -1430 8882 9878 1296 -8830 -13381 -10029 -145 9533
1261I533J924r229j1351n266M745J0927R458K75q475j0980n311N990J1909Q404
$$ 9533 11457 2228 -9123 -14389 -9644 1283 10741 11016 2541 -8439 -13750 -7760 4149 12553
1275A2553j334q025j0619n725N924J2082R005j620j0003j0506l159N579J0851
$$ 12553 11219 3194 -7425 -13150 -7226 4856 13861 12241 2238 -8268 -11427 -5848 5003
1288E003Q195k83j0485j1903k811P060J0762P246j127j0470j1355l328P053J1653
$$ 5003 13198 12915 2430 -9473 -12284 -5224 5538 12784 11657 1187 -10168 -13496 -6443 5210
1302E210O705k621r885j0011l632O172J1883P949j042j1791j1042q82O571J1307
$$ 5210 11915 9294 -591 -10602 -14234 -8062 3821 11770 10728 -1063 -12105 -12987 -6416 4891
1316D891Q280k498j2425r973k683Q123J1299O963k304j0109j1802k274Q573J1686
$$ 4891 13171 10673 -1752 -11725 -14408 -6285 5014 11977 9673 -436 -12238 -14512 -5939 5747
1330E747O966k454j0659j0591l300Q226J2911Q061m088j1798r982j574P480J2387
$$ 5747 12713 10259 -400 -10991 -14291 -6065 6846 14907 10819 -979 -10961 -12535 -5055 7332
1344G332P511l601j1994j1215j489Q935J2570O649m248j1720j1003k268R710J3694
$$ 7332 14843 11242 -752 -11967 -13456 -4521 8049 14698 10450 -1270 -12273 -14541 -4831 8863
1358H863N908n031j2272j0704j226R996J3435N786o178j2501r417m22R504J3152
$$ 8863 14771 9740 -2532 -13236 -14462 -4466 8969 14755 8577 -3924 -13341 -13763 -4259 8893
1372H893O262n210j3913j0710Q13J2213J1874M865o737j2561r240m48J1569J2008
$$ 8893 15155 9945 -3968 -14678 -13865 -1652 10222 15087 8350 -4211 -13451 -13899 -2330 9678
1386I678M920o433j2827q899K96J0805J2980N417q407j3639q203J834J0777J2672
$$ 9678 14598 8165 -4662 -13561 -13265 -2460 10520 15937 7530 -6109 -14312 -12478 -1701 10971
1400A0971L899p506j3352r481K055J2492J2199K341q238j2428q727K477J2377
$$ 10971 14870 7364 -5988 -15469 -13414 -922 11277 13618 5380 -7048 -15775 -13298 -921
1413i21J1994J975q010j2350q383K430J2208J1930K779q934j3723o386M209J0844
$$ -921 11073 13048 5038 -7312 -15695 -13265 -1057 10873 13652 4718 -9005 -15391 -11182 -338
1427c38J0834K810q550j3244p177M989J1897J0564J585q762j2305o409M139J1988
$$ -338 10496 13306 4756 -8488 -15665 -10676 1221 11785 13370 4608 -7697 -14106 -9967 2021
1441B021J0887N52r096j1162o690M102J1804J0848J249r804j1857o046N289J1133
$$ 2021 12908 13460 4364 -6798 -13488 -9386 2418 13266 14515 4711 -7146 -13192 -7903 3230
1455C230R547J349q418j2942o444N191J2169R887J16r393j2558n494N107J2007
$$ 3230 12777 14126 5708 -7234 -13678 -8487 3682 13569 13685 4292 -8266 -13760 -8653 3354
1469C354R660o4r705j2275n054M664J2367R824q4j0790j2406m514O543J1351R490
$$ 3354 13014 12950 3245 -9030 -14084 -9420 2947 12771 12687 1897 -10509 -15023 -8480 2871 12361
1484A2361p21r881j2065n069O383J2764R041j612j0533j0963m373O869J2737Q609
$$ 12361 11640 1759 -10306 -15375 -8992 3772 12813 11201 668 -10295 -14668 -7799 4938 13547
1498A3547k807j0242j0700l665P321J1603Q864k064j1336j1310k573Q777J0624
$$ 13547 10740 498 -10202 -13867 -6546 5057 13921 11857 521 -10789 -13362 -4585 6039
1511F039P100k300j0287j0835k040P797J1461O758l545j0306r740j774P372J1181
$$ 6039 13139 10839 552 -10283 -12323 -4526 6935 13693 10148 -158 -9898 -11672 -4300 6881
1525F881N913l485j1586p420j100O564R936N423l227q790j0087M68Q084R286N908
$$ 6881 12794 9309 -2277 -9697 -10797 -4233 5703 11126 7899 -891 -10978 -10510 -2426 6860 12768
1540A2768n445p217r635k052Q380R775M117k903r643r391J104O686J0062M862
$$ 12768 7323 106 -9529 -11581 -3201 6574 10691 7788 -1855 -11246 -10142 -3456 6606 11468
1554A1468m389r447p393L48O706Q848N696m720r314q310J128P676Q835L655l804
$$ 11468 7079 -2368 -9761 -9413 -2707 6141 11837 7117 -2197 -10507 -9379 -1703 7132 10787 6983
1569F983q537q432O56P348R359K632m297q603n423n94O984R234L652m284r482
$$ 6983 -1554 -9986 -9330 -1982 7377 10009 5712 -2891 -8314 -8908 -1924 7310 10962 6678 -2804
1584b804o030J54P288Q399M009m622q381p699J284Q399Q014K407m291q701o379
$$ -2804 -8834 -8680 -1392 7007 11016 6394 -1987 -9686 -8402 -3 8011 10418 6127 -2574 -8953
1599h953J654P559Q320J793m658q688n824J405P439Q495J424n259q724m309J977
$$ -8953 -7299 260 8580 10373 5715 -2973 -8797 -7392 47 8542 9966 4707 -4017 -8326 -6349
1614f349P171P491J928n645q271n233K801P993O616N60n163p468m734K264P778
$$ -6349 822 8313 10241 4596 -3675 -8908 -6107 1886 8502 9062 3899 -3569 -8303 -6039 1739
1629A739O610K06o137o791m074K888P095O264o5n855p251k544L032O515M917N27
$$ 1739 8349 8555 2418 -4373 -8447 -5559 1536 7800 7735 1880 -5371 -7915 -4883 1632 6549 7076
1645G076n342p072k998L833O496M416l90n366n405k227K846N807M619o35m765
$$ 7076 1734 -5338 -8336 -4503 1993 6409 6019 653 -4752 -6979 -4133 1674 6293 5658 893
1660H93n924j252K545N369M369q80n202m338j435K801M710L461j12m009n170j039
$$ 893 -5031 -6283 -3738 1631 6000 5120 -82 -4420 -5855 -3054 1656 5117 5005 996 -4174 -5213
1676e213K674M828K866j066l132m312j592K406M870K932j016l971l492j720K358
$$ -5213 -2539 2289 5155 4089 957 -3355 -4947 -2541 2329 5261 4245 274 -3218 -4938 -2580
1691b580M139L166m52m273l604o94K354L651K772M37m458l818j816K506M354K916
$$ -2580 1559 4725 4273 0 -3604 -4298 -1944 1707 4479 4916 458 -3360 -5176 -2670 1684 4600
1707D600j620l385k246j478J787M848K272j183m262k032j065K239L297K251q44
$$ 4600 2980 -405 -2651 -4129 -2342 2506 4778 3595 -667 -2699 -3764 -1525 1772 4023 3179
1722C179m089k810k10K464L350J543j084l131l186MK644L543Q33j287k538k868
$$ 3179 -910 -3720 -3930 -1466 1884 3427 2343 -788 -3974 -3970 -1326 2217 3050 1763 -775 -3643
1738c643M5K417L019J152j642l037j831J275J815J964J153j776k796j504J116
$$ -3643 -3598 -1181 1838 2990 1348 -1689 -3520 -2245 -430 1534 2687 911 -1885 -3389 -2273
1753b273K353J842j85j072k231j375M87K352K124n26j764j567n43P10J403J787
$$ -2273 80 1922 1737 665 -1566 -2941 -2454 -102 2022 1496 -268 -1835 -2378 -1668 -265 1522
1769A522q47j884q23R9Q93J378J80j11j206r17j98J465J325o61l52m12j053k43
$$ 1522 675 -1209 -2032 -1933 -1040 338 518 407 -799 -1716 -1914 -449 876 215 -137 -549 -1602 -1845
1787a845J145J343l73j091o04L39Q63L98j74J79q53p39N09J297Q74m69j501j65
$$ -1845 -700 643 270 -821 -1425 -1086 -223 175 1 180 -673 -1412 -903 394 1268 799 -702 -867
1805h67o09R78m33J319m44k173K473k056J451M41J51m40o01n90r4M73L197j166
$$ -867 -1476 -498 -931 388 -56 -2229 244 -1812 -361 80 231 -209 -810 -1400 -1494 -1021 2176 1010
1823A010k042O4p65J27k38L142q46j595j488Q76P13n02J047J349j643j994P54
$$ 1010 -1032 -968 -1733 -1606 -1844 1298 452 -1143 -2631 -1755 -1042 -1544 -497 852 -791 -2785 -2031
1840b031J795J066j197N86K16j997J22j324L120Q23k72j947o1m54R13J008J121
$$ -2031 -236 830 -367 219 435 -1562 -1440 -2764 356 1179 907 -1040 -1101 -1555 -642 366 1487
1857A487n34j216j634l02J131J778J177R0k194k058n45J731J887J437p44j713
$$ 1487 953 -263 -1897 -2199 -1068 710 1887 1977 -217 -2275 -2820 -1089 798 2235 1491 -222
1873b22j967o61J813K825Q51n90k065j963o69J120K571J951j084k866j616j171
$$ -222 -2189 -2850 -1037 1788 2639 2049 -16 -1979 -2648 -1528 1043 2994 1910 -956 -2572 -3743
1889c743J703K213K295p41j986m088K8K541L861J360k422k274l810P93K386L662
$$ -3743 -2040 173 2468 1727 -259 -4347 -4319 -1778 2083 3443 1021 -1253 -5063 -4270 -1884 1778
1905A778K592j668m260l259j1L098L696J869l006l661j947k28L105M799J415j894
$$ 1778 4370 2702 -1558 -4817 -4828 -1730 1966 3835 829 -2832 -4779 -5007 -1902 2897 4312 2418
1921B418l783l848J682L028L734M37j952l438l073Q09M835K090J721j656n772
$$ 2418 -1365 -5213 -3531 -503 3231 3668 1716 -1722 -4795 -3986 849 2939 4660 3004 -2768
1936b768k767L481K530K968J910k794o064k067J412M372L774Q53k968m789l164
$$ -2768 -5535 -2054 476 3444 5354 2560 -3504 -5571 -4159 213 3987 4840 1872 -2917 -6081
1951f081K907M378L706L41l802m375l772M592K485M357K38l398m100j576n05M727
$$ -6081 -3174 1204 4910 5251 1449 -2926 -6698 -2106 379 4736 4974 1576 -2524 -4100 -4605 122
1967A22K862K417n046l777k233O54M423L196K419l588n363j806R25M332M965R75
$$ 122 2984 5401 355 -3422 -5655 -5001 -578 2618 5037 1449 -3914 -5720 -4795 -463 4502 5477
1983E477n635n243R77R08N022L112L85l895n522j983L738L636L131J306m002n156
$$ 5477 -158 -5401 -4424 -3516 1506 4618 5003 1108 -4414 -6397 -2659 977 4108 5414 1412 -3744
1999c744k625L323M002M725j07m989n002k455M433N947K508j532m682m068j615
$$ -3744 -6369 -3046 956 5681 5574 585 -4417 -6872 -2439 3508 6016 4484 -198 -4266 -5881
2014e881K918N816L296J36n938m477k208M019M640L979j160n075n630j042L490
$$ -5881 -2963 2853 6149 6285 347 -4130 -6338 -2319 2321 6300 5140 65 -5565 -6607 -3117
2029c117O210J947j265l955n807j095L661O555K944j647n534m678j222M309N796
$$ -3117 3093 5040 3775 -180 -5987 -7082 -3421 3134 6078 4431 -1103 -5781 -7003 -2694 3102
2044C102K412j704n130n416n24M825N247K824j511o139m822m1M458N997K582k217
$$ 3102 5514 3810 -1320 -6736 -7260 -2435 2812 5636 4125 -2014 -6836 -6877 -2419 3578 6160 3943
2060C943n162m710Q4M578N620K826k688n736l756k40M187N745K957k979o613m246
$$ 3943 -1219 -5929 -5845 -1267 4353 7179 4491 -1245 -5001 -5241 -1054 4691 7648 4669 -1944 -6190
2076f190Q50M767N614J413k331n826m081J57N605N418J457l034n548m104Q71M668
$$ -6190 -5340 -573 5041 6454 4123 -1703 -5784 -5627 -22 5396 6853 3819 -1729 -5833 -4962 -294
2092b94N643K226l674n694m227J288M659N080J866l867n786l958J489M616M953
$$ -294 5349 7575 3901 -1793 -6020 -4732 -73 5007 6873 3006 -2780 -6738 -5249 -633 4320
2107D320J748l462n535l996J399N789N069J27k658m630l448N27M649O217K26l960
$$ 4320 6068 2606 -2929 -6925 -5526 263 5332 5459 2801 -1829 -5277 -4750 -101 6116 6342 2382
2123B382m745l149J441M884M035J606m044n240l034J403M780M976J347m239n617
$$ 2382 -2363 -5512 -4071 813 4848 6454 2410 -2830 -5864 -4461 319 5295 6642 2403 -3214
2138c214k774J692O062M752k73l449n130l187J734N169N478K21m595n544k604
$$ -3214 -5988 -4296 1766 6518 6245 2796 -2334 -5521 -3787 1382 6860 7081 2486 -3058 -5662
2153e662J987N416M372n7m412n481k667K903N180L633L6m439m921k059K862M921
$$ -5662 -3675 1741 6113 6056 1644 -3837 -6504 -3601 1579 5212 5248 809 -4112 -6171 -3309 1612
2169A612M930l64n714m387j700K430N523K167J551n342n827j72J176O172M155
$$ 1612 6542 6178 464 -3923 -5623 -3193 2330 4497 6048 706 -5121 -5293 -4117 2055 6210
2184F210k25m701n376j900L817L912M137j292m294l331r38J360P556J718j591
$$ 6210 5985 1284 -4092 -5992 -2175 1737 5874 4582 288 -3043 -3981 -2621 4935 6653 5062
2199E062m052m067m39K739M744R00J142n355m430j32K282M545K346q18m884l919
$$ 5062 1010 -3057 -3496 -757 3987 4887 6029 674 -3756 -3888 -1606 2939 5285 4467 -417 -4336
2215d336o20L651M595K145j259l636m665l93L067N094J987k303l592l766o8K528
$$ -4336 -4956 -1305 3290 5435 4176 540 -4125 -4518 -1451 3643 5630 3327 -265 -4031 -4099 -1571
2231a571M724L123k554m276l791R7K733L883K729j601m047m092l02L546M476J293
$$ -1571 3153 6276 3722 -554 -4345 -4248 -1515 2368 5097 3496 -551 -4643 -4945 -1399 3077 4370
2247D370q05m717k676p84K619N754J689k226m142k914R4L688L238J023p67m354
$$ 4370 3565 -1152 -3828 -4612 -1993 3761 5450 3224 -918 -3832 -3738 -50 3188 4211 3444 -910
2263i10m410J385L680L247K104k176m646l984J828L451M473j26j787k477m502
$$ -910 -5320 -3935 -255 2992 5096 2920 -1726 -5710 -3882 -431 4042 3916 2129 -348 -4850
2278d850J315L824K622K124k081l468k749J196J971M007L48k222m077j920N57
$$ -4850 -3535 289 2911 5035 2954 -514 -3263 -2067 -96 3911 4259 2037 -2040 -3960 -3403
2293c403L266K906O02k125l575k116J040M371J887Q50k268l379j442Q29K445L728
$$ -3403 -137 2769 3371 1246 -2329 -4445 -3405 966 2853 3703 1435 -1944 -3386 -2557 -112 3616
2309C616o92k347k982j485J245L769K110m0l777M63l581J480J155L658M79j682
$$ 3616 2924 577 -2405 -3890 -2645 1124 3234 3194 -583 -120 -3701 -2221 -1066 2592 3071 1389
2325A389m135j603K344K053L480q82j980k867q51P73L496J877m53k466k386p05
$$ 1389 -2746 -4349 -2005 48 3528 2646 666 -2201 -3052 -2279 1217 3094 2641 175 -2211 -2916
2341b916J343K445K197n4k832k536q23J773K639J355l81j816k300j313J796K709
$$ -2916 -1573 872 3069 3015 183 -2353 -3176 -1403 1236 2591 2210 394 -1906 -3219 -1423 1286
2357A286J918j126j366k317o03R78K839J734o42k575k041k24J252K176J206k38
$$ 1286 3204 2078 712 -1605 -2208 -1230 1609 3343 2701 126 -1915 -2139 -887 1289 2495 2257
2373B257k253k294l10J113K193J419q80j481k230m35J666K350R03p01j862j913
$$ 2257 4 -2290 -2600 -1487 706 2125 1245 -236 -2466 -2901 -1235 1115 2018 1317 -545 -2458
2389b458J63J301J818R95o12j824j988K25J398J853O45n55j779j867N11J738J742
$$ -2458 -2295 -994 824 1819 1207 -617 -2605 -2380 -982 871 1516 961 -818 -2685 -2174 -436 1306
2406A306K21p46j540j525R07J270J858K15j045j701j119J110J076J639L26j214
$$ 1306 1527 781 -759 -2284 -1377 -107 1751 1966 921 -780 -1899 -789 287 1926 2252 1038
2422A038k399K36K90J126J822m41n07j409j284P12J736J161o59r14p39p25O5J320
$$ 1038 -1361 -1125 -835 291 2113 1672 1165 -244 -1528 -816 920 2081 1422 508 -231 -956 -891 429
2440D29J709r51o38j362jM49R51O25L37j170j100r07J635M67J001q63p20n34j142
$$ 429 2138 1187 549 -813 -814 -365 586 1211 1548 378 -722 -1629 6 473 1474 611 -109 -643 -1785
2459a785R61K626j646q4r2j067M11L98J026L08J64j688m66o47J494J178J48j336
$$ -1785 -824 1802 156 72 -20 -1087 -676 -278 748 1056 1220 -468 -934 -1581 -87 1091 1239 -97
2477i7n96J51J52J188m12J136q81p96n4M38L34Q93J13j459n3k44L02K76R56o20
$$ -97 -693 -542 -390 798 386 1522 641 -155 -209 229 563 1456 1569 110 57 -187 115 391 1347 727
2497G27n72m17nN71O99J21o48K24j001J06O5J599o50m7r51L43j64j86J206m23
$$ 727 155 -262 -267 304 1003 1124 476 700 -301 -195 -130 1469 819 772 -179 164 0 -186 1020 597
2517E97j145J078j651Q49J217M86j486k16O42j376L61P93J093p27k53j037j02
$$ 597 -548 530 -1121 -272 945 1431 -55 -271 371 -1005 -644 149 1242 515 262 -775 -877
2534h77N44J157M13j11j615n46k57J254P11K91j57l77j609N9J156O70M00j01j143
$$ -877 -333 824 1237 1126 -489 -1035 -1292 -38 673 964 807 430 -1179 -1120 36 706 1106 1005 -138
2553a38j101L75R63J138N66o59j085j565J117K00K415o8j021j025j003M31J713
$$ -138 -1239 -864 99 1237 1803 1144 59 -1506 -389 -189 2226 2158 1137 112 -891 -460 1253
2570A253Q33q14m91j409l53J009Q31R63j78j065j250p46J269R70J369J13j300
$$ 1253 2086 1272 781 -628 -981 28 859 1822 1644 579 -671 -1417 -148 822 2191 2304 1004
2587A004j495n14O84P67J787k07j379j942q0L02J879J431q39p73j691l67J502
$$ 1004 -491 -1005 -321 446 2233 2026 647 -1295 -1375 -1073 806 2237 1398 625 -1066 -1433 69
2604F9J645r54R99j811j815J50R72J558J179m13j823j237k18J512J174J288m07
$$ 69 1714 760 1759 -52 -1867 -1717 -745 813 1992 1579 -244 -1481 -1699 -187 987 2275 1868
2621A868j554k517K63K133J472Q04r69k139j629K17J128K591N83o18j994j296
$$ 1868 314 -2203 -1940 193 1665 2469 1500 -639 -2268 -2051 -923 1668 2251 1633 -361 -1657
2637a657p1J513J902J106j014k372j220M12J180K040Q53r28k134j347j30J801
$$ -1657 -1728 -215 1687 2793 1779 -593 -1813 -1401 -221 1819 2672 1744 -390 -1737 -1867 -66
2653f6J882Q75j179k010j462o3K143J902J16j285j556j230m9J866K068J077j483
$$ -66 1816 2691 1512 -498 -1960 -2023 120 2022 2138 853 -703 -1933 -1982 -116 1952 3029 1546
2670A546k300j199L85K051J678N55j182k314j337M76J931K003L43j548k122j195
$$ 1546 -754 -1953 -1568 483 2161 2716 1534 -780 -2117 -1641 290 2293 2636 1088 -1034 -2229
2686b229P69K127K006j9j334k490q46O06K061K125J21j816k092p00O88J799K201
$$ -2229 -1460 667 2673 2654 1320 -1170 -2016 -1410 651 2776 2897 1081 -1011 -1711 -1023 776 2977
2703B977J9j571k331j889J392K335J934k23j898k169r29R25K146J676J92k265
$$ 2977 2996 1425 -906 -2795 -1403 932 2866 2643 745 -1424 -2353 -1428 718 2394 2586 321
2719C21j719m50O28K292J704k96j729k059p22J835J188J501n62n71k869j374K322
$$ 321 -1398 -1848 -1220 1072 2776 2480 751 -1308 -2030 -195 993 2494 1932 1361 -1508 -2882 -560
2736e60K263J633q26j684k891r27J704K918J611N01l840j951o5R08K219J372R61
$$ -560 1703 3336 2510 826 -2065 -2992 -1288 1630 3241 3742 -98 -2049 -2114 -1206 1013 2385 3346
2753C346k454k236j253Q84L332Q76l10l62m457O45O10M046M06q44k143k422k11
$$ 3346 892 -1344 -2597 -1713 1619 2495 2185 1823 -2634 -1989 -1379 2667 3073 2229 86 -2336 -2547
2770b547J073L752L71Ol964j196J02K905P86L33J184l447j121L99J261K620r6
$$ -2547 -1474 2278 2649 2655 -1309 -2505 -2403 502 1288 1621 2805 -642 -1763 -1364 -103 2517 2421
2787B421K32k651l378J576K39L382Q23j933k247r85R79J285K970N20j068k263
$$ 2421 2653 2 -3376 -1800 -1561 1821 2644 711 -1536 -2521 -1542 -257 2713 3233 2165 -98
2803i8k378J18K628J836R77j057k400k253O59K444K293Q13j711k360k335K99L357
$$ -98 -2476 -2358 270 2106 3083 2026 -374 -2627 -1968 476 2769 3582 1871 -489 -2824 -2525 832
2820H32J013J159j165j867k599J285J718K448O24k183k123j496L76J986K248L16
$$ 832 1845 3004 1839 -28 -2627 -1342 376 2824 3448 1265 -858 -2354 -1978 8 2256 2572
2836B572j114k540j842J621J891K287k5j353k940p99J220J715J658L42j692k748
$$ 2572 1458 -1082 -2924 -1303 588 2875 2850 1497 -1443 -2242 -1022 693 2351 2693 1001 -1747
2852a747j077J374J476K427J38j522k352j189J397J781J646N89k253j883j467
$$ -1747 -2824 -1450 26 2453 2591 1069 -1283 -2472 -1075 706 2352 2941 688 -1195 -2662
2867b662J003K503J933N6j946k077j146O65K410J712M1k315j740j081R15K102
$$ -2662 -1659 844 2777 2833 887 -1190 -2336 -1671 739 2451 2492 177 -1563 -2644 -1729 373
2883C73J687r5j397k199n21O19K659J398n64j174k271j045J173L085R39r35j330
$$ 373 2060 1965 568 -1631 -2152 -1533 1126 2524 1960 786 -1485 -2530 -1357 1728 2667 1732 402
2900D02j978q69J433K380J801m70k071k304m18J231K415J139o66j935k260M82
$$ 402 -1576 -2445 -1012 1368 3169 2699 628 -1676 -2094 -863 1552 2691 2025 90 -2170 -1688
2916a688J794J420J105j525j521k057P56J882J578O96r19j437j880p39J831J491
$$ -1688 106 1526 2631 1106 -415 -2472 -1716 166 1744 2440 1521 84 -1796 -2535 -704 787
2932G87J697j610j839o55l74J026K419N95r31j708k127N64J462K217J998l589
$$ 787 2484 874 -965 -1620 -1994 -968 1451 2046 1115 -593 -2720 -2156 -694 1523 3521 -68
2948f8P37k039o16J419K061R14J59k788k204J251M12K341J984l065j644j227l55
$$ -68 669 -1370 -1986 -567 1494 2408 2567 -221 -2425 -1174 -762 1579 3563 498 -1146 -2373 -2728
2965b728J650J674J273J359m374l26P40N94K476m50l46k742N14J21J270J476j37
$$ -2728 -1078 596 1869 3228 -1146 -1472 -732 -138 2338 1888 1542 -1200 -686 -565 705 2181 2044
2982B044j901r33o75o1J821L66P88j025j702L6J159R22L28M29m85k035p90R80
$$ 2044 143 -790 -1465 -1526 295 661 1449 424 -1278 -1242 -83 839 1167 1596 1111 -924 -1714 -734
3000g34l57K013O46j369j812n96J481J004R96J59k106k01j625J548J269L25Q15
$$ -734 -1091 922 1568 199 -1613 -2209 -728 276 1272 1431 -675 -876 -2501 -953 316 641 1456
3017A456j946O45j794J298j20K805j077q86j07j260K186p42J042l54j348R99j791
$$ 1456 -490 155 -1639 -341 -461 2344 1267 381 274 -986 1200 458 1500 1146 -202 797 -994
3034i94K92J908q3L38q92o04k44J226N9J597m99k079l08n8L18R21k25Q14j470
$$ -994 -702 1206 1123 1461 569 -35 -279 947 1006 2603 2104 25 -283 -341 -23 898 673 1487 17
3053A7l23m21p8J970j197P82j062n60o95M4K071Q79j422O83k802P92Q67J228O82
$$ 17 -306 -727 -805 1165 -32 750 -312 -872 -1567 -1523 548 1427 5 688 -2114 -1322 -455 773 1455
3072A455r4j865p06P62K29R89P67j431j56q73m11M40J969Q4O30k671j92m1J614
$$ 1455 1361 -504 -1210 -448 -219 770 1537 106 -50 -923 -1334 -894 1075 1159 1789 -882 -1074 -1115 499
3091D99O99Q9l26Mj230j298R34J438j07k0r04NJ057k76N62r9k25k339n01K052
$$ 499 1198 1287 961 965 -265 -1563 -629 809 702 682 -222 -217 840 564 1126 1027 802 -1537 -2038 14
3111A4K96Q52o9j613L27q39J758o20j56J262j858j224R6J438L89k39Q44j046m62
$$ 14 310 1162 1093 -520 -193 -1032 726 106 -50 1212 -646 -1870 -1774 -336 53 -186 658 -388 -850
3130h50o23O70R96n11J044m75O1j866J714O63M46j088j32j056J003l55J257P67
$$ -850 -1473 -803 193 -318 726 251 312 -1554 160 823 1269 181 49 -1007 -4 -359 898 1665
3148A665l80j486L8J37j054J544J079j618L88j276J760l17O22J99r55k82j273
$$ 1665 1285 -201 -163 -26 -1080 464 1543 -75 313 -963 797 480 1102 1301 346 64 -1209
3165a209J329q59J921j398J193j519j174P88Q55p87L079k659l38J02Q10O5L06
$$ -1209 120 -739 1182 -216 977 -542 -1716 -928 -73 -860 2219 -440 -778 -676 134 199 505
3182E05P96j738p37K95m84K420j33j128J12j118J241j574K067O75j188o4r14P81
$$ 505 1301 -437 -1174 -879 -1363 1057 924 -204 -92 -1210 31 -1543 524 1199 11 -53 -967 -186
3200a86N93j026J775j884J437j218K81J058m01J771j670j22n4r1K15M85m70L49
$$ -186 407 -619 1156 -728 709 -509 -228 830 429 2200 530 408 354 263 478 963 493 842
3218H42l88p76n02N97Q63k21k95o11J472k631J083J066j636R63Q1o95J289j01
$$ 842 454 -322 -824 -227 636 415 120 -491 981 -1650 -567 499 -1137 -174 -93 -788 501 400
3236D00J26j043N80q99N50r75M23J350j167K9N81j09j065J888r06J65N75r99l67
$$ 400 526 -517 63 -836 -286 -1261 -838 512 -655 -626 -45 -154 -1219 669 -237 -72 503 -496 -863
3255h63P63R25r4m54p2n43j5k81J411J27l29m29l73O2N33O35m35n36j151J220
$$ -863 -100 825 731 277 205 -338 -353 -634 777 904 575 146 -227 -165 368 1003 568 32 -1119 101
3275A01p38J81J004m72N09m96j438O25l6J269L28K79j136j922J535K41m17J271
$$ 101 -637 -456 548 76 585 89 -1349 -724 -760 509 837 1116 -20 -1942 -407 -166 -583 688
3293F88l43q66l26O92k7L49P52j197l7j86k87J072K08L13j146R41k043j49K176
$$ 688 345 -521 -847 -155 -182 167 919 -278 -315 -501 -788 284 492 805 -341 600 -1443 -1592 584
3312E84M77Q7q99j1q57j462K437o0O18l99j710J332l35Q26n81J277o23j277m69
$$ 584 1061 1148 249 238 -619 -2081 356 296 914 515 -1195 137 -198 628 47 1324 701 -576 -1045
3331a045M71J316M75M34j728m71M28r16M51J483P2j413P5j029J244j64O14M74
$$ -1045 -574 742 1217 1651 -77 -548 -120 -1036 -585 898 970 -443 -368 -1397 -153 -317 297 771
3349G71o56o76L40n49J419J115n68k271j57O6R59R29j66j03j576L65L78M22R33
$$ 771 115 -561 -221 -770 649 1764 1196 -1075 -1232 -1166 -207 722 556 453 -1123 -758 -380 42 975
3368I75O18j159j373r8Q70O16N59N1m85q60o12k42O78J262q1m12q32o16m64J279
$$ 975 1593 434 -939 -1037 -167 449 1008 1059 574 -286 -898 -1140 -462 800 719 307 -525 -1141 -1605 -326
3388c26M75P71j188m73j04n79P12R58O01l4j425q01Q22K88J369M87q36o25n52
$$ -326 149 920 -268 -741 -845 -1424 -712 246 847 813 -612 -1413 -591 -303 1066 1553 717 92 -460
3407d60n65Q52J229l8o65r97k50kQ19O55m2M1p40j055M75P50J138R5r12r10l96
$$ -460 -1025 -173 1056 1018 353 -644 -894 -896 -77 578 536 577 -163 -1218 -743 7 1145 1240 328 -582 -978
3428i78N17R71N93n3o76q02p56N09P09P87R6o10j280o80L42J385L68Q8o20r13
$$ -978 -461 510 1103 1050 374 -428 -1184 -675 34 821 917 307 -973 -1653 -1311 74 442 530 -90 -1003
3448a003l64N29P13R23L24j131j069K57J11O08Q81o6o10r38p15P01J300K53J99
$$ -1003 -1367 -838 -125 798 1122 -9 -1078 -821 -710 -102 779 713 103 -835 -1550 -849 451 704 903
3467I03j407p98J00N15J034R00j54p92j291p60J539J358J041j707m34k325R79
$$ 903 -504 -1302 -1202 -687 347 1247 1093 301 -990 -1750 -211 1147 2188 481 47 -2278 -1299
3484a299K117P89j71j318m47r47J8J109L10M77r97L54j089n28R01J007N57l41
$$ -1299 818 1607 1436 118 -329 -1276 -1258 -149 161 638 -359 -5 -1094 -1622 -721 286 843 502
3502E02q12r31K70N29P40O34j67r85o62l57J017j18O19M67o71k86j604K161M31
$$ 502 -310 -1241 -971 -442 298 932 765 -220 -882 -1239 -222 -340 279 746 75 -211 -1815 346 777
3521G77L28j221l27r18L46O28J326l4j49p45j016O4J407j88Q56m81o86j885P5
$$ 777 1105 -116 -443 -1361 -1015 -387 939 905 756 11 -1005 -941 466 278 1134 653 -33 -1918 -1843
3540a843J325J544N49j370j201j100J826m16R27O26j126q0j204K64R17K01M9j04
$$ -1843 -518 1026 1575 205 -996 -2096 -270 -686 241 867 -259 -339 -1543 -1279 -362 -161 -112 -216
3558b16p99q1J57O57R50L17r09j133J39L1Q94R12j6o02j193l60O54P78P91l30
$$ -216 -1015 -1096 -939 -282 668 985 76 -1057 -918 -887 7 919 903 301 -892 -1252 -598 180 971 641
3578F41r22k71m93O20P18P80L71j032r24J43K0P87O86Q2q07q22j34K78P47N63
$$ 641 -281 -552 -1045 -425 293 1073 1444 412 -512 -369 -349 438 1124 1206 399 -423 -557 -279 468 1031
3598A031j82n89q09k76L56L81J051j112K74k11j245O81N07N25K50j531k15n25
$$ 1031 849 260 -549 -825 -469 -88 963 -149 125 -86 -1331 -650 -143 382 632 -899 -1114 -1639
3616a639J183J043l8j3o31j840R6J119O79J71m51o37l07j13Q96M53O5Q37m83r86
$$ -1639 -456 587 549 536 -95 -1935 -1839 -720 -41 130 -321 -958 -1265 -1378 -482 -29 36 873 390 -596
3636e96k3J200J09N66p43j023l6K80K28N87O25n87l75p96Q13L26k61Q84o86l47
$$ -596 -619 581 690 1256 513 -510 -546 -266 -38 549 1174 587 212 -584 229 555 294 1178 492 145
3656A45j022N42q89J536j91N84j176p98N36O59M60J82l87k36o78r97R32J485L34
$$ 145 -877 -335 -1224 312 121 705 -471 -1269 -733 -74 386 568 181 -55 -733 -1730 -798 687 1021
3675A021j708J06m75l11J458M93o26j056K10j06O04L70K86k27l47l07r74L43J224
$$ 1021 -687 -581 -1056 -1367 91 584 -42 -1098 -888 -994 -390 -20 266 39 -308 -615 -1589 -1246 -22
3694b2J228l14k000Q42j728J752O11l51R72j63j178o72M36J008N61m49k51q92
$$ -22 1206 892 -1108 -266 -1994 -242 369 18 990 827 -351 -1023 -587 421 982 533 282 -610
3712f10J21J150j666J835o95q85Q11j68o93P89J546j480p11n01J226l63l01P64
$$ -610 -489 661 -1005 830 135 -750 61 -107 -800 -11 1535 55 -656 -1157 69 -294 -595 169
3730A69q0q47J05J36j089J357Q16k50j112N52k93n39J652N45k017N85q51J343
$$ 169 89 -758 -653 -517 -1606 -249 567 317 -795 -243 -536 -1075 577 1122 -895 -310 -1161 182
3748A82j16p04J469m65q81K54p92J313k06N81j676J72Q18j361K024k52J16n90
$$ 182 66 -638 831 366 -515 -261 -1053 260 54 635 -1041 -869 -51 -1412 612 360 476 -114
3766a14M16n65N28J18j092K290j627K05n10M47L89o08O08R71j820o81J584o7L45
$$ -114 302 -263 265 383 -709 1581 -46 159 -351 96 485 -123 485 1456 -364 -1045 539 472 817
3785H17j624J422o18l7q14J991j736L62o44K33n72O20O52P38k35j258N08j302
$$ 817 -807 615 -3 -40 -854 1137 -599 -237 -881 -648 -1220 -600 52 790 555 -703 -195 -1497
3803a497J526K16M90r60q9l02l34R26M0J044p61r4j44q02J189M40j327Q82q48
$$ -1497 29 245 735 -225 -314 -616 -950 -24 16 1060 299 205 61 -741 448 888 -439 443 -405
3822d05k44J226j26N98l90o22k19L41l93L08j00N90l18q17O83n53M8O28m65L81
$$ -405 -649 577 451 1049 659 37 -182 159 -234 74 -26 564 246 -571 112 -441 -393 235 -230 151
3842A51j031k79M44M50J06M68m47o91l93N63O57Q81o65m80o87M79p94J053M13
$$ 151 -880 -1159 -715 -265 -159 309 -138 -829 -1222 -659 -2 879 214 -266 -953 -474 -1268 -215 198
3861A98k43m79J75n05P6J41J319P1j183R8o96P87OP85j36j046k75Q49M31p19q59
$$ 198 -45 -524 -349 -854 -778 -637 682 753 -430 -332 -1028 -241 -235 550 414 -632 -907 -58 373 -346 -1205
3882a205J186Km47q05O74L60L54J239j235j479Q95L10M87L89k88j442O59l12O33
$$ -1205 -19 -17 -464 -1269 -595 -235 119 1358 123 -1356 -461 -151 336 725 437 -1005 -346 -658 -25
3901b5l7m30M65J026j245o40K09O63N46n07m36n35q8N11O35m40j03m20n52J374
$$ -25 -62 -492 -27 999 -246 -886 -677 -14 532 25 -411 -946 -1034 -523 112 -328 -431 -851 -1403 -29
3921b9j52N40j56l58J1o93q6N94M4L32L04k64q21K26O57N6l28l37O00k009O40
$$ -29 -181 359 203 -155 -144 -837 -923 -329 -285 47 351 87 -734 -508 149 205 -123 -460 140 -1869 -1229
3942a229J936N40r56l57r06M29j25j18R05J39k8j477L42J01N80M62L92j024N6
$$ -1229 707 1247 291 -66 -972 -543 -668 -786 119 258 230 -1247 -905 -804 -224 238 630 -394 -338
3961c38r42J009j74L81p1J67p42l2o9J420R2j37n51q62J67L52J186j147J74J080
$$ -338 -1280 -271 -445 -64 -135 32 -710 -742 -811 609 701 564 13 -849 -682 -330 856 -291 -117 963
3981I63k789K121j385J977K91j251l46p01J231j013J263l24L47j263k05O49j8
$$ 963 -1826 295 -1090 887 1178 -73 -419 -1120 111 -902 361 37 384 -879 -1084 -435 -453
3998d53M92M95r53m02K0m31J318p61O10m66R9m73j27P24p3O04o28n31O26m46L98
$$ -453 39 534 -419 -821 -801 -1232 86 -675 -65 -531 -432 -905 -1032 -308 -381 223 -405 -936 -310 -756 -358
4019c58k57N46J49l92k17p05N00R18k97J99j142L3J91M37J038k90q72K31K78r89
$$ -358 -615 -69 80 -312 -529 -1234 -734 184 -113 86 -1056 -1023 -832 -395 643 353 -519 -288 -10 -999
4039i99J436l87M06K19j052m51m25J115J73j21k40p17L62J8J080p5K84l10j321
$$ -999 437 50 456 675 -377 -828 -1253 -138 35 -86 -326 -1043 -681 -663 417 342 626 316 -1005
4058a005M63n8P34K10p50j97M92r07L0J031M06m78l06p55M21l48O55O64o75j11
$$ -1005 -542 -600 134 344 -406 -603 -111 -1018 -988 43 449 -29 -335 -1090 -669 -1017 -362 302 -373 -484
4078d84l53j94K52M52k03K06K91p16K89rP64m13N99m44o36j01N40K79M41m76o56
$$ -484 -837 -1031 -779 -327 -530 -324 -33 -749 -460 -469 295 -118 481 37 -599 -700 -160 119 560 84 -572
4099e72L25L87j121Q13K26J31n62k68K29k93J192j244O46j04r87P65j28L33J21
$$ -572 -247 140 -981 -168 58 189 -373 -641 -412 -705 487 -757 -111 -215 -1202 -437 -565 -232 -111
4118a11K48q32L00r4M02K38O77j231n84o2k51J373l42n13Q2M71p77p5J626J37
$$ -111 137 -695 -395 -489 -87 151 828 -403 -987 -1049 -1300 73 -269 -782 -700 -229 -1006 -1081 545 682
4138F82k76r86R88j308R95J494k139M15m39J15k11J022q55N07J94j18k96m95o67
$$ 682 406 -580 408 -900 95 1589 -550 -135 -574 -459 -670 352 -503 4 198 80 -216 -711 -1378
4157a378J768r08m04J206q50n73P43O7J08M53n50l13j65m4O17J80J2m59R8l28
$$ -1378 390 -518 -922 284 -566 -1139 -396 -329 -221 232 -318 -631 -796 -840 -223 -43 -31 -490 -392 -720
4177g20L12J04oj58J41m11K70j57K30q1P4K52o96K68m9P38j54Q9l09J86j37j85
$$ -720 -408 -304 -310 -468 -327 -738 -468 -625 -395 -476 -402 -150 -846 -578 -627 111 -43 46 -263 -77 -214 -399
4199c99M51L33k15M2n49R3K79J03K22J4l44k19r7K02P68n27M5n61l24M48L0K99
$$ -399 52 385 170 212 -337 -244 35 138 360 374 30 -189 -286 -84 684 157 202 -359 -683 -235 -205 94
4221I4m4r3l55p2j2K29J16n8k38M7l96K45J75K85j22j35L6m57q2Q03m11L57o9
$$ 94 50 -43 -398 -470 -482 -253 -137 -195 -433 -386 -782 -537 -362 -77 -199 -334 -298 -755 -837 -34 -445 -88 -157
4244a57k08OR1J13o2J90p6k29m92M76l22P80J473k141N48o79J44q3N72Q59j84
$$ -157 -365 -359 -268 -155 -217 -27 -103 -332 -824 -348 -670 110 1583 -558 -10 -689 -545 -628 -56 803 619
4265F19j168O41l31L11Q8l38Q77j012k2l8n98J718n45n16N57n97Q13o80j63K03
$$ 619 -549 92 -239 72 160 -178 699 -313 -335 -373 -971 747 202 -314 243 -354 459 -221 -384 -181
4285a81l09m23O47p03O38O07o87m95J020o61N35m23l08N97j319R65j14J405l33
$$ -181 -490 -913 -266 -969 -331 276 -411 -906 114 -547 -12 -435 -743 -146 -1465 -500 -614 791 458
4304D58j330J400j276K53N49M60n82j09M39j053N89Q07q62m4R45r02m58O6L48
$$ 458 -872 528 -748 -495 54 514 -68 -177 262 -791 -202 605 -257 -301 644 -258 -716 -650 -302
4323c02P66p28L98r90N12J104r12N15N1j05j012L4k31L79M1J43n55j63J71K62
$$ -302 464 -264 134 -856 -344 760 -152 363 414 309 -703 -669 -900 -521 -480 -337 -892 -1055 -884 -622
4343f22M23R95r42n51J038j263n17R29J845j50j151M01n04p7m2Q7l84J810j398
$$ -622 -199 796 -146 -697 341 -922 -1439 -510 1335 1185 34 435 -69 -146 -188 -101 -485 1325 -73
4362g3p11O81o59K86J260o19m49n72L95Q67J36p7q02J48k14K76J92M49m75j82
$$ -73 -784 -103 -762 -476 784 165 -284 -856 -461 406 542 465 -337 -189 -403 -127 65 514 39 -143
4382a43j40P1P8L7K90J92n48P6q91L29P48m56M69l73k43o00l3O55N68r81R46k63
$$ -143 -283 -212 -134 -97 193 385 -163 -87 -978 -649 99 -357 112 -261 -504 -1104 -1137 -482 86 -895 51 -212
4404b12o79n93J406n22J307o72j020L84j82O29N14J90r97r8R0K69L43j47l66l87
$$ -212 -891 -1484 -78 -600 707 35 -985 -601 -783 -154 360 550 -447 -545 -455 -186 157 10 -356 -743
4424g43l68P58m91J954j88m52q92j24K13L06M7M12K0n42m35o6K3O02N19m27n07
$$ -743 -1111 -353 -844 1110 922 470 -422 -546 -333 -27 20 432 452 -90 -525 -591 -568 34 553 126 -381
4445c81k09j03Q47q6N32o23O69j093K82Q8M48q17R34q63O89o60J64P0j63O14q11
$$ -381 -590 -693 154 68 600 -23 646 -447 -165 -77 371 -446 488 -375 314 -346 -182 -112 -275 339 -472
4466d72n66J157r50J133n81m55l0N30P33M32q72p58M84q06o26j90K499j425O44
$$ -472 -1038 119 -831 302 -279 -734 -764 -234 499 931 59 -699 -215 -1021 -1647 -1837 662 -763 -119
4485a19p5K45k26K1n18J601j254K37o98K56J162j27N4q26n3j085P44O53l95K32
$$ -119 -194 51 -175 -154 -672 929 -325 -88 -786 -530 632 505 559 -267 -320 -1405 -661 -8 -403 -171
4505a71L14l02l37J67K16l93J956j646l95P06n22P9M60N41o30r8M2l89M2L80O72
$$ -171 143 -159 -496 -329 -113 -506 1450 -196 -591 115 -407 -328 132 673 43 -55 -13 -402 -360 20 692
4526F92r27m7p14R7L87M20L29R4p26m46Q66j71l0R24q38M53k61r55O84O0Q82n07
$$ 692 -235 -282 -996 -899 -512 -92 237 331 -395 -841 25 -146 -176 748 -90 363 102 -853 -169 -109 773 266
4548B66m69K68m83J76L75K31k12L7q20M26j042K369o87p41j030L40M63L50m26
$$ 266 -203 65 -418 -242 133 364 152 189 -631 -205 -1247 1122 435 -306 -1336 -996 -533 -183 -609
4567f09M15j74k20K12j077J405K04n91N12n74K92m65M7P72K86R3j126p47P65J19
$$ -609 -194 -368 -588 -376 -1453 -48 156 -435 77 -497 -205 -670 -623 149 435 528 -598 -1345 -580 -461
4587d61P15L26l60m71l88L01K06L95J23m5q08j34R3M76L23nj39j18m38j78J42
$$ -461 254 580 220 -251 -639 -338 -132 263 386 341 -467 -601 -508 -32 291 286 147 29 -409 -587 -445
4608d45N45K67m65k79n3R3K27L44J53k24n46l07K3K93N04J25q3n55j35Q4K66N18
$$ -445 100 367 -98 -377 -430 -337 -110 234 387 163 -383 -690 -667 -374 130 255 172 -383 -518 -434 -168 350
4630C50j36J7r15L1K61K66L49j69J77q30Q8j06O83K78j38l1m40j8k1K56M10k84
$$ 350 214 231 -684 -653 -392 -126 223 54 231 -599 -511 -617 66 344 206 175 -265 -283 -304 -48 362 78
4652G8k4p9m66J05L41J93M61j73p60Q6k59O95K35k18k80j00m74K50L35R1l07N02
$$ 78 54 -25 -491 -386 -45 148 609 436 -324 -238 -497 198 433 215 -65 -165 -639 -389 -54 37 -270 232
4674B32o35J66n91J006l6m05L58l52M7J66k14L60R16j063j2k71M48o06J401j456
$$ 232 -403 -237 -828 178 142 -263 95 -257 -210 -44 -258 102 1018 -45 -57 -328 120 -486 915 -541
4694e41J24O50j41o35j08J217l06l0p31j142J446L50O6r86J554j993J021l65j38
$$ -541 -417 233 92 -543 -651 566 260 230 -501 -1643 -197 153 219 -767 787 -1206 -185 -550 -688
4713f88J541l46m62p0M90j030O95j77L41j38J97j001J29Q80k66l90M31O8m17R7
$$ -688 853 507 45 -25 465 -565 130 -47 294 156 353 -648 -519 361 95 -295 136 204 -213 -116
4733a16j034J616n32L94m9q90j8P44L1m14J30l20k37N63k35P53o64L99K76r85
$$ -116 -1150 466 -66 328 279 -611 -629 115 146 -268 -138 -458 -695 -132 -367 386 -278 121 397 -588
4753e88K97J72M48q4j17k85n2J72K48L65m31n7n50k5P11k38N00k85q96K78m21
$$ -588 -291 -119 329 245 128 -157 -209 -37 211 576 145 88 -462 -487 224 -14 486 201 -695 -417 -838
4774h38J077L19k96M34p75j2n39O52m35K12o44l76J000m17O9L06M58K42j020j25
$$ -838 239 558 262 696 -79 -91 -630 22 -413 -201 -845 -1221 -221 -638 -569 -263 195 437 -583 -708
4794g08L97R60j068M1O87l93n28K95P8M90m07L9l21L39k34j5N84N6k86j00K11
$$ -708 -311 649 -419 -378 309 -84 -612 -317 -239 251 -156 -117 -438 -99 -333 -348 236 292 6 -94 117
4815A17k40K49K90K79m67J30k78j24q0N7M88k89N4l27j12L93m38M18o8l32N35
$$ 117 -123 126 416 695 228 358 80 -44 -124 -67 421 132 186 -141 -253 140 -298 120 52 -280 255
4836B55l72M0K42m05M49k90j69k52N46p7j29N24m56m58K14J32r3L7Q2j04n8p8
$$ 255 -117 -77 165 -240 209 -81 -250 -502 44 -33 -162 362 -94 -552 -338 -206 -299 -262 -180 -284 -342 -420
4858d20J05M36j87M36m92k14R79p74J23N48m40K49P4p54N51n8l9J39J18l07o2
$$ -420 -315 121 -66 370 -122 -336 643 -131 -8 540 100 349 423 -331 220 162 123 262 380 73 11
4879A1J51j6J13k07J83m28M46j02N0j40j88O2Kl25L76J0m4J16o5j87k62J35O2
$$ 11 162 146 259 52 235 -193 253 151 201 61 -127 -65 -63 -388 -12 -2 -46 70 5 -182 -444 -309 -247
4902b47j50L54l84M3J66j13J35j15M14n91KL43L7j20N0o4J00L3M42j96n5O2N1
$$ -247 -397 -43 -427 -384 -218 -331 -196 -311 103 -488 -486 -143 -106 -226 -176 -240 -140 -107 335 139 84 146 197
4925A97K19j21l48R9L93j81J86j74K4O4q37O66J02j07k72J59J83M5o58L64kM43
$$ 197 416 295 -53 46 439 258 444 270 294 358 -479 187 289 182 -90 69 252 297 -361 3 1 444
4947D44j05m14j15K6L42kn69L77j48k26j85N85J8r4k14k42q8M76j10k70N16r1
$$ 444 339 -75 -190 -164 178 176 -393 -16 -164 -390 -575 10 28 -66 -280 -522 -610 -134 -244 -514 2 -89
4969h9l02M41J65p7o7l7l0j76PJ31j70K70L28l64K36n31L69L0N2K57n77L69l56
$$ -89 -391 50 215 138 71 34 4 -172 -165 -34 -204 66 394 30 266 -265 104 134 186 443 -134 235 -121
4992a21o7N26l05J93k28J69p29P57M0J09J1q06J3p8n11p64J840N78m45o25k05
$$ -121 -188 338 33 226 -2 167 -562 195 235 344 355 -451 -438 -516 -1027 -1791 49 627 182 -443 -648
5013f48K25O30Q83m22M88j864k62J339j422J469k70k87j9k10p82R58N73K1m29
$$ -648 -423 207 1090 668 1156 -708 -970 369 -1053 416 146 -141 -160 -370 -1152 -194 379 400 -29
5032b9p79Q90l92j31N80j14N60o14l88l79Q20K47K4j22p3m01K02K38N8l6R8k85
$$ -29 -808 82 -310 -441 139 25 585 -29 -417 -796 24 271 295 173 100 -301 -99 139 197 161 259 -26
5054b6j90k25Q92J98m37L07q05q36J087m73K2Q64l40L73j221J192j458K290l73
$$ -26 -216 -441 451 649 212 519 -286 -1122 -35 -508 -486 378 38 411 -810 382 -1076 1214 841
5073H41j408J076o87J95r87J287l00n04L15o7K09J160j068m52J77m02P4n2L61
$$ 841 -567 509 -178 17 -970 317 17 -487 -172 -239 -30 1130 62 -390 -213 -615 -541 -593 -232
5092b32j385J640p99N65j067J898o59j797K109l74n67J26o13J099L44l27J07Q32
$$ -232 -1617 23 -776 -211 -1278 620 -39 -1836 273 -101 -668 -542 -1155 -56 288 -39 68 900
5110I00j688M64Q84r17P64k99n24N67R7N59j379J309r16M88k56j882K650j104
$$ 900 -788 -324 560 -357 407 108 -416 151 248 807 -572 737 -179 309 53 -1829 821 -283
5128b83N53L79r45K77R2J00L57k60n26J172j243j09O33j18p8k63k82K1P34m00
$$ -283 270 649 -296 -19 73 173 530 270 -256 916 -327 -436 197 79 1 -262 -544 -523 211 -189
5148a89N20j125M82O16j022J336ol4k0m67m87R27n2l04K52m95j95l87p68M47J028
$$ -189 331 -794 -312 304 -718 618 612 578 558 91 -396 531 479 175 427 -68 -263 -650 -1418 -971 57
5169E7K02k91N17l70J47k75P06q69k21n2M21r33L46N25P97m38j92j11J46l81k19
$$ 57 259 -32 485 115 262 -13 693 -176 -397 -449 -28 -961 -615 -90 707 269 77 -34 112 -269 -488
5190d88K44J75M12j036j80N27m23R19L17n01N03J67l82k69O55j089R94k067L29
$$ -488 -244 -69 343 -693 -873 -346 -769 150 467 -34 469 636 254 -15 640 -449 545 -1522 -1193
5209a193M58J115R91j415L81j002M79l45L15O0l00N14l88J611r94j178R21P57
$$ -1193 -735 380 1371 -44 337 -665 -186 -531 -216 -156 -456 58 -330 1281 287 -891 30 787
5227G87n97k13j364O42O50J24K34n78k96k54J221p73J3L27L98P97j677L86O94
$$ 787 190 -23 -1387 -745 -95 29 263 -315 -611 -865 356 -417 -404 -77 321 1118 -559 -173 521
5246E21l64q10n26J192Q64j732J273j091J65M40J87n12p6j50q30J514P32l81j93
$$ 521 157 -653 -1179 13 877 -855 418 -673 -508 -68 119 -393 -469 -619 -1449 65 797 416 223
5265B23j68N13m06j34K68l15L49o63L26L45k4l65r01J03O05M09N73j176Q35q19
$$ 223 55 568 162 28 296 -19 330 -333 -7 338 314 -51 -952 -849 -244 165 738 -438 397 -422
5285d22K22J79Q1J007o62j38j77l90N2N49k72J68k44m38N28q93R34J45M59j084
$$ -422 -200 -21 60 1067 405 267 90 -300 -248 301 29 197 -47 -485 43 -850 84 229 688 -396
5305c96K37q86N21J61O96J24o38N52p73K39Q49L85p1k005J122M15q32m88J207
$$ -396 -159 -1045 -524 -363 333 457 -181 371 -402 -163 686 1071 1000 -1005 117 532 -300 -788 419
5324D19o04m04J454j587O54k50K24O7L82l48l58M1L45p7K50j25qk09j30P31n48
$$ 419 -185 -589 865 -722 -68 -318 -94 -27 355 7 -351 -310 35 -42 208 83 75 -134 -264 467 -81
5345h1L74j51p25J02M84k36J71p6K42m46j11L50m05R0Q73o37K59J9J53O35q53
$$ -81 293 142 -583 -481 3 -233 -62 -138 104 -342 -453 -103 -508 -418 455 -182 77 96 249 884 31
5366C1J49o3k17L3k60M86J53r0k2q98J110l68N5M58r90Q63m61l40L18L67O21m01
$$ 31 180 117 -100 -67 -327 159 312 222 200 -698 412 44 99 557 -433 430 -31 -371 -53 314 935 534
5388E34j77P5l92mJ94L53n56K02k66n6J6o9L43j11k04j8j93J13J26Q3j52L7k88
$$ 534 357 432 40 36 230 583 27 229 -37 -93 -77 -146 197 86 -118 -136 -329 -216 -90 -7 -159 -122 -410
5411d10J89J25k02N71j83J19l64M22m75j14L79q31N50j32J39K21J80p4J02k98
$$ -410 -221 -96 -298 273 90 209 -155 267 -208 -322 57 -774 -224 -356 -217 4 184 110 212 -86
5431h6l4l05M41n9M59j64j17J8l33L53l9J15j53J98pm32J4L26n5K41l17j37J45
$$ -86 -120 -425 16 -43 416 252 135 153 -180 173 134 249 96 294 287 -145 -131 195 140 381 64 -73 72
5454G2m2K5Q3l09K64k95n7q7P7K11K44o4l64j35K4r7M23j3j42m7j01J66K57J65
$$ 72 30 55 138 -171 93 -202 -259 -346 -269 -58 186 122 -242 -377 -353 -450 -27 -40 -182 -229 -330 -164 93 258
5478B58P9K52p73J1J14O90k06j79n85K82m67J89J49M05J08j74L2pk56K53K48k03
$$ 258 337 589 -184 -173 -59 631 425 246 -339 -57 -524 -335 -186 219 327 153 185 178 -78 175 423 220
5500B20K23n99j13M85K33k12m14M42K24l10Q1k67J53k16j32k71J75k43Q65j012
$$ 220 443 -156 -269 216 449 237 -177 265 489 179 260 -7 146 -70 -202 -473 -298 -541 324 -688
5520f88K63J55n89L61L00O38j104N47k08J30q24L18L84P14p96J77J98K81l72L95
$$ -688 -425 -270 -859 -498 -198 440 -664 -117 -325 -195 -1019 -701 -317 397 -399 -222 -24 257 -115 280
5540B80l74K58k39l03K7Q77k43l16N87j33o27J01L76J06j181M05L06n14P22j180
$$ 280 -94 164 -75 -378 -351 526 283 -33 554 421 -206 -105 271 377 -804 -399 -93 -607 115 -1065
5560a065J030R93m63r73J007j903J365p35N69K96N93q72K85n73j037K903r34L97
$$ -1065 -35 958 495 -478 529 -1374 -9 -744 -175 121 714 -158 127 -446 -1483 1420 486 883
5578H83j331l09o45J961m64M89l98N26j099r49R05p23J048o82J207j650N08Q12
$$ 883 -448 -757 -1402 559 95 584 186 712 -387 -1336 -431 -1154 -106 -788 419 -1231 -723 89
5596H9K05N8J98q19r95J973j783Q88Q18j143l92R34J471j504l48J206Qp92J497
$$ 89 294 352 550 -269 -1264 709 -1074 -186 632 -511 -903 31 1502 -2 -350 856 864 72 1569
5615A569j826L65O49K18l74q49M23j175J359m05Q24m37j059M05p03J928m58k37
$$ 1569 -257 108 757 975 601 -248 175 -1000 359 -46 778 341 -718 -313 -1016 912 454 217
5633B17j12r3j212N65K53J210M0n65J10j089N44j094J098J06k10j72N15p89K7
$$ 217 105 12 -1200 -635 -382 828 868 303 413 -676 -132 -1226 -128 -22 -232 -404 111 -678 -651
5652f51J038J98l96n94J71l71R48P4n0J89j6j21n02L72Q4j41J20K6m73k63L47
$$ -651 387 585 189 -405 -234 -605 343 417 367 556 540 419 -83 289 373 232 352 378 -95 -358 -11
5673a1P56m97m0k54J36j01K09M03o74L45q02L70p5O84o25K74n09Qo1j17l7L98
$$ -11 745 248 208 -46 90 -11 198 601 -73 272 -530 -160 -235 449 -176 98 -411 -403 -464 -581 -618 -220
5695b20l52K75P38m72j32l2M93l02J02L61j678R72l1QN28k49p76K87j88P37j73
$$ -220 -572 -297 441 -31 -163 -195 298 -4 98 459 -1219 -247 -278 -270 258 9 -767 -480 -668 69 -104
5716a04R84j139l45K33JP38n30J68j83r23N09J200p37m06P26o07L60j17K84K48
$$ -104 880 -259 -604 -371 -370 368 -162 6 -177 -1100 -591 609 -128 -534 192 -415 -55 -172 112 360
5736C60k73M97m80O02l20r29J005j373R08M63m97m58K05L60M39m46J56l23q5k88
$$ 360 87 584 104 706 386 -543 462 -911 -3 460 -37 -495 -290 70 509 63 219 -104 -189 -477
5756d77L75J00l78L49oJ33m29J80N04m08J78l04k47R6M0O26j75J28m15j46J03
$$ -477 -102 -2 -380 -31 -37 96 -333 -153 351 -57 121 -183 -430 -334 -294 332 157 285 -130 -276 -173
5777a73J04l09O19j07n27J4R9M52j44m32Q06p33r7R82q93K02J98L9m54J57j39
$$ -173 -69 -378 241 134 -393 -379 -280 172 28 -404 402 -331 -428 554 -339 -137 61 100 -354 -197 -336
5798c36M41k51K15K3k36J99m76L81K75l15J91m7n45K61K5L82R4m73j63J38l2L10
$$ -336 105 -146 69 92 -144 55 -421 -40 235 -80 111 64 -481 -220 -195 187 281 -192 -355 -217 -249 61
5820F1p1M5k4j50J9O7m1M40m51J57m62K04NL59Q2j31k91K8J85k65J92L52k18J73
$$ 61 -10 35 11 -139 -120 -53 -94 346 -105 52 -410 -206 -201 158 240 109 -182 -154 31 -234 -42 310 92 265
5844B65l20j18J8K63L10m86j71J20j69j62K59M22M1k32m10o8N1K55K98o0jm55
$$ 265 -55 -173 -155 108 418 -68 -239 -119 -288 -450 -191 231 272 40 -370 -438 -387 -132 166 106 105 -350
5866c50j6M7O4L62J2p6m75MO01r02J668o36p01Q55k84L43J42J65L77j150Q03k199
$$ -350 -366 -319 -255 107 119 43 -432 -428 173 -729 939 303 -398 457 173 516 658 823 1200 50 853 -1346
5888a346J770j46R8J015k403J170r28n6J175J60q68J093m06l16M46j597J244l55
$$ -1346 424 278 376 1391 -1012 158 -770 -826 349 509 -359 734 328 12 458 -1139 105 -250
5906b50J2l02O36q36M71J19L32M50r25K55m15m5O72j2j567K002j188Q2k17j84
$$ -250 -238 -540 96 -740 -269 -150 182 632 -293 -38 -453 -498 174 162 -1405 597 -591 -509 -726 -910
5926i10J3J297j284R89j395J307R97l99q79N0M36o53J432o44k45Q8r46O7J61R2
$$ -910 -897 400 -884 105 -1290 17 1014 615 -264 -214 222 -431 1001 357 112 200 -746 -679 -518 -426
5946d26Q82o35k92M69j59L95k64k5k0l06K40O2n66O80M97n85K7j13k26k92J313
$$ -426 456 -179 -471 -2 -161 234 -30 -55 -75 -381 -141 -79 -645 35 532 -53 -26 -139 -365 -657 656
5967F56q99L06j89k46M20k76K68R7o71n92J111p98M15J647m32q26J76m48j14J46
$$ 656 -243 63 -126 -372 48 -228 40 137 -534 -1126 -15 -813 -398 1249 817 -9 167 -281 -395 -249
5987b49l67L10k32N94Rj298J158O92j27m73o98J15M50n59P63M90o73o14Q07O98
$$ -249 -616 -306 -538 56 65 -1233 -75 617 490 17 -681 -566 -116 -675 88 578 -95 -709 98 796
6007G96q22n55k16J441K01n59K62N02o12M53o25J038j659P52j49o05P50o6J78
$$ 796 -26 -581 -797 644 845 286 548 1050 438 891 266 1304 -355 397 248 -357 393 327 505
6026E05J84j415j38K78L00J396j418L83q38M57M3P73j008Ql02k71J328R9L10q37
$$ 505 689 -726 -864 -586 -286 1110 -308 75 -763 -306 -263 510 -498 -490 -792 -1063 265 364 674 -163
6046a63L91n0M8N42j331QM74P75r94m01P95k74O70M04r18R8m09L31k13k09J95
$$ -163 228 178 226 768 -563 -555 -81 694 -300 -701 94 -180 490 894 -24 74 -335 -4 -217 -426 -231
6067b31L37n27L1M62o34O56J5q5n30P35q1j25o25J503j36o06k80K6N61n31J351
$$ -231 106 -421 -390 72 -562 94 109 24 -506 229 148 23 -602 901 765 159 -121 -95 466 -65 1286
6088A286j635o42M02Q27q0p2m86N99k74K72n02Q6J78M35l19l2RK5j80r9J94j54
$$ 1286 -349 -991 -589 238 158 86 -400 199 -75 197 -305 -219 -41 394 75 43 52 77 -103 -202 -8 -162
6110a62K62k36M7o2L34K34l79M2k45M7K65M64m00l6k39L86l90r4K25k60J02o3
$$ -162 100 -136 -89 -151 183 417 38 80 -165 -118 147 611 211 175 -64 322 -68 -162 63 -197 -95 -158
6132a58l5l9l63Q22n89R79J92r68m24L13k24O29N9l61K82k28m39L8O60j67J16
$$ -158 -193 -232 -595 227 -362 617 809 -159 -583 -270 -494 135 194 -167 115 -113 -552 -514 146 -21 95
6153I5k32m06L58L58n54J253n25J42o75j28J302j465L34k7K84K90o90K15N9j45
$$ 95 -137 -543 -185 173 -381 872 347 489 -186 -314 988 -477 -143 -170 114 404 -286 -71 -12 -157
6173a57M9J52p1n2M49q91j05J71q1j57O46L30P2P1p92K9l74K20K85J2P25n35J33
$$ -157 -108 44 -27 -79 370 -521 -626 -455 -536 -693 -47 283 355 426 -366 -337 -711 -491 -206 -194 531 -4 129
6196A29j555k6J425N0O06l56k50o00j38L57N06J23p88k21R52q95N97K13o22O92
$$ 129 -1426 -1452 -27 23 629 273 23 -577 -715 -358 148 271 -517 -738 214 -681 -84 129 -493 199
6216A99l51p5p69K88O58R1J39r10O17k68K72O58n49K16l99J78j63K06M3J82l56
$$ 199 -152 -227 -996 -708 -50 41 180 -730 -113 -381 -109 549 0 216 -183 -5 -168 38 81 263 -93
6237i3k96P7L47K41J66k12j19M5o22L38l8N92l81k10j94j92O08O81j301J240o16
$$ -93 -389 -312 35 276 442 230 111 156 -466 -128 -166 426 45 -165 -359 -551 57 738 -563 677 61
6258F1l06K06k3L31n43L57M50O69j751n42Q96p58L99K070k686M80K42N2l52J612
$$ 61 -245 -39 -62 269 -274 83 533 1202 -549 -1091 -195 -953 -554 1516 -1170 -690 -448 -396 -748 864
6278H64p38R16p96R5K26q81N71J772j782j028O10J29P4P76o96m70K9M24j21Q65
$$ 864 126 1042 246 341 567 -314 257 2029 247 -781 -171 -42 32 808 112 -358 -329 95 -26 839
6298H39m11l43J7m79l24R69J07j134J56K43RJ27m58M76R45j140L27j096J486j182
$$ 839 428 85 102 -377 -701 268 375 -759 -603 -360 -351 -224 -682 -206 739 -401 -74 -1170 316 -866
6318h66J130O64j974K72K05M97J99k0K18j074l91M78Q58q81P59j162J028p99J058
$$ -866 264 928 -1046 -774 -569 -72 127 107 325 -749 -1140 -662 196 -685 74 -1088 -60 -859 199
6337A99m86P96j46r32j96Q86n4j115J666q64N08Q94L36j560n9K66J23p68m53K80
$$ 199 -287 509 363 -569 -765 121 67 -1048 618 -246 262 1156 1492 -68 -127 139 262 -506 -959 -679
6357f79N41q81J165N67k52p06p6k35J16P93Q11r76m69J14K15n47P03k23q60J050
$$ -679 -138 -1019 146 713 461 -245 -321 -556 -440 353 1164 188 -281 -167 48 -499 204 -19 -879 171
6377A71r20R92o89K95P86j614N14L44m13n80J413Q83r57m35Q3m00N43M20l32m37
$$ 171 -749 243 -446 -151 635 -979 -465 -121 -534 -1114 299 1182 225 -210 -127 -527 16 436 104 -333
6397c33N2K41O05n38k06O14K7p53q1N68m18r4Q96k33n23K38n5n74M07L30J99o61
$$ -333 -281 -40 565 27 -179 435 462 -291 -372 196 -222 -316 580 347 -176 62 7 -567 -160 170 369 -292
6419b92K05N40L76o29l40J138j162k49l6J70R04o22j34L85p24j5O26j3P51P69
$$ -292 -87 453 829 200 -140 998 -164 -413 -449 -279 625 3 -131 254 -470 -485 141 128 879 1648
6439A648k174N23n41O54M1L5j87j60K77n05J41L49j89J99l73K00r9J51J40R5p3
$$ 1648 -526 -3 -544 110 151 186 -1 -161 116 -389 -248 101 -88 111 -262 -62 -161 -10 130 225 152
6460A52k02k91J85J3k37N28k70P6k36J74J57M4m9J31k99J89l88O55k77M07or09
$$ 152 -50 -341 -156 -143 -380 148 -122 -46 -282 -108 49 93 44 175 -124 65 -323 332 55 462 456 -453
6482d53M43k30N96l82N55o61L23l51N04l18k52N43L4L10r63k9k19P88L6o22j50
$$ -453 -10 -240 356 -26 529 -132 191 -160 344 26 -226 317 351 661 -302 -331 -550 238 274 -348 -498
6503d98R15r52R17k32L88n08m01M88K92k80q43K023j354n03p8q68J355K72K07
$$ -498 417 -535 382 150 538 30 -371 117 409 129 -714 1309 -45 -548 -626 -1494 -139 133 340
6522C40k66n59K43l0L10l91o04J315q22M1L4J1j49L59k67M37O7n83J042r73O66
$$ 340 74 -485 -242 -272 38 -353 -957 358 -464 -423 -389 -378 -527 -168 -435 2 69 -514 528 -445 221
6543B21o30L24K9M5N14j250J76P4L83j328M19J135n08O77n23L59J138j825L41
$$ 221 -409 -85 -56 -11 503 -747 -571 -497 -114 -1442 -1023 112 -396 281 -242 117 1255 -570 -229
6562b29J790p61j515K29N07l96M55K6M9o05L69M66R86j090p16J432p61P47p87
$$ -229 1561 800 -715 -486 21 -375 80 106 155 -450 -81 385 1371 281 -435 997 236 983 196
6581A96m07J82P90j59j540Q12l61lj42J73L62n64j2Q41P5j85L06l67M32j44l08
$$ 196 -211 -29 761 602 -938 -126 -487 -490 -632 -459 -97 -661 -673 168 243 58 364 -3 429 285 -23
6602b3J69o78J864q99J43k14r73M96k33J085m25n6n59J469j816J67K67n25K92
$$ -23 146 -532 1332 433 576 362 -611 -115 -348 737 312 256 -303 1166 -650 -483 -216 -741 -449
6621d49R68q39k32K67j60K00J336k463J268k23R91j54J057j235P93k787M37J673
$$ -449 519 -320 -552 -285 -445 -245 1091 -1372 -104 -327 664 510 1567 332 1125 -1662 -1225 448
6639D48j398J924o58j176R93p99J589j567P98J07m14O16j426J334j184J112m72
$$ 448 -950 974 316 -860 133 -666 923 -644 154 261 -153 463 -963 371 -813 299 -173
6656a73R3j89K41M11m89k85K88L28l62j00N73k94n7N1P18q86J13N2N95j014k75
$$ -173 -80 -269 -28 383 -106 -391 -103 225 -137 -237 336 42 -15 36 754 -132 -19 33 628 -386 -661
6677f61Q49p69N26p0P7O2J8j38j92K61O1j85J07O7p5j77p0K06J84k3m5J09k09
$$ -661 188 -581 -55 -125 -48 14 32 -106 -298 -37 24 -161 -54 13 -62 -239 -309 -103 81 58 13 122 -87
6700h7K98k74M07j99m90l18R18p8l63O36J93p29j57j58M92k67J86j26J53K2j34
$$ -87 211 -63 344 145 -345 -663 255 177 -186 450 643 -86 -243 -401 91 -176 10 -116 37 59 -75
6721g5J48j28J16L7k14njJ07j43J96j20Q0k2J3j33K7R2J18j00j07N0j2o2J46j9
$$ -75 73 -55 61 98 -116 -121 -122 -15 -158 38 -82 -2 -24 -11 -144 -117 -25 93 -7 -114 -64 -76 -138 8 -11
6746a1L2lJ58j98j85l1j8J25J93J38l69M7J15o9L27m08k1j34J44J8K09lk7k09
$$ -11 21 18 176 -22 -207 -238 -256 -131 62 200 -169 -122 -7 -76 251 -157 -178 -312 -168 -150 59 56 29 -180
6770a80N8J48j89J62M11k29m78K86k42K76j64L45j93r4p9Q1n10J091k10L82o98
$$ -180 -122 26 -163 -1 410 181 -297 -11 -253 23 -141 204 11 -83 -162 -81 -591 500 290 672 -26
6791b6j06K11l28N76n41l03R53q25J71l88j2N97M17n59O4k00j21j6R39j49j05
$$ -26 -132 79 -249 327 -214 -517 436 -389 -218 -606 -618 -21 396 -163 -99 -299 -420 -436 503 354 249
6812B49n36K28J41n41O42k14N99n81n8j01J61j15lO37k22n34N52l95M7L97l83
$$ 249 -287 -59 82 -459 183 -31 568 -13 -71 -172 -11 -126 -129 508 286 -248 304 -91 -44 353 -30
6833c0R8j13j51K20j42N96n12o12O18j24j78Q48p69M05j48N7M24q08j6K12J15
$$ -30 68 -45 -196 24 -118 478 -34 -646 -28 -152 -330 518 -251 154 6 63 487 -321 -337 -125 -10
6854a0L32o30j030J397k30M96j400O44k0p57J269M34k4K35k066J974p50j36R68
$$ -10 322 -308 -1338 59 -171 325 -1075 -431 -451 -1208 61 495 471 706 -1360 614 -136 -272 696
6873F96j96q3j472N18O09j40o59M53k26L40j06J22L44O07r15L54J0j099O83L96
$$ 696 500 417 -1055 -537 72 -68 -727 -274 -500 -160 -266 -144 200 807 -108 246 256 -843 -160 236
6893B36l15K31K34l13n16K24P35m23L97m65J58k31K69n93J096j144J017j25o3
$$ 236 -79 152 386 73 -443 -219 516 93 490 25 183 -48 221 -372 724 -420 597 472 409
6912D09m61J192o62j028J128m99o46j5J524j272j75k12N41k17J883p22j050J53
$$ 409 -52 1140 478 -550 578 79 -567 -582 942 -330 -505 -717 -176 -393 1490 768 -282 -129
6930a29P0r07O55P23n1Q81j537q2l64m67L22J228J2j120p46J667K36j659J890
$$ -129 -59 -966 -311 412 361 1242 -295 -377 -741 -1208 -886 342 354 -766 -1512 155 391 -1268 622
6949F22N2o3j08r37J52m08J18Q27k67k53j84l12J28Q53N11q14q49N00K339q73
$$ 622 674 611 503 -434 -282 -690 -572 255 -12 -265 -449 -761 -633 220 731 -83 -932 -432 1907 1034
6969A034r91L21j242J260r76K316j692M31p35M74j539k50O44J149O82j656J967
$$ 1034 43 364 -878 382 -594 1722 30 461 -274 200 -1339 -1589 -945 204 886 -770 1197
6986A197j855Q01q18j7J951j198P22q70m39j259J086N67R85M55j089o03o2J04
$$ 1197 -658 143 -675 -692 1259 61 783 -87 -526 -1785 -699 -132 853 1308 219 -384 -446 -342
7004c42O94j01m19l02m68J273l00k20R4N60p60j122J281O33j5q64O60r35p80J354
$$ -342 352 251 -168 -470 -938 335 35 -185 -91 469 -291 -1413 -132 501 486 -378 282 -653 -1433 -79
7024g9k37p40J440P54l94K12j554N77K15j02J406j530k79J132m25R06k363o5J514
$$ -79 -316 -1056 384 1138 744 956 -598 -21 194 92 1498 -32 -311 821 396 1302 -1061 -1126 388
7043C88o88j78K57J020q21j517J704l18m73q14J466l64M30K65N17k028M67J133
$$ 388 -300 -478 -221 799 -22 -1539 165 -153 -626 -1440 26 -338 92 357 874 -1154 -687 446
7061D46K57o60n40J52o9J205l98p73O34M19k273J453J365o78r52J310j030L11
$$ 446 703 43 -497 -345 -414 791 393 -380 254 673 -1600 -147 1218 540 -412 898 -132 179
7079A79q48Q23l55N55J071j612Q8r22P02J41Q11o45m84n46P97m55N29K68l77K46
$$ 179 -669 154 -201 354 1425 -187 -99 -1021 -319 -178 633 -12 -496 -1042 -245 -700 -171 97 -280 -34
7099c4K69j394J639m53R83o96j247J88Q94o7m15M65k91l28K86l14M53k07O73j69
$$ -34 235 -1159 480 27 1010 314 -933 -745 149 82 -333 132 -159 -487 -201 -515 -62 -269 404 235
7119B35k14n4L95p88J80M43n24m3K61LK39j96l49M12l16o6q06R54M5J164lj404
$$ 235 21 -33 362 -426 -246 197 -327 -370 -109 -106 133 -63 -412 0 -316 -382 -1188 -234 -189 975 972 -432
7141d32K65m93J374p54j060K003j249r04N33Q47o67M4K84j35O25j189J498n5p86
$$ -432 -167 -660 714 -40 -1100 903 -346 -1250 -717 130 -537 -493 -209 -344 281 -908 590 535 -251
7160b51N34j039O67k48R22O83j838Rk84O17J034k95m6p69Q88j610R70O25j90j317
$$ -251 283 -756 -89 -337 585 1268 -570 -561 -845 -228 806 511 465 -304 584 -1026 -56 569 379 -938
7180i38N70J372k138J9J173j073J309J6L86j652R76o74N77L80p90P64p40l65J206
$$ -938 -368 1004 -1134 -1115 58 -1015 294 310 696 -956 20 -654 -77 303 -487 277 -463 -828 378
7199C78P6m02p99Q53k91J26J83j5O2j109J070J38m1k125J563k270J583J293r84
$$ 378 454 52 -747 106 -185 -59 124 109 171 -938 132 270 229 -1896 -333 -2603 -1020 273 -711
7218g11L33K149k213J342m64j133M60J91J84J099j572O78q4j007j341K242o83
$$ -711 -378 1771 -442 900 436 -697 -237 -46 138 1237 -335 343 259 -748 -2089 153 -530
7235e30K560k249J433j408k20M26p83J17j28O53Q2l7j213L31l88P35J194O97j705
$$ -530 2030 -219 1214 -194 -414 12 -771 -654 -782 -129 -47 -84 -1297 -966 -1354 -619 575 1272 -433
7254d33P51j533J127o89J051j89l61N4L24j4K99j94m55jl46J493p16M22p12K11
$$ -433 318 -1215 -88 -777 274 85 -276 -222 102 88 387 193 -262 -263 -609 884 168 590 -122 89
7274H9m68L73lJ26p8k67j80M09n39M20J3L00J18n74J06O23o43R1J25j30R5p1j50
$$ 89 -379 -6 -9 117 39 -228 -408 1 -538 -118 -105 195 313 -261 -155 468 -175 -84 41 -89 6 -65 -215
7297b15j47K30J18j96L61K54p69K84N1P8R6q13P41o52Q64j460Q95P56j150R82
$$ -215 -362 -132 -14 -210 151 405 -364 -80 -29 49 145 -668 73 -579 285 -1175 -280 476 -674 308
7317C08o96O42l48J75j146P91K67Q2o42R40q10k72M10n59J11O10k70P21p34O68
$$ 308 -388 254 -94 81 -1065 -274 -7 75 -567 373 -437 -709 -299 -858 -747 -137 -407 314 -420 248
7337B48j026Q08j68J24j21j47O47n50K75N73m86r19J397p32Q45j604R72l11J15
$$ 248 -778 30 -138 -14 -135 -282 365 -185 90 663 177 -742 655 -77 768 -836 136 -175 -60
7356f0m56N40j71O43p84R72j046R30k16p99O41m97M40L23k89M30O98j454n5k46
$$ -60 -516 24 -147 496 -288 684 -362 568 352 -447 194 -303 137 460 171 601 1299 -155 -210 -456
7376d56L05J034m77p57k56P44o23Q98l66j88L79o9j507Q46L11R55n15l57R10j042
$$ -456 -151 883 406 -351 -607 137 -486 412 46 -142 237 168 -1339 -493 -182 773 258 -99 811 -231
7396b31L10q3n55k66J145j269J431l43n1m2R1j303P49J176p03O75L62n75j072
$$ -231 79 -4 -559 -825 320 -949 482 139 88 46 137 -1166 -417 759 56 731 1093 518 -554
7415e54K0Q2m54P02J681q59O4K82m88o47M57r0o55N39K54l33l44N77p49M76k94
$$ -554 -534 -452 -906 -204 1477 618 682 964 476 -171 286 196 -459 80 334 1 -343 234 -515 -39 -333
7436c33m62R3J204j583J418p91R3J54N21j749J531J6J44Lj829J876j44j44J438
$$ -333 -795 -702 502 -1081 337 -454 -361 -207 314 -1435 96 112 256 259 -1570 306 162 18 1456
7455A456m78m5j680J67J366r74oK398r69p06m30O29j579J754r82M54M3p28n42
$$ 1456 978 933 -747 -580 786 -188 -194 2204 1235 529 99 728 -851 903 -79 375 418 -310 -852
7474h52J382o28Q1L25j004Q36L00J21o35n61O70P18j685Q10N06j085R9J680j843
$$ -852 530 -98 -17 308 -696 140 440 561 -74 -635 35 753 -932 -122 384 -701 -602 1078 -765
7493g65M06l94K157j858K51j80%J512n04n77J61m52k34K61O3k50R70Pn68j60o81
$$ -765 -359 -753 1404 -454 -203 -383 -383 1129 625 48 209 -243 -477 -216 -153 -403 567 574 6 -154 -835
7514h35J417j50k29l25p7p01J064P5J77q4m19P28q83k59M5N47j24N55p70K35K58
$$ -835 582 432 203 -122 -199 -900 164 239 416 332 -87 641 -242 -501 -456 91 -33 522 -248 -13 245
7535B45p70J194l17n61M36o34K67p28O82m9M19n81M27L21j46o11M99L89m36J67
$$ 245 -525 669 352 -209 227 -407 -140 -868 -186 -235 184 -397 30 351 205 -406 93 482 46 213
7555B13l23L28n01l14r6J41K17L98Q7j27Q61m30j141M88J71n87J210j61o08K0
$$ 213 -110 218 -283 -597 -693 -552 -335 63 150 23 884 454 -687 -199 -28 -615 595 434 -174 -154
7575a54K74o9O00j140P56L28N24j035K36k32q23R26K32r94L60o4m8Q50o37N65
$$ -154 120 51 651 -489 267 595 1119 84 320 88 -735 191 423 -571 -211 -275 -323 527 -110 455
7595D55j18q38q9J514r61P38k58n53q27P25R3l97J018r30O88j134O76o15o4L04
$$ 455 337 -501 -590 924 -37 701 443 -110 -937 -212 -119 -516 502 -428 260 -874 -198 -813 -877 -573
7615e73M77P38q21m93K29P24K04m87l02j19l31l55Q65j44o24J430r11K49Q0R4
$$ -573 -96 642 -179 -672 -443 281 485 -2 -304 -423 -754 -1109 -244 -388 -1012 418 -493 -244 -164 -70
7635g0N22j90r74O51L54p59R57j392J618l45m03o53j02R57N94o54j69J48q03J043
$$ -70 452 262 -712 -61 293 -466 491 -901 717 372 -31 -684 -786 171 765 111 -58 90 -713 330
7655C30L76O9j61o3k12n19M0j32P23j94o2p15M78n73N53J01M5m88L32j49L54L66
$$ 330 706 775 614 551 339 -180 -140 -272 451 257 195 -520 -42 -615 -62 39 84 -404 -72 -221 133 499
7677D99J07m33n87P88o77Q57l29m38K03J4P4p89J177k32J163r25l94j83P61J88
$$ 499 606 173 -414 374 -303 554 225 -213 -10 4 78 -711 466 234 1397 472 78 -105 656 844
7697H44j172K73L9j77k42Q94p88Q00o50L87k23K91j118J751o89Q56o30q57N01
$$ 844 -328 -55 -16 -193 -435 459 -329 471 -179 208 -15 276 -842 909 220 1076 446 -411 90
7716I0j257R86N8P04j060J25O4L83N70m12J83o26j5L47K43o20L60J07r54R96j134
$$ 90 -1167 -181 -123 581 -479 -354 -290 93 663 251 434 -192 -207 140 383 -237 123 230 -724 272 -862
7737h62P44L05p5j30l3m8K1n32J400o43K02l63L83m14j3o25O62N33P8l30l05j05
$$ -862 -118 187 112 -18 -51 -99 -78 -610 790 147 349 -14 369 -45 -58 -683 -21 512 590 260 -45 -150
7759a50L31L30k92l29K90j70n03Q70n61N37k01k37k98M12L33j0P9m42l52O51n32
$$ -150 181 511 219 -110 180 10 -493 377 -184 353 152 -85 -383 29 362 352 431 -11 -363 288 -244
7780b44J14P4n4o7L27m88j02O71k10J21j06j86q0M36n73L02L97l9l15r6K16o7
$$ -244 -130 -56 -110 -177 150 -338 -440 231 21 142 36 -150 -230 206 -367 -65 332 293 -22 -118 98 31
7802C1l1M4j1k91J16K23j7P75j00o80M83j786J604Qo30R93q78Rl57J02k5L80L86
$$ 31 0 44 33 -258 -142 81 64 839 739 59 542 -1244 360 368 -262 731 -147 -138 -495 -393 -418 -38 348
7825C48l46m09J20M4j46K46K87J98l21j95J29k62M54j94K25mj07j15n8O0O07n74
$$ 348 2 -407 -287 -243 -389 -143 144 342 21 -174 -45 -307 147 -47 178 174 67 -48 -106 -46 561 -13
7847a3L95N72j215O16j55k40O45L15j365M39L13k44J80n8L55q45R8R23%j47o10
$$ -13 382 954 -261 355 200 -40 605 920 -445 -6 307 63 243 185 540 -305 -207 716 716 569 -41
7868d1P38j437k4R08J27l37l62j84Q67j047k94J228l46o08K12J770p07R23j194
$$ -41 697 -740 -764 144 271 -66 -428 -612 255 -792 -1086 142 -204 -812 -600 1170 463 1386 192
7887A92L7P18j489M17P25o29L15K59q67Q93q23J111m74n58M20l20K56q51M21j827
$$ 192 229 947 -542 -125 600 -29 286 545 -322 571 -252 859 385 -173 247 -73 183 -668 -247 -2074
7907b074K842q96J63r71J147k29N16j10O02n91q8k94k90o4j198K059j112R36p66
$$ -2074 768 -128 35 -936 211 -18 498 388 990 399 311 17 -273 -337 -1535 524 -588 348 -418
7926d18K30N59L4k86k97N14j193J785j870J618p09o7q8l70o06R98m01n1J422m17
$$ -418 -188 371 405 119 -178 336 -857 928 -942 676 -33 -100 -188 -558 -1164 -166 -567 -618 804 387
7946C87n67l46J435j214j094J188N42N35j691K599r04j527l72J898j038K58N94
$$ 387 -180 -526 909 -305 -1399 -211 331 866 -825 1774 870 -657 -1029 869 -169 89 683
7963F83q87N09K72k608K559o86J2l41J134q59J548m30j058M5K93J200j653Q37
$$ 683 -204 305 577 -2031 528 -158 -146 -487 647 -212 1336 906 -152 -107 186 1386 -267 570
7981E70j390J840p16q5r18J453j81l31L05j288J222j32R52n70r24l0Q16j182Q43
$$ 570 -820 1020 304 219 -699 754 573 242 547 -741 481 349 1301 731 -193 -223 593 -589 254
8000B54K61l24m77K84K30j82j75N0J10N71o94j72Q03j228P93j64L9l43j49O56
$$ 254 515 191 -286 -2 228 46 -129 -79 31 602 -92 -264 539 -689 104 -60 -21 -364 -513 143
8020A43r9n22J125o32p2L22m10J73L39K02r32L32p34P40k25q6Q83o06n8L65p05
$$ 143 44 -478 647 15 -57 265 -145 28 367 569 -363 -31 -765 -25 -250 -336 547 -59 -117 248 -457
8041d57Q51m35m41N01M89k10k64M0N07K3k41n33J23P06o59l45K67P44j117P9K02
$$ -457 394 -41 -482 19 508 298 34 74 581 604 363 -170 -47 659 0 -345 -78 666 -451 -372 -170
8062a70N45m95N70o74M45p03N76k84K45K02mn50M73q2J58l6p3k11m09J96j94L76
$$ -170 375 -120 450 -224 221 -482 94 -190 55 257 253 -297 176 94 252 216 143 -68 -477 -281 -475 -99
8084i9J15j2l36N49l54j0L95l77P0NJ18l58J09J58O14n57l69L52k92M84j73R9
$$ -99 16 4 -332 217 -137 -147 248 -129 -59 -54 64 -294 -185 -27 587 30 -339 13 -279 205 32 131
8106A31L71j09j13K95j228Q98l91L39L00o47N59J4p19J028m35k69j99J298j511
$$ 131 502 393 280 575 -653 245 -146 193 493 -154 405 419 -300 728 293 24 -175 1123 -388
8125c88K45k3M81K53p45R89o67M3m37N55l22N2l82K90J9J118j171L0o47k77R43
$$ -388 -143 -166 315 568 -177 812 145 188 -249 306 -16 36 -346 -56 -37 1081 -90 -60 -707 -984 -41
8146d1J60O39j003J352j055p58J776m64K08j251Lk46O9L35R8k4N76j179J330J10
$$ -41 119 758 -245 1107 52 -706 1070 606 814 -437 -434 -680 -611 -276 -178 -202 374 -805 525 635
8166F35k55l54L84r8k037K110K18o17j93J45Q58q42J77m55j95J167j218R40q36
$$ 635 380 26 410 312 -1725 385 603 -14 -207 -62 796 -46 131 -324 -519 648 -570 370 -466
8185d66J292j349L9L09K07L9
$$ -466 826 -523 -484 -175 32 71
8191G1
$$ Imaginary data points
##PAGE= N=2
##DATA TABLE= (X++(I..I)), XYDATA
0@%%%qJ6j0J0j6K4l2M0n5P1q2R8j22J46j76K09k43K84l33L88m51N18n92O79p74
$$ 0 0 0 0 -8 8 -2 8 -8 16 -16 24 -31 40 -42 56 -66 80 -96 113 -130 154 -179 209 -242 276 -316 363 -411
28d11Q76r92J120j258J412j582J768j972K193k438K706k998L323l681M076m515
$$ -411 465 -527 593 -665 747 -835 933 -1039 1154 -1284 1422 -1576 1747 -1934 2142 -2373
44b373N002n545O159o854P648q568R647j0934J2501j4456J6981k0384K5249l2842
$$ -2373 2629 -2916 3243 -3611 4037 -4531 5116 -5818 6683 -7773 9208 -11176 14073 -18769
58a8769M6474p8685K95806L11617k97445j51155p7730R8624J02763J21049j6363
$$ -18769 27705 -50980 244826 556443 258998 107843 30113 128737 231500 352549 336186
69C36186j34422k10863q4463P0619J73254J02372k1647j54414j63106o0628J01507
$$ 336186 201764 -9099 -93562 -22943 150311 252683 231036 76622 -86484 -147112 -45605
80d5605J53244R5930k9614j21553j44408n4337P7375J51574R6106l3754j37702
$$ -45605 107639 203569 173955 52402 -92006 -146343 -68968 82606 178712 144958 7256
91G256j30106l3598Q0329J34382R4145k7237j26032j14102j2504Q9141J33897
$$ 7256 -122850 -156448 -76119 58263 152408 125171 -861 -114963 -127467 -38326 95571
102I5571R6938r328j08869j13231j1020J09964J44132P3746l1039r4341r7052
$$ 95571 192509 183181 74312 -38919 -49939 60025 204157 277903 246864 152523 55471
113E5471k9583P4953J32512P8588m1654j25651j11858k0127P8265J06220N2599
$$ 55471 25888 100841 233353 311941 270287 144636 32778 12651 90916 197136 249735
124B49735l6182j06913j09909l2457P5835J21262O7210m1667j12530r6771j3409
$$ 249735 213553 106640 -3269 -35726 40109 161371 228581 186914 74384 -22387 -35796
135c5796P3947J04266O2288l4526j10131r9339j9811O5414J02611N6912m3570
$$ -35796 38151 142417 204705 170179 60048 -39291 -59102 6312 108923 165835 122265
146A22265j15433r7948j4014P0320R7926N2873l5735r8398q9744q917Q2554J07359
$$ 122265 6832 -91116 -105130 -34810 63116 115989 80254 -18144 -107888 -116805 -34251 73108
158G3108N1796l0850q4719p6943p940Q1914J09012M6964m2043r1321p1142o235
$$ 73108 124904 94054 9335 -67608 -75548 6366 115378 162342 120299 28978 -42164 -48399
170d8399O6780R3159M8960m1805j09165q0587R199P4170P9168L4253l4294q8647
$$ -48399 18381 111540 160500 118695 9530 -71057 -61858 12312 91480 125733 91439 2792
182B792p6330L331Q2393R0516L3853m5005q6442o4071Q505P9434Q9109K2990n4052
$$ 2792 -73538 -70207 12186 102702 136555 91550 5108 -58963 -50458 28976 118085 141075 87023
195H7023q2851n4111L305O2039Q1401K7161n3696r1491n3036J7393P0212O8007
$$ 87023 4172 -49939 -46634 15405 96806 123967 70271 -21220 -74256 -56863 13349 81356
207H1356K0693m2637p6734n0664K2799P5797O6144J5265l5692o5975m7078J5550
$$ 81356 102049 59412 -17322 -67986 -45187 30610 96754 112019 76327 10352 -36726 -21176
219b1176O9820O6123P878m8577o7406l6256J1728M9421N4688J3487m8407p2221
$$ -21176 48644 114767 122645 74068 6662 -29594 -17866 31555 86243 99730 51323 -20898
231b0898l8938J6791N0669M8394J0315m1326o0708l3928J7493N3580M9179P192
$$ -20898 -59836 -43045 7624 56018 66333 25007 -35701 -69629 -52136 1444 50623 57815
243E7815l7153n2678l3068J2785N2868M6563L516l8485n0089l0645J2659M7408
$$ 57815 20662 -32016 -65084 -52299 569 47132 50648 12163 -37926 -68571 -55912 -8504
255h504M3771O878l5827n1706k4758K1316M8182L9857J0502k6016m4391k3789
$$ -8504 35267 42145 6318 -45388 -70146 -48830 -648 39209 49711 23695 -20696 -44485
267d4485K0361N0149M3399O528k9737m0343j8644J6181M3008M1334M410l6182
$$ -44485 -24124 26025 69424 75952 46215 5872 -12772 3409 46417 87751 92161 55979
279E5979m3535j8060J3554L6164L3856L112l4657m5104k0301J7737L8556K7449
$$ 55979 12444 -5616 7938 44102 77958 81070 46413 1309 -18992 -1255 37301 64750
291F4750j953k8889l8425k2165J6744M0909K8645p574l1389l3477j7009J4497
$$ 64750 62797 33908 -4517 -26682 -9938 30971 59616 52042 20653 -12824 -29833 -15336
303a5336L3719K5645o528l4680l5721j0222J6526K8835K3008k005l1721l5283
$$ -15336 18383 44028 37500 2820 -32901 -43123 -26597 2238 25246 23241 -8480 -43763
315d3763m809K4388L0027J7139k936k1800k4573o173K1793L3387J8361r429k2434
$$ -43763 -48572 -24184 5843 22982 20046 -1754 -26327 -32500 -10707 22680 41041 31612 9178
328I178j6257l317J5785K6477J7770r781k3314j5689k66J3020K0369J3152m774
$$ 9178 -7079 -10396 5389 31866 49636 39855 16541 852 586 13606 33975 47127 42353
341D2353k1171j8842O28J7646J6224M455m809j2033j5969m121J2698J5990N771
$$ 42353 21182 2340 2968 20614 36838 41293 36484 24451 8482 4361 17059 33049 38820
354C8820q099j3572j2702k732Q252J2306O730o792j6129q612k16M023O810Q763
$$ 38820 30721 17149 4447 1715 9967 22273 29003 22211 6082 -2530 -2746 1277 8087 16850
368A6850k601j2816j0444R90Q928Q661M226k062n356p197k838P633J2186M162
$$ 16850 14249 1433 -9011 -8021 907 9568 13794 11732 6376 -821 -3659 3974 16160 20322
382B0322k795n084l911j463M795Q771L389k150m803m240M77K040L714N551J755
$$ 20322 17527 12443 8532 7069 11864 20635 24024 21874 17071 12831 13308 15348 19062 24613 26368
397B6368o017q552L91N785J783j7m81j605l927m368J600L429J850k949l378j714
$$ 26368 20351 11799 12190 17975 19758 19741 19260 17655 13728 9360 10960 14389 16239 13290 9912 8198
413H198j79k009J512K324k914l671J807J139k008j714K28K140l72j302J353K735
$$ 8198 8019 6010 7522 9846 6932 3261 5068 6207 4199 2485 2713 4853 4481 3179 4532 7267
429G267l219m155J290O717L776j133k001r71k019K090P371O432N44l040m574p32
$$ 7267 4048 -107 1183 7900 11676 10543 8542 7571 5552 7642 15013 21445 21989 18949 14375 13643
445A3643L301O443Q814L221r271j0813j723P472Q315M120K78p543j0616o747M998
$$ 13643 16944 23387 32201 35422 26151 15338 13615 21087 29402 33522 33800 26257 15641 8894 13892
460A3892J3907P832o109j1894r992m415N745J4486R481o845j5045j2071j953Q070
$$ 13892 27799 35631 29522 17628 7636 3221 8966 23452 32933 26088 11043 -1028 -2981 5089
474E089J2471R085m094j7726j6951l3J4893J3374L235o998j4218j5091j875J4339
$$ 5089 17560 26645 22551 4825 -12126 -12159 2734 16108 19343 12345 -1873 -16964 -18839 -4500
488d500J7574O836r193j6262j1896J233J5710J9424J1104j0438j9733j0663O818
$$ -4500 13074 19910 10717 -5545 -17441 -16208 -498 18926 30030 19592 -141 -10804 -3986
501c986J5461J7552Q361r109k0300j4675M894J9432J8157K997j1556j7561j5450
$$ -3986 11475 29027 37388 28279 7979 -6696 -1802 17630 35787 38784 27228 9667 -5783
514e783K625J8768K1417L655j4584j9183j1075L627J9443J9882N306j4103k0873
$$ -5783 -3158 15610 37027 40682 26098 6915 -4160 -533 18910 38792 44098 29995 9122
527I122j2194N357J8130J7518M741j2109k4229j4908O115J8599J6972M266j3744
$$ 9122 -3072 2285 20415 37933 42674 30565 6336 -8572 -2457 16142 33114 37380 23636
540B3636k1990j4571L394K0092K1594N447j4996k1892j2778M722J9393K4483O824
$$ 23636 1646 -12925 -9531 10561 32155 37602 22606 714 -12064 -7342 12051 36534 43358
553D3358j5959k2629j4296N900K2187K1555O238j5048k7313j8558O287K6161K1878
$$ 43358 27399 4770 -9526 -3626 18561 40116 46354 31306 3993 -14565 -8278 17883 39761
566C9761J408j7207k6294j7379N359K5684K5146N272k0665k8151j3958R072K6272
$$ 39761 41169 23962 -2332 -19711 -14352 11332 36478 41750 21085 -7066 -21024 -11952 14320
579A4320K6933N675k2342l1770j4883J5197K7063K2815K612k2009l1920j7062
$$ 14320 41253 46928 24586 -7184 -22067 -6870 20193 43008 45620 23611 -8309 -25371
591b5371J3265L1520K4819k510k5528k8395j2598J3468L3059K7986j209k6554
$$ -25371 -12106 19414 44233 41723 16195 -12200 -24798 -11330 21729 49715 48506 21952
603B1952k8079q692J6204L3842K7155j477k8260l1353q102K0523L1337J9021l581
$$ 21952 -6127 -14819 1385 35227 62382 60905 32645 1292 -6810 13713 45050 64071 60490
616F0490k5665l3393j3414J8707L3668K0124q465k9301l1130r750J8301L2899
$$ 60490 34825 1432 -11982 6725 40393 60517 52052 22751 -8379 -18129 172 33071
628C3071K1482r084l1147k8978n845J7689L0544K2001p222l3637l1615n507K0934
$$ 33071 54553 45469 14322 -14656 -20501 -2812 27732 49733 42511 8874 -22741 -28248 -7314
641g314K9736J6626r928l0227l0755p899K1095L2807J6890j1423k8848k6647n501
$$ -7314 22422 39048 29120 -1107 -31862 -39761 -18666 14141 31031 19608 -9240 -35887 -41388
654d1388K2962L5177J9249r259k7780k3958j608K3908L3339K0267p032k9908k6927
$$ -41388 -18426 16751 36000 26741 -1039 -24997 -26605 -2697 30642 50909 43877 13969 -12958
667a2958j567K5646L1190J6264r140k9949k8035l230K4149L2108J6546j2122l1079
$$ -12958 -14525 11121 42311 58575 49435 19486 -8549 -11779 12370 44478 61024 48902 17823
680A7823k5775j729K2669L2935J7996j3061l2641k6649j413K3313L2198J5154
$$ 17823 -7952 -9681 12988 45923 63919 50858 18217 -8432 -9845 13468 45666 60820
692F0820j4699l4747k9507k754K5155L0600J1271j6591l4094k9669m021K6298
$$ 60820 46121 11374 -18133 -20887 4268 34868 46139 29548 -4546 -34215 -38236 -11938
704a1938L3492J2612j7419l4809k6396J210K7329L4280J4870j6302l5296k4187
$$ -11938 21554 34166 16747 -18062 -44458 -43248 -15919 18361 33231 16929 -18367 -42554
716d2554N581K8878L2502J3861j6053l5272k6089O468L0979L2065R172j8375l2685
$$ -42554 -36973 -8095 24407 38268 22215 -13057 -39146 -32678 -1699 30366 39538 21163 -11522
729a1522k3339M278L1119L3846R026k1422l1930j8734P779K9925L2612R085k1497
$$ -11522 -34861 -30583 536 34382 43408 21986 -9944 -28678 -20899 9026 41638 50723 29226
742B9226l2669j8834R242L0340K8312N788k1370l4680k1329R920L0349K5023J594
$$ 29226 -3443 -22277 -13035 17305 45617 51405 30035 -4645 -25974 -16054 14295 39318 40912
755D0912k2509l2622k0212Q393L0681K6898J593k4067l0951j5550J0345K8961
$$ 40912 18403 -14219 -34431 -26038 4643 31541 33134 9067 -21884 -37434 -27089 1872
767A872K7575M139k4110l2057j3590J2306K7748K4853L055k1904l2564j5726J1995
$$ 1872 29447 33586 9476 -22581 -36171 -23865 3883 28736 31791 9887 -22677 -38403 -26408
780b6408K9029K3686O69k2552k8441j4750J1189K9612K4861Q33k1730k6981j3183
$$ -26408 2621 26307 26976 4424 -24017 -38767 -27578 2034 26895 27728 5998 -20983 -34166
793c4166J1817K9207K4395J618k2267k8347j2011J3438K7052K1372P67k2215k8722
$$ -34166 -22349 6858 31253 32871 10604 -17743 -29754 -16316 10736 32108 32875 10660 -18062
806a8062j3555J2127K7423K0348j041k2479k7840j2089J1827K8379K2561j575
$$ -18062 -31617 -19490 7933 28281 27240 4761 -23079 -35168 -23341 5038 27599 26024
818B6024k4253k5892q910J4020K6570K1888q09k3717k6935r138J6341K7283J9022
$$ 26024 1771 -24121 -33031 -19011 7559 29447 28638 4921 -22014 -31152 -14811 12472 31494
831C1494n337k1388k5987j0414J5613K7785J7880n775k2746k4591p640J5679K7794
$$ 31494 26157 4769 -21218 -31632 -16019 11766 29646 23871 1125 -23466 -31106 -15427 12367
844A2367J8635n283k4462k3436m790J6175K6022J6240m079k5331k4703l759J7157
$$ 12367 31002 25719 1257 -22179 -26969 -10794 15228 31468 27389 2058 -22645 -26404 -9247
857i247K3035J4376o327k3163k3473n754J6079K4324J3070r518k0456k0670m241
$$ -9247 13788 28164 21837 -1326 -24799 -30553 -14474 9850 22920 13402 -7054 -27724 -31965
870c1965J4668K5591J2697q379k2897j7553j410J5131K2413J2364o708k1404j9548
$$ -31965 -17297 8294 20991 12612 -10285 -27838 -29248 -14117 8296 20660 13952 -7452 -27000
883b7000l59J7550K1338R690o645k0816j8110n89J7010K1167Q864q785j8522j5781
$$ -27000 -27359 -9809 11529 21219 14574 -6242 -24352 -24941 -7931 13236 22100 13315 -5207 -20988
897b0988n62J6054K0540J0959q755k0650j3495J583J5437J8566R200r069j9259
$$ -20988 -21550 -5496 15044 26003 17248 -3402 -16897 -15314 123 18689 27889 18820 -439
910d39j5252J475J4983J6750P323r844j8147j5098l8J5207J8194M596q309j7910
$$ -439 -15691 -14216 767 17517 24840 14996 -3151 -18249 -18287 -3080 15114 19710 11401 -6509
924f509j2731m76J4914J7160O958q964j8559j2037K090J4876J4275P003q847j7448
$$ -6509 -19240 -19716 -4802 12358 19316 10352 -8207 -20244 -18154 -3278 10997 18000 9153 -8295
938h295j3000L652J3352J4180N965q951j5847j1642K448J4085J6600K977j0478
$$ -8295 -21295 -17643 -4291 9889 15854 6903 -8944 -20586 -18138 -4053 12547 15524 5046
951E046j2967r418K852J3548J5908L491r550j5522p833M039J3610J3595K011r122
$$ 5046 -7921 -17339 -14487 -939 14969 18460 8910 -6612 -14445 -10406 3204 16799 18810 9688
965I688j4426q947M609J4173J1273Q01q923j3647q424L853J4250J1801p19j0711
$$ 9688 -4738 -13685 -9076 5097 16370 17171 8248 -5399 -13823 -9970 4280 16081 15362 4651
979D651j2015m967M260J1436R671K325j0178j3036n032O394J0213Q513M87q544
$$ 4651 -7364 -12331 -8071 3365 13036 15361 5183 -7853 -12885 -6491 3722 12235 12722 4178
993D178j1979m536N194J0541O866j62p606q892m675L336J0675Q329r82q519p357
$$ 4178 -7801 -12337 -7143 3398 10264 10102 2496 -6396 -11071 -7735 2940 11269 10287 1768 -5589
1008e589k663L637Q342P245k40p170q166k834M643P990M861p39n361q196k664
$$ -5589 -8252 -4615 3727 10972 10732 3562 -4604 -7438 -2795 5195 10056 9317 3956 -4240 -6904
1023f904M505P050M486p22m898o995l523L414P727N523j753o256o029r33L059
$$ -6904 -2399 4651 9137 8415 3517 -3478 -7001 -3587 4140 9663 7910 1654 -4375 -5308 -2249
1038b249N117M849M94o029o356j147K916O316L941p02m944n546j531L615N856
$$ -2249 2868 7717 8211 2182 -4174 -5321 -2405 3911 7852 7150 2206 -3340 -4871 -1256 4600
1053D600L056k100k489m685j670J502O523L798k640m595l003n23L684L623K598
$$ 4600 7656 5556 3067 -1618 -3288 -1786 4737 8535 5895 1300 -1703 -2226 1458 5081 7679
1068G679j82m506l463o5L789L474L35n65m624k631J200L045K739j73j932j874
$$ 7679 7497 2991 -472 -537 3252 6726 7061 6496 1872 -759 441 3486 6225 6052 4120 2246
1084B246o19n65J319K980J239k773l612L52J714J284L89o06m86j434l92O62J379
$$ 2246 1627 1062 2381 5361 6600 3827 215 567 2281 3565 3954 3348 2862 1428 1036 1698 3077
1101C077K95j942j138J19j0P13K604n86m018p94J854K657j342J38j42j132j663
$$ 3077 3372 1430 292 411 401 1114 3718 3132 -886 -1680 174 2831 1489 1627 1485 353 -1310
1118a310L43K778K709j530m397l90J426J466J921J535j484k184r75K93J905J789
$$ -1310 -967 1811 4520 2990 -1407 -1797 -371 1095 3016 4551 3067 883 -92 201 2106 3895
1134C895P14j347k209k707j13N202M217j589l873k497q79O34L878L861O2m067
$$ 3895 4609 3262 1053 -1654 -1767 3435 7652 6063 2190 -307 -1186 -552 3326 7187 7249 3182
1150C182m360k016L516M915K170m43l679m764j389L682M962K214j261l418m285
$$ 3182 -1178 -3194 322 5237 7407 6964 3285 -1479 -2868 814 5776 7990 6729 3311 -974
1165i74j817K386N379M497k638o159l679M24L337L584L948j815n207m431q79L978
$$ -974 -2791 -405 4974 9471 6833 674 -3005 -2581 756 4340 8288 6473 1266 -3165 -4044 -66
1181f6M896K512j112m485o167n61M138O071K604k288n282l707k074K682P302M017
$$ -66 4830 7342 6230 1745 -4422 -4983 -845 5226 7830 5542 260 -3447 -5521 -2839 4463 8480
1197H480l449n942n362K90L281M911O868j992p336p382k52N826O107M231J96q282
$$ 8480 5031 -911 -6273 -5983 -2702 2209 9077 7085 -251 -7633 -7885 -2059 4048 8279 8475 193
1213A93n684k610O307Q611K883k173p674n568k340O311R157N017l819q779o415
$$ 193 -5491 -8101 -1794 6817 9700 7527 -147 -5715 -8055 -1744 7413 12430 8611 -168 -6583
1228f583j79M768R681M325k488r387q100j57Q084R493L272l717j0020p654o52
$$ -6583 -6762 -1994 7687 12012 9524 137 -7963 -8120 -36 9457 12729 9012 -1008 -8662 -9314
1243i314R180J0172L095n426r753q399L39R433R538L474n226j2130p595K266Q824
$$ -9314 -134 10038 13133 7707 -2046 -10445 -10106 -673 8865 12339 7113 -5017 -12612 -10346 -1522
1258a522R402K526n102j2045p378J457J0146J1071K254o669j1332o891J949J0566
$$ -1522 7880 10406 5304 -6741 -14119 -12662 -2516 8555 10809 4140 -7192 -14083 -12134 -1568
1272a568J1312J299p842j0769o055K101J0295J1103K107q598j1291o111M210J0766
$$ -1568 9744 11043 3201 -7568 -13623 -11522 -1227 9876 11983 3385 -7906 -14017 -9807 959
1286I59R395J927p438j1138p181M691J2149R127N17p545j1639n725M308J1553
$$ 959 10354 12281 4843 -6295 -13476 -8785 3364 12491 13008 5463 -6176 -11901 -7593 3960
1300C960R682k42q770j1385m968L803J0251J0587Q53j0090j2305m648N562J0650
$$ 3960 13642 13400 4630 -6755 -11723 -7920 2331 12918 13771 3681 -8624 -13272 -7710 2940
1314B940Q726J008r353j1699n642N310J1830Q597l49r308j0854o163N351J2508
$$ 2940 11666 12674 3321 -8378 -14020 -8710 3120 11717 11368 2060 -8794 -14957 -9606 2902
1328B902R204j028r187j1235n664M926J2018J0178j14j0661j2407m549O801J1286
$$ 2902 12106 11078 1891 -9344 -15008 -10082 1936 12114 12000 1339 -11068 -15617 -8816 2470
1342B470Q961J24j0084j2492m654O957J2881Q782j335j0396j2072m295O193J3132
$$ 2470 11431 11555 1471 -11021 -15675 -8718 4163 12945 11610 1214 -10858 -15153 -8960 4172
1356D172R829k421j1782j2278l305P428J3218Q732k245j2120j2456k706Q218J2747
$$ 4172 14001 11580 -202 -12480 -15785 -8357 4861 13593 11348 -772 -13228 -15934 -7716 5031
1370E031Q206j974j1995j1996m422R407J4244P518m435j1669j0880k138P848J3484
$$ 5031 13237 11263 -732 -12728 -17150 -7743 6501 14019 9584 -2085 -12965 -15103 -7255 6229
1384F229Q272l981j3246j0784j740R984J2198P125l626j2890j1934n37J0528J2145
$$ 6229 14501 10520 -2726 -13510 -15250 -5266 6932 14057 10431 -2459 -14393 -14930 -4402 7743
1398G743O109l931j2132j1568q30R890J4325O147o262j2425r963n02R559J3448
$$ 7743 13852 9921 -2211 -13779 -14609 -4719 9606 15753 9491 -2934 -12897 -13399 -3840 9608
1412I608N897o437j2747r048k93R513J2921N362n976j3372j0010J171J0967J1801
$$ 9608 15505 9068 -3679 -12727 -13020 -3507 9414 14776 8800 -4572 -14582 -13411 -2444 9357
1426I357L908n625j2274j0007O88J1185J2088M086p027j2392q588J141J0345J1881
$$ 9357 13265 7640 -4634 -14641 -13953 -2768 9320 13406 6379 -6013 -14601 -13460 -3115 8766
1440H766M512p184j2828p723J613J0139J1900M530p083j2850q253K654J0940J1163
$$ 8766 13278 6094 -6734 -14457 -12844 -2705 9195 13725 6642 -6208 -14461 -11807 -867 10296
1454A0296K857o176j1475r010J447J1702J1865L013p530j1710q558K182J1402
$$ 10296 13153 6977 -4498 -13508 -12061 -359 11506 14519 6989 -4721 -13279 -11097 305
1467C05J1838K621q051j1731p654K662J0467J0965L781q069j3697p370L742J1279
$$ 305 12143 14764 6713 -5018 -12672 -10010 457 11422 15203 7134 -6563 -13933 -10191 1088
1481A088J0209K489q052j2768p304L211J1800J1186J354r124j2274n936L514J1456
$$ 1088 11297 13786 5734 -7034 -14338 -11127 673 11859 13213 4089 -8185 -14121 -10607 849
1495H49J0872R37r317j2349n074M422J1054R914Q13r213j1987n773N125J2398
$$ 849 11721 12658 3341 -9008 -14082 -9660 1394 11308 12121 2908 -9079 -14852 -9727 2671
1509B671Q825q65q009j0907n573N491J1525R018p42r126j0803m456N767J0550
$$ 2671 11496 10631 2622 -8285 -13858 -8367 3158 12176 11434 2308 -8495 -12951 -7184 3366
$$ [...]
8191f83
##END NTUPLES=NMR FID
##END=
