##TITLE=1H_KYU-20
 CDCl3, 108 sc, 
 13.3.2019
##JCAMPDX= 6.0         $$ Bruker NMR JCAMP-DX V2.0
##DATA TYPE= NMR FID
##DATA CLASS= NTUPLES
##ORIGIN= UXNMR, Bruker Analytische Messtechnik GmbH
##OWNER= root
$$ XWIN-NMR		Version 3.5
$$ Wed Mar 13 16:21:54 2019 Russian Standard Time (UT+4h)  she@DPX200
##.OBSERVE FREQUENCY= 200.1315
##.OBSERVE NUCLEUS= ^1H
##.DELAY= (6, 6)
##.ACQUISITION MODE= SIMULTANEOUS
##.ACQUISITION SCHEME= undefined
##.AVERAGES= 108
##.DIGITISER RES= 16
##SPECTROMETER/DATA SYSTEM= spect
##.PULSE SEQUENCE= zg30
##.SOLVENT NAME= CDCl3
##.SHIFT REFERENCE= (INTERNAL, CDCl3, 0, 15.7039)
##AUDIT TRAIL= $$ (NUMBER, WHEN, WHO, WHERE, WHAT)
$$ ##TITLE= Audit trail, XWIN-NMR		Version 3.5
$$ ##JCAMPDX= 5.01
$$ ##ORIGIN= Bruker BioSpin GmbH
$$ ##OWNER= she
$$ F:/spectra/data/she/nmr/H-F/1/audita.txt
$$ ##AUDIT TRAIL=  $$ (NUMBER, WHEN, WHO, WHERE, WHAT)
(   1,<2019-03-13 16:20:35.03 +0400>,<she>,<DPX200>,
      <continue with go, POWCHK disabled, PULCHK disabled
       configuration hash MD5:
       00 E9 B6 7A A2 85 ED C7 34 08 36 98 17 FE 4E 26
       data hash MD5: 16K
       35 A3 4B D4 49 12 F3 24 73 DF 2F 08 7F CB 2D 8C>)
$$ ##END=
$$ 
$$ hash MD5
$$ E2 34 BF 28 19 F8 AE D1 2B 28 67 C2 60 82 AC 64
##$RELAX= 
##$RELAX= 
##$RELAX= 
##$RELAX= 
##$RELAX= 
##$RELAX= 
$$ Bruker specific parameters
$$ --------------------------
##$DU= <F:/spectra>
##$EXPNO= 1
##$NAME= <H-F>
##$PROCNO= 1
##$TYPE= <nmr>
##$USER= <she>
##$AMP= (0..31)
100 100 100 100 100 100 100 100 100 100 100 100 100 100 100 100 100 100 
100 100 100 100 100 100 100 100 100 100 100 100 100 100 
##$AQSEQ= 0
##$AQ_mod= 1
##$AUNM= <au_zg>
##$AUTOPOS= <>
##$BF1= 200.13
##$BF2= 200.13
##$BF3= 200.13
##$BF4= 200.13
##$BF5= 200.13
##$BF6= 200.13
##$BF7= 200.13
##$BF8= 200.13
##$BYTORDA= 1
##$CFDGTYP= 0
##$CFRGTYP= 5
##$CHEMSTR= <none>
##$CNST= (0..31)
1 1 145 1 1 1 1 1 1 1 1 1 1 1 1 1 1 1 1 1 1 1 1 1 1 1 1 1 1 1 1 1 
##$CPDPRG= <>
##$CPDPRG1= <>
##$CPDPRG2= <>
##$CPDPRG3= <>
##$CPDPRG4= <mlev>
##$CPDPRG5= <mlev>
##$CPDPRG6= <mlev>
##$CPDPRG7= <mlev>
##$CPDPRG8= <mlev>
##$CPDPRGB= <>
##$CPDPRGT= <>
##$D= (0..31)
0 1.2 0 0 0 0 0 0 0 0 0 0.03 0 0 0 0 0 0 0 0 0 0 0 0 0 0 0 0 0 0 0 0 
##$DATE= 1552479464
##$DBL= (0..7)
120 120 120 120 120 120 120 120 
##$DBP= (0..7)
150 150 150 150 150 150 150 150 
##$DBP07= 0
##$DBPNAM0= <>
##$DBPNAM1= <>
##$DBPNAM2= <>
##$DBPNAM3= <>
##$DBPNAM4= <>
##$DBPNAM5= <>
##$DBPNAM6= <>
##$DBPNAM7= <>
##$DBPOAL= (0..7)
0.5 0.5 0.5 0.5 0.5 0.5 0.5 0.5 
##$DBPOFFS= (0..7)
0 0 0 0 0 0 0 0 
##$DE= 6
##$DECBNUC= <off>
##$DECIM= 2
##$DECNUC= <off>
##$DECSTAT= 4
##$DIGMOD= 1
##$DIGTYP= 9
##$DL= (0..7)
0 120 120 120 120 120 120 120 
##$DP= (0..7)
150 150 150 150 150 150 150 150 
##$DP07= 0
##$DPNAME0= <>
##$DPNAME1= <>
##$DPNAME2= <>
##$DPNAME3= <>
##$DPNAME4= <>
##$DPNAME5= <>
##$DPNAME6= <>
##$DPNAME7= <>
##$DPOAL= (0..7)
0.5 0.5 0.5 0.5 0.5 0.5 0.5 0.5 
##$DPOFFS= (0..7)
0 0 0 0 0 0 0 0 
##$DQDMODE= 0
##$DR= 16
##$DS= 0
##$DSLIST= <SSSSSSSSSSSSSSS>
##$DSPFIRM= 0
$$ [...]
##$SUBNAM2= <"">
##$SUBNAM3= <"">
##$SUBNAM4= <"">
##$SUBNAM5= <"">
##$SUBNAM6= <"">
##$SUBNAM7= <"">
##$SUBNAM8= <"">
##$SUBNAM9= <"">
##$SW= 330.908255636489
##$SWIBOX= (0..15)
0 0 2 0 0 0 0 0 0 0 0 0 0 0 0 0 
##$SW_h= 66225.1655629139
##$TD= 16384
##$TD0= 1
##$TE= 0
##$TE2= 300
##$TE3= 300
##$TEG= 300
##$TL= (0..7)
0 120 120 120 120 120 120 120 
##$TP= (0..7)
150 150 150 150 150 150 150 150 
##$TP07= 0
##$TPNAME0= <>
##$TPNAME1= <>
##$TPNAME2= <>
##$TPNAME3= <>
##$TPNAME4= <>
##$TPNAME5= <>
##$TPNAME6= <>
##$TPNAME7= <>
##$TPOAL= (0..7)
0.5 0.5 0.5 0.5 0.5 0.5 0.5 0.5 
##$TPOFFS= (0..7)
0 0 0 0 0 0 0 0 
##$TUNHIN= 0
##$TUNHOUT= 0
##$TUNXOUT= 0
##$USERA1= <user>
##$USERA2= <user>
##$USERA3= <user>
##$USERA4= <user>
##$USERA5= <user>
##$V9= 5
##$VALIST= <valist>
##$VCLIST= <CCCCCCCCCCCCCCC>
##$VD= 0
##$VDLIST= <DDDDDDDDDDDDDDD>
##$VPLIST= <PPPPPPPPPPPPPPP>
##$VTLIST= <TTTTTTTTTTTTTTT>
##$WBST= 1024
##$WBSW= 4
##$XGAIN= (0..3)
0 0 0 0 
##$XL= 0
##$YL= 0
##$YMAX_a= 657073
##$YMIN_a= -300913
##$ZGOPTNS= <>
##$ZL1= 120
##$ZL2= 120
##$ZL3= 120
##$ZL4= 120
##$ABSF1= 10
##$ABSF2= 0
##$ABSG= 5
##$ABSL= 3
##$ALPHA= 0
##$AQORDER= 0
##$ASSFAC= 0
##$ASSFACI= 0
##$ASSFACX= 0
##$ASSWID= 0
##$AUNMP= <proc_1d>
##$AZFE= 0.1
##$AZFW= 0.1
##$BCFW= 1
##$BC_mod= 2
##$BYTORDP= 1
##$COROFFS= 0
##$CY= 11.3945322036743
##$DATMOD= 1
##$DC= 2
##$DFILT= <>
##$DTYPP= 0
##$F1P= 18.9103706918063
##$F2P= -1.10871071338519
##$FCOR= 0.5
##$FTSIZE= 0
##$FT_mod= 4
##$GAMMA= 1
##$GB= 0.15
##$INTBC= 1
##$INTSCL= 1
##$ISEN= 128
##$LB= 0.24
##$LEV0= 0
##$LPBIN= 0
##$MAXI= 10000
##$MC2= 0
##$MEAN= 0
##$ME_mod= 0
##$MI= 1.114404
##$NCOEF= 0
##$NC_proc= 0
##$NLEV= 6
##$NOISF1= 3.799351
##$NOISF2= 2.8
##$NSP= 1
##$NTH_PI= 0
##$NZP= 0
##$OFFSET= 15.70392
##$PC= 1
##$PHC0= -9160.786
##$PHC1= 19.60026
##$PH_mod= 1
##$PKNL= yes
##$PPARMOD= 0
##$PSCAL= 0
##$PSIGN= 0
##$REVERSE= no
##$SF= 200.130013532006
##$SI= 16384
##$SIGF1= 3
##$SIGF2= 2
##$SINO= 400
##$SIOLD= 16384
##$SREGLST= <1H.CDCl3>
##$SSB= 0
##$STSI= 0
##$STSR= 0
##$SW_p= 3612.71676300578
##$SYMM= 0
##$S_DEV= 0
##$TDeff= 0
##$TDoff= 0
##$TI= <>
##$TILT= no
##$TM1= 0
##$TM2= 0
##$TOPLEV= 0
##$USERP1= <user>
##$USERP2= <user>
##$USERP3= <user>
##$USERP4= <user>
##$USERP5= <user>
##$WDW= 1
##$XDIM= 8192
##$YMAX_p= 0
##$YMIN_p= 0
$$ End of Bruker specific parameters
$$ ---------------------------------
##NTUPLES= NMR FID
##VAR_NAME=  TIME,          FID/REAL,        FID/IMAG
##SYMBOL=    X,             R,               I
##VAR_TYPE=  INDEPENDENT,   DEPENDENT,       DEPENDENT
##VAR_FORM=  AFFN,          ASDF,            ASDF
##VAR_DIM=   8192,          8192,            8192
##UNITS=     SECONDS,       ARBITRARY UNITS, ARBITRARY UNITS
##FACTOR=    1.51e-05,      1,               1
##FIRST=     0,             0,               0
##LAST=      0.1236841,     0,               0
##MIN=       0,             -300913,         0
##MAX=       0.1236841,     657073,          0
$$ Real data points
##PAGE= N=1
##DATA TABLE= (X++(R..R)), XYDATA
$$ [...]
2757d44K102k296N38l92N67P25n87m19r83J300j056J68o0J023k5j60J95K81l33
2776A44n9l88J057j352N35m33M90l64K7N08l92K61J331j826R2O50J1q15R46m74
2796e1M14n68P68j335Q73O04kR89j175n6j210J412o25k42k80N70n24l52RP16J462
2817A397j335J96l3p9o83O34n59J75Q88m53m67O78k79J72L40r99m21K86J254n19
2837A93j90J91q50P26j289Q83M75k96o8N22M86p14l22J051j483J124o74N89n80
2856b26K48j6k87M7m12R57M01k67ll69m17k76M43N7o2N30j9N09j570J842q65m3
2878B02n06o47J619j82K5o88L84r44K82K72J35k56N00n45L76N0k13j29N6J151
2898I42r99m0l3M19Ko9M17j093J020r96Q78j369M21J625P6j893R1R67j604J337
$$ y = [-444, 1658, -638, -100, -492, 75, 800, 213, -206, -1189, 111, -945, -777, -837, 186, 161, 1, 196, 477, 144, 85, -303, 754, -598, -63, -496, -6, -370, -343, 165, -227, 34, 1365, -461, -369, 281, 292, -523, 423, -51, 363, -205, 563, -772, 101, 705, 703, 1692, 517, 461, -749, 663, 38, -204, -484, 86, -438, -790, -781, -65, 1397, 62, 258, 225, 146, -537, 97, -462, -287, 601, 148, -319, 359, 80, 252, 592, -407, -828, -542, 712, 193, 3, 194, -656, 70, -1219, -336, 139, -157, -225, 297, 783, 69, -253, 798, -685, 439, -235, 354, -226, 22, 6, -281, -234, -646, 311, 712, 445, 442, 73, -344, -620, -177, -120, -182, 348, 329, 838, -732, 1110, 245, 202, -304, -951, 668, 486, 511, -177, 207, -737, -455, -183, -48, -304, 196, -349, 27, 77, -136, -265, -209, 942, -57, -97, -130, 289, 291, 222, 639, -454, 566, -430, 448, -921, -500, 1125, 1201, -692, -601, 366, -1238, 99]
2918I9J49M05o99Q84o76l80m76K01l93J74O65N92r91P68J57r29j01L90P92j958
2938a327R45K24L18m42J224j327n44m87J227J89L2N52r45j94M04J156J6m66o72
2957a17n9J091n18p11M53m62J470j174J175j107n88Q51M21n08k98j45L03L23q53
2976d53k38J669r51K72p18J19Q78N79j013O6N69j483J100o80K10P8L96n58N10
2995C52j078M50Q7O94j98n77O93n68r75J309j166Q95k53J026p21j34M05r36J158
3014D63j078P28j06L61n06N21k71n11N16O99j184J180n58r11Q42j063R36J97p77
3033e22J098o92J92N19p74L44l12j81K64p73Q21l46O78k45M94n59K51J66m66M34
3053C91r08O65L55j167k07J426l8j714J364m24L41L5l06L70q45P44J40J28j040
$$ y = [99, 248, 653, -46, 838, 162, -218, -694, -493, -886, -712, -47, 545, -446, 322, 479, -450, -551, -161, 631, -1327, -382, -158, 160, -282, 942, -385, -929, -1416, -189, 0, 32, 584, -361, -555, -151, 1005, 1021, 555, -117, -176, 915, 397, -314, 139, -323, 1147, -27, 1148, 41, -547, 304, 725, 217, -81, -226, 77, 400, -453, -691, 978, 27, 299, -419, -300, 578, 1157, 144, 210, 779, -704, 396, -284, -74, 4, 400, -158, 352, -726, -276, -189, 505, 307, -270, 423, -145, -1120, 189, -977, -82, -335, 691, -30, -164, 241, -695, 463, -615, 113, 7, 368, -138, 383, 112, -399, 117, 816, -368, 812, 254, -657, 185, -878, 58, 255, -522, 576, -116, 76, 595, -179, 165, -147, -328, -64, -837, -16, -362, 316, 71, 565, 6, 257, 423, -43, 391, -517, 148, 503, -664, -871, 555, 517, -1197, 167, -257, 84, 119, -187, 183, -662, 82, 222, 350, -690]
3072f90L40L10Q20j096L15J87n23p0K95Q20m82j92K01k63k04P26L0j078J151j114
3092e17R83J314j246q51Q13n96j4J97r49P61L09J011j314j095J465P50j286K29
3110c6L36k38J016j525o9p6O75m01j36N37o01p3j22N58M74o94k46j85j89N54K28
3131b13Q61q80M08p68N31p87k68R28k85Q08j840K140j137Q0N85K30k78O38r76
3150b23J48l44m82O61j28N4J104J0j024n27J31Q12K40L61j144N09l68N61N43q79
3170A5M24n08P83p52n54j3J155n53J61J69k30P21n89M00k096K227j614Q59O44
3189F49or92J149n71o65R70k77q02M81N00k20m94l9k55l56K26J480n46K45j105
3209f28l52J198l04L93q66M59k24R01L87j476J288r61m02M44J301o50n21O53o83
$$ y = [-690, -350, -40, 780, -316, -1, 186, -337, -407, -112, 708, 226, 34, 235, -28, -232, 494, 524, -554, 597, -517, 466, 1780, 534, -317, 496, -100, -114, 83, -866, -105, 204, 1215, -99, -1194, 271, 1021, -265, -36, 300, 62, 1078, -447, -516, -592, 83, -318, -454, 83, -518, -591, -713, -155, 319, -375, -621, -806, -995, -441, -213, 648, -232, 176, -592, -61, -848, -1116, -188, -473, 335, -1505, 635, -502, -422, 163, 393, 115, 753, -223, -75, -419, -901, -240, -368, -314, 790, 800, -224, -751, -620, 192, 432, 793, -351, 158, -210, 351, 894, 15, 439, -69, 714, -38, -592, -605, 550, -3, 158, 327, 97, 818, 229, 629, -1467, 760, -854, 5, 649, 643, -349, 800, 229, -436, 534, 257, -545, -64, 436, 216, -278, -317, -572, -928, -702, 778, 232, 477, -628, -980, 218, -86, 307, -559, -100, -324, 577, 964, -512, 776, -185, -587, -143, 1158, 508, -13, 640, -43]
3228d3P00p54Q16l92j290N74J741o65M50k037J522N01j553K25R14j75q76N95p96
3247e43J179m07J32m85j87l5J193j79r58j59K03L2N65Rm62O91j388J133m63P8
3267e1r1rm05L6K70L30N70n83j42k94j0J419j725J191L93j878P46L02q01P37r5
3288i0r78J868j245L1P58m3j08J96q22J198j211j60O33j257J136o33Q97r22l04
3307a056J785o06m42R9j76O22K24o22J07r38J289l68M02j074Q93k82L19j180Q65
3326a39P23N69J49q99P58p52n36P79k72p01L57k94R0r7K14j64L73q7L50P5m86
3347A0r7n67L00M44o43j31J0K49J550o78n02m8M81j284N86P8J285q87p08M62Q09
3368G19r40k12o8J387q70l58P62j110Q81r74K087j158L67N48r71n14N25j136J573
$$ y = [-43, 657, -97, 719, 327, -963, -389, 1352, 687, 1137, -900, 622, 1123, -430, -205, 709, 534, -342, 253, -543, 636, 229, 361, -124, -311, -346, 847, 668, -290, -449, -246, -214, 351, 360, -102, 589, -799, 334, -129, -51, -142, -151, -556, -520, -250, 80, 650, 67, -75, -369, -379, 1040, -685, 506, 899, -979, -233, 69, -732, 5, -90, -1068, 800, -445, -414, 344, 301, 193, 389, -433, 765, -446, -606, 27, -1230, -94, -727, 170, -752, -1056, 729, 123, -319, -220, -396, 226, 450, -172, -65, -1003, 286, -82, 320, -754, 139, -143, 176, -1004, -139, 584, 1153, 1302, 403, 1161, 409, -127, 652, 380, -321, 36, -258, -168, -265, -51, -215, 158, 71, 421, 496, 10, -87, -654, -354, 90, -553, -684, -674, -425, 1125, 447, -55, -103, 378, -906, -320, -242, 1043, 156, -552, -90, 719, -221, -433, -501, 886, 16, -342, 420, -690, 191, -783, 1304, 146, 513, 1061, 90, -424, 101, -1035, 538]
3387E38ko81N42N76o05o53J319j832R67Q26j090l3M57l02j15k54R73j43j017M74
3407e5J89j045M70n31J797j041K26M06K11j017J39k5L21r2j45n51J386j434N97
3426a94R30j031J046q47P79n98J27M3R0l56j3j23J04R2N58j22L8j20O09k714J560
3447a42L70m74R71J25l64j28J0O66n29M9k52j50M29N9m39r56N02O7l94J259r49
3468b70K77m12L78L87m91k31J67J0m7O54j571J317k78j99m03N11P07m42o69P28
3488A23J06J76Oj825K023j158M10J228j201Q32r42J23K2o87J131j97m42K72J92
3507A92M26j050O06k68N24J33o96K19M5m40nK7j223J847j253J032l32O37N1J19
3527E91l75m87l18O90k79L57j39j138J77L08K403j702L93o8j432J212J88L31j221
$$ y = [538, 536, -145, 397, 973, 368, -285, 1034, -798, 169, 995, -95, -128, 329, 27, -88, -342, 631, 488, -529, -55, 134, -911, -441, -972, 825, -216, 10, 416, 627, -390, -251, -276, 45, -47, -192, -743, 643, -791, -194, 736, -295, 751, -96, 683, 85, 212, 255, 345, -11, -24, -147, -43, 49, 607, 485, 523, 403, 1012, -1702, -142, 228, -246, 725, 850, 486, 358, 368, 1034, 505, 554, 302, 152, 581, 640, 201, -755, -253, -186, -580, 679, -270, 7, -405, -27, 360, -131, -362, -195, -185, -232, 422, -1149, 168, -110, -309, -712, -201, 506, 64, -605, 123, 229, 405, 411, -1414, 609, -549, -139, 1089, -112, 720, -222, -99, -77, -764, 367, 170, -272, 0, 192, 618, -432, 174, -94, 430, 563, -133, 86, 131, -309, -314, -287, -1510, 337, -916, 116, -216, 421, 472, 591, 216, -271, -589, 101, -178, 179, 40, -1098, -921, -613, 1790, 88, 481, 413, -1019, 193, 381, 712, -509]
3546e09J308p43O79J47o66r53Q99k22J190j084k38O53N2j272J111n83o06j22O26
3565c33p34M26N02m56M71Q5k48M00q9k82K9O37n57O56r67l80J913j417P65o84
3585b63O18j11o6n01L06jm68P70j28l64O39r98R67P9L25l82o16R83k5K60n61j078
3607f15N44P95j078K95l59l52J814j436j58N75m57N06l01L68p16P2P84n97J347
3626A031j597L46j058N00K71J310m62n55j58p1M14L98m73j192J450n39l69M65
3644b89q7L2N44m13K55M4N71o75l26Q30K12J06j333O02Q6L07o22M37N35j68o75
3665b7J78n50J731p62j469J422L30q59p66N06j4P33p02j34j37K59J08P03o56P7
3685b9m30J36N40r81P68j067J369n0K06l99N21o10m7Q21j102P94j152J040q39
$$ y = [-509, 799, 56, 735, 882, 216, -737, 162, -60, 1130, 46, -192, 461, 513, -759, 352, -231, -837, -959, -333, -1067, -641, -139, -595, -124, -39, -287, 113, 24, -258, -229, 408, -149, 507, -460, -840, 1073, -344, 421, -263, 355, 244, 178, -323, -17, -18, -486, 284, 156, -208, 431, -567, 400, 479, 804, 422, -194, 789, 764, 1024, 463, -615, -71, 724, -354, -59, -418, -770, 1044, -392, -550, 25, -432, 74, -227, 141, -575, -503, 281, -316, 1031, -566, -220, -1278, -778, -507, 803, 341, -214, -372, -443, -29, 369, -104, -1296, 154, -385, -754, -289, -376, -344, 200, -213, 42, 86, 657, -18, -344, 486, 698, 804, -529, 73, 159, 466, -156, 281, 816, 648, -27, 151, -399, 1332, 570, -899, 523, 853, -6, -772, -266, -280, 453, -249, -383, -520, -261, -153, 550, -106, -29, -459, -323, 217, -764, 4, -1063, 306, 256, 462, 63, 584, -26, -73, 748, -354, 440, -712, 328, -511]
3704e11M72J46N0Q2m2r91J039n15K44M83m27K92l48q68K084j154p88K22J738j183
3724B5o92L5N34P57r30q1n28J470j809J611k47J2M32r84Q04o23LQ3m4J143j030
3745e9K87M79j112J69J107j05o25O84q46P96q47l8p71J028j001J453n27O7K42
3764C81j89n49M43j199J823n25j026J512k98j219L96R49n21M74j8n67l45J066
3782E88j249J87L60K21m32N70j205J179n62M78O7j109R97K34K18j043j20R42n93
3801b72J79o13J67O04M5j57n36J05O29p50M71Q65p77K16m31j44K74n2N26r3M33
3822F89l18j220O79J11k00p95P53j61J23J32K16J15J71n65O26o32L1K56N63j199
3842f25J100L2K04o20n14N13m66P06k0o79q1L05J179j364K51K82K37j70q72P20
$$ y = [-511, -39, 107, 157, 239, 197, -794, 245, -270, -26, 457, 30, 322, -26, -894, 1190, 36, -752, -530, 1208, 25, -667, -632, -98, 659, -271, -352, -880, 590, -1219, 392, 145, 157, 589, -395, 409, -214, -211, -128, -172, 971, -59, 228, 707, -405, -236, 871, 766, 141, 825, -21, 775, -72, -110, -881, 147, -854, 599, 72, 139, 381, 192, -357, 86, -1113, 710, 185, -841, 671, 373, -846, -450, 499, -22, 452, 434, -133, -478, 588, -661, -474, -114, 107, -325, 245, -960, 219, -343, 135, 202, -907, 90, 324, 542, -501, -621, 321, -272, -93, -706, -539, 65, 110, -47, -583, -478, 151, -599, -128, 737, -40, 176, -255, -399, -125, -177, 349, 256, 689, 371, -849, -170, -59, -259, -1054, -301, -462, -339, -207, 9, 124, 295, -270, 356, -276, -245, 11, 574, -625, 475, 507, 711, 91, -423, 90, -376, 330, 310, -369, -450, -145, 1034, -330, -79, 203, 440, 270, -602, 118]
3862A18o66P46m34N1O34n54J604j070r27Q01j81MP5N27n80O51o93K20l5l07j14
3883a30k7n79M85L23l78K66L72j99m9j50n62J292j86k26Q21j262k61Q5j5P71l13
3904G8m76R5p73J027J6r6O66M6m50L71j86q84k49K97O39l67K21R5j102J153n70
3925d49Q09r13O60O6l59k19k41k67P68O2M4Q3J32m97P23m20L70J76m75o38K85
3946c00N10J94np67J30J37K45q73J311O8k80k49M9r10N56J68Q03j559J404n16
3966A16r1J26o16J67P09m0p47l28L22J16m16o8J157lQ63j910P71k48N90L57r85
3987a58K51q3j98l16P56nK6l15m38Q46n07m82k37P11j25M70k64m34P04L42j218
4008f74J8L92K19Q00j320J683o93j55r30R1m70J453k89L8j156J674j914J605k43
$$ y = [118, -548, 198, -236, -185, 449, -105, 1499, 429, -498, 303, 122, 126, 201, 728, 148, 799, 106, 326, 291, -16, -130, -157, -736, -251, 72, -306, -40, 332, 133, 84, -66, -628, 664, 478, 252, 1073, -189, -450, -365, -380, 391, 78, -398, -303, -1076, -49, -33, -129, 537, 583, 133, 504, 318, -566, -815, -518, 121, -246, -25, 70, -1032, 121, -449, 360, -553, 107, 173, -186, -405, -646, -913, -145, -83, -39, 44, 176, -321, 402, -18, 352, 528, 53, -585, -300, 210, 404, 399, -368, -238, -101, 144, -729, 582, 650, 370, 121, 170, -740, -184, -16, 787, -772, 632, 116, 25, 151, -465, -298, 411, 371, -376, -704, -382, -266, -682, -750, 407, 404, 1267, -643, 128, -120, 470, 827, -158, 93, 10, -188, -504, 252, 247, 273, -42, -480, 366, -141, -623, -860, -149, -274, 196, -68, -502, 202, 544, -674, -656, -264, -45, 755, -565, 1118, 425, 270, -660, -569, -1039, 414, 125, 163, -993, 681, -1233, 372, 129]
4027A29o47P23n7o5k01O72q45L37k7j80m78M65l71P93j38J074j163j78N86j0k07
4048B12K2K87r53N34l96R50m4l49m15K19n05q0L86oR80o59K2n26Q61j253J338
4069F25M78l55m9r2l23j631J288R9j97J17l26J73j05M44n0k91M74j03m02n61Q08
4090B1m79J168n16M4q01J428j468K67j6N54o06q63J987j87o34k88N10J6Q75j353
4110c41l31J348j306PN25n48k90J050l22k91J067l95k48m29P36j49j04J33J8j78
4130d8N64q18L44k97L17J65N63p70r91J502n17n15J305j209N46M10k42j76k69
4149a36L30R15j242J9j133J156K00q02J012J52r81k55J086j223L37K95o73J076
4167A33j59p45LJ179j073J221q22R11l23l03L3L5j47M57n29L87o55O95K81p24
$$ y = [129, -518, 205, 148, 83, -118, 554, -291, 46, 19, -161, -639, -174, -545, 248, 110, 1184, 21, -157, 429, 419, 212, 234, 521, -432, 102, -294, 656, 612, 263, -152, 67, -438, -518, -132, -138, 842, 183, 205, -321, 540, -713, 625, 1103, 748, 699, 607, 284, -1347, -59, 40, -157, -40, -366, -193, -298, 146, 96, -195, 279, 176, -226, -787, 21, -458, 710, 194, 238, -563, 865, -603, -336, -352, 202, -404, -1267, 720, 533, -101, -389, 121, 137, 1012, -341, -672, 676, -630, -623, -98, -646, -936, 114, -208, -499, 568, 173, -75, -504, 232, 83, -21, 112, 130, -48, 516, -302, 42, -255, 62, 227, 790, 20, -971, 531, 14, -501, 804, -405, 141, 551, 309, 133, -136, 194, 1109, -133, -114, -1247, -91, 109, -693, 319, 471, -510, -765, 321, -902, -565, -270, -943, 133, -26, -771, -768, 411, -662, 559, -263, 648, 325, 22, 55, 90, -57, 400, -129, 258, -397, 298, 579, -145]
4187a45l58M91J15k51N33p3o42J593j944j04N58m07Q90m53k92K26J522o81n67
4206A1j705J770K39j71M03k83K58m27K89j151m57K194j359Q81j386O85J209j429
4224d29N68L61m83l85J057r38l39J177j138M6R29j132N97Q16o01j66jr74O71L75
4244A1J2L8n12J9R07n58N45r66L78M06n76n8P5K82p1j21L44l03k84O85L47n92
4266Hk37Q07j617Q14k41K28l66N94O52l32j093J004M40j231k08J042l54O9N73
4285E52o68k26Q75j24o78M8K48N6K01J66o42N72j32l73J212q2j843O21R27N81
4305A291j049o1J20n32N60j34k05n87J025p40O69r76Q78n99J193p05j71m56J700
4324A221j189n02k62M66k25J71m95O31l52N98q58R24p9m14K84J152K11j007k86
$$ y = [-145, -503, -12, 103, -148, 385, 312, -330, 1263, -681, -785, -227, -634, 256, -197, -489, -263, 1259, 578, 11, -1694, 76, 315, 144, 547, 264, 522, 95, 384, -767, -1224, 970, -389, 492, -894, -209, 1000, -429, 139, 500, 17, -368, 689, -249, -588, 589, -549, -503, 426, -706, -109, 707, 106, -60, -61, -1035, -364, 11, 23, 61, -451, -432, 475, -83, 462, -504, -126, 280, -296, -354, -279, 3, -68, -189, 155, -148, -432, 253, 600, 8, -229, 578, -1039, -225, -466, -238, -604, -10, 642, 310, -783, 221, 661, -570, -778, 264, -90, -21, 552, -116, -342, 533, 409, -269, -221, 27, 83, 284, 450, -192, 380, 248, -125, 1087, 1005, -838, -217, 710, 1291, 242, 181, 301, -231, 329, 195, -10, -597, 428, -312, 357, -619, 259, -340, 853, 148, -23, -479, 1221, 32, -470, -732, -266, -491, -320, -815, -184, -536, 62, -796, 128, 49, -365, -81, 1071, 1282, 275, -11]
4343a1j7m31R08N34j139K05l72J285k01o84m77n65J457l56l30O73n23Q4n44J81
4363c23N22j22M58o16L55J53l68l20J50o53J294m06%m98O5M52J55o88k49J82P11
4384B54n16L47k36K13o68M97o4n39O72R6M85o65O40n71M07p30K52n18J001r24
4404e67r2p4N75J42j11k19O86j80O74j321J88p07J614n49J8P56l80o19q6K28l5
4425e9o2k20J17J240j99o47N92p33l31P41R51o83j097M03j288R16Q20j1o32m41
4445f23J769m51n66J43j92K89j40J114j827M70J86m20J451j865R02l23K93k18
4463hn7m73O0J532j530O36r05K92N53N84j86l63r00J141q79N17Q7k35k0N70j43
4484B73p54O67j53k22L5J89j66j133J277J88J97o50L05r78R20o75Q42m68j304
$$ y = [-11, -28, -459, 449, 983, -156, 49, -323, 962, 761, 77, -400, -965, 492, 136, -194, 479, -44, 40, -504, -323, 199, 77, 535, -81, 274, 427, 59, -261, -111, -764, 530, 124, 124, -374, -309, 143, 298, -390, -639, -457, 254, -262, 85, -151, 62, -606, -109, -173, -712, -40, 56, 541, -124, 516, -55, 352, -378, -126, -644, 357, -567, -659, -733, -158, -16, -127, -346, 340, 160, 834, -487, -299, -1006, 608, 59, 77, 833, 453, -166, -252, -24, -59, -121, -341, -224, 1016, 817, 170, 762, 29, -302, 439, 1390, 707, -390, 13, -1275, -359, 461, 450, -182, -623, 1146, 695, 129, 272, 80, 369, 229, 1343, -484, -14, 172, -248, 1203, -662, 240, -83, 210, -8, -65, -538, -478, 1054, -476, 160, -745, -453, 100, 684, 498, 135, -765, 376, -503, 14, 101, -134, -154, 416, 273, -481, 186, 33, -189, -154, 35, -131, -1264, 13, 201, 398, -252, 53, -925, -5, -680, 162, -306, -1610]
4503a610J365j69J183q34J45K40j00q58j61k39J660l95o99J39J85p6O88j32o76
4522c44j84r7N64q29O55J091o44o55O43r31P96q8l10q9R54k34L2J000j269M12
4542D73n08j222J605l48r01J156l85M06k65R1P2J29J36j053R81m89l6m47J48J531
4562A074r49k83Q74n79m09O55M71l35J59M76j291M73r66J793q87k46j00j54j03
4581c27N57M47p88J96K72K27m25n8P12r50J75o82R90R07j084n08m41N88k96J056
4601E68p82J54J105j463O13k01J34n1P76j660L27J413j365M64L82m08J99L48m45
4620A08m44K32m85j63O93O96j196J089M3n25r37N30J015q23O85m29l64N90j237
4639i22N09O90p90J177m95j268J443k64J6m34J340j129MK33k14k74J104q18K36
$$ y = [-1610, -245, -414, 769, -65, 80, 320, 220, -638, -799, -1038, 622, 227, -472, -333, -148, -224, 464, 332, -344, -528, -625, -61, -890, -235, 856, 212, -443, 200, -731, 65, -23, -333, -422, 532, 298, 330, 1330, 61, 473, -35, -1257, 348, 0, -901, 255, -130, 276, 11, 102, 174, 303, 439, -614, 367, -122, -158, -605, -457, 1074, 125, -158, 716, 137, -272, 383, 854, 519, 678, 1154, -137, 336, -630, 1163, 276, 30, -70, -224, -327, 230, 677, -111, 85, 357, 584, 159, 101, 813, -137, 38, -644, 346, 1253, 169, -339, -780, -192, -488, 568, -214, -60, 1045, -418, 195, -6, 128, 77, 853, -807, -480, 933, -432, 32, 414, 6, 205, 553, 108, -336, -104, -589, -752, -59, 637, -559, 530, 573, 48, -889, -359, 656, -167, 518, 89, -275, 315, -922, -413, 277, -513, 664, 169, -1099, 344, 80, 96, -338, 1002, -127, -123, 110, -104, -378, 726, -92, 144]
4658A44k74J57m30P61j83p7j8K65m36L87j11J06o0P19q69M00k21J10N9j108J094
4679D15q41R45l65o2j392Q50J270r26O28j51j48m91o22J86m4J083r7m07L66L51
4699E48n31J15p35Q28K47l11J016j120K25j085R97j218K436q49j71r8l7l95L3
4718a05J98k07O51O68j554j26M84N44o07J03K21n07Q05j554Q94l68J52n80J504
4737F16k37r31J025k93o89O27M88q10M89l61K7p14P48l40J524j770m28R50k6L80
4757B75m83L53l46L25r50M87O2j8O07J66j593J034O66n82L49p50O92J30J093j683
4777a66O99M62p62n21M97p1j3J29k69J282p62o13N08l81j130J224n28Q78j134
4796f71J135p48J88R26l17n19j133N32J329j090l54J336j119J97P83n18M08j51
$$ y = [144, -130, 27, -403, 358, 175, 98, 80, 345, -91, 296, 185, 291, 231, 950, 81, 481, 260, 370, 429, -679, 415, -426, 519, 154, 92, -1300, -450, 820, -106, 522, 371, 223, -268, -890, -704, -748, 335, 238, -169, 197, 548, 17, 132, -603, 225, 472, 161, 1177, 57, 282, -803, 194, -1024, 1412, 563, 392, 294, 257, -138, -105, 93, -114, 537, 1205, -349, -475, 9, 553, -54, 49, 270, -237, 568, -986, -92, -460, -308, -888, 616, 379, -552, 473, 180, -509, 118, 606, -204, 285, -76, -49, -763, -15, -355, 1169, -601, -1029, -79, -105, 275, -208, 145, -201, 124, -826, -339, -277, -295, 312, 478, -1115, -81, 585, 3, 352, -398, 294, 424, 1517, -166, 533, 995, 233, -288, 209, 138, 125, 254, -15, 1267, 505, -108, 400, 19, -1111, 113, -415, 463, -671, 464, -284, -96, 830, 513, -6, -1139, -607, 722, -368, -722, 614, -505, -308, 475, -43, 365, 214]
4814B14k6n70P43n50N11l98J80j41k49l25Q37L28o83M66p80k23P98M17j14N02
4834I37l44j107P72k99k92k88M35j30N87M20j106P40M68j20m09J65j270J352m9
4853D62j275M9J120n37Q30j008P65o30J043n56p02L11n23J040m68M27q9o22K67
4872i6o61L53l09J461j379O31M70j067N9Q06P7o30M44m94J033j2l31p47J095q66
4892a63J638j563K70r49J053K8j67l63j43R2N68o70L21O68j521K079n49k091J856
4911C94n63K01j025J765j846O66J301p96l56J138j135n56K73m02J645j220P8M41
4929Cn68P11J4o41Q66j832J292P30o79m79N21k7K30j059J602o16p64R65j422J538
4949C85P70p32k87R70j639M27J94J75k77P07j773J248p37M08P28m45K99N43l93
$$ y = [214, 188, -382, 361, -189, 322, -76, 104, -37, -286, -611, 226, 554, -129, 337, -443, -666, 132, 549, 435, 937, 593, -514, 258, -41, -333, -621, -186, -316, 271, 691, -415, 325, 793, 673, 264, 429, -841, 511, 462, -813, -764, 356, -181, 649, -359, 406, -224, 819, 263, -439, -128, -651, 389, -79, 348, 259, -363, -96, -757, -404, -713, 748, -631, 0, 470, -597, -538, 268, 345, -285, 159, -335, 698, 686, 355, -392, 703, -163, 1475, -88, 182, -767, 286, 314, 147, -216, -359, -267, 301, -369, -48, 620, -901, 1178, 629, -1462, 394, -169, 32, -993, 772, -1074, -408, 893, 97, -259, 879, -256, -812, -539, -941, 704, -516, -438, 3, -565, 146, 160, -481, 385, -1447, -155, 575, -104, -583, -62, -89, 141, -918, 684, 68, -696, 269, -1153, 385, 1155, 423, 136, 1106, -533, -106, 88, 263, -14, 693, -1080, 168, -569, -161, 567, 122, 421, 964, 571]
4968E71l04q04L84j51J69j79k31J96J14J219K8m03o57O14J54p4l31L96l58l62
4988iM28o5K38j086j76Q33L36n57l26R13m19j14j81R3K17k03J27K02K20j165J035
5009C41J90j535R02k5k58Q10o94R05j304L65J319j883J148k042R07J730n18J63
5027E21r1j05K36q40j12R53j082q06J286P33J13o04j45M80q5k19Q4l77L80m82
5047a62O44q77M04J37o28J055l80P08q74n92R57k62m62R45j140j56M11P28n60
5066a04O66l61n20P14l0M8k8P23j222k34o7J131j216N40l48P03j391N16q9N68
5086aq60N44K16l00R89r14J131j879J695M3l98K4k63P21m47M68q20pJ44n20M5
5107c89L22O48j539Q29j12J294j415Q43k04q30J124n24P72j197J385r84K70j02
$$ y = [571, 267, -537, -153, -304, -135, -314, -545, -349, -235, 984, 1012, 609, -48, 566, 720, 646, 315, 711, 353, -9, 419, 354, 592, -494, -670, 163, 499, -58, -384, 529, 110, -4, -185, -92, 125, -78, 49, 251, 471, -694, 341, 531, -1004, -102, -127, -385, 425, -269, 636, -668, -303, 1016, -867, 281, -1761, -854, 876, 358, 521, 430, 325, 561, -279, -391, 562, -520, -1326, -40, 693, 806, 202, 57, 537, 452, 233, 317, -60, 320, -162, 482, -395, 9, 146, -482, 573, 193, 901, 27, -565, 392, 130, -332, 613, -527, -683, -272, 456, -104, 562, 201, -319, 395, 365, 413, 385, 1108, -114, -348, -415, 716, -500, 40, -308, 395, -996, -480, -569, -1, -861, -317, -101, -401, 588, -326, 805, -1074, 621, 664, 266, 290, 27, 748, 301, 769, -51, -58, 86, -434, -389, -67, 581, -958, -129, -241, 1053, -362, 481, 277, -553, 571, 47, 819, -378, 1007, 23, 293, 191]
5125A91j96K54j3r18N57J21L70j217J025j16p49K44M21M70k59j66Q01j70j403
5144g53J455j90r35M91j47l77J76p43J462q78K79J164j280l24J597q83R1n51R8
5163b48J01K97l92M40q6J18o25O46J2j062P51O22o54m6N4M42n18J257q11L81m43
5184B36l13P58p46P56l23P1J48n81q51K122j331n09J418l73n57QJ043o58P0m25
5204c7K06l28l10R29k88O7p48M97p86J522m48j39m46J446o42J28j283N61P3l90
5224d16N65m8J48q77O17l28K8K02L2q24J68P62m77M10l32K44M1J90L73o17j83
5245c22P40j67r2M05j034J140J32j93n43j359k95R56N98l06K44k85K9K12J252
5264A112k018J232p12J119q56o08L44k93Q45K40L6p69O38j492R32Q51j941J575
$$ y = [191, -5, 249, 236, -682, -125, -4, 366, -851, 174, 58, -691, -447, -26, 444, 185, 19, 820, 650, -753, 702, 512, -423, 68, -79, -456, -280, -1023, 439, -439, -160, 1004, -276, -600, 997, 114, 205, -346, -248, -147, 150, -242, 198, 112, 230, -395, 251, 263, -799, -48, 574, -80, -126, -72, 370, -148, 1109, 298, 679, 236, -77, 681, -65, 691, 368, 439, 587, 6, -845, 1277, -54, -563, 855, 482, -75, -67, 976, 318, 388, -37, 169, -159, -469, 460, 172, 239, -509, -12, -798, 724, 276, 137, -309, 1137, 495, 623, -660, -99, -26, -416, 149, 101, 249, -628, -11, -339, -311, -109, -77, -901, -733, 29, -448, -38, -370, -126, -85, 105, 478, -139, -322, 418, 251, 159, 564, -470, 670, 802, 609, 66, -1293, -1588, -632, -34, -340, -96, -381, -352, -140, 1112, -906, 326, -386, 733, -123, -731, -387, -680, 165, 405, 441, -328, 310, -1182, -250, 601, -1340, 235]
5282B35k08n67P05o78J150R8j945J498O00q26l53O64r53K85Q87j487J377M45j792
5301h65j70J444j09L99j071J663j119K47M36o23p20J68J50R25n94l07p37P47m55
5320e91L13k0N5O03j191J737q23j07P11j397L44J84m05J216l56k62P76j190q8
5339d91R99j514J692m86J89K4P4r82J184j737J495m36j263J947n54m3K36m2j26
5358A66k43r7N46J85j161O18J161j148n33M91J233k349J418j00r04N5Q9Q45l01
5377b9n3O04j208J37N08O04r92M8J425p46p1q12P07J108j806M8J303p56j77k27
5397c85L51O35q18K12o52Q16L53j172L14J030l13K9q40N40L06k79p22R2N84L61
5417D42n12k40O54n09M6L29R7M62l75o7j150L42R17q96Q3R90L08q90N59k53p00
$$ y = [235, 27, -540, 165, -513, 637, 735, -1210, 288, 888, 62, -291, 373, -580, -295, 592, -895, 482, 927, -865, -1035, 409, 300, 699, -372, 1291, 172, 419, 855, 232, -488, -320, -170, 755, 161, -146, -883, -136, -591, -278, -298, -243, 360, -831, 906, 83, -24, 687, -710, -366, -182, -587, 629, 273, 11, 787, -403, -491, 508, -1006, 686, 200, 389, 413, 487, -495, 689, -1048, 447, 11, -1252, 695, 141, 98, 334, 292, 166, -77, -174, 372, 557, -604, 14, 1175, 27, -506, -15, 1218, -1131, 287, 187, -717, -662, -573, 272, -29, -82, 522, -686, -549, -41, 563, -429, -381, 1044, 298, 227, -585, 122, 1230, -576, -528, 775, 19, -158, -385, -34, 601, -217, -5, -657, 159, 512, -660, -346, 684, 371, 400, -440, 100, 406, 127, -595, -503, 81, 442, -70, -310, 344, -165, -119, 210, 307, 769, 394, 327, -823, -481, 436, -460, -377, 613, 921, 31, 590, 337, -363]
5438c63L22J56k03O65o84l99O98r4N49p69P9KK46n25M86M39k39K80L43k46n45
5459A98P56j379j13O27j77p02Q10p9j9l9M01N79j827O99M35O15o46o0N1o88O44
5480H6k58M45q00J070p99l77J81M15k37m86J009k76J190p09k504K209qk44K88
5499A95m10Q5K91N81j022j18J473j048R7L43l08q28R96j97K83p09J052p41O32
5518F47j196J549l71q29K2J30R23K64p74j112J076j261Q12M0O1m55P33j84k50
5537a75L35k85j85J50L59n94M8L53m65K297j996R34q04K65K87j51k75l29q14O04
5557d41M0N4J98n17L84l03l8L2J31k32K38r5P86m1r62N97J17o00M62q83R21P98
5579F46k90j89r76O03P18j96j444J468M83K36pj212k82K72j24L20L25n16M44q08
$$ y = [-363, -41, 115, -88, 577, -107, -506, 192, 98, 647, -122, -43, -41, 205, -320, 166, 605, 366, 646, 989, 743, 198, 954, -425, -538, 89, -88, -790, 20, -59, -78, -117, 284, 863, -964, -265, 170, 785, 139, 79, 130, -558, 86, -172, 273, -527, 543, -256, -633, -452, -37, -274, -760, 249, -27, 1163, 454, -2050, 159, 151, -93, 195, -215, -130, 161, 742, -280, -398, 1075, 27, 124, 467, 159, -669, 327, 130, 413, -296, 756, 15, 647, -549, 1000, 629, -200, -178, -48, 875, 1139, 365, -747, 329, -932, -120, -80, -19, -474, 259, 75, -175, 160, -125, -310, -160, 199, -395, -347, 6, -459, 1838, -158, 776, -28, 237, 524, 373, 98, -231, -1045, -441, -401, -347, -149, -666, -282, -585, -623, -591, -460, -692, -454, -549, 237, 196, -766, -169, -52, -652, -190, -1073, -152, 646, 356, 167, -809, -206, 512, 316, -1128, 340, 823, 1059, 1052, -160, -442, -170, -294, 26, 351, -165, 279, -529]
5599e29Q50n30q1R70n31j70l45k30J880j813J245j641J090k15pO49o53N41n38
5618e8O45q75J12j90J54M66m42K57M22l23k35M97o40P23q7k23j37K96j256J064
5638A70J54j08K83q09L00o31P01mP28r13k96N06m05l37K53k14R27j66O23n20p13
5659d71L39P70j103K93o74J348k99r79M86O7Q96j136J491j373K74l99O7O07j4
5678A90K91k33q30J284q81m41Q16j63k80Q16q51O80j402L67J91N91k50n54Q57
5697A98k99q00J476o09K97p00J049m95l84K90n58m2Q09q58Q0j95J05J050j113
5716f99R20L85o89L31K62k86r09R43k164K498K97j080N42J87k04J230j030o94
5734a60l6O90r49j95J41K03P69m4m6o31N18n92M87m73J74M2l3R74m58k0l19l51
$$ y = [-529, 321, -209, -290, 680, 149, -21, -366, -596, 1284, -529, 716, -925, 165, -50, -57, 592, -61, 480, -58, 587, -288, -176, -366, -212, 254, -188, 69, 491, 168, -67, 430, -210, 513, 426, 203, 66, 362, -894, 170, 324, 216, 499, -310, -10, -641, 60, 56, 784, -129, -425, 81, -324, -661, -408, -622, 305, 139, 762, 242, -471, -132, 638, -465, -172, -846, 502, 203, -776, -290, -223, 673, -463, 1028, -345, -71, -470, -403, 204, 190, 481, 248, -582, 702, -179, -620, 196, 33, -247, 569, -282, 398, -1004, -637, -446, 145, -105, -659, 198, -101, -901, 575, -34, 263, -437, 612, 117, -267, 23, -535, -577, 232, -626, -546, -741, -636, 414, -699, 221, 606, -83, 248, 510, 224, -685, 258, -1906, 592, 889, -191, 351, 538, 334, 1564, 534, -160, -196, 494, -455, -650, -509, -306, 463, 419, 373, -258, 260, -332, 155, -318, -144, -102, -135, 839, 381, 361, 42, -309]
5756c09K23k65R90m29m42j00M92J53l98O55o15m30r21J558K29q96J98%Q7p7Q83
5777E86j41n36J62p39L49R44o63j89O9K2M87M90o68j79M03j518J9O17j82P04n22
5798d85J51K99P01l42n95J11L45J90j534J421J5L0o37q93J776j481J625o10j478
5817a391J939o03l71N36o38M91j36K46Q48j154J172p36o83J78j35O96l88m82R60
5836C49j23l68M99m69N70j87j11j55p43Q55p70Q61q85J266m13k15M41r39P36m79
5856b80L70n29N39k20M38K92l95m28p2P18j79l46J751j416Q5K05o71l90Q72m92
5876a48k09K44K73j009K51O95j87J40j20k34L50k38J178m29j57O8j454R83L97
5895C94k18m57r8q8M86N2r2n03P05n7K18k20L68o52M09P05j080K46L80p05L9l77
$$ y = [-309, -86, -351, 639, 210, -232, -332, 160, 313, -85, 570, -45, -475, -1396, 162, 391, -505, -307, -307, -220, -297, 586, 445, -91, 71, -668, -319, 625, -38, -227, -158, -136, 351, 841, 173, -6, 397, -1121, -1102, -485, -667, 37, -485, -334, -35, 666, 324, -271, -160, 185, 375, -1159, 262, 277, 307, -330, -1223, 553, -928, 697, 87, -1391, 548, -55, -426, 110, -528, -37, -173, 73, 921, -233, 939, 203, -480, -302, -437, 259, -129, -611, 349, 226, -142, 357, -112, 458, 271, 160, 5, -738, 117, -653, 208, -677, 589, 176, -39, 402, -537, 199, -280, 90, -439, 100, -120, 318, 610, 215, -213, -285, 433, 254, -92, 1659, 243, 328, 533, -138, -528, 344, -148, -357, -113, 160, -849, -598, 97, -90, 50, -70, -304, 46, -192, 986, 557, 400, 468, -986, -3, 394, 176, -281, -379, -467, 19, 71, -21, -524, 181, 124, 342, 122, 490, -162, 247, 952, -128, 118, 498, -207, -168, -545]
5917e45L83r3K04L97L14k54l43J84j3j55j96k73N56K64o00k00j05R50q3n13o4
5938a85N14n42m20J029p33k94L08l35R17r70j1M96n29Q33o29M43l4p90L86P93
5958B47n14o19R38L34r08L31q6j03j59j90J066R21j227K72j097R41l35m46J198
5977E64j524J224l42M29J26r84K06L94R6j47j93J63O17p58R77m91l20k65l3P32
5997D71n54N44M9j22k06j364J761j83l61m06L72m10L95j88N39l54N39M56p93K06
6017C91n95J55J141j888R14j9n42P22O79k56j192J131q70R79n87J50j259O28l26
6036f44J404n22N26j090K77j71L37m36l02R84P2p61L60N99k57k63j283J069K46
6055A45Qr89Q95m67K48N66o30N30l35J001r58n88J730q34N67j019k63PJ039q67
$$ y = [-545, -162, -255, -51, 346, 660, 406, 63, 247, 234, 79, -117, -390, 166, 430, -170, -370, -475, 475, 392, -121, -185, 329, -213, -633, 396, -337, -631, -323, -658, 259, -711, -722, -226, -755, 78, -551, -108, -142, -932, -546, 247, -267, -886, 52, 386, -522, -191, -277, -380, -539, -729, 337, 1258, 31, 303, -794, 147, -188, -634, 564, -960, 264, -78, 351, 477, -507, -301, 93, 189, 42, -151, 12, 629, -129, 848, 357, 37, -228, -261, 471, -83, 461, 510, 388, 182, -1182, 579, 396, 35, -371, 1, -409, -14, -202, 337, -17, 522, 978, 185, 391, -204, -49, 1092, -796, 118, 99, -443, 279, 958, 702, -490, 641, -229, 750, 163, 313, -946, -318, -644, 760, 238, 764, -326, -49, -220, 117, -319, -621, 363, 435, -326, 34, 633, 376, 113, -1170, -101, 145, 153, -836, 59, -408, -160, 406, -224, 306, -29, 972, 14, -574, 1156, 322, 889, -130, -393, -386, 653, -214]
6075b14J211j240j33k41Q90j077J211k76M23K47r90J26L30o15L84o69J047j065
6093f51O55K90p98M17O88j556L43P21J7M8k67j28K28N67J04l16J87j45j516J639
6113E27o33k75l91J213n91M79n69N20r86k9O29o55K014j689P07j81k34K97l45
6132a92L05R57o78j012m71J578R7o30r83J412q27N26Qj83j19J23n64oJ03Q46N97
6153H87o14K80n32l65L6K26K12q47P99q4p57J495m56L8m33L50r32K231j373p18
6173e57l21m19J357n38Q07p84M90l23J4L4L79j90m8K85o63M04O14m47j27n55L78
6194b10l3M79p56k09J093m91L71j011N1m05J019J93o80R83n8n13L01n4O43j214
6214e01J30Q12j73K61P51j157om72L22L84P63j824Q39L06Q7p99K41n44M74j01
$$ y = [-214, 997, -243, -376, -617, 273, -804, 407, 131, 554, 801, -189, -63, 267, -348, 36, -633, 414, -651, 4, 294, -504, -87, 601, -955, -612, 109, 126, 174, -93, -221, 7, 574, 678, 362, 549, 404, -1112, 527, -106, -381, -772, 441, -150, 329, -240, 280, -706, -735, -106, -761, 1253, -436, 271, 90, -144, 153, -192, 113, 1070, 392, -620, -1091, 487, 584, -46, -1029, 383, -444, 82, 90, -93, -212, -89, -653, -659, -556, 290, 887, 273, 553, 21, -344, -308, -82, 130, -717, 82, -2, -759, 736, 280, 318, -115, 235, -697, 1534, 161, -557, -878, -1297, 60, -478, 329, -455, 35, -288, -274, -240, 139, -51, -99, 186, -477, -73, 541, 94, -33, -588, -210, -243, 236, -520, -729, 364, -127, 244, -767, -716, -1121, -102, 91, -589, 394, 336, -177, 124, 70, 713, -501, -371, 441, 268, 529, 1280, 123, 117, -355, -33, 351, 1114, -710, 129, 435, 522, -277, -36, -580, -106, -207]
6234b07j50j34k36K83O52M7J23m67J93J09L28m30j3L31N04n24j308P48O10j35
6254C24j94Q33r49L45M95r66L3O40l21p12J262m27q55K17k42J189j067M73n25
6273d47k9Q70j126J51L57j1L97m86m32N34J445j309L82l97M7L32N05j736J463
6292E10n39j61K88J47p18P17K69m59M98q74L20M96o28N72k14k19O35j112P37j243
6312i78R65O54n23P91n38k71l73J159p44N07p98L04Q7p43J01L37M86m55N0l6n45
6333e63J78M77m8L6J31o93P89r01q3Q67po58O27P08m24q41o5J300j160M05l76
6354c01O78q76n78K058j583M47O36m74P82n32K28m25p01J235p76Q84k57q33m06
6373g94Q65J21k54O77j016O28P3l44K57p68O02J045k81o59l50O03o87J429r42
$$ y = [-207, -357, -491, -727, -444, 208, 255, 378, -89, 104, 213, 541, 111, 98, 429, 933, 409, -899, -151, 459, 324, 130, 963, 14, 359, 854, -112, -79, 561, 240, -472, 790, 363, -492, -275, -517, 672, -395, 78, -447, -476, 394, -732, -581, -224, -235, 162, -324, -756, -222, 1223, -86, 296, -101, -54, 278, 783, -953, 510, -29, -190, 98, 245, -473, 244, 513, 54, 552, -322, -2, 494, -134, 438, 224, 5, 640, -472, 265, -978, -13, 641, 118, 909, 371, 100, -273, 886, 142, 649, -149, 155, 242, -501, -400, -63, 423, -32, 18, -18, -563, -385, 92, 44, 80, 211, -482, 307, -594, -677, 190, 183, -475, 152, 860, 436, -405, -470, 830, -330, 75, -301, 377, -499, -1077, 981, -602, -155, 481, 7, 789, 257, 485, 60, -641, 594, -182, 702, 445, -388, -794, 71, 192, -62, 615, -401, 227, 300, -44, 213, -555, 47, 1092, 811, 152, -198, 405, -282, 1147, 205]
6392B05r0n89K40k98L22m90J189l39m70M5n93P27O55n31K73N4j159J450l95j38
6412F8L70j87j166M89P46K01k4K91j463J4R31J23p77M98N92j55j294Q60N04n35
6432H6K62o15N42L79j224K5q0K72J0N53k40J030j183R29j778J847m62l63j28p1
6452b09K48n14N63m21Q80m34Q4M40j383P48m98J46R85k86n35Q18L08j225J96o79
6472g68J435j440O48n8n90r47K249p11K10N34p29j72q91J477o76n07J104R84j562
6491d10Q2L72j093J013Q67j377K75n94J063K45r69J486j300K26J647k501Q90l99
6509d77P17j38k87K16j01k64M67j3J01q9m92L49K01r7l92M23k50l37J057L78j626
6530f54L6J508M4j556J715j030m67Q98j077Q60O5o75J069j058N1Q8m62J579j027
$$ y = [205, 115, -474, -234, -532, -210, -700, 489, 150, -320, -275, -868, -141, 514, -17, 256, 310, -849, 601, 206, 68, 438, 251, -915, -426, 320, 521, 497, 788, -675, -661, 270, 393, -384, 114, 706, 551, -743, 117, 621, 86, 348, -267, 275, 654, -570, -545, -625, -353, -343, 210, -30, 1000, -183, 746, -1032, 815, 353, -10, -138, -209, 39, -475, 88, -333, 547, 113, 197, 637, -746, 2, -496, -350, 635, 349, -186, 632, 940, -285, -89, -768, 667, -773, -125, -183, -773, -1720, 529, -182, 28, 562, -167, -339, -1230, 247, -429, -936, 168, 1152, -410, -328, 44, -1049, -36, 831, -546, -271, -865, 198, 443, -526, 960, -340, -114, 1533, -968, -78, -477, 240, 102, -185, 31, -70, -334, 133, 120, 221, 132, -360, -11, 190, 93, -299, 124, -126, -463, 594, 972, -654, -618, 890, 934, -622, 1093, 63, -404, 494, -583, 277, 342, -333, 736, -322, -271, -183, -645, 934, -93]
6549i3m52j16P3Q10j74j59L24j683J057O93o54J06K64m47J276l30j303M95K21
6568i2l49P59o44J71n37O60j221O82M57N98Q91j489P69j048r18K210l38q25L13
6587D9k54k85J234p63k26R22o43Q14p55N60j066L07Q15q07l01J20J68k1m15M3
6607e04P40k91Q98l23r11Q28j75m18j280J276Q95q36k86M56o57J537n88K15J88
6626G64n53j44K77j238J861q43p02n86R25n75J540k21j051L62K70N10m11r99R34
6645A20O8p83O02p22K52j31l75K119j382J137r08O77j208L70M82M11m51n26J33
6664a15N87k76n95L29m8Q16q78K9M41o83N94k38j6l83m47J432j620O72R38l55
6684A84k68K08m6l83j79L62N5q0k18o8L09Q74r8m61k76p10k31J406k24L56r77
$$ y = [-93, -545, -661, -588, 222, 48, -111, 213, -1470, -413, 280, -374, -268, -4, -451, 825, 495, -808, -313, -92, -441, 318, -326, -155, -692, -32, -1253, -571, -114, 484, 1375, -114, 655, -393, -1311, 899, 561, -264, 49, -205, -490, 744, -19, -245, 677, 34, 848, 93, 653, -413, -106, 709, -98, -399, -279, -111, -132, -547, -504, 236, -55, 843, 520, -391, 437, 262, -156, -1436, -160, 735, -101, -387, 69, -588, 949, 361, 576, 764, 211, 67, 344, -894, 967, 124, -578, -1164, -239, -814, 726, 505, -546, -184, 86, 596, 185, -814, 120, 188, -595, 7, -715, -463, -594, -969, 1150, -232, 905, -3, 674, -534, -164, 318, 729, 278, -248, -115, 472, 196, -399, -70, -118, 698, -180, -151, 290, -393, 201, -37, -53, -436, -883, 549, -1071, -399, 539, 184, -84, 124, 78, -305, -484, -122, -67, -147, -365, -433, -124, 750, 652, 191, -85, -795, -1026, 380, 156, 512, -465]
6705d65R29N29j264o11o1P44P00m11j3L37j44n98k4O84j72o44J35O16J90j273
6725h16Q31P55p96n9j79N45k37J31L81n43o65J374q06o02k14J762j112R65O7j449
6745f67N7J675j880L55j05P99J50j252r8N81N81k52m29O4P50K55o11o15O53M4
6765E5L08J01j235J334n70j84J97j060P02K9m86P05P28q16j06O62k92l32O50k60
6785A30o8q6K10j209J225l0J145j018q24Q1J81J333q37q7q57J416J13j318J12
6804c88N96o83L3J035m03J87m3j39K12q98k26J078l03R7r3m27m0N48k49l37K29
6825b14m70O5J075r03R9k51l04P76j14k5o60P51m63J497q82r13L25J266m35N13
6845G33m47r97N18m65J193m25m43J02L59K72m65N83j364J460j054M9J238n35j40
$$ y = [-465, 464, 993, -271, -882, -943, -199, 501, 90, 77, 414, 270, -328, -352, 332, 160, -484, -349, 267, 457, -816, 15, 770, -26, -85, -264, 281, 44, 175, 556, 13, -652, 722, -84, -686, -900, 862, -250, 715, 782, -667, -610, 1065, -815, -460, -565, 234, 384, -868, -966, -385, 196, -56, -485, -421, 329, 584, -27, -642, 11, 55, 363, 464, -771, 563, -7, -191, 6, -1054, -352, -323, -809, -104, 624, -192, -298, 364, 72, -260, 390, 130, 62, -24, 186, -1023, 202, 172, 1317, 299, -525, -444, -263, 1070, 233, 146, -711, 705, 818, -500, -388, 208, -475, -442, 593, 190, 377, 334, 195, 407, -491, -717, 361, 58, 155, 62, -365, -405, 143, -106, -443, -214, -684, -619, 456, -447, -348, -599, -903, -127, -241, -266, -926, -175, -638, 859, -23, -936, -611, 655, 220, 733, 286, -711, -193, -658, 535, 110, -333, -231, 128, 400, -65, 518, -846, 614, -440, -391, 847, 312, 172]
6864A72m12L64o40M05P85j025p52Q85L76j328K004r62N73j239J316o83j60l85
6882g06J068k56K70L20k54r80P9Q02j223R18o87J026J68j480J429o06p84J958
6900A062l99j762J048K3L17m16M99j356J047M68l29l12l78P95m48j60J241j93
6918G47r58J10L64n2q97J978r19q16Q51j53o60O58k06k71M63Q37j185M67j151
6937g93J359j406J115R47r57j78m3q6K3J1k68k39J036j230J006m35P9n53J331
6956G19p03q55L92Q96k33l90j29k69n52R94N60O6o03l93n82P14j35J301m85m1
6976B72p14M6J31N52O91j732L17Q3p44R36j07p28Q13J089r24j68J097J10j432
6995d12N50q34J078n18l63J146j043J71O05l01Q8O27j68L32J62j257O0j97J313
$$ y = [172, -240, 124, -516, -111, 674, -351, -1103, -218, 158, -1170, 834, -128, 445, -794, 522, -161, -321, -706, 362, 106, 376, 696, 442, -538, -459, 343, -880, 38, -649, 377, 545, -935, 494, -112, -896, 1062, 663, -1099, -51, -28, 289, -127, 372, -984, 63, 531, 202, -110, -488, 307, -141, -301, 940, 747, -211, -101, 263, 211, -686, 1292, 373, -443, 408, 255, -405, 253, 47, -224, 239, 1076, -109, 358, -793, 566, -840, 275, 1222, 265, 87, 44, -42, -19, -8, -276, -515, 521, -709, 297, -138, -59, -612, 719, 16, -839, -447, 449, 216, -174, -303, -572, -1124, -130, 430, 496, -107, -500, -1082, -368, -503, 798, 313, 272, -442, -396, -265, 287, 978, -754, -437, -354, -1098, -162, -269, -997, -184, 905, -19, -187, 910, 1020, -412, 138, -696, 382, -136, -499, 647, -396, -225, 380, 79, 167, 794, 626, 958, 1120, -137, -77, -274, 1039]
7014A039j098l38N66l51K21M0J89Q91j498L86K17j973J908L0O43j558M45J56J53
7033F8P96j145J098p87Q7j383Q50L19R69j015m98O21K54J2O10j247j29o8P64j71
7053Ep66J85K80k68R98r51Q87r31k03R3J051O6m94q6m5R79k42J87j109P64o19
7074b19o56M83q6M11L53q15o1J151p04O41j31o80R51p55P09p32J92o06Q96j013
7094f71K71N98p29J953j187n58q7m02J056j04n17J084j316J111n49p79M96m18
7112g48O30J251j287M40p33N61o26L95k39K87k56o58Q19K8J128j213N56j46K91
7131D80Kj103M76n56J07p7J247p12J256p36o3l79N77o3j059N05J12p91J123q85
7151e39J7O48l81n10J539j057J19N79j762L62JO41N41L15n03J31M66l84j212J396
$$ y = [1039, -59, -397, 169, -182, 39, 79, 268, 1159, -339, 47, 264, -1709, 199, 229, 872, -686, -241, -85, 68, 864, -281, 817, 30, 117, -1266, -416, -97, 872, -143, -641, -20, 234, 246, 856, -391, -520, -588, 176, 5, -761, -576, -296, -564, 434, -517, 370, -561, -764, -671, 380, 446, -48, -134, -179, 800, 558, 745, -364, 400, -219, -875, -392, -478, -67, 286, -529, -590, 561, -143, 498, 367, -313, 638, -117, 592, -140, 52, -554, 342, -671, -400, 198, -531, 1422, 235, -323, -410, -812, 244, 140, -377, 707, -609, 502, -47, -826, -330, -748, -118, 1133, -154, 286, -447, 114, -512, -117, -356, -69, -325, -983, -164, -136, 992, -221, 335, 189, 480, 482, -621, -145, -701, -594, -671, 576, -136, 1120, 384, 321, -58, 519, 456, -603, -98, 14, -777, 346, -539, -522, 126, -255, -765, 774, -283, -164, 415, -1347, -985, -984, -343, 198, 513, 10, 141, 607, 223, -989, 407]
7171D07j097O49o65L55N47j043J206j170M09M17j046J674m27m37Q14n60l61O7
7189b61o20J355l75n85M33K01n35J597j461n83J506m12P3m13J273q60k36K6M33
7208E56R3k37o23N92k71N87p96k56K83J38o85Q31p04J88O14L94r17n36L74N22
7228A47m03p67N20M37L01q8m87k61P63m50L67K16n78P1L14k05P9K37n50J58q90
7249a069O84J35J30k54L56r63K97J95m55R49k62L38O9o34L43L36q0q62M37J41
7269a69k55Q10k65O74j096P45m80J083j116rj76J75J010l98O3o38jj27J010p01
7289A39p62L19J60J0L85N1M27p18j54n15J250m53j218J094N26k35J44j360N22
7308c88J458j809P12J63k53J097j298L94n8L44M0j43Nj041R16K32l09p35N25k75
$$ y = [407, -690, -41, -706, -351, 196, -847, 359, -811, -402, 15, -1031, 643, 216, -221, 593, 33, -328, -261, -881, 474, 99, -486, -53, 148, -387, 1210, -251, -834, 672, 260, 333, -80, 1193, 333, 97, 123, 556, 649, 412, -211, 381, 110, 697, -99, -355, -72, 66, -619, 212, -492, -304, 310, 704, -213, -749, -375, 147, -256, -1023, -503, -66, 235, 147, -340, -601, 162, -288, 79, 295, -283, -212, 102, -103, -24, 213, -337, -179, -1069, -385, -250, -120, -374, -18, -981, -684, -489, -944, 5, -257, 81, 150, -484, -141, 195, 115, -747, -310, -169, -424, 386, 121, 795, -301, 444, -36, 1047, -69, -78, -254, -79, 931, 533, 596, -42, -43, -170, 840, 139, -623, -304, -144, -134, 251, 302, 729, 11, -143, -658, 592, 139, -1079, 15, 541, 306, 450, -910, -388, 1070, -739, -27, 136, -117, 980, -318, 76, 18, 362, 402, 259, 264, -777, 139, 371, 62, -673, -148, -423]
7328d23O95M24o58P58L61n27n35j12m9J82j58m0l91O01o64J026j029j33P67l9
7348E6k86l33M5J704q72n64K18l19N91M16p88N92l94l79L28M96r26N61N9k50O41
7369E96j77r86P08j241N00M32K19L9J6J55o48lm56P80j82K91K87J112j251r96
7389h05R05p5k66q66J184n22L47o56O33O37j11l09O99m00r99K18J17Q9M5L97o70
7410d08N63J92r87J10J094j078K12j79R5R12p43O3p36J289n33m84J327p0j92j650
7430a203J995j105n64J391j187N85L44Kl33n5l9m27J114j95m46N56o20K2m69O81
7450D7L86o93J54o3l96j00M56M71k72P44j108K54L92j186P19K58Q25o4r92R34
7470G66n88J35k62K30j39k80k86M58m95n92O56O41J5j90M87J82o62M7P0j037J578
$$ y = [-423, 272, 696, 38, 796, 1157, 630, 95, -17, -66, 116, -42, -82, -473, 128, -536, 490, -539, -672, 95, 56, -230, -563, -518, 1186, 314, -250, -32, -351, 240, 656, -132, 460, 66, -313, 15, 511, -415, 146, 205, -45, 596, 419, -567, 141, -1100, -600, -168, 51, 90, 106, 261, -387, -390, -846, -66, -248, 43, 330, 1442, 191, -805, 100, 25, -241, -1107, 77, -445, -98, -754, -121, 516, 405, 96, 795, 395, -604, -386, -269, -180, -135, 262, -408, 155, 347, -640, -530, 564, -514, -302, -481, -386, 526, -217, -154, -890, 399, -134, -618, 709, 639, 447, -1203, 792, -313, -877, 514, -673, -88, 256, 258, -75, -130, -169, -596, 518, 323, -123, 433, -187, -165, -634, 47, 433, -260, -106, -169, -565, -665, -209, 262, -10, 734, -374, -120, 272, -914, -195, 63, 888, 824, -168, 766, 178, 313, 51, 281, 142, -138, -424, 34, -461, -1053, -397, 244, 259, 69, 556, 738, 76, 123, 193, -844, 734]
7491G34r08O74l37q06J354q50K7O4j28r7n87J954q05p7r15R53m68O88l73J44p25
7512d84L07J084p38M87l52l86m24Q36r07L91Q73l61p62J096n94K07m35p45J228
7531C21j076M45r5Q37p72R1Q61j405J219l76m31m44J159l13L76N98p79M62m69
7550B09K77l33J82q32N66O87n30m61J222n89q64L02l71J062m2l60M35J20j209
7569e29J8J431r76k15J90n88J684J14j239qM34m28K93R65q15q72N13l17MN60j96
7590B3M74r85L21r05P21J95o8N6p0J01l49L73j13m02j39J009K48k1N5r21M89K84
7612C76l70O54r57j45K73k46K03L47K95j107O18N93m17N80p54o78N15J77P61q27
7632a09N94j279J431j032J062j510J926n45j034l22R96l45K7j91R80l68J11j70
$$ y = [734, -174, 500, 163, -643, 711, -139, -112, -48, -176, -273, -860, 1094, 289, 212, -703, 250, -218, 470, 97, 241, -484, -177, 907, 169, 656, 304, -82, -506, 330, -577, -186, 687, 326, -436, 660, 66, 273, -162, -907, 321, -755, -310, -405, 432, -340, -249, 612, -793, 426, 50, -381, -825, 334, 21, 397, 995, 216, 678, 209, 486, 153, 335, -497, 69, 756, 226, -235, 987, 398, -466, -164, -535, 527, 485, 125, 560, 680, -529, -511, 920, -56, -271, -81, -669, 1015, 1129, -110, -118, 316, -112, 181, 1146, 331, -541, -28, -345, -341, 219, 23, 497, -488, -167, -1072, -351, -156, -224, -168, -238, -137, -486, -113, -226, -628, -767, 242, 490, 469, 524, -397, 92, 376, 6, 660, -297, -442, -169, -415, -212, 135, 430, -677, -59, 534, 117, 697, -57, -735, -220, -43, 718, -109, 485, -794, 637, -395, 667, -843, 1083, 538, -496, -818, 178, -167, -140, -331, 649, 281, 392, 222]
7650B22o8l46L45m47j70J03K22M68n46J87P14p83J433Lj486l17L74O2l18O08j162
7671i02J069P5k26j73p64J047p95J67J571j216P24q39O38P42j422j67J233m15
7689C47m99o9J218n01m07n35l47J248q17J121o32n60j06k04N3R24M12p37R9o17
7709f09J495m55k84k95o88L11N40L9N91j004j34P84M7r80J052q80J550j037K63
7728C06q5p37m66L93K4O37K32n08M32K65K01K13m99n46p45J150j503J230J071
7747A065j080m7N22R39k098Q37L06n14J26l7m01J06n90J766q00n96N76K61o00
7766b59L55k96P41L51j327QO42q16M07J159m78l61l34P76p12N28p4j214m69J485
7786A12K3K20M33r76k96m5O51j035R26o6q6p88Q88M11n7k90m01j82j11M24q49
$$ y = [222, 154, -192, 153, -294, -464, -361, -139, 329, -217, -30, 684, -99, 1334, 1337, -149, -466, -92, -30, -348, 260, -902, 167, 242, 16, -157, -921, 126, -669, -502, 1069, -147, 577, -262, 376, 1118, -304, -471, 762, 347, -152, -221, 997, 496, 89, -446, -793, 455, -362, 759, 127, -433, -539, -743, -690, 234, 646, -91, 8, -609, 886, 431, 147, -148, -836, -525, 15, 54, 645, -359, -493, 291, 338, -642, 410, -470, 1080, 43, 306, 221, -516, -982, -589, -565, 72, 304, -204, 228, 493, 694, 907, 408, -138, -883, 267, -1236, -6, 1065, -15, -62, 460, 1399, -699, 138, 444, -70, 56, 19, -382, -276, -866, 900, 100, -496, 80, 341, -259, 96, -200, 541, 892, -435, -427, 215, -601, -194, 965, 487, 126, -208, 568, -144, 384, 310, -904, -1373, 112, 135, 355, 788, -188, -484, -529, 122, -913, 13, -53, -139, -927, -39, 372, 315, 25, -376, -558, -669, -245, -1094]
7807a094P93R73k32M8j330L34m96J025r49M78PO36j85o78O85l41L84O8l44J022
7827H04j30n39m46P60L5p97J73Q33j487O94n1j065P05O39L59k43J18o23L35J526
7847A600k241J83O05j77m64P77o77L1P22l52j72M09n49j30m06J345M10j46p13
7866E5O86J35p55Q54j065n71J80M15L70k08m0M19j152J000l2K77k61j164J415
7885E58o71P1P43l98j057K83P72J78m8o05P8P66m51r34J349n61m83l71O52o4N31
7906C38j20k31n21K90L13n81o14J974Pn41o20O20o02K18N07J55l61r63Q07R44
7926A019j266j82n00O93j81L67j37j03J369j201M29O09n83l54n60J393o27n33
7944c48M82K7j3K50m84j2R40o91n50j78R67l91m05Q92q29O89k78l21J289j443
$$ y = [-1094, -301, 672, 440, 488, -842, -508, -1004, 21, -928, -450, -443, 193, 8, -670, 15, -326, 58, 126, -218, 804, 674, 135, -311, 449, 484, -313, -140, 693, -794, -100, -151, -1216, -511, 128, 487, 244, 362, -261, 74, 1600, -641, -458, 147, -30, -494, 283, -394, -363, 359, 7, -165, 244, -305, -435, -841, 504, 914, 768, 55, 741, 876, 121, 975, -90, -661, -481, -66, 304, 96, 56, 475, -677, 323, 291, 568, 307, -857, 558, -113, -42, 701, 303, -754, -471, 301, 479, 431, -174, -96, 670, 219, -715, 634, 73, -410, -781, -129, -193, 338, 218, -13, -534, -244, 69, -512, -1126, 848, 855, 314, -306, 314, -288, -70, 437, 592, 231, -732, 75, 1019, -247, -429, -929, -236, -417, -50, -187, -290, 1079, -122, 307, 916, 333, -21, -581, 812, 185, -348, 134, 161, 148, 398, -86, -98, 842, 151, -399, -577, 390, -1, -406, 486, -343, 346, 68, -253, 1036, -407]
7964d07O80l23R6J278j399n19N99P6K21k12r71P32o1r0M00k04qK20J43j051J086
7985B86K08j252k74N30M34l62j59q12J558p43L89j60J87r05j65J399k55P87k86
8004D05J17J022k009K15j182J010Q01m19J77j012K2M12j21J83K51k28N08l28O81
8023E05j054O29J32L02q44L18j057J354p12RJ27r7j7j55j70R75P06j315N37n0
8043A23k7l97R00l03m23J67k3K46O68o39q50R03j039p1J314j51q3k34J26K87j198
8064g04Q51m75K89P61l34k71O5j26k92m6k6O94j112P07L00l20J290j166K77p53
8084c91J114k33p94n3K02L96j109J672q84K15K75n69N89M70j565Q10R8L79j39
8103D83N5n37N45q97j14M85l12R12j016M22J80L63o65P35p30k1Q0M87j245q6R39
$$ y = [-407, 273, -50, 46, 1324, -75, -594, 5, 81, 302, 90, -881, -149, -210, -300, 100, -104, -112, 108, 251, -800, 286, 494, -758, -1032, -502, -68, -430, -589, -1401, 157, -586, -197, -357, -170, -1075, -1240, 159, -96, 691, 405, 522, 1544, -465, -250, -1432, -422, 379, -40, 137, -875, -853, -441, -562, -379, -128, -356, 152, -176, 505, -549, 80, 212, 514, -330, -12, -1069, 285, -427, -418, -291, -388, -405, -560, -730, 245, 951, -364, 173, 123, 96, -301, 599, 296, -127, 40, 17, 263, 931, 292, -558, 345, -694, -765, 549, 398, 315, 81, 207, 494, -704, 147, -328, -39, 722, 388, 117, 182, 56, -236, -282, -308, 386, -726, -19, 281, -39, 1251, 85, 362, -391, 723, 490, -304, -357, -155, 241, -868, 804, -80, 135, 410, -159, 430, 900, -665, 145, 243, 622, 483, 538, 1, 546, -351, -465, 20, -292, 620, -396, 26, 206, 569, -96, 639, -91, -112, -32, 455, -790, -876, 63]
8124F3J66k79j09k63O83q99J090n71j64O57n5j89j24N92j16l60m43K50k03L36
8144F2M47J24l37p79K25k79L42m3N14l41o47J43M20j08j064J413J268j359J77
8163A78L00o22J05N19r16L70p37J244k56M31j295P61m19l95O9R09j125M85L38
8182e6K95O32j419N51M22n81Q53r97o31
$$ y = [63, 229, -50, -159, -422, 261, -638, 452, -119, -283, 374, 319, 130, 6, 598, 482, 122, -321, -71, -274, 62, 509, 633, 296, -483, -258, -537, -195, -238, 276, -65, -712, -569, -149, -257, -1321, 92, 1360, 1, 178, 478, -144, -39, 480, -436, -66, -803, 441, 185, 616, -679, 82, -337, -732, -663, 246, -879, -394, -56, 239, 871, -548, 3, 425, -156, 697, -300, -931]
8191i31
$$ Imaginary data points
##PAGE= N=2
##DATA TABLE= (X++(I..I)), XYDATA
0bK8l6N9q6J24j65K02k50L07l69M47n37O42p57Q79j021J169j340J538j757K004
21A079k280K574k905L265l680M133m626N178n799O485p273Q173r194J0366j1754
36f258J3423j5462J8001k1296K5795l2341M2949o3803J35993j84797k13117R3651
48b07262o8013L1791l9225J8190k5217J4276j6146J2477q417J6226k041J6456
60b56905K004J9054Q127J8378J1680J9986J3137K0175J4891J8884J5480J6774
72g8335J5988J7132J3663J5511J1841J3098J0513J0477P468Q560N402M556M077
85E9951K186O81K97r75j382k872l317m732l954n159l522p791n918m865o701m696
101G231n440n098m008l345l920j332k104j176N07J64R70J214K760K378M556M504
$$ y = [-2, 26, -10, 49, -37, 87, -78, 124, -126, 181, -188, 259, -278, 364, -393, 486, -535, 634, -706, 832, -925, 1079, -1201, 1373, -1532, 1733, -1947, 2186, -2440, 2738, -3061, 3424, -3849, 4324, -4870, 5496, -6258, 7165, -8297, 9704, -11592, 14203, -18138, 24811, -38992, 97001, -87796, -300913, -207262, -275275, -243484, -282709, -264519, -289736, -275460, -291606, -279129, -287546, -271320, -273361, -256905, -254901, -235847, -227720, -209342, -197662, -177676, -164539, -144364, -129473, -110589, -95109, -78335, -62347, -45215, -31552, -16041, -4200, 8898, 19411, 29888, 37356, 45916, 51318, 55874, 59951, 62137, 62818, 63115, 62140, 60758, 57886, 54569, 49837, 45883, 40724, 37202, 29411, 23493, 18628, 11927, 7231, 1791, -3307, -7315, -10660, -14580, -15912, -18016, -19192, -18685, -18521, -17551, -16337, -13577, -11199, -6643, -2139]
117b139M408N777M207N898M905N945M680N621M953M986N462L316K546L113K850
132F6528R83m18M39j56j900l643l074l395n038m969n688n622p364p131p819p633
148D100p885p445r321p115q706p757o255o289o374o577m478m495l996l818j988
163h8399j713N90r86k71J497K901K157K029L433O255M338M386N884O515M835O951
179c9598O336N852M643O158O000N666M628N526L224K278M451K316L330J514K039
194B4363j11O01o37o23r96k67j526k123j871l478j197j727l745k380j223l540
210d80l539L9j567l417O75q66j455l62j174J406l16J891R7J438P75J834K011K681
228c29J866J991K018J610J501K633J242O07J883P1P38P44m1O85j512n24j313j205
$$ y = [-2139, 2269, 8046, 12253, 18151, 23056, 29001, 33681, 39302, 44255, 49241, 54703, 58019, 60565, 63678, 66528, 67511, 67093, 67532, 67376, 65476, 61833, 58759, 55364, 50326, 45357, 39669, 34047, 26683, 19552, 11733, 4100, -3785, -11230, -20551, -27666, -36372, -44129, -50384, -56673, -63047, -69624, -74102, -78597, -82593, -86411, -88399, -90112, -89522, -90508, -90779, -89282, -86381, -84224, -82195, -78762, -72507, -68169, -63783, -57899, -51384, -46549, -39598, -33262, -27410, -22767, -16609, -10609, -4943, -315, 5211, 8435, 10713, 15164, 17480, 20810, 22324, 24363, 24252, 24853, 24216, 23593, 22597, 22330, 20804, 18681, 16810, 13332, 12135, 10408, 6663, 4283, 3060, -480, -4019, -3980, -5547, -8964, -8289, -9155, -10610, -10972, -12146, -10740, -11056, -9165, -9068, -7630, -6855, -5021, -3010, -329, 1537, 3528, 5546, 7156, 8657, 11290, 12532, 13139, 15022, 15093, 15831, 16575, 16534, 17219, 15707, 15183, 13870, 12665]
246A2665j164k474k962k542k016l456k816l350k505l784k817m753k660j774l292
261b9700j624l054l221K18k617k017M35j007P89l29R43P08J762K451J320K395
277c2548L031K191M774K975K080M888K391L651M199L340L715K812K372L972J061
292A4904K958J422J577M30K974R96l85Q66q11j011p71j138j434k314r10k523k073
309A2757l588k108k086k228k185k307l147k175k104j905k090j776q34k614m07
324a8797p1j480N67k83L91L04J62J462L93J023N63L023Q80J295J534J206K601
341e227J068Q66K143J349o23L004n76J044M36j035N29J11l95l28l10j822Q13k352
359a305l40j541j709n58o36k125j018k194j409q94q21j132m91q39j96J61j125
$$ y = [12665, 11501, 9027, 6065, 3523, 1507, -1949, -4765, -8115, -10620, -14404, -17221, -21974, -24634, -26408, -29700, -31324, -34378, -37599, -37381, -39998, -42015, -41580, -42587, -41798, -42127, -41184, -40476, -38714, -36263, -34943, -32548, -29517, -27326, -22552, -19577, -17497, -12609, -10218, -6567, -2368, 972, 4687, 7499, 9871, 13843, 14904, 17862, 19284, 20861, 21291, 24265, 25261, 24876, 25742, 24931, 23920, 23149, 22011, 20577, 18263, 17353, 14830, 12757, 9169, 7061, 4975, 2747, 562, -1745, -4892, -7067, -9171, -11076, -13166, -14942, -15776, -18390, -18797, -18868, -20348, -19781, -20064, -19673, -19369, -19207, -17745, -17352, -16329, -15766, -12743, -11863, -10568, -9034, -7828, -5227, -4159, -3293, -1150, 199, -424, 2580, 2004, 3048, 3484, 2449, 2978, 3089, 2694, 2366, 2056, 234, 1047, -1305, -1645, -3186, -4895, -5453, -6089, -8214, -9232, -11426, -12835, -13729, -14550, -15682, -16173, -17012, -17208, -17047, -18172]
376a8172j02J591l79Q41P68K000N89J394J073J892K124J536J300K480K900J321
392C156J665J856J260K241K468Q57J586J440O21O53LK401k16q02k03p73q80m60
410A6873n76j596k101o03j313j967k324j830j599j715k375k199k181k418j336
425i260j392j696k353j56k114P61p60j664q83L21j22m58J089r3J37K010J64K241
443a4228J041K54J366J906O38J869J088J743K165K079O34Q41J419L73J166O32
459D986J022N51K08M1J020k34k77q52K85j038p45k93j003j226j186N07j962L3
477a63j060N13j890q08q37P10j233m5m24m3m66J124k89J25M06P78L8J554r2J39
497a963J173Q43J499Q34L33J459M35J016N41J558n01OJ793J7j67M8P3K41j410
$$ y = [-18172, -18274, -16683, -17062, -16221, -15453, -13453, -12864, -11470, -10397, -8505, -6381, -4845, -3545, -1065, 1835, 3156, 4821, 6677, 7937, 10178, 12646, 13503, 15089, 16529, 17150, 17803, 17806, 20207, 19991, 19189, 18986, 18213, 17333, 16873, 16297, 14701, 12600, 11997, 10684, 8717, 6393, 4563, 2964, 1249, -1126, -3325, -5506, -7924, -9260, -10652, -12348, -14701, -14857, -16971, -16210, -16970, -18634, -19517, -19196, -19318, -19776, -18687, -18780, -18643, -16633, -16469, -14228, -13187, -12933, -11567, -9661, -9023, -7154, -6066, -4323, -2158, -79, 555, 1396, 2815, 3188, 4354, 4986, 6008, 6559, 6767, 6808, 7828, 7594, 7317, 6465, 6750, 5712, 4967, 4674, 3671, 2445, 1259, 1766, -196, -163, -1223, -710, -2600, -3408, -4245, -3535, -4768, -4813, -5237, -5280, -5746, -4622, -4911, -4786, -4380, -3602, -3564, -2010, -2102, -1963, -790, 53, 1552, 2386, 2719, 4178, 4613, 5629, 6170, 7728, 7227, 7233, 9026, 9043, 8876, 8924, 8997, 9238, 7828]
516G828L42j302j09k63j235p00j337q96j615m01o06j351k239j474j00j893m52
533g803j807J59j166j245J095j933O84O72j457N40j158P49J185R46N70Q94J049
550h026O85N46J307K04K715Q47J473J513J417K63K002N37J444l14J512Q57K69
567I251O53o70R01k59J596k039n79j13L71q48j807m26k95j362o83q14p09j699
585D69m9j720k59p72j364n18J11p05m58o3j11K03N91r36R11p13J824j26n61R97
605c249J355P66J54R11R75J87R88J62R42J236J113J56O86M8j117J118p35P4j61
624E609M61j250n54r08O14j015k161l7n90j266o64j487n51j98j412o09k21j225
642g464K14n42j320J113j421L46K2Q97K79j72J336N13q4K024O59J255K31J698
$$ y = [7828, 8170, 6868, 6759, 6496, 5261, 4561, 3224, 2328, 713, 312, -294, -1645, -3884, -5358, -5458, -7351, -7803, -9610, -9451, -10617, -11862, -10767, -12700, -12016, -11344, -12801, -12261, -13419, -12670, -11485, -10539, -9969, -9075, -8026, -7341, -6795, -5488, -5284, -2569, -1722, -249, 1264, 2681, 2944, 4946, 5483, 6927, 6613, 8125, 8982, 9251, 9904, 9234, 10135, 9876, 11472, 9433, 8854, 8741, 9112, 8264, 6457, 6031, 5736, 4374, 3691, 2877, 2168, 469, 420, -1300, -1559, -2331, -3695, -4213, -4102, -4807, -5265, -5328, -5439, -5236, -4645, -5581, -4670, -5383, -3559, -3685, -4246, -3249, -1894, -1128, -974, -63, 912, 1099, 2087, 2249, 3191, 4427, 5540, 5696, 6382, 6430, 5313, 6431, 5696, 5770, 5609, 6070, 4820, 4266, 3358, 3972, 2957, 796, 759, 169, -1097, -1761, -3248, -3799, -3997, -5409, -6018, -6239, -7464, -7250, -7792, -9112, -7999, -9420, -9074, -9052, -8155, -7876, -8048, -6712, -6199, -6283, -4259, -3600, -2345, -2114, -416]
660d16J021L03R23P87J476J480M80J702j32J276M97N85n2M41n03J99r1J238j307
679I907N79k159j97k28j531q29j095o62j58k155j2j057j608q32j529k94j430O12
697d678j259j460R14o19l29k7j606K377j421K77J261q5J471l46P14J355q1M23
715c119K241J468oN55K71Q03J64J161J040p38J484j01K99O74k68K02q56L59p1
734E562m42j434j08r26K01k85j213j530N78r24m86p69j90j078o46l34k62n75n42
753e403p6K77j45Q19q98J826m15K74p01J983J284N39K07J067M40L23R01L4K272
772D608j68J315r34J8R44R32n67J132O02l67p97n70M30l07l64q91o41p8j699k75
792B323m48j168J2j302m37j362k36r94j110j76j198J5j14m42n69Q20k24j402R02
$$ y = [-416, 605, 908, 1831, 2618, 4094, 5574, 6054, 7756, 7624, 8900, 9397, 9982, 9930, 10371, 9868, 10067, 9976, 11214, 9907, 10486, 8327, 8130, 7902, 6371, 5542, 4447, 3785, 3627, 1472, 1460, 403, -1205, -2037, -3566, -3860, -5290, -4678, -5937, -7397, -6483, -7102, -7431, -7458, -9064, -6687, -8108, -7831, -6570, -6655, -5184, -5530, -4816, -3461, -3542, -3119, -878, 590, 584, 1139, 1410, 2213, 2377, 3538, 4578, 3840, 5324, 5223, 5522, 6196, 5928, 6130, 5274, 5633, 5562, 5120, 3686, 3578, 2652, 2853, 2568, 1355, -175, 403, -521, -1007, -1776, -1966, -3044, -3690, -4024, -4286, -4861, -5403, -5479, -5202, -5347, -4528, -5426, -3600, -4015, -3741, -4442, -2459, -1175, -636, -429, 638, 1078, 1401, 2302, 2336, 4608, 4440, 5755, 4821, 4839, 5783, 6715, 6148, 7280, 7882, 7515, 6718, 6148, 6578, 6271, 5907, 5016, 4375, 4297, 2598, 2323, 1875, 707, 719, -583, -1020, -2382, -2618, -3612, -4722, -4898, -6096, -6081, -6195, -6637, -7206, -6386, -6610, -8012, -7110]
811g110M22l8J038Q47Q1K85K93J652K28J211O60L21P61Q27N2J214n50Q69J174
830D237J93J319K92m65O83j056J258r14k65r60l18O54r95m13L0j251k06L43j196
849I70j113m36P3j206P55n80q70r60L13n67q7K39k92K36J69N2Q29L85k50k92R69
870a663P85L63J166O8j96J699r95J060r7J27J447k51M37P98j301J003J65l25J97
889D487j388M5n89k09L74q90o84j166O54j434N53j51p51p84n25j173R68n62o74
908c899p53K2P60n82l84q42K32Q79M72l59J765m78J292o15Q95m7Q91J48K56J316
928I69M91M31O9Q98P26n46J797p64M40o63Q45P05l83m04l63O62j269P90j74j239
948C018R72j589O14j708N79j544O30J19k843J017l72K3m47j92q43m34M80p33R49
$$ y = [-7110, -6688, -6726, -5688, -4841, -4760, -4475, -4182, -2530, -2302, -1091, -431, -110, 651, 1478, 1530, 2744, 2194, 3063, 4237, 4430, 5749, 6041, 5576, 6259, 5203, 6461, 5547, 5282, 4322, 4004, 4658, 3663, 3250, 3280, 2029, 1823, 2166, 970, -143, -579, -506, -1712, -957, -1537, -2407, -3367, -3054, -3621, -3708, -3469, -3761, -3525, -3356, -3304, -2475, -2090, -2340, -2632, -1663, -878, -515, 651, 719, 523, 2222, 1227, 2287, 2190, 2317, 3764, 3513, 3950, 4748, 3447, 4450, 4615, 4290, 4487, 3099, 3144, 2555, 2346, 2720, 1830, 1146, -20, 634, -800, -247, -398, -1149, -1933, -2458, -3631, -2663, -3225, -3899, -4652, -4630, -3870, -4452, -4836, -5678, -5446, -4567, -4095, -4454, -2689, -3167, -1875, -2490, -1595, -1642, -751, -603, -347, 969, 1460, 1891, 1960, 2858, 3584, 3038, 4835, 4071, 4511, 3848, 4693, 5398, 5015, 4611, 4248, 4910, 3641, 4431, 4257, 3018, 3990, 2401, 3015, 1307, 1886, 342, 972, 1091, -1752, -735, -1107, -1084, -1531, -1723, -2566, -3000, -2520, -3253, -2304]
967b304n87j55N95k38O61O23r18J353M59q02M05O01P25l60J654j139M18P24P46
986B461l66l70M04r5N47m3P69L02j604J186M18j860N76m29o51n21o27K20l07n42
1006e32k36j02o80J41k175R73j19m58o16J395j436J316J17j689L78R23L39p4M58
1025b077M79J60N93%n48J268L43O37J069K57j026R39J82J157J79j035J123m27
1043C273R39k85k14K40N7p41L2NKp01n07l72O87j733R41o95j10r81l0l91p27O70
1065f41k037M67J62n63o81N37K63o33J31P37L82j317O20R03n60O16J2Q65L24n90
1085a003O88k20Q98J056q00l45M45J92N48k30K57Q92N42K73k704J514N18n62j84
1104A775L51r2m37q37N21k38q36R5q43P15p53l69r3O42j068P54j37k70k85L1J05
$$ y = [-2304, -2891, -3046, -2451, -2689, -2028, -1405, -2323, -970, -511, -1313, -908, -307, 418, 58, 1712, 573, 991, 1715, 2461, 2095, 1725, 2129, 2034, 2581, 2538, 3307, 3609, 2005, 3191, 3609, 1749, 2325, 1896, 1245, 724, 97, 317, 10, -532, -768, -870, -1550, -1409, -3584, -2611, -2730, -3188, -3804, -2409, -3845, -2529, -2412, -4101, -3723, -2800, -2461, -2535, -2077, -1598, -1438, -845, -845, -1393, -125, 218, 855, 1924, 2181, 1155, 2094, 2276, 3433, 3612, 2577, 3700, 3273, 4212, 3927, 3713, 3953, 4010, 3269, 3301, 3306, 3308, 2607, 2100, 1728, 2415, 682, 1623, 928, 818, -163, -193, -584, -1311, -641, -2678, -2211, -2049, -2612, -3293, -2756, -2493, -3126, -2995, -2258, -1876, -3193, -2573, -1670, -2230, -1614, -1602, -737, -413, -1003, -315, -535, 363, 1419, 619, 274, 719, 911, 1459, 1229, 1486, 2378, 2920, 3193, 489, 2003, 2521, 1959, 1775, 2126, 2034, 1597, 760, 1281, 1043, 207, 302, -541, 174, -579, -948, -1041, -399, -1467, -713, -850, -1120, -1405, -1374, -1269]
1125a269Q85p00j218Q02l35Q17j2J024j352l13P19P61K92K26o46R35Q20p65Q47
1144A518J246j250P74p11P78L03l42L76n32j69J053j420M8L94Kj425K96k40j59
1163E40L25q25o02k64M08j411ON86n02l80j97M85K1p91J288o05j70j34R80l37
1183a579k91k07p4J010J47N59r29P78N93L9k5k18K96j43O46J042q94P23j075J133
1203A531n52O49J29o78J199j093N70l5j61N27j110n13Q78j076n09Q55n39J74K16
1222D62l24r68qJ09r8j87L57r05J617r07m71Q57j99J30J00k73P46M35j109k6M47
1243b15O79j410J120M97o89P79O35q32M01O3O47o90L18q57J151N48m53j62l27
1262A203l55K98M1j155N53j612J571P30j183N60j621K09m21K08j85l55J90M91
$$ y = [-1269, -384, -1084, -2302, -1500, -1835, -1018, -1030, -6, -1358, -1671, -952, -191, 101, 327, -319, 616, 1436, 671, 1518, 2764, 1514, 2288, 1577, 2355, 2658, 2316, 2692, 2160, 1991, 3044, 1624, 1672, 2066, 2068, 643, 939, 699, 540, 865, 40, -562, -826, -418, -1829, -1823, -1237, -1739, -2119, -2316, -1831, -1810, -2601, -1313, -1918, -2088, -2222, -1242, -1579, -1870, -2077, -2151, -1141, -994, -435, -1364, -586, 7, 46, 21, -197, 99, -44, 602, 1644, 750, 1473, 398, 1531, 979, 1628, 1757, 1079, 2278, 1185, 1755, 1720, 1559, 2086, 976, 463, 1341, 265, -244, 611, 72, 246, 462, 138, -830, -838, -729, -827, -1014, -657, -1562, 55, -852, -1323, -466, -665, -535, -435, -708, 38, 473, -636, -662, -215, 464, -946, 174, 671, -18, 761, 1396, 564, 965, 1028, 1675, 985, 1303, 446, 1597, 2145, 1692, 1530, 1203, 848, 1146, 1187, 32, 585, -1027, 544, 1274, 91, 651, -970, -761, -1182, -974, -1159, -1514, -1324, -833]
1280h33m08M15o46L25j081N48k23P97n27L71m50O24M48k6r94J044M0J225j244
1299e95j68J050N71k23r47J574m21J458l64J94k93m24k50j0o99P23M50L6K4J13
1319A799o72p50q39J022Q16p78j55l93O1n87Q38q11n87N05j001J318j610O10q93
1338b107J060l24p88P55L69k40j79O00p41R36j32L34L05j091O4J350K1Q2l69J12
1358A7L39L09M1K62m58l69J713J63r15n26O66q27J73N81r01n46J346n59R76q00
1378F85k00j565O42m45P19J73p3k69R50j073O35o82j833P50L88P85j064R78pn63
1398a069K67n87O08L21o11N87P81l45M74J12p6K97r00J954j515K14k26J61k19
1417B28J201r07J119j211k3K050j510m71N68j03j84r62J208J00j383L12N65r05
$$ y = [-833, -1241, -826, -1472, -1147, -2228, -1680, -1903, -1106, -1633, -1262, -1712, -1088, -640, -666, -1660, -616, -576, 649, -595, -763, 287, 858, 635, -312, 1262, 841, 2299, 1935, 2129, 1836, 1412, 1162, 1152, 453, 1176, 1626, 1662, 1686, 1799, 1127, 377, -462, 560, 1376, 598, 443, 50, 111, -476, 362, -449, -1036, -531, -1532, -214, -1824, -1214, -2107, -1047, -1371, -2159, -1404, -1035, -1275, -1454, -854, -1595, -659, -791, -457, -152, -1243, -1179, 171, 192, 274, -95, 17, 356, 665, 706, 968, 510, 141, 1854, 2017, 1102, 576, 1242, 415, 588, 1169, 268, -278, 1068, 509, 1485, 685, 485, -1080, -438, -883, -164, 9, -64, -333, 617, -456, 179, -503, -2336, -1586, -1198, -413, -1477, -499, -506, -1069, -802, -1389, -781, -460, -1071, -484, 297, -48, 426, 538, 462, 759, -141, 1813, 298, 512, 286, 447, 228, 1429, 522, 1641, 430, 407, 2457, 947, 476, 1044, 941, 757, -205, 1003, 1103, -280, 32, 597, -308]
1435c08L1J27o13P32m5K1j197P6R4m98K7N13O46l29k94j278J377j117J049NK00
1456g81j26K69L53k18J006k74J78j233J483m3j57P11j37p42L44k91N72n36p7J535
1476A836j454J080n02l62j27L46o29o82N83j85m46N09Q31n13l44J67j053k72O9
1495a148M08n61M19R5M4r68L73O81O24q02P84n81K79L70n01l02J096m29k04P44
1515D21q18J638j078j043J261M13J34q94J175m91J45o4j464R57N71l13o31O83
1533F02p3m26m26P53l99N21j292L20N20p68q20J379j224J66l26M67m19O17k27
1552a055q72O22o8R61o12j16m81J034j44N15q39J412m41J96q25R77o19J827j472
1571@P66n20L70J73p77P35o82P10Q59r94r5l77Q83J78l74n11o52J098q3o0o63
$$ y = [-308, -277, -150, -763, -31, -76, -55, -1252, -1176, -1082, -1580, -1553, -1040, -394, -723, -1017, -2295, -918, -2035, -986, -981, -781, -907, -638, -285, -503, 503, 229, 407, -826, 657, 614, 457, 1168, 1031, 289, 633, 342, 914, 378, 301, 1836, 382, 1462, 960, 598, 471, 817, 188, -494, 89, -96, -542, -33, 798, 285, -59, 108, -945, -1217, -1148, -740, -1301, -882, -787, -743, -1711, -1338, -657, -33, -835, -51, -632, -353, 17, -484, -786, 310, -119, -323, 421, -397, 1241, 163, -880, 381, 794, 928, 34, 1209, 718, 863, 799, -665, 292, 863, 550, -81, 602, 529, 103, -323, 430, 31, 552, -740, -420, 100, -668, -1488, -109, -1333, -1167, -1493, -1026, -1445, -828, -1055, -1927, -1305, -1373, -412, -1024, -1140, -1621, -587, -731, -216, -1055, 357, -84, 112, -713, 264, -355, 1472, 0, 766, 246, 616, 789, 12, 747, 65, 775, 1634, 640, 545, 168, 1051, 1229, 855, 344, -308, 790, 707, 647, -16]
1592a6n73M09R0Q86p87j183M19q1P62k44j039K61M97R70j853N04l62O45j74j83
1612a052k86M37O81o39r1M01L23O74m29N12K10j205R87Q44j717K22J391j216J239
1631A286p85J37l59J74J019j539m8J149n49r13O4L09L00o11o17J16O86l80q48
1650a409J455l96j026K52K42m97Q83j64k47J017l33r67j39O37N85n16P52m99M05
1669C5o91M63J82R8K77m22L75M55k84m50J469l80J39j58K20o98P7J035l77k46
1689A119l33r4k33n33N53j01j53M3K55L56j85k582J727O06r02L98q92j498J497
1708i52L70j87l00l2O07n82K67r2J252j130k14j06P92j16Q2Q02Q6n49K96l68L51
1729B77j41J51Q3k56K63P54j76q32J210j272O69k69o27Q31o49n4K84K5n81m19
$$ y = [-16, -589, -180, -90, 796, 9, -1174, -755, -836, -74, -318, -1357, -1096, -599, 371, -1482, -978, -1340, -695, -869, -1052, -1338, -901, -220, -859, -950, -549, -226, 448, 19, 531, 741, -464, 523, 1367, -350, -128, 1263, 47, 1286, 501, 638, 279, 453, 1472, -67, -115, 1034, 485, -428, -364, -55, 245, -366, -983, -867, -181, -561, -1409, 46, -350, -1376, -1124, -882, -1379, -496, -660, -907, 110, -223, -1190, -1329, -692, -107, -623, 129, -370, 35, -656, -193, -11, 87, 364, -58, 317, 772, 488, 38, 1507, 1127, 1266, 1108, 1328, 630, 707, 1742, 1365, 1119, 786, 692, 459, -74, 479, 378, 225, 268, 523, 879, 694, -1888, -161, 445, -457, -59, -951, -2449, -952, -582, -769, -1069, -1101, -494, -1076, -809, -901, 351, -779, -993, -1099, -307, -423, -341, 461, 547, -2, 294, -74, 277, 136, 287, 370, 114, 377, 1131, 955, 123, 1333, 61, 730, 461, -166, 665, 16, -38, 246, 271, -310, -729]
1749g29Q28j100M23N81p51J23N0J21p6r09Q82j230R97K97r8m60J638j485M64r6
1769e30J16l83J53j2M53L63l26R43j573M11K86R15o57o81J664l64O70j660J97
1788a5O24Q54l12J10j40j44k36J69m68j25J47Q84j073p74N22k79L02n79J22m07
1808h18j64M83r4m84J069k94k12l20k8K21P06p97O7m25J56N98k33j67l23K23N58
1829b78o24P26m94j91R33O66o16P54l20M22j010R35m41k16n35N74kj66j27N06
1849D96n35l96P43K60m88q20Q30M38n97N80n40m48M9o0L98N86o80l33Q22l23j030
1870a048L95P26q06J65N41j78M89j228J003j30n68P09q11R0Q31o97J158P88r36
1889D93K23m63k66j54J164p68N01J47m33J193j537K30J242k348P45L49K52j03
$$ y = [-729, 99, -1001, -578, 3, -748, -625, -575, -454, -530, -1439, -557, -1787, -790, -493, -591, -1051, 587, -898, -434, -530, -414, -797, -644, -656, -203, 160, -166, 777, -796, -385, -99, 816, 159, -522, 1142, 778, 1448, -212, -15, 609, 1463, 1151, 1261, 1121, 977, 741, 910, 442, 317, 464, 1348, 275, -499, 23, -256, 46, -533, -411, -818, -982, -499, -593, -1077, -8, -302, -514, -834, -862, -641, 65, -732, -665, -1090, -934, -336, -569, -736, -1059, -836, -278, -902, -176, -670, -861, 72, 738, 122, 876, 556, 978, -32, 903, 462, 246, -289, 285, 283, 117, -10, 496, -39, -435, 308, 568, 80, -740, 90, 528, -69, 511, -29, -477, -428, -488, -90, 496, -184, -517, 305, -18, -1048, -653, 73, -733, -568, -27, -205, 284, -944, 59, -71, -639, 70, -741, -651, 180, -517, 641, 1429, 493, 716, 253, -13, -167, 997, 229, 730, 877, 444, 1637, 100, 330, 1572, -776, -31, 318, 570, 467]
1907D67j151M41j142J467r02Q06p57PJ173j023L37J86j079J656j050P04n92Q62
1925D10p92j13q66o4J699j022j94N93J005r89P72M29m29j235J198p60J058n09
1943A91K39l2n69k08J73Q86k17l7K76n13r24J595j142J34M81j12k14p50R77q88
1963f54P11l99R09j03j044q96J367p39M28O50p30K74M85r46J33J34k1N21p43L07
1983c56O59j097p5P13O57l95o45J061kl81L0J169j340k31l73J374j818J760m68
2002B42j67j25R58k16o21J125j295J906p52j253Q96m63k43p45M80N33m86j75M83
2021H2J99j97o57k71M38J18M40M2j88l78J57j283R59K1q82J842r68O98K67j346
2041i07N65o85J314p04R01p62m63n72J904n19J9M08p17R95p75M58n41L42M72j974
$$ y = [467, -684, -243, -1385, 82, -820, -14, -771, -764, 409, -614, -277, -91, -1170, 486, -564, 140, -452, 410, -382, -495, -1361, -1425, 274, -748, -942, -349, 656, -333, 439, 868, 439, -796, 402, -358, 700, 191, 430, 398, -171, -379, -206, 680, 463, 426, 702, 189, -735, 860, -282, -148, 333, 221, 7, -743, 234, -654, 57, -342, 567, 464, -580, -1476, -109, -848, -420, 230, -500, -226, 259, -687, -554, -420, -441, 80, -663, -356, 303, -794, -869, -156, 501, 106, -539, 522, 520, 139, 169, 1338, -2, -233, -606, 768, -1050, 710, 242, 75, -50, 908, 692, 71, 1196, -99, 1807, 1055, -198, 698, 235, -8, -753, -273, 260, -226, -401, 82, 281, 84, -573, -844, -406, -288, 152, 194, 6, -372, -215, -1498, -539, -518, -1400, 442, -526, 172, 439, -907, -342, -1027, 287, -417, 484, -278, -741, -1313, 591, 72, 91, 499, -218, 777, 2, 460, -81, 261, 733, -1241]
2061a241J208N53n6M54j135K56K17m70R6K86l95N05r00J140k02P58m89m24Q57
2080A018j368R42m15n75L67Q38p39k04j37Q29n35K75j61n27Q17q92p5L58J38j58
2100b04P94o96K3j82K57K29p75J047r90P3K89l49J381q87r5L56N22j054J37L67
2120B43j173K93l47Q26k6P69l3J10j185J228j140k77P34o34R85q31J88j105M89
2139h86R25K89J22l61K10o79J147j300J9K00K94j27R50l79p35M84n06M22Jn32
2159d42O76r24Q69j06N89k86q27K42L11k4p68K41J176NJ260k417M4L54O23p88
2179a92M44n83k97M70m76J093m09K88o30N49j094Q19O77M8r65q1J0P74j046L70
2199b31m87J012N93m12m02p57k33J629n98k25M56o30J8R3N22l79L53k8q60J170
$$ y = [-1241, -33, 520, 464, 918, -217, 39, 256, -214, -118, 168, -227, 278, -622, 518, 316, 1074, 585, 161, 1018, -350, 592, 177, -398, -31, 807, 68, -136, -273, 556, 21, 296, 135, -392, 425, -467, -542, -184, -46, -204, 590, -106, -83, -265, -8, 221, -554, 493, -497, -424, -135, -484, 897, 10, -85, 271, 793, -261, -124, 243, -930, -637, -984, -158, -184, 585, 552, 662, -523, 705, -435, -712, 22, -612, 373, -458, -270, -1375, -886, 39, 328, 450, 89, 299, -380, 767, -533, -514, -314, -20, -147, 803, 424, -311, 173, -333, 89, 90, -442, 234, -690, 179, 73, 662, 376, -451, -209, 102, 78, -690, -449, 727, 732, 1992, -425, -381, -27, 596, -192, 252, -331, -628, -158, -634, 459, 50, 338, -292, 257, -837, -18, 659, 707, -258, -339, -329, 445, -601, -231, -718, 294, 887, 475, 73, -684, -917, 712, 114, -111, 345, -285, -267, -174, 348, -31, 322, 294, -566, 604]
2219F04m99q87J137O3p19P3K25O22o5q42J061j290j05Q53l84L98q5j235R28l80
2239e27K52N69o66m14P54m99O9oO98j104J498o74k2j19L81j23k43k44m65J572
2259F87n06P08p39r77J106m78O04r25J462n86k24Kj49K83L72R9j213J216n55q16
2279f29O84L13P82q03m40O40p32o57J023o05R77p86k95J189o04J031j436N71k4
2298A99p3m52K82m44j42J053q87K95K31M7J01p29Q04n16j84l39J029j193Q9J836
2318A007p35j24k24k09K47Q20k49k48n05j99M26K58j004P76M02l81j26k65J26
2337b07k81N9L46N6l77M77p41P80J01j022O23J2k43R00J88j479J239n53N03j389
2357a008M88M75m41K26M94p75J19J084p05P46k62J3j180J029l57k09J36M56o90
$$ y = [604, 105, -782, 355, 418, -301, -228, -3, 619, 554, -288, 773, -517, -622, 231, -153, 245, 160, -1075, -147, -527, -275, 294, -372, -786, -32, -531, -462, -468, 230, -874, 624, -50, -72, -191, 190, 67, -176, -420, -885, 687, 181, 889, 150, -827, 279, -199, 405, -520, 942, 356, 132, 134, -15, 268, 640, 739, -474, 742, 187, -629, 55, 368, 1150, 347, -93, 547, -185, -842, 181, -424, 553, -233, -528, 661, 57, 1088, -348, 223, 199, 126, -326, -44, -488, -630, 423, -464, -169, 62, 109, 210, -519, 285, -231, -415, -754, 275, -918, -829, 1007, 272, 148, -76, -285, -38, 782, 533, 285, -220, -419, 7, 265, -739, 37, 439, 58, -68, -333, -207, -488, -429, -83, -27, -404, 73, -668, 112, 213, -809, -186, -174, -417, 483, 671, -808, 431, -122, 381, -1008, -520, -45, -486, -260, 234, -541, -422, 662, -43, 703, 441, 454, -726, 303, -54, -263, -127, 329, -361]
2376c61M5J122n40j049J530K67n01r07P03O36r06N40m23o95L03N32J66m38p66
2395g42Q90l68K3J11N54j50l33m7j90N24j596R68l28N38N89o56k23J22k29L57
2415a86j42m41N01O3k18J058p43M27K72o76j83J021j101P15N04o55k44l47M33
2434E8L13n10P61k25n44K83l58j08N61q47Q11k32r29R67J71o99R6Q57n49q50O79
2455b94O77p10R23o18j240R81m53R37j05j74K88K92j63j66o44K69N30O42p97N71
2475G46q47K33l9m84L79M78J00l68j91O99j005p40K273j266P59r40K61N7M67J82
2495G54n60l90N74M09j82j073M81o7k19o2m8O5r9M88L29J35k040P53R80o49k35
2516f56R87p50Q39n78o89P51N29j260J270K12j228l70j38J316m81k36m80J314
$$ y = [-361, -316, 806, 266, -783, 747, 1014, 513, -394, 309, 945, 39, 579, 156, -539, -236, 296, 462, 24, -742, 148, -220, -197, -86, 468, 318, -15, -62, -252, 272, -1324, -356, -684, -146, 443, -213, -436, -314, -543, -186, -328, -769, -268, -205, -423, 635, -108, 319, 591, -85, -268, 753, -348, 367, 871, 216, -28, -375, 58, 371, -139, 622, 397, -147, 136, -222, -330, 231, -616, 195, -37, -966, 1, 172, -527, -431, 426, -123, -973, -294, 383, -327, 596, -22, -1262, -281, -734, 203, 98, -76, 212, 504, 341, 175, -469, -200, 330, 972, 175, 746, -101, 132, 93, -391, -12, 466, 566, 198, 7, 706, -299, -1039, 1234, -32, 727, -213, 48, 105, 572, 754, 194, -196, 378, 787, 605, -468, 13, -54, -273, -335, -383, -318, -417, 71, 400, 535, -1505, -752, 228, -421, -656, 331, -419, 420, -158, -847, -96, 433, -827, 443, 655, -573, -943, -1081, 235, -246, -482, -962, 352]
2534C52n03m78Q30p64J48J005j037N34P3N31k41j017O18p63L62O37p06J520k297
2553a196J040o6l6R07j274Q76m94k04J535o37j493J667n50q1Q84q58p55P6M50
2572b09j09P1k5M20N0L75j3r56Q7Q80k68k4L46n74m78j09M38J90J38k96J25K81
2594C40l3N1k70j79m39O42PJ53Kn78j14j5J73N99l59n06J66Q04K85n58p81j90
2616h00P76k45P66r00Q97j089M80j314J383p2M85o9n71o6J053j318J871q71o01
2635b05N01L8M30m21j97r91O52KK13J316j707Q16jl25o62M39M1m3p5N02Rm90K47
2658H9N13J72l44p40N39j10n31o8J08J234r73j32k94J349j883J471j312J200Q50
2677A138n21o73Q90j564R79R45j670j08P65K17o23q5k70N5L92n14O43k90R54r13
$$ y = [352, -151, -629, 201, -563, -415, 590, -447, 87, 160, 691, 450, -567, 51, -712, -350, 287, -419, 1101, -1196, -156, -222, -258, 649, -625, 251, -243, -447, 1088, 451, -1042, 625, 75, -6, 878, 20, -735, -659, -209, -318, -247, -272, 148, 198, 573, 560, -396, -309, 571, 303, 279, 625, 51, -427, -536, -98, 92, 230, -66, 59, 340, 307, 358, 88, -91, -530, 112, 119, 272, 274, -304, -418, -433, -260, 339, -20, -526, -360, 444, 729, 171, -610, -800, -24, -269, 497, -403, 494, -595, -115, -1429, -46, -118, 367, 298, -273, -339, 714, -604, 1267, 396, -205, 296, 334, 764, 343, 146, -845, -193, -191, 22, 1338, -369, 447, 446, 121, -541, -102, -61, -104, -179, 323, 332, -158, 89, 602, 774, 430, -310, 229, 119, -412, -480, -372, 862, -111, -243, -537, 812, -1071, 400, -912, 288, 1138, 617, -56, 834, -730, 249, 1194, -476, -584, 181, 398, -225, -310, -580, -525, -133, -647, -4, -294, 660, -253]
2697b53r36J518k53L56j19j92j92K31o28J530j648l64J204m94J57J23M35P02j927
2716g50J311j429J538r45K67l00K28N87l80j30o82N7n75J180O28j333J021j05
2734A88L3k07M12o87Q12J69j26m40J67j119J114k11K31k2l23q91L2J974q67q47
2754f08J484o19n10KM47O4p06J191j284P79r22O7J33L27L03o57N54p11N40N65
2774D39p37J253%n18o70r9M06k40M31j24P19j090P48K8mK04o42j333J146P28n83
2795F2J047j618M81J71N9j024J689j210J91M32m5m14J81Q10j326o42R36j20l24
2814f64L48M59j20l20K24m07L05J052j326m9l6l26N46N62j155O93N21p34j21Q43
2834B95j248J521J86r99n43Q93K98j201L23J292p49n31P10J99k45k40K66l2o14
$$ y = [-253, -1189, 329, 76, 432, 313, 121, -71, 160, -468, 1062, -586, -950, 254, -240, -83, 40, 475, 1177, -750, 561, -868, 670, -275, -8, -308, -80, 507, 127, -3, -685, -628, -1203, -23, 605, -728, 293, 188, 221, 14, 426, -261, 551, 720, 594, 154, 321, -798, 316, 105, 336, 314, -9, -900, -868, 1106, 239, -608, 876, 257, -253, -251, 196, 260, -446, 745, -539, 240, -682, -615, -482, -155, 148, -509, 45, -666, -126, 439, -298, 955, 955, 437, -233, -332, 74, -166, 265, 141, 860, -230, 518, 546, 542, 746, 104, -1229, -83, 645, 62, 1109, -509, -28, 143, 202, -822, 867, -343, -152, 280, 235, -179, 2, 812, -514, -1156, -220, -340, -664, -316, 143, 23, -297, -73, -480, -175, 877, -449, -498, -534, -860, -314, 248, -907, -214, 307, -427, -548, 295, -953, 568, 754, -245, -788, 105, 403, -798, -475, 817, 68, -463, 247, 446, 201, -39, 227, 195, -419]
2853d19L36J51n56J047j212M62J47N02o77m46j48R16o6N30p77p22R55J63p51J95
2873c70P29n2J4n60m34J599j331J002o20n07J223q03M87J46p87m71L33M80L08
2892C86J77k43l29K45j021N49M42j23k15l87Q36m94m28m27J466J5p98M65K33j052
2912g03P04o69n48J692k48o73N66P1J00j16k36l42R68j397P84M90j491J366L28
2931F46n61m31M70M90M95j625J269r55J153m55K14L43r8m7q65m47M95k95N51j268
2951i21J042l43n16Q33k43R55m86l94j88oL43k57j12L56L39r14J030m67N42j706
2971a113P67J642k071J509L27j009m1J139j423J104q79K1N2L9j495J375O94l81
2989B57m18O47L77m69m6p65J91j37P05p7q38M50J40q59J204j363J400j35j438
$$ y = [-419, -83, 68, -488, 559, -653, -191, -44, 458, -219, -665, -813, 103, 37, 567, -210, -932, 23, 186, -565, -370, 359, 307, 321, -239, -673, 926, -405, 597, -23, -530, 693, -110, 377, 523, -264, -735, -402, 78, 386, 563, 320, -9, 236, -785, -236, 206, 83, -132, -519, 317, -177, -605, -1032, 434, 449, -349, 116, 349, -703, 1, -668, -1216, 476, 228, -445, 121, 192, 292, 176, -60, -402, 566, -831, -47, 443, -1048, 318, 646, 85, -346, 124, 614, 1109, -516, 753, -202, 951, 496, 710, 1053, 955, 908, 43, -404, 91, -204, 347, -921, 121, -222, -738, 95, -148, 807, 321, -73, -261, -267, 76, -181, -293, 63, 402, -512, 518, 51, 593, -1113, -346, 1296, -775, 734, 1061, 52, 11, 1150, -273, 831, -48, -27, 25, 64, -1431, -56, 638, 257, -161, 486, 863, 394, 348, -417, -226, -363, 342, 265, -573, -123, 17, -842, 362, -1001, 399, 264, -1174]
3008a174P72J247j294m9J203O33j816M42n5l77P85n70M83j81n00j51n03J273k9
3027A39np22L12N94q1o58P59m29R40j378o26J684j161M39l26J318j139J27J30
3046h3J088j358L25k19O76l52J124j976J27K37N91m22O55O9J4p44j64O83j25J67
3066C13m23K80N36j649J459M56m81j101O65L3K42J77o03k13o66J697p14k31N96
3085C73N2m87k5m17J033j173Q8r49J339l8L92N01j040o22N60J632k128J71Q33
3104I5k71N11r19J103O5r16k20K98j75P93m01P01j234J518K88j094M00j140N24
3123g4M06o41O9R5j79J180j820K83J458m35J49j53r91Q99J055j808j8k13O09K27
3143I8k06j34n1O36l04q55N94K63j059P46n88J373k58J83m81N62j085O58R6J97
$$ y = [-1174, -402, 845, -449, -498, 705, 1338, -478, -36, -91, -468, 317, -253, 230, 49, -451, -602, -1105, 168, 139, 134, -588, -276, 318, 237, -421, 338, -91, 849, -529, -1155, 529, -632, -193, -519, 799, -340, -213, -83, 1005, -353, -28, -247, 429, 77, 1201, -775, -648, -411, 180, -242, 413, 482, 496, -248, -412, 271, 146, 313, -110, 170, 706, -943, 516, 972, 491, -610, 55, 88, 330, 507, -96, -309, -975, 722, 8, -223, 373, 425, -62, -87, -504, 529, -644, -556, -1505, -166, -204, 188, 689, -351, -973, -413, 1219, -909, -738, 95, -176, 335, -584, 519, 584, -332, -552, -254, -429, 364, -37, 664, -570, 948, 1236, 142, 542, -598, -74, 332, -309, -240, -145, -324, 856, -964, -681, 777, 342, 491, 338, -653, 246, 1301, -507, -525, -738, -129, 98, -108, -242, -293, 343, 39, -816, -222, 41, -1018, -272, -860, 513, 255, 438, -43, 519, -566, 92, 188, 385]
3163C85J57n03Q84p9j80J43j170J119p87K50p03M00J49n12J096p29k60K60O61
3182E81j012L91k62O23k47k29J93J16q44J641j292k06P7M56L51j030M74O8m22
3201e73P4M86L32j420J824n00m20O71o2j03j39j30O10L3J00q80m93M67K96n33
3221c60O34J35n45LM8P8k26N97p20O51k0K79n69K80m40m37L12n55R64m91L07m68
3243e43P40k08l62j55L13L18n03J667j108j092J391m34M57m28n42M23J16J38J61
3262C49q07O88k01l85N93m27N96m56L85K82k20l35k4j90r1m9O33m95P86l87L88
3283F33m57q1j458K386j068J137j702r84J553L28j554K08J065J50k70j22j28J54
3301b10o77N87P64n04p13O6J74K31M74K99o1L57o32P09l52k76J23N91j015M41
$$ y = [385, 542, 39, 923, 844, 664, 807, -363, 756, -31, 219, -484, -84, 65, -447, 649, -80, -340, -80, 581, -431, -40, -302, 321, 74, -155, 38, 154, -690, 951, -341, -547, -470, -14, 337, -693, -219, -151, -573, -499, -13, 319, -1101, 723, 223, -197, 474, 412, 309, 170, 40, 650, 683, 783, -97, -590, -123, 173, -360, 274, 409, -136, -133, -85, -7, -233, 364, -356, 295, 275, 554, -15, 265, -175, -612, -300, -855, 109, -382, -75, -543, 197, -11, -373, -528, -215, 103, -400, 1267, 159, -933, 458, 24, 481, 53, -489, -66, 50, 188, 349, -458, 230, 29, -356, 237, -190, 406, -50, 335, 617, 397, 62, 38, -152, -243, -292, 341, -154, 632, 245, 633, 176, 95, -1363, 1023, -45, 1092, -610, -1594, -41, 287, -1267, -1059, 6, 156, -114, -236, -364, -210, -887, -300, 464, -40, -753, -687, -513, -282, 192, 491, 430, 787, 155, 864, 512, 236, 359, 950, -65, 376]
3321C76Q69L56k949J863j136M54N1j47P84o66Q34n78l97L69K88n3m76j17M83m8
3341A60P70r00M35m97K10O3M75m40j246Q94l81J654j028j068J530q32J49N21p85
3360c16j06Q00q22k51K44P20k68Pm91M70J3Q2m37Q63l78J8o70L67m33M67l28J477
3382A028j210n45l54J336q92J352L12j266R75l87L16n32O04o42j243O57J64l07
3400f34p90J682l04o0j63m93R57j195L5J666j186J58O68k31p2k12K80l11M62o18
3420c61m77N68P12j77q55J065o33L07k41m53N02k70N37L81L2j139P19r14P42n5
3440a0L38l24P9O94o00o2K91m07lR4n12J878k407O87j53P01M54j376O50p64N38
3461b14k44J098j367O29o79N80J302o92L9k29K21p99P78l73L8n19J59l4J015M4
$$ y = [376, 1245, 1601, -1348, 515, -621, -167, -116, -263, 521, -145, 689, 111, -286, 83, 371, 318, -158, -275, 208, 160, 930, 30, 465, -32, 178, 241, 716, 276, -970, -76, -457, 1197, 169, -899, 631, -201, -52, 469, -316, -422, 378, -444, -695, -451, 269, 1, 8, -483, -13, 0, 82, -355, 508, 130, 148, -522, -155, -588, -121, -449, 1028, -182, -727, -1081, 255, -637, 715, 1027, -239, 736, 349, 665, 133, 737, 95, -1148, -491, -327, -634, -1424, 258, -46, -106, -269, -762, 195, -1000, -965, 701, -485, -327, 341, 110, 38, -174, 106, -205, 257, -361, -838, -270, 442, 265, -590, 475, -158, 149, -92, -545, -43, -313, 224, 605, 637, -502, 217, -697, 45, -10, 328, 4, 83, 777, 177, 115, 406, -1, -4, 90, -422, 1456, -951, -264, -417, 284, 738, -638, 12, -752, -214, -458, 640, -727, -98, -777, -197, 1105, 413, 452, 223, 444, -355, 423, 50, 88, -431, -272, -306, 709, 753]
3481G53K9K53j455J92K53j226K392l54j004J310r01p52Q2N32L6o08L67n38MO87
3501E2j6n04P26N59r27m79J13N73j7N22j190k72J300q77M04j79o59N16j24n8O89
3522A52j32k89P64l15j58o64J493j704N97J80pl40q5Q97r65J133q87j76Q11l79
3542g4O40j193M53l06J51o36N89O04R2l98m9R65q31j35J271j653RO29L34o38j08
3563b84j21L70P0k11K33k21O64l49R10j217m02N59l24q07J849n93n67J016J14
3582F89j243O68L12q01m9K92k9l16O62M3m22Q64m89N6q31J022o6k65J64j98Q36
3603H99k180J888n27n73L29k47m46J137K0p40O03J62j023J295r77N84j027O05
3621b18M92p04P27k18p42J378q03M40P25k179O27K87J02O29j353R65j28K88j32
$$ y = [753, 782, 1035, -420, -228, 25, -1201, 1191, 837, -167, 1143, 242, -510, -428, 104, 140, -468, -101, -639, -635, 52, 36, -468, 258, 817, -110, -589, -476, 97, 80, 602, -588, -860, 440, -437, -33, -212, -871, -355, -479, -537, 152, 20, -269, 495, 180, 22, -642, 851, -853, -256, -76, -83, -423, -508, 389, -576, 557, -330, -506, 305, -74, 566, -627, -174, -480, -329, -965, -376, 228, 320, -78, -127, 838, 7, -128, 1143, -510, -501, 128, 462, -176, -284, -405, -35, 35, -176, 57, -164, 500, 151, 1061, -156, -558, 1, -323, -1130, 719, 126, -441, 575, 689, -554, 114, 426, -375, -424, -132, -161, -477, 185, 228, -194, 670, 181, 237, -594, 428, 362, 97, 261, 63, 899, -1281, 607, 80, -493, -164, -411, -857, 280, 300, -440, 163, 325, -698, 597, -380, 204, -823, -218, 274, -430, 297, 79, -663, 715, -88, 352, 1077, -1102, -475, -188, -86, 543, -810, 155, 27, 315, 183]
3640A83m57l8M95J05j021M22M78J7L2N86K61m8j240N68j031O42m6M63q75M59Q12
3661G67j579J358o17L32J38k99K44n50p28J146M19Q1j381k08M11Q64q30P43j78
3680A33K70n71J071r13q92J422p47n35Q99j74l20Q83q45J17M41j032J334q54J94
3699a19j83L34O01j446Q50l9P48j266J258o69K66J68j392J118J89m55J9l32J53
3718a97l1K03m21r2p8Q97Q4k92j283R14o94J64Q12N70j47p34P10o84L08J104q11
3739C02j188M19l99N06J494j447J31K73j78k2k77L39M06j11M12K2n56k97Q22O77
3759A328j661N75j260J395l05k94j76J056M3m0m11n48K08J89m9K40r45J074OP2
3779D97m91k34n38J82M80n17o91R99m81k22J205m60k65J404k672J995p39J365
$$ y = [183, -274, -312, 183, 288, -733, -311, 167, 184, 216, 802, 1063, 1015, -225, 343, -688, -46, -92, 371, -504, -45, 767, -812, 546, -71, 261, 399, 100, 344, -206, -934, 212, 631, 712, -669, -877, -466, 398, -432, 311, 133, 403, -168, 903, -10, -902, 520, -227, -762, 137, -37, -357, 526, -319, -202, 239, -793, 541, -313, -119, -302, 32, 633, -813, 37, -2, 746, -520, 738, 69, 335, 503, -889, 229, 418, -37, -18, -350, -197, -228, -25, -446, -538, -616, 281, 365, 73, -1210, -296, -990, -826, -14, 556, 409, -325, 385, -299, 9, 1113, 302, -886, -467, -866, -360, 1134, -313, -182, 91, -87, -109, -386, -47, 359, 248, 660, 682, 126, -171, 651, 1328, -333, 242, -1018, 377, 72, -222, -398, 658, 701, 661, 250, -298, -90, 99, 50, 290, -655, 419, 425, 497, 6, -228, -766, -584, -104, -621, -1312, -313, -794, -1016, 189, -271, -536, 868, -1804, 191, -548, 817]
3797H17m77p34J048k09j81j66L85j08n81N26m59O09K88j100M98q62K59J149j27
3816E75m21N7L13m31n58J325K39j829M06K72oK40p57J219N6r92j79o1j019J421
3836a30m98J087n12L5N16n39o19P71L15m24Q31p81J87J83j015J036N5r81J12R36
3856E65m58n54L43m11N19n47J007k44Kj49l05L0K0N44q33N6J310l12M40p23j649
3877a349J526j084L55Q49k04l83L64m40N7l1J182p45p89J222k22j083P41p4k42
3896c50P45j517J069O56o95R35j43J42j826J910q22q00N63q9p7N58j25L40K93
3915G67j367R59j648O52O75j340J226j41O54q65K28R38j661J174O95j719k36Q
3933a001N92p23Q82K78L58p18m52M70M17j53L04J52J37N9j118M11r20J480p12
$$ y = [817, 340, -394, 654, 445, 264, 98, 483, 375, -206, 320, -139, 470, 758, -342, 156, -706, -447, 702, 575, 154, 211, 524, 93, -465, 860, 1099, -730, -324, -52, -58, 182, -575, 644, 700, -292, -471, -532, -1551, -130, -628, 459, -53, -18, 498, -41, -660, 111, 426, 2, 833, 52, 239, 422, -593, 443, 498, -483, -371, 565, 107, -447, -104, -515, 4, -543, 464, 220, 222, 73, -232, -202, -182, 362, -471, -415, 895, 583, 1023, 300, -1349, 177, -907, -552, 297, 93, -290, 74, -366, -309, -340, 842, 97, -692, 530, 308, -775, -34, -108, -350, 395, -1122, -53, 603, -92, 843, 700, 842, -984, 926, 104, -696, -133, -222, -299, 259, 134, 474, 767, -600, 359, -1289, -637, 38, -1302, -76, -217, 437, -428, -200, 738, -923, 251, 946, -773, -1009, -1001, -409, -1132, -250, 28, 386, -332, -784, -314, 103, -50, 254, 406, 543, 602, -516, -105, -1025, 455, -257]
3952b57K87L73J30o47N70j503J198l19L90J58n45P3J03q8j05N78j009J598j072
3971h7M02j30p03o32K142p34k46N03o80j98O0N65q75M0R85l51j073N07J006N72
3991A073k028J405j73j240J293o58q46J476j021Q66m57P70o89J69O57j04m21j137
4009a065R00M46j49J332j143J044l23j320K36P02p24k44N50l82j21m2J20N51R05
4028A273j194Q2k81m00J168k26k78K61n49N80k65j16N51j351Q43L22l98J140j126
4047C6M20q73K86Q46q24k46k39J78L46j3l1N62j143M37n14J958j451M0L66L35
4067D76n93m88N34N87n76l48Q08k75J57l86o51N62P52j670J046Q22m05J20k26
4086B46M46n65n69J99L37j205J066Q8R2r6m0M84p97Q4M57j085J399m08K27n94
$$ y = [-257, 30, 403, 533, -114, 456, -1047, 151, -168, 222, 380, -165, -92, 11, -77, -182, 396, -613, 985, -87, 315, 185, -518, -1150, 992, 258, 12, 515, -165, -363, -303, 262, -613, -573, 412, 61, -1012, -505, 501, 1073, -955, 450, 277, -963, 330, -328, -1174, 302, -719, 147, -310, 460, -229, -60, 597, 493, 72, -1065, -165, 281, 132, 1464, 321, 1365, 1042, -278, -42, 660, -64, -308, 242, -140, -261, -303, -183, 368, 1273, 79, 161, -120, -520, 648, 422, 144, 405, -144, 436, 171, 55, 606, -745, 98, 420, 22, 1162, 36, 456, -417, -131, 715, -109, -355, -594, -416, -70, -83, -114, 448, -695, -258, -772, 1186, -265, -225, 141, 476, -117, -605, -71, 516, -60, -408, 400, 125, 282, -104, -755, -193, 559, -1111, -65, 757, 352, 472, 246, 692, 127, -442, -243, 94, -1111, -45, 43, 135, 39, -1, 483, -314, -230, 227, -858, 541, 133, 360, -234]
4106b34j20N71K47m44l17j032J701l81J5L15l9j73L29p96p19J405R45j442N77
4125D08n26k90J84M66k15O60j78r19P95r21m61J856q61r2Q86j206K43O34r47M3
4145d41j9J557j430L68J66O15p47Q18q80k98m67J161k62k57O54k90Mk01k0PN33
4166E71q9j04r73K26J725j582l19L99j23N10J56R97j598p73J072m07J265J27k005
4185i25K11K97J194j955R60L66m84N10L30l34p95k74J059L06m29j324J681j49
4203B45J04n55N45j135L07R45q15L47n4K93j58j31k28j97r3K26o8M9L86K79P07
4224I99j443J000r40L58M10l53k25l71J856j560m88P62o01J37R36j79Q17j152
4242c7L1m10N20M50Oj003K46L72n99J082o25n50K44K97jp75M68q6L05J04M1k34
$$ y = [-234, -354, 217, 464, 20, -297, -1329, 372, -9, 6, 321, 282, 109, 438, -358, -1077, 328, 1273, -169, 408, -118, -408, -224, 242, 27, 687, 509, -410, 385, -536, -997, 859, -2, -94, 792, -414, -171, 463, -484, -441, -460, 1097, -333, 35, 201, 816, 69, 887, 7, -291, -758, 403, 141, -116, 538, 248, 252, 51, 31, 38, 571, 482, 378, -595, -369, 1356, -226, -545, -146, -269, 241, 397, 1394, -204, -977, 95, -312, 953, 1080, -925, -714, -417, 777, -1178, -218, 148, -336, 174, 504, 170, -625, -899, 160, 466, 37, -1287, 394, 245, 349, -206, 339, -796, -489, 456, -359, -12, -66, 227, 69, -62, -290, -487, -580, -354, -422, -373, 13, 292, 999, -444, 556, -384, -26, 384, 31, -194, -565, 1291, -269, -757, 5, -596, -459, 477, 298, 1115, -37, -6, -416, 104, 554, 560, -443, -197, 175, -424, 658, 33, -517, -273, 24, 23, -752, -284, -370, -65, 39, 80, -154]
4264a54l46J301j561O22M70J25n02J77k29k56K13n4P92j093Q20m32N44o07k4R90
4284G96j044M61o77j99R44l49N04j170n4J555j066j60J153q65p3m6P13L43O4k16
4304F14j493K95M74r52R84J056n21o27j61n65J166p17J679m92q89Q8M1J81L08
4323D69O88o53j717N14N35N93K02q56J53L43l56K84r13L59j03p3M88J88L02p7
4343C70o39L40J03L4P79m12l42K77q94J3Q09o10j75R28m51o42j063J392L79r32
4363g36P56q15R28q69R77n55k74M11k68N25L41l68J89n91Q62r35R07j13J25p06
4383b09K48n72p76J752M9n0j467J489m75l02Q43m98m72P86j100J416o42p49J39
4402e90N06N40j72M60o53m47Q03k65o01P21r0m82Q1N26m84k00K94J26o00j23J144
$$ y = [-154, -500, 801, -760, -138, 332, 457, -45, 132, -97, -353, -140, -194, 598, -495, 325, -107, 437, -170, -194, 796, -248, 213, -464, -663, 281, -68, 436, -734, -788, 767, -299, -459, 694, -171, -244, -290, 423, 766, 830, 614, -879, -584, -110, -1062, -78, 978, 457, -170, -331, -896, 270, -447, 1232, 740, -149, -61, -20, 161, 469, 1157, 504, -1213, -699, -164, 429, 631, -225, -72, 271, -85, 199, -714, -355, -458, -531, -43, 145, 447, 370, -269, 71, 174, 208, 987, 575, 233, 510, -384, -371, 438, -172, -347, 581, 130, -512, -1575, -183, 196, -736, 20, -795, 133, -736, 241, -314, -588, -177, -445, 80, 421, 53, 242, -349, 513, -422, 485, 372, 497, -209, 39, -533, -1309, 443, 492, 442, -1025, 464, -11, -313, 530, 32, -440, 346, -754, 662, 20, -729, -590, -84, 456, 284, 744, 91, -356, 447, 182, -419, 302, 212, -270, -189, 337, -147, -347, -53, 73, -527, -650, 494]
4423D94n29n09J590j490Q53K0j248J639j288m47K026l96r51M46o4q72L80L23m53
4442d76K39k70j14k84J654p56j28m1K29Q80j300O39N72j487M28j094J294N38q85
4461c62R46o40l15K00k34J49P35j19l74j88K27J247j183J4P90r82M40q9K52o8
4481D46j104J089j195Q28o15Q42K91o86J406j311p61N85J65J57j22k75m98Q48
4499I0k08M23N24j19l94M54l21O6l97k55L27r72J450n40m13R48m92N41n15L00
4519D97p59j55m70P96OL67L62j689R54J061j520M03J073j076M30K66K17l12p62
4538c11N94j40q80N40Q35n22J073j479n19J070j45m46j96R70q56k75J032m93o94
4557h42M12k35J225q92K34j39P59l91M86k34k5o02K8O17m00J34m13J498p97p72
$$ y = [494, -35, -544, 1046, -444, 409, 429, -819, 820, -468, -915, 1111, 715, -236, 210, 146, -726, -346, -23, -476, -237, -507, -621, -905, 749, -7, -135, -176, 53, 933, -367, 272, 844, -643, -215, -1309, -15, 523, -362, 584, -56, -371, -171, -405, -256, 479, 360, -14, -202, 25, 1272, 89, 103, 893, -89, 351, 262, 514, 446, -658, 431, -764, 64, -551, 291, 582, -104, 1302, -9, -770, -185, -20, 137, 15, -260, -758, 90, -118, 305, 829, 710, 316, 770, 449, 515, 118, -137, 190, -782, 668, 128, -285, 663, 171, 712, 197, 497, -262, -417, -887, -91, -85, 282, 644, -1045, -91, 970, -550, -147, 926, -150, 280, 546, 763, 451, -311, 283, 143, -737, -197, 638, 116, 1189, -290, -809, 261, 116, -330, -526, 444, -412, -687, 345, -148, -842, -430, -665, 560, -332, -98, -237, 522, 131, 617, 383, 358, -244, -216, 401, 1, 135, -278, 1220, 423, -349]
4577c49j66M39M02N09p0n05R0N48r16p92P76J54J83n74K19N1R17j764P40l86M07
4598h7k19L19L73j129J22J036p5N8m87J3P76k36L06p71O48r68L91m52L36R8p07
4619f55m73J047P93j563J101j383K000j266R4J74j90P1O1r65J207M22l8Q9K67
4638G93j167M74j59Q15k03M04q71m62J262r51J05k7k72M46Q6p43J276j929O22
4657e01R3N51q17P57l32l63L19L17Q49o45m8K42o30M3J081j314O3O00J83J91j835
4678a196J140M76l72L31o59k76J275p99l02N48Q7J58p08M22j04K05o10K75l31
4697d40K30M35o79M00J093m74j661J464l68L55j035O83J05M79j055M52P9rj8n76
4717e40k59J59O19n29K77p4L86l36N59k7p25oM35L03m82K14P20p68M54q10L09
$$ y = [-349, -515, -76, 326, 835, 765, 260, 350, 898, -18, -810, -34, 120, 303, -271, -52, -1, 916, -848, -108, -494, -87, -306, 13, 386, -743, -621, 415, 340, 398, -89, -76, 700, 464, 770, -1, 647, -321, 70, -382, -46, 52, -655, -1128, -81, 712, -851, 250, -1133, 867, -399, -305, -131, -321, -250, -189, -1154, 53, 475, 437, 526, 793, -374, 100, -59, 756, 553, 957, 86, -376, 886, -65, 40, 13, -259, 187, 273, -470, 806, -1123, -501, -408, 143, -674, 83, -249, -612, -293, 24, 873, 228, 180, 422, -208, -165, 916, -398, -335, 265, 448, 639, -1196, -56, 420, 48, 379, -280, -556, 719, -80, -382, 166, 253, 411, -297, 125, 21, 226, -384, -109, -440, -210, 225, -454, -54, 1039, 565, -1096, 368, 0, 355, -680, 3, 108, 587, -468, -16, 63, 54, 36, -540, -799, -640, -21, -550, -273, -347, 39, -297, 262, 235, -490, -496, -61, 242, -240, -26, 694, -74, 380, -430, -121]
4738a21j03m00R86o29J52m45L07J55j39J22K00l20n1K84m58m65N87P66n64L03
4758A67n39l82K061j802J077Q1j342J221n58k79M24j076M23m00Q56J165j687O52
4776F2o31K64R13j315J67N96K22k13K5o79L73Q68j439P71N05p67J004k02k74L40
4796E90j97p30L85q7j88k53M36N83j328J129j58n57q15J177J66o36J181l40r19
4815e61M63n36j78J413j234Q13l22O23o47M59m30O33M29j516J038q35O0J178o66
4834A84L42N26j955K39J186o98P97r32Q42j015P00J48k23R4j086R66m94N39j84
4853b4N0j37j003Q18J74j18J081p09k06J6j057J468P5k56M68j427J009l23Q03
4872G02q07m30J027p38J292r49j94K33q42R97k60M64p41Q47r36L9n3j33P85r37
$$ y = [-121, -224, -624, 362, -267, -115, -560, -253, -98, -237, -115, 85, -235, -286, -2, -460, -925, -338, 428, -136, 167, -372, -754, 1307, -495, 582, 663, -679, 542, -16, -295, 129, -947, -524, -924, -68, 1097, -590, 62, -569, -305, 608, -707, -540, 56, 278, 65, 90, -589, -216, 652, -787, -16, 489, -278, 726, 524, 250, 590, 393, -337, 48, -39, -227, -480, -44, 539, -789, 340, 182, -375, -1190, -13, 153, -483, 698, 358, -561, -98, -634, -812, 601, -633, 180, -142, 481, -166, 293, -137, 496, 925, -591, 447, -388, -328, 850, 184, 526, 1052, -903, -664, 522, -176, 621, -311, 531, -484, 216, 364, 141, 235, -851, 115, -379, 160, -24, 26, -111, -1114, -296, -122, -240, 841, 132, -74, -58, -1115, 353, 428, 172, 640, -787, 222, -101, 702, -105, -535, 492, -246, 1046, 97, -97, 136, -706, 291, 31, 495, -246, 601, -335, -296, -349, -482, 303, -634]
4892f34L85L7N00R66q96k9P65j430k12J246n05P39O39j456p18Q16r62M57O74n84
4912b02Q68m17Q25j424N5O90l02p09K7P82k76Q90m90o78n4L50P42k67l58r9l51
4933c98J076r64o30Q26N26m39O9J3n60K01J72n71Q19p01K72Q15o10L27r17M37
4953b37l52J000j342J126Q05j749J150j045J116Jj54m19l7M09O0n17J104o90j65
4972F4J82J21O81m98n79l10L33L47j06j283J119m9l96J373j754R43j160J609O41
4991A278k041o51J477L73m6j073J033J72n71L55j14m35j36j53L5R6qM15J82m65
5011b77Q82m55o84N52m6p12K97O70J03O28j071K74m6j156L84P50K25n79N89m68
5031a40N71n58Q26p05J54l75L21o54J213r88L68M63j302J625o96j107P02k2m22
$$ y = [-634, -249, -212, 288, 1254, 358, 329, 1094, -336, -548, 698, 193, 932, 1571, 115, -603, 213, -749, -292, 382, -202, 666, 249, 1074, -350, -295, 395, 93, -616, -589, 193, -83, 807, 317, -361, -415, -65, 677, 410, 52, -47, -398, 678, -286, -916, -90, 436, -3, 66, 79, -481, -280, -108, -679, 140, -561, -289, 526, -84, 243, -674, -237, -589, 411, -931, 195, 1000, -749, 401, -644, 472, 473, 319, -100, -137, 272, 332, -185, 919, 229, 64, 246, 367, 1048, 550, -29, -339, -6, 341, 235, -1048, 71, 22, -374, 999, -755, 188, -972, 637, 1278, -763, -1414, 63, 436, 390, -683, 350, 522, -49, 306, 192, -243, -379, -532, -497, -401, -409, 6, 188, -277, 605, 150, -534, 18, -28, -740, -443, 227, 330, 958, -113, 161, 115, -1041, -657, 93, 318, -261, 328, -140, 431, -127, 699, -6, 148, -227, 94, -560, 653, -335, 33, 496, -806, 819, 123, -984, -282, -304, -726]
5050g26J084j58l11N79j01j232J452l84L60p45Q09p41n96J143l19p60J672j041
5068a5L71r97K21O69k73k92n02O08M81J66R56k016J087L20j023J162r01J20q73
5087g31L42K39J87p9j31l57R90L46p67n8l44jN80o59L01M90l67K10L59p05n82
5108g37K05o8J192j028m7M55k33K97L64r35M89q25O77J367j514o14J151j286M48
5127f42K015k587J368L37l77K28k99m69J104j015m12O50P01l14p25K59k69Q76
5145D29p57O87n32j108O7J389J32J74j320L12J110m32o62Q2O06j095L09N57K1
5164c1k73k79K30K20M32O28R9r41p89j98R80k80n68J075r03J175l00J41j86O93
5184I25q77L7p35O71M33m18K99o58r89K048l57p37L4R04m72j1m64J002j073n9
$$ y = [-726, 358, 200, -111, 468, 367, -865, 587, 203, 563, -182, 627, -114, -710, 433, 114, -646, 1026, -15, 356, -641, -420, 249, -24, -316, -818, -210, 271, 437, 1393, -623, 464, 784, -239, 923, 22, 142, -731, -389, -150, 37, -42, -173, -530, 460, 806, 39, -19, -363, -364, 216, -443, -142, 348, -19, 191, 550, -155, -737, -532, -600, 592, -436, -483, -28, -261, 36, 400, -535, -46, -871, -194, 1173, -341, -955, 196, -1090, -642, 1373, -1214, 154, 491, 114, 342, 43, -426, 678, -337, -749, -99, 602, 288, -437, -178, -447, 429, -328, 359, -173, -1281, -1214, 175, 307, 481, -839, -527, 583, 151, -511, -429, 177, -918, -609, -52, -31, -304, -583, -353, -133, 299, 927, 1026, 85, -704, -902, 78, -202, -770, 305, -598, 577, 277, 418, 232, 925, 48, 85, -650, 21, 454, 36, 335, -323, -1312, 736, 379, -358, -324, 580, 108, 97, -367, 635, -438, -497]
5204d97M73P7l89N84m63m51O81q94J298p19R24m81P3l83k5J60K99j07m62J12O24
5225D34O45q68k56N23k65p50J228l55j050M91K66n37K52r19P53P68l14M0l96R84
5245F74m37N3n57N74Kp93L58J96l79M29q40K78l22J530j032J455j049m57M27J07
5265B17K9m29m81M04N43K76m72p47j91J119k00q3M87j203J531j478J623q52L95
5284D88l78M59j084P26j039K82J054j21j56n98J029r10M60m15P88o21M68Q6r64
5303d46k62Q84K36O93j183l26N54n42j16m49J709J31j327L69P42j87o79R30j27
5322F04q98j31J54p73J299q8M53l00j27J07j16o08N15r26J317n58P07q00n79J074
5342C26M15q14p6J5J068p06n25M71o61J134p33m52N65m5j68N85J08l80r9O7l78
$$ y = [-497, -24, 53, -336, 248, -215, -666, 15, -879, 419, -300, 624, 143, 216, -167, -192, -32, 267, 160, -302, -190, 434, 1079, 211, -45, 478, 213, -537, 691, 336, -714, -223, 43, -494, -242, -1161, -408, 360, 46, 86, -310, 674, 237, 290, -267, 307, 309, -484, -126, 70, -309, 120, -720, -442, -764, 766, -266, 1189, 140, -317, 110, 217, 246, -183, -664, -260, 283, 559, 87, -660, -851, 268, 68, -15, 472, -731, 800, -678, 945, 93, 488, 110, 569, -515, 211, -828, -546, 508, 387, 231, -367, 662, -248, 212, -203, 585, -36, 432, 518, -446, -708, 176, 412, 1105, -78, -404, 150, -392, -508, -957, 752, 883, -444, -75, 667, 480, -199, 731, 604, -294, -425, -271, -1044, 255, 167, 620, 320, 193, 300, 184, -424, 91, -835, 482, -76, 631, -169, -748, 326, 741, -73, -149, -134, 934, 228, -297, 174, -487, 647, -86, -538, 27, -18, -186, 399, 507, 127, 28, 95, -283]
5363b83J141p70K9k34k13L91l92P47N01r71m88P84k88j36P1n27O5m16P85K29k27
5384b02k11N56k34l66J8L41o25J133p77K39K55o00Q72k62n29N67J50m20K19o87
5404e63R83o89n16N82R41j519Q99J32q51J62J57Q94r48p4p26J912k47j090J011
5423D50K31j427Q92j13P23r53K45JK21k5k9m87K56P5Q34r85L58L5j84L89k72M28
5445F63o31Q8K11l02M70K82j593O72N82l28j231O25O28L77r91m3K17k9k3P02R
5466C55r32J182j299J501q62j001R21n97M10k18K68L53O51j069O10K87m29m71
5484c40Q68m78m31M82l71K25k79J197m75r00L18oJ24J88m1O72j33p05m45k34J265
5505E01j270m98J086P26J3j06j62j780J168O86q84j38J455k82n05L22j414J160
$$ y = [-283, 858, 88, 117, -117, -330, 61, -331, 416, 917, -54, -542, 242, -46, -182, -111, -638, -573, -989, -204, 25, -202, -413, 143, -91, -457, -439, -98, -723, 410, -367, -128, 127, -473, 399, 137, -392, 175, 325, -95, 124, -563, 420, -269, -785, -203, 738, -781, 118, 250, -601, -439, -282, 612, -336, -410, -1136, 776, 529, -561, 450, 681, -746, 146, 33, 756, -197, 48, 49, 270, 245, 216, -271, -15, 60, 894, -91, 267, 302, 118, 507, 235, 663, 32, 120, 331, 29, 499, 781, -812, -140, 442, 114, -1117, -492, 136, 513, -478, -521, -304, -333, -356, 346, 355, -577, 605, -694, 807, -55, -1056, -135, -732, -322, -540, -272, 81, 732, -337, 273, 560, 131, -340, 528, 50, -381, 101, -270, -45, -324, 873, 398, -502, -184, -190, -66, 122, 81, 753, 620, -85, -530, -764, 501, -769, -1267, -181, 545, 558, 452, 290, -1490, -322, 364, -520, -658, 797, 515, 10, 332, -1082, 78]
5523G8M08r38j112K366j478P43O17j278R74n46r45R82k50K02m4J78o72Q86rk71
5543a09L84L10n57j85m6K45j93j66m12J027o22k60P68m84j022J682q26O57J048
$$ y = [78, 486, -452, -1564, 802, -676, 67, 684, -594, 380, -166, -1111, -129, -379, -177, -221, -43, -715, 171, 162, -109, 275, 585, 28, -157, -203, 42, -151, -317, -729, 298, -324, -584, 184, -300, -1322, 360, -466, 191, 1239]
$$ [...]
8191I2
##END NTUPLES=NMR FID
##END=
