##TITLE=1H_KYU-20
 CDCl3, 108 sc, 
 13.3.2019
##JCAMPDX= 6.0         $$ Bruker NMR JCAMP-DX V2.0
##DATA TYPE= NMR FID
##DATA CLASS= NTUPLES
##ORIGIN= UXNMR, Bruker Analytische Messtechnik GmbH
##OWNER= root
$$ XWIN-NMR		Version 3.5
$$ Wed Mar 13 16:01:31 2019 Russian Standard Time (UT+4h)  she@DPX200
##.OBSERVE FREQUENCY= 200.1315
##.OBSERVE NUCLEUS= ^1H
##.DELAY= (6, 6)
##.ACQUISITION MODE= SIMULTANEOUS
##.ACQUISITION SCHEME= undefined
##.AVERAGES= 108
##.DIGITISER RES= 16
##SPECTROMETER/DATA SYSTEM= spect
##.PULSE SEQUENCE= zg30
##.SOLVENT NAME= CDCl3
##.SHIFT REFERENCE= (INTERNAL, CDCl3, 0, 15.7039)
##AUDIT TRAIL= $$ (NUMBER, WHEN, WHO, WHERE, WHAT)
$$ ##TITLE= Audit trail, XWIN-NMR		Version 3.5
$$ ##JCAMPDX= 5.01
$$ ##ORIGIN= Bruker BioSpin GmbH
$$ ##OWNER= she
$$ F:/spectra/data/she/nmr/H-F/1/audita.txt
$$ ##AUDIT TRAIL=  $$ (NUMBER, WHEN, WHO, WHERE, WHAT)
(   1,<2019-03-13 16:00:51.46 +0400>,<she>,<DPX200>,
      <continue with go, POWCHK disabled, PULCHK disabled
       configuration hash MD5:
       00 E9 B6 7A A2 85 ED C7 34 08 36 98 17 FE 4E 26
       data hash MD5: 16K
       B3 B9 AA E2 C1 97 B0 31 9D 67 16 B5 9C FB C3 4B>)
$$ ##END=
$$ 
$$ hash MD5
$$ EE 06 81 61 8A 11 D8 65 96 E8 A6 E2 45 9D 9B C6
##$RELAX= 
##$RELAX= 
##$RELAX= 
##$RELAX= 
##$RELAX= 
##$RELAX= 
$$ Bruker specific parameters
$$ --------------------------
##$DU= <F:/spectra>
##$EXPNO= 1
##$NAME= <H-F>
##$PROCNO= 1
##$TYPE= <nmr>
##$USER= <she>
##$AMP= (0..31)
100 100 100 100 100 100 100 100 100 100 100 100 100 100 100 100 100 100 
100 100 100 100 100 100 100 100 100 100 100 100 100 100 
##$AQSEQ= 0
##$AQ_mod= 1
##$AUNM= <au_zg>
##$AUTOPOS= <>
##$BF1= 200.13
##$BF2= 200.13
##$BF3= 200.13
##$BF4= 200.13
##$BF5= 200.13
##$BF6= 200.13
##$BF7= 200.13
##$BF8= 200.13
##$BYTORDA= 1
##$CFDGTYP= 0
##$CFRGTYP= 5
##$CHEMSTR= <none>
##$CNST= (0..31)
1 1 145 1 1 1 1 1 1 1 1 1 1 1 1 1 1 1 1 1 1 1 1 1 1 1 1 1 1 1 1 1 
##$CPDPRG= <>
##$CPDPRG1= <>
##$CPDPRG2= <>
##$CPDPRG3= <>
##$CPDPRG4= <mlev>
##$CPDPRG5= <mlev>
##$CPDPRG6= <mlev>
##$CPDPRG7= <mlev>
##$CPDPRG8= <mlev>
##$CPDPRGB= <>
##$CPDPRGT= <>
##$D= (0..31)
0 1.2 0 0 0 0 0 0 0 0 0 0.03 0 0 0 0 0 0 0 0 0 0 0 0 0 0 0 0 0 0 0 0 
##$DATE= 1552478135
##$DBL= (0..7)
120 120 120 120 120 120 120 120 
##$DBP= (0..7)
150 150 150 150 150 150 150 150 
##$DBP07= 0
##$DBPNAM0= <>
##$DBPNAM1= <>
##$DBPNAM2= <>
##$DBPNAM3= <>
##$DBPNAM4= <>
##$DBPNAM5= <>
##$DBPNAM6= <>
##$DBPNAM7= <>
##$DBPOAL= (0..7)
0.5 0.5 0.5 0.5 0.5 0.5 0.5 0.5 
##$DBPOFFS= (0..7)
0 0 0 0 0 0 0 0 
##$DE= 6
##$DECBNUC= <off>
##$DECIM= 2
##$DECNUC= <off>
##$DECSTAT= 4
##$DIGMOD= 1
##$DIGTYP= 9
##$DL= (0..7)
0 120 120 120 120 120 120 120 
##$DP= (0..7)
150 150 150 150 150 150 150 150 
##$DP07= 0
##$DPNAME0= <>
##$DPNAME1= <>
##$DPNAME2= <>
##$DPNAME3= <>
##$DPNAME4= <>
##$DPNAME5= <>
##$DPNAME6= <>
##$DPNAME7= <>
##$DPOAL= (0..7)
0.5 0.5 0.5 0.5 0.5 0.5 0.5 0.5 
##$DPOFFS= (0..7)
0 0 0 0 0 0 0 0 
##$DQDMODE= 0
##$DR= 16
##$DS= 0
##$DSLIST= <SSSSSSSSSSSSSSS>
##$DSPFIRM= 0
$$ [...]
##$SUBNAM2= <"">
##$SUBNAM3= <"">
##$SUBNAM4= <"">
##$SUBNAM5= <"">
##$SUBNAM6= <"">
##$SUBNAM7= <"">
##$SUBNAM8= <"">
##$SUBNAM9= <"">
##$SW= 330.908255636489
##$SWIBOX= (0..15)
0 0 2 0 0 0 0 0 0 0 0 0 0 0 0 0 
##$SW_h= 66225.1655629139
##$TD= 16384
##$TD0= 1
##$TE= 0
##$TE2= 300
##$TE3= 300
##$TEG= 300
##$TL= (0..7)
0 120 120 120 120 120 120 120 
##$TP= (0..7)
150 150 150 150 150 150 150 150 
##$TP07= 0
##$TPNAME0= <>
##$TPNAME1= <>
##$TPNAME2= <>
##$TPNAME3= <>
##$TPNAME4= <>
##$TPNAME5= <>
##$TPNAME6= <>
##$TPNAME7= <>
##$TPOAL= (0..7)
0.5 0.5 0.5 0.5 0.5 0.5 0.5 0.5 
##$TPOFFS= (0..7)
0 0 0 0 0 0 0 0 
##$TUNHIN= 0
##$TUNHOUT= 0
##$TUNXOUT= 0
##$USERA1= <user>
##$USERA2= <user>
##$USERA3= <user>
##$USERA4= <user>
##$USERA5= <user>
##$V9= 5
##$VALIST= <valist>
##$VCLIST= <CCCCCCCCCCCCCCC>
##$VD= 0
##$VDLIST= <DDDDDDDDDDDDDDD>
##$VPLIST= <PPPPPPPPPPPPPPP>
##$VTLIST= <TTTTTTTTTTTTTTT>
##$WBST= 1024
##$WBSW= 4
##$XGAIN= (0..3)
0 0 0 0 
##$XL= 0
##$YL= 0
##$YMAX_a= 579451
##$YMIN_a= -256987
##$ZGOPTNS= <>
##$ZL1= 120
##$ZL2= 120
##$ZL3= 120
##$ZL4= 120
##$ABSF1= 10
##$ABSF2= 0
##$ABSG= 5
##$ABSL= 3
##$ALPHA= 0
##$AQORDER= 0
##$ASSFAC= 0
##$ASSFACI= 0
##$ASSFACX= 0
##$ASSWID= 0
##$AUNMP= <proc_1d>
##$AZFE= 0.1
##$AZFW= 0.1
##$BCFW= 1
##$BC_mod= 2
##$BYTORDP= 1
##$COROFFS= 0
##$CY= 11.3945322036743
##$DATMOD= 1
##$DC= 2
##$DFILT= <>
##$DTYPP= 0
##$F1P= 18.9103706918063
##$F2P= -1.10871071338519
##$FCOR= 0.5
##$FTSIZE= 0
##$FT_mod= 4
##$GAMMA= 1
##$GB= 0.15
##$INTBC= 1
##$INTSCL= 1
##$ISEN= 128
##$LB= 0.24
##$LEV0= 0
##$LPBIN= 0
##$MAXI= 10000
##$MC2= 0
##$MEAN= 0
##$ME_mod= 0
##$MI= 1.114404
##$NCOEF= 0
##$NC_proc= 0
##$NLEV= 6
##$NOISF1= 3.799351
##$NOISF2= 2.8
##$NSP= 1
##$NTH_PI= 0
##$NZP= 0
##$OFFSET= 15.70392
##$PC= 1
##$PHC0= -9170.872
##$PHC1= 19.60026
##$PH_mod= 1
##$PKNL= yes
##$PPARMOD= 0
##$PSCAL= 0
##$PSIGN= 0
##$REVERSE= no
##$SF= 200.130013532006
##$SI= 16384
##$SIGF1= 3
##$SIGF2= 2
##$SINO= 400
##$SIOLD= 16384
##$SREGLST= <1H.CDCl3>
##$SSB= 0
##$STSI= 0
##$STSR= 0
##$SW_p= 3612.71676300578
##$SYMM= 0
##$S_DEV= 0
##$TDeff= 0
##$TDoff= 0
##$TI= <>
##$TILT= no
##$TM1= 0
##$TM2= 0
##$TOPLEV= 0
##$USERP1= <user>
##$USERP2= <user>
##$USERP3= <user>
##$USERP4= <user>
##$USERP5= <user>
##$WDW= 1
##$XDIM= 8192
##$YMAX_p= 0
##$YMIN_p= 0
$$ End of Bruker specific parameters
$$ ---------------------------------
##NTUPLES= NMR FID
##VAR_NAME=  TIME,          FID/REAL,        FID/IMAG
##SYMBOL=    X,             R,               I
##VAR_TYPE=  INDEPENDENT,   DEPENDENT,       DEPENDENT
##VAR_FORM=  AFFN,          ASDF,            ASDF
##VAR_DIM=   8192,          8192,            8192
##UNITS=     SECONDS,       ARBITRARY UNITS, ARBITRARY UNITS
##FACTOR=    1.51e-05,      1,               1
##FIRST=     0,             0,               0
##LAST=      0.1236841,     0,               0
##MIN=       0,             -256987,         0
##MAX=       0.1236841,     579451,          0
$$ Real data points
##PAGE= N=1
##DATA TABLE= (X++(R..R)), XYDATA
$$ [...]
2764i34q8J372j313J094J11J72j36M02q07j7N23J111j117K19J29m50m31k29K8
2783c61R0M51n63K80n18J89J199m91p86r41K49J081k32Mj21O31j39L47k21J28
2803B76k46J41p10J81J202P16j263J61M93j410J51M94k27l80N57N23o19n28M52
2822c6l39Q28j9J487k914J531k41j047n83R22Q4k1N07M1J13m36J368j666P66m19
2842g4M2j57Q70K48j639Q40Qo60J62RR34o11Q26m86j697Q79K79p7K90M98o8K69
2864F85m87J60O38q90n07K89l05NJ143o42n69R88r43N66p97K46O75J09p18R54
2884F00L7j086P5j6m72M86Q29l09m76R87l34J01n34N14K68r81J003j535J323j34
2904C46L03l04j366O20J333j731J016j231J651l78n91M63o84J571j734J452q14
$$ y = [-934, -1022, 350, -963, 131, 242, 414, 278, 680, -127, -144, 379, 1490, 373, 592, 721, 271, -160, -389, -361, -271, 180, -383, -103, -621, -432, 767, 276, -510, -1451, -1202, -121, -353, -349, -470, 161, 22, 369, 148, 276, 30, 171, -539, -358, 844, 1560, 297, 458, 951, -459, -308, 186, -41, -421, 136, 659, 40, -488, -36, -375, 453, 434, 1921, -993, 538, 297, -750, -1333, -411, -327, -348, 159, 200, 313, -123, 1245, -421, 345, -74, -32, -189, 681, 929, -710, 130, 138, -522, -360, -351, 583, -28, 798, 312, -1385, -506, -227, -304, -14, 484, 416, 685, 198, 358, 996, 106, -401, -112, -417, -412, 731, 89, -480, 508, -435, 131, -666, -420, 255, 364, -354, 600, 637, -449, -374, -390, -862, -376, 453, 144, -332, 655, 321, 422, -112, 402, 670, -311, 692, -843, 480, 346, 649, 345, -1021, -401, 932, -799, 217, -1014, 637, 259, -332, 131, -553, 1018, -716, 736, -78]
2921g8J52N82j154J435j290M76m80P96m20P59j368j05K62N13l91K07m69M67J61
2940E5R8O29j028M45n39N75j407J118K43J35o26K15j270J613l1l20J51j077J016
2959eN6J96p30J00k82J430j035J86Q00n42m73L38M13l48m32M58P87j769L10K55
2979b87R12p11k1n63K49J467j378J89P03j032L21q08L08M46J65M30N50j15p82
2998D3j62j2K71j58o78Q70mM30q57k09J499k15j481O82R97p97L46L95o49R57j426
3019a58k58K88M9K66l76J15R67j377K50l32M01m79J320m85M40j06n32l87J00M90
3039A96q42J480j426M09l63R62m17O91j860J680L85p87m26k67J88M99m57p13J474
3058D06k73l34P59p82L94m9r25L63J326q5p48o5k74J215j049J87m29L43L07p56
$$ y = [-78, 74, 656, -498, 937, -353, 123, -357, 439, 19, 778, -590, -695, -433, 80, -311, -104, -573, -106, 55, 153, 782, -246, 199, -340, 235, -1172, -54, 189, 324, -302, -87, -1357, 256, 225, -95, 56, -1021, -5, 51, 247, -483, -383, -665, 765, -270, -84, 716, 174, -299, 39, 452, 104, -328, 130, 917, -852, -542, -287, 625, -86, -107, -670, -421, 1046, -332, -143, 560, -472, -151, -959, -651, -205, -40, 390, 940, 825, 43, -119, -131, 140, -18, -696, 174, 170, 600, -257, -466, 1033, 818, -663, 19, 1016, 219, 565, 960, 311, 1268, -158, -416, -128, -79, 187, -189, -74, 893, -484, -234, -566, -165, -644, 676, 191, 631, 525, -7, -394, -294, 196, -646, 834, -592, -183, -546, 416, -1, 690, -1170, 510, 895, 108, -318, -585, -397, 102, -355, -1068, 406, 133, -201, 558, -224, 170, 121, -804, -441, 885, 800, 52, -13, -287, 928, -121, 66, -363, -20, 287, -469]
3078d69K15L33j93M84N22L12j391j68P70J17K52j179J498j117n06P41m61M07J23
3097B90m85n28Q93o92M21l62O54K57p14M46j585K067j503J101l45M02%j251Q97
3116c7o39K33N64J603r54j302K64J86j80K01j91M04L39r64P78N4l29R08n86P25
3136A077l69M16k012L18J013j135K74P54q29k52K39k20J058r60J51J97M19j089
3154i50J169o82L23k02n03J421k09j516Q31L58q7q0L22N68m69j26o18J94l50J243
3174F37k71K98R2J57j276N68L66l52J65M0l82m37M77K25q7m32K0L67M95p28J181
3195A123j321N59k57J4o60Q97m71l5n5J068o09P85p82J07m62p11J744j508J99
3214c75l13n99Q43q24J373o20k29J150r4K47o51J205q15q33rm04J332N15j381
$$ y = [-469, -254, 79, -114, 370, 892, 1204, -187, -355, 415, 532, 784, -395, 1103, -14, -520, 221, -240, 167, 290, -195, -723, 170, -522, -101, -463, 191, 448, -266, 180, -1405, 662, -841, 260, -85, 317, 317, -934, -37, -676, -443, 121, 1724, 770, -532, -268, -82, -262, -61, -252, 152, 491, -473, 305, 359, 30, 938, 352, 1077, 708, 1124, -888, -570, 443, -692, -418, 336, -493, -745, -506, -726, 332, -628, -477, -280, 139, -950, 219, -463, -140, -342, -845, 576, 367, -1149, -318, 40, -47, -127, 195, 763, 294, 168, -450, -256, -606, 637, 366, 664, 756, 913, -363, 205, 571, 219, 384, 424, 42, -395, 82, 307, 220, -212, -192, 175, 670, -58, 1123, -198, 361, 104, 118, -542, 355, -116, -151, -206, 862, 253, 1038, 256, 363, -99, -810, 934, -574, -375, -688, -1287, -444, -1268, 105, -515, -744, 406, 312, 559, -92, 1113, 298, -535, -544, -948, 384, 899, -482]
3233d82o9J393j272k7q8L13J81J08K24l76J20M95j377L88K22n4l87P99M60l17
3253B54j04j109M69k73K83J01J65J382j411K64J6l78O94o69k61J145k82N5n30
3272a89j95M74K06q8o09O91L40k73K6o46R7K94l01O46j43q58J142r74M02M06q50
3293d02N76p98R45J56j192Q85P8O4L26q89N41K04j609J583o17kN34J87q19O80
3313D31j616J720p90l46R13p07m31L69J53K32l07l9P86k40R4n34k55m2Q51p08
3333d66M64l38O35L59o60L89N8k1o21P97M91n36k33L75l88J99q42O16k5j7k83
3354d7M21o67R2J023n26M82k65Q3j428J079n68K74l25R97m87q81L91M8K35J239
3374A170n98r30j43M93o97P88N51o14l11k51Kl04J02P45k52L36M92o66j98k22
$$ y = [-482, -551, 842, -430, -457, -545, -232, -51, 57, 281, -95, 25, 520, -857, -469, -247, -301, -688, 111, 571, 254, 150, -959, -490, -763, -480, -379, -214, 1168, -243, 21, 37, -341, 353, -316, -577, 568, 286, 341, -189, -384, 90, 296, 208, -401, 290, 630, 357, 383, -263, -166, 128, -173, 473, 330, -528, 614, -360, 42, 448, -402, 174, -624, 321, 477, -715, 170, 248, 312, 638, -251, 290, 494, -1115, 468, -149, -151, 383, 570, -249, 431, -1185, 535, -255, -601, 312, -395, -826, -457, -304, -72, -379, -418, 368, 128, 222, -312, -567, -609, 242, -466, -2, -340, 295, 654, -6, 383, 441, 420, -201, 596, 1087, 551, 318, 693, 305, 504, -338, 278, 253, 236, -47, 374, -293, -201, 822, 296, 778, 513, 596, -832, 247, -321, -47, -372, 625, 138, -743, -352, -304, -69, 1170, 572, -358, -501, -8, -705, 83, 634, 20, -291, -542, -540, -844, -742, 3, -249, 87, 579, -87, -285, -507]
3394e07N68K30q21M63q5R14r62M00j495J643m42J092j242R75p13M50q05n51K329
3413A441j449J69Q35j116J25j9P2R07p04l82j75M54j04L62o37M26l70n36Q23l69
3433b47N64L4k53j40m57k89Q21M90j039L45o33J37J275k67K8q21N71j59k82L76
3453E4o59R60j169N06O28n4O26j484J308j632J169k94q78O89j131J233L10j031
3471h49R89r71M99P86p60O78q12J514q6j267J44J153j529J007o07o5m27j69J227
3490D55m16K20P86j228R41j257K63p16P71j78L13J94n73Q26l59K1m73P67N07p07
3510A57M4j39m89O76J33m00p60j84O46R92l30k77K18r80J320j050r3N35n87L66
3530b02J20L51n96N5L84ON29r67N18L89m33n32P27L93m06j700J749M22j48j457
$$ y = [-507, 61, 291, -530, -67, -152, 762, -200, 200, -1295, 348, -94, 998, -244, 731, 18, 468, -337, -888, 1441, -8, 161, 996, -120, 5, -14, 58, 965, 261, -121, -296, 158, 54, 416, -221, 205, -165, -701, 122, -247, 317, 351, 98, -42, -499, -788, 33, 523, -516, -171, -804, -667, 608, 341, 369, -452, 119, -40, -322, 54, -605, 355, -814, -308, 320, 266, 892, -592, 716, -916, 253, -41, -919, -230, -1361, -128, 182, -849, 140, -831, -332, 454, -306, 372, -440, 1074, 988, -279, -135, 1018, -511, 496, -111, -176, -603, -772, 455, 39, 259, 1045, -183, 758, -499, -236, -952, -181, -359, -46, 148, -425, 401, 42, 63, -410, 357, 864, 157, 201, 62, -427, 249, 382, -18, -778, -962, -316, 676, 346, 69, 287, -693, 627, -423, -516, 19, -568, -202, -82, 269, -327, -272, 112, 118, 647, -320, 198, 587, 154, -378, 349, 742, 336, -1364, 385, 807, 659, -798]
3550g98K54Q36Mn45M59K66m94j73p80J46J389L5k92J07o61K71q61N33k30K8J894
3571A388r50n64Q70q47j42J511j264M14n52j74Kl00p10M11R47P5q65J076r36L68
3591b42L04J59j194N72P44M57j067J03M9n97J075j40q6R45j322J043p90j28J335
3610A220r55O23r25N8k62N81j55O14q18q3O37j005K5J49J80K05o3J68J272j338
3630A28M2l3N99j482K22O87n92Q14K52j15p60R82r18L51n96J17n72J286r70J64
3650c94P62n0l01R02L9j070Q56j255N53Q01q83O69j433K54n5L36j61N33k7O42
3670G18j11q60J075M1j087N8P6P53j053J166j106J9K82j74k8k1J038j951J230
3689F5M71n19j42l83j91m33P31L06j00j319K038k95J61l82M20k02o21N11K34o73
$$ y = [-798, -544, 292, 296, -249, 210, 476, -18, -191, -971, -825, 564, 599, 307, 414, -247, 24, -837, -304, -534, -506, 1388, 438, -126, 744, -103, -245, 1266, 2, 416, -136, -310, -308, -608, -1318, -907, 40, 115, -750, 326, -610, -242, 62, 221, -973, -401, 343, 800, -267, -164, -115, -712, 363, 223, 137, 1082, -240, 803, 13, -115, 1220, 265, 888, -37, 21, -241, 340, 185, 799, -19, -102, 535, -470, -445, -296, -116, 89, 26, 194, 1466, 128, 170, 137, 736, -746, -524, 163, -429, 385, 637, 522, -238, 744, -174, 177, -419, -302, -874, 412, -558, -394, 368, 318, 17, 919, 958, -112, 744, -511, 42, 843, -40, 629, -804, -550, -605, -269, -430, 103, 76, 718, 607, -253, 822, 863, -224, -166, -90, 663, -390, 776, -330, -311, -29, -203, -231, -252, 786, -1165, 65, 536, 17, -125, -508, -699, -1132, -401, -95, -195, -1514, 524, 229, 390, 8, 428, 226, -395, 116, 350, -323]
3709c23J263n95L8k82l78k41R12m05j01M25k13o47J278k72J03qj538N3J724p84
3729Ij92qP82k19m6j543J212m4o78L05P7M56k58J9q52P45j2j98J230j018N73p62
3751d22N07k56j177K479r51M04r0J86n22j15n09Q81q21L94J248j964J357K73j268
3770c66R15J18n87m2J271k029Q36k32L49N63j99p94l7N45j9j36P6j287Q63l53
3790e45J97k85Q3l50J771o54K59j510O91P06j245Q08N61n79M53K92r16j4l30q3
3810f90Q87j1l38J103j333k57Q52N98m38n55J001o16n02R30m37j04l54j98J568
3829A106k77j173n63J361k41k24P7L97j407K94O50j42J190j079j84Q80p18l7L47
3848B57L48j327J040J12j096P83L01p58o04J640j383M33K94o71J619j049J270
$$ y = [-323, 940, 345, 383, 101, -277, -518, 394, -11, -112, 313, 100, -547, 731, 459, 562, 554, -984, -931, 793, 9, -183, -191, 591, 372, 326, -1217, -5, -49, -727, -422, -345, 111, -147, -128, -980, -235, -247, -445, 785, -233, 340, -422, 85, -171, -1348, 1131, 180, 584, 494, 680, 158, 43, -466, 415, -406, -12, 1236, -728, 629, 902, -366, 549, 667, 80, 38, 1309, -720, 116, -116, 233, 796, 597, -197, -234, 311, 292, 156, 232, -1055, -192, -545, -348, -633, -550, -900, 871, 217, 476, -1034, -343, 363, -882, -74, 487, -92, 361, 653, -263, -277, -607, -690, 197, 186, -152, 951, -382, -639, 213, 811, 373, -182, 819, 203, -299, 631, 194, 90, -264, -462, 1106, 829, -344, -907, 454, 213, -11, 66, 463, -944, -650, 0, -142, 1048, -31, -215, 665, -53, -90, 257, 605, -722, 318, 430, -666, 117, 418, -340, -944, 696, -687, -254, 40, -631, 988, -61, 1209]
3865A209k367R78J395j494P70j15p56P93j18l47k16J13R95R3n15p67J3J92L31
3884A87K59r43J26L10m2R42j773J139k84k50R26p16M84M19p3j118N56n89J332
3903H92o8p26K07j219r7N39Q99J80p86k99N79j065J217P3r22J55O64l77k54m2
3923d50K59K43q30P14k40m32Q1P14o9R0k31J5N00j344J244n88p50k61J001p08
3943a042M23J263j965J281L64j92l3Q94m77n16j58K34m91N03m05o54Q10p40J093
3962A92p88J264m73k57k44O72r10Q9J155K61j187J51J61J52N01p76j20l17J133
3981F59o22L57m86k4k95J080j071j53N40M61j005M86n73M76l05M68K6l31P13K81
4001F82j475R21j277J438J77r99Q74J78j268J735r53k76nk77N07l20M54j487J048
$$ y = [1209, -1158, -180, 1215, -279, 491, 376, -380, 413, 295, -52, -268, -155, 840, 933, 418, -349, -336, -144, 187, 446, -497, -371, -61, -103, 839, -934, 205, -79, -329, 597, -119, 365, 784, 711, -407, 149, -440, 892, 824, 98, 305, -914, -1011, -472, 427, 607, -179, -478, 101, -964, 253, 326, -596, -441, 223, -154, -408, -450, -191, 52, -778, -64, -304, -736, -655, 59, -10, 80, -151, -136, 364, -980, 264, -324, -1074, -1335, -334, -1042, -619, 644, -1321, -40, 324, 132, 99, 993, 516, 0, -158, 76, -415, 88, -317, -971, -161, -901, 192, -596, 668, 195, -62, -306, 366, -544, -455, 700, 961, -226, -75, 86, 238, 739, -37, -157, -474, 659, 37, 394, -92, -116, -411, 669, -402, -555, -15, 446, -559, -73, -646, -170, -475, -7, 19, -312, 401, 682, -793, 128, -1149, 289, 466, -533, 341, 519, -749, 986, 33, -243, -248, -525, -18, -338, 116, -1371, -323]
4020c23P79m17q15N13n38L42P07m7Q7M68n58J61K12k83n62J035o24m34N93r58
4040f62J282j82p00j31M03N15l85J84K13j18J54q21M72n83P36J011r59m18j21
4059a10j37l71K82j4M96J67M7k09k0J79n79K92n89K7J221n9k70k82k05r73J262
4080A55o12l52J008p22M81k16K02N55j205P42q5O9Q4k80J09O59l60j59N4j83M40
4101C84J40r53P63l71j000J113j43m85j21P58J82o8k9J06l08O5Q17p32R1l25m71
4122e87l18K8J302l69K36j220J111P58j464R46q87K83L40j04m32Q19o24o2P99
4141E55J16j625R61j18j71n94k32J317O8K11q49K94p20L16R39j220K725k141L33
4160A65Q9p12K37O31K44p48J65j077P88m70N54K90n4k44m29J43P47L84k073J016
$$ y = [-323, 456, 39, -776, -263, -801, -459, 248, 201, 288, 756, 198, 359, 571, 288, -274, 761, 137, -297, 296, -662, 620, 438, -262, -393, 10, 525, 140, 324, 537, 419, 573, -248, 224, -359, 377, 1388, 429, 11, -110, -247, -618, -336, -350, 146, 313, 360, 151, 131, 310, -269, 23, -566, -539, 682, 623, 353, 71, -134, -1107, 155, -457, -809, 199, -523, -42, -258, -56, 499, -706, 36, -49, 20, 104, -176, -67, 592, 232, 73, 127, -56, 384, 524, -429, 334, -37, -1037, 76, -67, -552, -673, 85, 267, 199, 170, 276, -32, 33, 850, 118, 209, -116, -587, -905, -877, 425, 56, 292, -928, 183, 941, -523, 423, -464, -181, 159, 55, -377, 442, -182, -244, 555, 671, -954, 7, -111, -282, -876, -1108, 209, 277, 488, -361, -67, -787, -471, 468, -752, 1973, -168, 165, 254, -458, -221, 410, 654, -94, 71, -1006, -218, -688, -134, 156, 102, -142, -571, -428, 319, 703, -1370, -354]
4180c54P66n54L1j252J128J50O95L79j198o8J372j43k21o66k2p99P5m55N40r4
4200f90J087n67l82L22K51o1l3l10N27k06p75m4Q69J50p98J92j60p4R0J23J14
4221c75J24P65m41N10n92p9j004J646l55l7m77Q0o17J262L20j095M93p0l49m16
4241g07k14J424k52p79m78K75J452o92k05J42J2o82L74O06M40q11J25K62O71n35
4261D28j533K052j259R8m22J376o07k20R33j099J164q08L78r90P78N87j000P15
4279E71M71j874P13j38N51J80j599L84J476p45q57M09lkQ33r55L65j75J051j37
4299E19q66J395j055L10q17o1J64L79P07L7q01P62p64k16O94j54m49L96m23M14
4319A71K38r53R26l6j85r7Q68o33K23r2J137j977N47P54j93n03M3k98n58L23J292
$$ y = [-354, 412, -142, -111, -1363, -235, -85, 610, 989, -209, -277, 1095, 952, 731, 65, 43, -756, -681, -1136, -596, -690, 397, -170, -552, -230, 21, -40, -73, -383, 144, -62, -837, -881, -12, 138, -660, -468, -628, -702, -612, -489, -375, -251, 514, 73, 583, -9, -88, -1092, 554, 199, 162, -315, -235, -852, 410, 730, -365, 128, 58, -291, -707, -921, 503, 251, -528, -1006, -731, 721, 29, -176, -34, -22, -704, -330, 276, 716, -95, 30, 292, 963, 428, -1105, 947, -312, -214, -636, 740, 133, -87, 846, -253, 911, 103, 481, -509, 269, 856, -144, 571, 1042, -832, -119, -257, 294, 474, -1125, -741, 735, -10, -867, -458, -461, -463, 370, -585, -220, -395, 656, 519, -347, 1048, -7, 303, -514, -575, -411, -32, 675, 712, -89, 673, -91, -307, 387, 233, -216, 180, -243, 171, 409, -544, 382, 346, 161, 64, 932, 299, 522, 430, 1567, -410, 137, 891, 698, 195, 238, -60, -618, -295, 997]
4340I97j177J032j212P10j15j527J041o64L48k55l61K393j171j009R03n74J377
4357G36o09m71K38N75p91L50n88R13o18k6M58m71q04J434l07o1j68k55J396j465
4377e34J035n08M83l27j50N37p60K22K23J01j732J073L43n49J520r75J48j03l24
4396b77N45l87k55J80O5P58m18j168J928o33k51k64K77kl06K52j81K70R93r00
4416B26mK78j500Q98R58j609Q88n4N85j647J218J25o56J19j52P96j040L54r11
4435a128J130N19k94k38K42m95k5K23j243J623O40j381k11J198Q3j238M11J124
4453I40r13k43M14M00rj459L49p3J001j657J228R7q11O42R05j106K16J219j428
4472b88Q84o07N1L53k19K09O9j058N25J05K55n70k53M27J75J86P50j213M80L2
$$ y = [997, -180, 852, -360, 350, 235, -1292, -251, -915, -567, -822, -1183, 1210, 39, -970, -67, -641, 736, 127, -344, -106, 469, -322, 28, -560, 353, -265, -291, 167, -304, -1108, 326, 19, -42, -210, -465, 931, -534, 501, -7, 476, 149, -1, 536, -224, -2, 221, 322, -1410, -337, 6, -543, 977, 2, 150, 47, -277, 268, -119, -374, -194, -129, 629, 211, -957, 971, 338, 87, -177, 100, 98, -208, 44, -137, 133, 1126, 226, 222, 500, -1000, -102, 856, -753, 135, 81, 666, -981, 237, 362, -294, -175, -327, 469, -571, -217, -1128, 2, 521, 227, -11, 231, -264, -289, -66, -1309, 314, 954, -427, -638, 560, 643, -595, -184, 940, 27, -216, 198, 598, 589, -870, -521, -594, 407, -1250, -22, 75, -736, -94, 811, -295, -79, 1140, -288, 596, -11, 40, 393, 174, 383, 452, -606, -81, 24, 279, -291, -544, -117, 58, 244, 994, -219, 261, 293]
4492B93l54q6m46O55J48l47q05K57J366o36l1k83j092Q94J052n93j015O89L41
4511GjO71k88o31p3R06n30l32j22K14O83o42M62J8P0k42j18N20p26l42M85k37
4533b48j02j09K46K59NL59j577J269k76R23O3p68L12P33j194J71r71J958j205
4552a52N07O33m77l47n69M05m5Q9o12P23l78o22Q21N07j17j063O27j86Q72j016
4572d00L77Q1o43l79Q83N56L3l08n09m1L14J023j438J025O37j583K65P39q25j97
4592c90N86L80K19o63P29j522m13J207K94Q8n19m85J99o82N03k57J80P65l79O64
4612E04p8k391J890J033j929Q79k02N84j50j279J046J51L97M49j919K079n10r18
4630c64p09R58M30r97J322l87j46J62j84Q45r61n35k16Q34Q04m54n04l30J077
$$ y = [293, -61, -147, -593, 62, 210, -137, -942, -685, 681, 45, 14, -269, -1361, -467, 585, -8, -1023, -334, 7, 6, 677, 389, -242, -315, 591, 61, -271, -393, -179, 504, -138, 324, 342, 412, 170, 52, 572, -154, -496, -11, -248, -350, -459, -213, 46, 51, 410, -1167, 102, -174, 749, 812, 44, 356, 1089, -105, 66, -905, 1053, -152, 355, 988, 511, 164, -405, 0, -45, 44, -568, 155, -223, -845, -24, 483, 366, -697, -70, -256, 616, -400, -23, 58, -585, -964, -81, 475, 508, 200, -309, -350, -36, 987, -451, 574, 1211, -372, -107, 632, -193, -390, 196, 576, 795, 132, 861, -661, -1074, 133, 427, 515, -4, -489, -290, -972, -469, -726, -546, 219, -160, 504, 426, -1965, -75, 958, -971, -92, -294, 290, 140, -1139, -93, 58, 455, 904, -1015, 1064, 554, -364, -1073, -115, 315, -682, 640, 253, 107, 269, 85, 930, -31, -566, -782, 52, 856, 402, -102, -432, 645]
4649F45q32L02n09J40k50K66J63P66j056P74K66j101O19QM87p29o41P56N01m48
4669A27j24j090J044K94j85J73k60j91l09k69J031k20j25JL98L0q18J841j292
4688E6L07m66k53K46K14m50K06n11L05o4N79o32n1N14K48Q50j091k17K25K00j457
4709a242R41k12n5M38K71j079N69L48P21o64r8l3P8m03M8O40j99L25l00K64q00
4730d42J04L11m08r3N20N1k60qJ167k82o94L35N57j028q77P67K75L83j432J687
4750F33j17j224N32K75n29J482l74j65N44j651O15K47m76L2L99m65l16J369p5
4769G36j097L73m95R53n83J05K54n32J294j337L85O66J8r62M38p22J564j777O52
4788f7P04j117P74q02K45k03K78K405k544K63J4N29j47q91O83O25j929L86K55
$$ y = [645, -187, 115, -394, -254, -504, -238, -75, 691, -365, 409, 675, -426, 193, 201, 688, -41, -682, 74, 575, 127, 3, -1087, -43, 251, 66, 239, -21, -212, -521, -790, 241, 21, -104, -103, 295, 325, -493, 1348, 56, 363, -103, -356, -110, 104, -346, -140, -651, -346, -410, 169, -463, -514, 0, 248, 1098, 7, -210, 15, 215, -1242, -301, -513, -568, -130, 141, -938, -369, -21, 700, 36, -62, -95, -17, -420, -372, 268, 69, 394, 94, 358, -442, -338, -27, -435, -528, -8, 43, -217, -225, 942, 660, -34, 301, 858, -170, -1047, -280, -5, 378, -1054, 633, 516, -708, -176, 99, -430, 1052, 678, 513, 1057, -594, 21, 268, -208, -176, 223, -242, -558, 811, 736, -361, 12, -483, 470, -113, -8, 246, -286, 1008, -329, 56, 722, 740, -222, 216, -506, 1058, -719, -67, 637, -480, 294, -508, -263, -466, -188, 2217, -327, -64, -50, 479, 332, -559, 124, 749, -1180, -794, -539]
4807e39M70P28K8p53j15k78R06j44j073J419j262N69Q46l78j45r14K63j91M47
4826a16k72O88L49k55M18j615M28l98K69J137o35J213j095j221J426p45J07P70
4844D53Ko30R68j005Q4K48o25k57K13N16k75P45r67o83K012o11l3O70n95l42o1
4865a73J240j061L89l0J15q68m49O41O88o64j15M76k41n16M08K97n10L68k98O36
4885C33L81q25k27J93l24R42n28M43q26O46m42K27K21M73j230N66J95k59o03J20
4905e24N77n65L46n90M40K71j09m5R31j004O86q37p4q47M63O44J074n24m88Q6
4925h9p27P6O9N06j91N05L6J078j882R80m57l3q4J288r56Q8q0l81m63R62K18p76
4947c13P18q76O94j005L06K74N19n91J138m35mo13k88M27k73Q97n54m03R61l31
$$ y = [-539, -69, 659, 687, -66, -181, -459, 447, 303, -770, 649, -613, -44, 802, 424, 279, -635, -372, -563, -116, -388, 300, 649, 394, 812, -803, -375, -773, -504, 633, -2, 1211, 116, -1105, 321, -424, -317, 453, 455, -175, 793, -212, -128, 120, -505, -762, -549, -33, -308, 437, -530, -1213, 799, 188, 155, 825, 230, -112, -173, 1067, 6, 395, 365, 480, -388, -837, -196, 492, -172, -287, 189, -52, -568, -160, 137, -373, -5, -303, 333, 714, -111, -338, -145, -469, 473, -55, 388, -438, 208, -234, -7, 214, 687, -543, 23, 218, -41, -644, -524, 53, -512, -166, -756, -316, -45, -154, -199, 732, -272, 414, -423, -497, -1344, -881, -237, 837, 313, -175, -89, -816, -740, -671, -165, -356, 149, 185, 1263, -619, 361, -96, -129, -213, 1075, 119, 207, 127, -254, -717, 245, 463, -313, 405, -471, 223, -782, -476, -202, 317, -274, 864, 429, 425, -188, -476, -49, -322, 575, 21, -382, 579, 248]
4967B48J43j097k9R55n15n81J210k73P0o61J316j005N08p28N78r87N57J76N30
4986D15M1N6m29j391K011q17K91j151Q1J713k59p92R48q61n33M98K60l40p10R18
5006e1k59O8m9L93q97Q00J38j3j30j06L81j85J94Q1p18J058j456M6M43L02m7M85
5028D78O62n90q88m78R9P40q37O79O33m20l09P58K17j425J463q97L39L73l61n20
5048b84O73j059Q87P6j193J188o70j082J834p59P74P63j232J84J218j938J308
5065F88o18j47Q77k14r01L26O93j826N85k41L53J084j186J9m71J210L48j419P14
5084a26Q67o46L33n5n2j41p37J35l04J350O30k006M16J2K35Q37r84m7m1J219j063
5105a68j41Q39j152Q58k45P77p55R34p35j206R99R7M7n96N00j094N16J237k43
$$ y = [248, 391, -706, -735, 220, -295, -876, 334, 61, 131, -530, 786, -219, 289, -439, 139, -848, -291, -115, 415, 456, 512, 83, -1308, 703, -114, 177, -974, -893, 820, 561, -231, 717, -144, -677, -179, 81, -259, -969, -51, -310, -242, -291, 102, -795, 5, 143, 130, 0, -106, 275, 90, 284, 365, -353, 705, -751, -705, -262, 40, -7, 478, 1140, 550, -338, -816, -717, 23, -814, -135, 498, 78, -231, 527, 744, -681, 782, -115, 224, 597, 236, -284, 389, -670, 217, 293, -900, 288, -382, -1464, 370, -389, 385, 1148, -84, 100, 1318, -620, 688, 70, -77, 800, 586, -315, 11, 704, -1122, -537, -778, -425, 659, -527, -508, -979, 231, 579, -840, -126, 741, 95, 428, 373, 321, 180, -557, -422, -726, 624, 1254, -752, -336, -324, -89, 748, -236, -283, -324, 895, -168, -309, 530, -622, 236, -9, 768, 13, 947, 212, -994, 5, 102, 149, -447, 53, -1041, -525, 712, 469]
5124D69Rr01N60o76K88P68m89p16Q46j146M73n9O96K33k55k71M21K95n81J25O4
5145A53J77j166M31M09J046p40m41R67r09m56J103J337j422j27k09m52J021K83
5163A005j66m43p46L47o43R06O10q31P6m96m3K90j91q5J88M50n00n72J247j258
5183h55P17J65M2l99R52j126M98j369R81Q71o35P08j020n43J043q28J709j98p73
5202f0j22J20n41J595q93J27j33j185K062j537P6Q49m75n24J443r27p70K55Q09
5221A69j20N36o78m9k1o32Q87Q7M01p9o90j53r63K288j616L87R56j092M37o11
5241e56J007K96m94p22M02M04j31O03p74p69J152j34j232J195j95n2L51k72j83
5260a04K04j327R79L26r06M22P04m0j91o09N96M91j653J073j46P00j60J71J1p72
$$ y = [469, 478, -423, 137, -539, -251, 517, 28, -688, 158, -988, -515, -574, 122, 355, 100, -171, 250, 545, -36, 89, 153, 330, -836, -405, 4, 1050, 310, -131, 836, -73, -529, 574, 1911, 489, 362, 153, -299, 722, 1005, 839, 396, -350, -3, -646, 260, 870, 39, 115, -381, -424, -134, -325, -410, -222, 228, -272, -844, 403, -855, -138, 27, 69, -330, 622, -504, -6, -1375, -394, 477, -158, 550, -470, -1013, 30, -798, 911, 713, -60, -182, -62, -603, 992, 99, 226, 93, -1092, 970, -567, -491, 358, -117, -641, 802, -125, -895, -640, 169, 49, 585, -93, -142, -163, -795, 92, 179, 580, 501, -189, -342, -1305, 983, -633, -246, 710, -382, 55, -556, 451, 747, 253, -469, -67, 337, 206, 809, 35, -734, 418, 284, -948, 247, 52, 0, 351, 79, -104, 100, -1227, -248, 78, -828, -406, 298, 258, 67, -542, 54, 545, -1108, -35, -181, 519, 359, 530, 541, -231]
5280b31Q10K89r24q87Q35m8Q3m96o52J198j16M05O29m09l9n84Q26p35L58j03k80
5301g1j32J279r44L36j060M24K01N21q51N63k54P4j119P51m97L38J76j41Q32k92
5321A34M2p86M5J581j104M59n64J76j61J81K56o40J70N09p55R76P02j869k52J269
5341C69O32r76M38q70K2m9N44m90R95m76n55l59M31P80l95L63n82N44j058R35
5361B43r16R99l16j273J560j23o70J025l74m41K88kj08j09J53n41J034l46K80
5380C63l91J17k29j6k87J140m34n03j48J155P7j099R90r51l08O8J30q1M12R42
5400I47m74l0p76P53q05r8M18M15l84j79J035n50p3n95K81L17l70k28J219J86
5420A009J63p13L86l65K99m21k03K10K28r21M07K39j290P32k51M08j02J05p04
$$ y = [-231, 579, 868, -56, -943, -108, -156, -73, -569, -1221, -23, -139, 266, 895, 486, 447, -137, 689, -46, 312, 209, -71, -203, 1076, 132, 468, -592, -168, 33, 554, -297, 266, 12, 86, -1033, -282, -779, -441, -265, -406, 426, 134, 176, -610, -565, 1016, -88, 371, -193, -17, -178, 3, 259, -381, -211, 298, -457, 519, 1221, -648, -900, 369, 1001, 25, 463, -407, -385, -434, 110, -380, 615, 139, -416, -775, -344, 436, 41, 404, -178, 366, -692, 243, -673, 326, 10, -1263, 297, 174, -496, 529, 155, -286, 2, 0, -108, -217, -64, -605, 429, 83, 363, -28, 89, -140, -156, -443, 697, 263, -240, -388, 767, 844, -255, 735, -216, -524, -456, -326, -407, 5, 947, 473, 443, -333, 420, -385, -483, -65, 350, -34, -213, 822, 272, 199, -396, -115, 202, -168, -396, 823, 1009, 1172, 459, 845, 480, 779, 358, 155, 365, 593, -328, 79, 318, -972, -240, -491, -83, -185, -80, -784]
5439g84O18Q28q50M99j06Rn95M62k36p13J515n34l50L78n80L50O6N48R33j389
5459F9j230J570j11p66O88K22n80M23j88J45k76K52p76j76J080l63J27r20R04
5478I4j92l44M17j095Q88L60j57l61J545r49j01k68o50P01Q14m25L62p42j00M09
5498B06l10M44p50J406n22p42o90L42J772o32j584Q41k10P01l4N46j84n30J150
5517A220j071L58j84n88J047p86K03r69J459r04L64n7j20L19m04m19P20l09N66
5536D45j92m53o30N33p8P8o1N32P44n98Jj59l6J10j45r79P49K67P0k89J159j344
5558b76P35L45m46n34K94k91l53J189K1o57o84J159J84q02J287j127l57M00j71
5577h4j59p57J318j152J491n81N13m01p19M27P08n69L48m02R07N7j019N38n20
$$ y = [-784, -166, 662, -188, 311, 205, 214, -381, 81, -155, -868, 647, 113, -237, 141, -439, -89, -23, 525, 1458, 69, -1161, 409, 298, -468, 220, 442, -138, 285, 97, 242, -34, 218, -558, -734, 346, -17, 110, -810, 94, -98, -442, -25, -1120, -232, 128, -29, -390, 1155, 206, 105, -163, -813, -112, 702, 277, 639, -103, -203, 206, -104, 340, -410, 996, 474, -268, -958, -616, 1156, 524, -1060, -219, -429, 272, 238, 784, 600, 70, 1220, 149, 507, 323, -265, 782, -4, 199, -770, 689, -215, 149, 92, -28, 291, -113, -532, 188, -121, 445, 253, -200, -830, -297, -375, -297, -358, 174, 918, 320, 321, 162, 126, 236, 91, -888, -139, 128, 198, -91, 1068, -276, 459, 804, 358, -176, 118, -173, -526, 663, 684, 27, -657, 502, 686, -116, 1171, 44, -313, 87, -84, -243, -1000, 318, -834, 657, 76, 589, 188, -531, -104, 604, 35, 383, -19, 888, 945, -74, 464, -56]
5596e6L28k57PK66L2o14p1l6PP73l1n08k92K70j65n3R98k52J36j218J64Q01p19
5619d90Q60m82L34j53K68k89P42l70l27p13N75N35n58N91M97p58p63M85L82r4
5639B72k49j31m24l56R35l99k9O59J83j004Q57k038J949Q2m52L45j06K39L78m42
5659B69J28J3j596P06Q83M5r45J204q20M06R68n90J97j313L01j47K39l19J11m0
5679c00M1m48R82k80L6k00p32J079k94k70o17L43J161M66k27q31m13J025m72O94
5699G43m48l3j16j61Q35o62P63q04L92K82j262P86L84j659M63K08R5L25R3p46
5719e22Q22J24l50j67j018R47N36N56r66K16o68L59J40q93M44J99m27K02R08O14
5739A056j756J057M94m98l35L31k26j54M0m81M25J58Pp8l69K17k50M54J57m56
$$ y = [-56, 272, 15, 22, 288, 320, -294, -365, -401, -394, 379, 348, -160, -452, -182, -347, -400, 598, 346, 482, -736, -572, 229, -490, 370, -112, 222, 69, 337, 48, 790, 420, 93, -620, -45, 490, -68, 523, 1020, 262, -501, -16, 366, 272, 23, -108, -532, -888, 47, -352, -381, 278, 461, -543, 314, -1724, 225, 307, -145, 200, 94, 333, 711, 269, 397, 410, -1186, -480, 403, 448, -497, 707, -113, 293, 1261, 671, 868, -445, -144, -291, -52, -371, -260, -300, -259, -707, 275, -5, 31, -169, -901, 178, -116, -386, -1003, -660, 501, 967, 740, -91, -504, 521, 49, 743, 295, 262, 146, -15, 820, 158, 921, 117, 509, 791, -471, 315, 699, -960, -497, -289, -194, 131, 224, -522, 300, 424, 74, -93, -1111, -164, 372, 928, -38, 178, -490, -131, 9, -884, -440, -241, -668, -466, 442, 1056, -700, 357, 851, 353, 18, 349, 123, -31, 9, -472, -47, 111, 118, 40, -329, -112, -362, 92, 249, -207]
5759b07J00L43L28j162J198p30o69P69k70j4R7j97P80p59O80m09m5R96O35j413
5779E1K77m87M97k58o23J106r09o85L22Q87M69p49M89r74N83l9L79m84K8p5O35
5800D40m44n70J271m05n59L07k35J02J66p78L37P54n00k41O53j165J044Q6j208
5819i45J239o02J59J119Q3o80k83j205J596m6k40L70j029N23k61j66o6O18P35
5838I19o24j9m47r98J954j031J36k37J114q59p79J422J21O93q87n34j55q7R9J109
5858I10j819J345q36J046M17r47L08j314R45n2J27m68R71m14k08Q3r46R18n94
5877e28Q65p56o42N07O02K65j232k56N49J373p03l08J30l09M36p0Q6n1O01j064
5897e05N84p91m19R06o05N89l95J155j21M2k60j68M95m3j03l53o68P52L88r49
$$ y = [-207, -107, 236, 564, -598, 600, -130, -799, -30, -300, -314, -217, -414, 366, -393, 287, -122, -167, 829, 1464, 51, 328, -159, 338, 80, -543, 563, -346, -1031, -709, 178, 647, -102, 387, -587, -4, -43, 336, -148, -120, -195, 440, -4, -574, 697, 292, -267, 40, -195, -93, 73, -705, -368, 386, -114, -355, 298, -867, 177, 263, -945, 294, -308, -149, 970, 1053, 373, 90, -1115, 481, 435, 195, 565, -464, 59, -202, -368, -434, 184, 919, 295, 276, -171, -1169, 785, -246, -110, -347, 767, -92, -871, 551, 672, 1365, 478, -56, -211, -298, -199, 910, -909, 436, -400, 646, 1063, 116, 424, -890, 55, 3, 130, -338, 633, 219, 11, 94, -852, 66, -528, 337, -419, -1061, -554, 48, 313, -919, -1175, -626, 747, 44, -264, -134, -443, -7, -77, 9, -42, 559, -505, 79, -712, -1131, -225, -830, -241, -636, 519, 398, 440, 180, 12, 507, 464, 361, 8, -660, 92, 480, -469]
5917d69M6J623o42k78n87n2O3R05j158O82P90j580J433n68P50j265J283j258m84
5936g66R78J07j218J025p1M13r47M81J85j59K17j267J396Q0l44l77J538j808n5
5955e92O92k8P98j44l52j180J627j112p49J284O45j648J212l13m43K80l35J86
5973a72q3K4j5R8M18o09L54j23l34M73j95R88k67K41j657J015O3o03P15r32J133
5994E32Q04j435p24R75m53j76m11J192j447J489n26N33q6Q69q78j414J022m95
6012f29R5J425p36j73K95o41Q38o96l91J460n71j015K08j88M80K15r0J110j479
6031d83N11J149j715J029m29J75L00l63K50j012l9N35o33M57M15M19M89q08j365
6050a118J122O58q38J010j019j22j38O04k33P78o7j02n19r55P60L54j86l49O47
$$ y = [-469, -423, 1200, 558, 280, -307, -359, -296, 609, -549, 133, 923, -657, 776, 208, 958, -307, 976, -282, -766, 212, 319, -899, 126, 55, 468, -479, 2, 187, 28, 245, -1022, 374, 454, 110, -267, 1271, -537, -592, 100, 72, 870, 726, 374, -806, 821, -291, -1040, 244, 889, -759, 453, 140, -303, -23, -358, -172, -255, -231, -246, -148, 270, -339, 15, -108, -442, 31, -164, 824, 557, 798, -859, 156, 219, -384, 331, -601, 532, 1336, -99, -823, 152, -301, -477, -888, 304, -1143, 346, -180, 353, 267, 1136, 258, -1156, -134, -629, -534, 891, 155, -18, 277, -364, 474, -222, -613, 847, 276, -739, -531, -719, -239, -24, -114, 996, -483, 28, 1177, -538, 491, 62, 237, 537, 174, 424, -588, -627, -92, -725, -268, 147, 566, 1055, 247, -1118, 4, 662, -176, 834, -185, -307, -445, 159, -74, 704, 637, 535, 16, -939, -179, 175, -11, -360, 287]
6069B87k41j220N59M85j71M47J38R81j387j037J418p01N15n06J289j19j695J059
6087A01P3R85j104P01r70j85L69j25M73o18k75k64J442j175J586j024k42M68m00
6106a84N21m06k72N42r20O20k63J31J098j248O60j338J578j619K208j101J12q37
6124g18J155j98l92N37p26O87k26N18m27l62N38Rk43M43m78l4p91j62Q45P18q56
6145a63J652j032q23Q14o94l75J1R22j173R73J36o17J004n26n57n52J282M57n51
6164A88o48J415m88R64j038r10lQ04r89K73q49J243M83r86J94o8O5r5N97k09K44
6185A87l86M72L84L9q97q12J341q18O35M4j26l35j75J466j541J105p65n57J135
6204C96o75J68J190j258O50o21j18P01QM85j710O50N4L14j75P32q15j26Q24o22
$$ y = [287, 46, -1174, -615, -130, -301, 146, 284, 1265, -122, -1159, 259, -442, 73, -433, 856, 737, -958, 101, 174, 1159, 55, 756, -214, -399, -30, -155, 318, -300, -575, -839, 603, -572, 1014, -10, -252, 216, -184, 337, -69, -341, 201, -719, -99, -362, -231, 867, -381, 279, -1059, 519, -1100, 1108, 7, 119, -718, 437, 239, -153, 384, -342, 345, 119, 637, 210, -152, 386, 395, 152, 595, 117, 83, -708, -870, -25, 693, -163, 1489, 457, -366, 448, -246, -621, -610, 312, -861, 112, 248, -369, 635, 109, -448, -1000, 282, 739, 188, -460, 955, 467, 1431, 393, -517, -520, 284, -705, -432, -1281, -38, 445, -541, -347, -415, -350, -445, 152, -57, 187, -199, 273, 657, 696, -201, -1013, 328, -490, 145, 189, 63, -272, -447, 1019, -522, 583, -182, -739, 396, -279, -111, 1079, -179, 471, -150, -268, 433, 441, 926, -784, -134, -80, 234, 59, 791, -24, -150, 674, 52]
6224E2M48j13q30R8J046j206R43k36J3r75O75o32M40K48p06l14P33L3L7J072l06
6245E20j020Q31l55P64j046P24j43q69J305Q5P45j357q9O60p27K71J2L13m57p28
6265e61M00m8l51p03l0J856p65Q22o6J58l4m57J09o70L02N05n05q12J039p10Q58
6286C37j81N38q11Q83n10l21M62j016J103r07K09N94o36M7r07j79J781n78O53
6305E61j376O42M92n78J408j361J47K96J375o41j379j48J451j372J754p97j281
6322h07J301j168J373j480R83j22l29J043l51K16j049Q27n55l08N12J47k03p68
6340g38J155l32k70L57J75q77L28k98N35j44M10m39J85J37l68R11n56k54J371
6359A288m17j253J235p32L02r99M98j17K66q10O21P60j64K88j326J112J16q72
$$ y = [52, 500, 387, -443, -345, 701, -505, 438, 202, 215, -760, -85, -717, -277, -29, -735, -1049, -316, -283, -246, 826, 520, -500, 331, -24, 740, -306, 418, 275, -594, 711, 796, 1541, 184, 95, 755, 28, 299, 311, 624, 167, -561, -161, -209, -560, -1263, -1293, 563, -202, 620, 554, 712, 678, 221, 330, -340, -38, 467, -38, -850, 189, -521, 337, 156, 694, -117, 766, 256, -65, 397, -619, 484, -423, -214, 380, -256, -209, -1116, -1295, 486, -92, 561, -815, -173, 319, -259, 1149, -212, -65, 231, 1606, 965, -414, -562, 889, -483, 1271, 474, -807, 494, -674, 699, -781, 202, 80, -249, 794, 443, 659, -390, 437, -118, -426, 86, 233, 30, -738, 417, 85, -185, 172, 347, -530, -202, -500, 35, -109, 301, -138, 47, 184, -184, 727, 171, -83, 1288, 871, -382, 853, 121, 423, -576, -78, -195, 71, -739, -118, 642, 478, 766, -560, 552, 668, -204]
6377b04M4o08O31R41J45j400L42Q04j024R87o41Q59m64q29j42O18M21r20j20J19
6397d41P88l10j95J78l22k04P64o56M78l88K64o87J183l38O96q25p41J063M4p70
6417d19L10n51K90N84K1K8l23k95R61m08m3J10r3L23K87k51m37L09N39k78n50
6438A14O38j425J056n60J1Q98j222K99k53J521p07j135M21P93n20M12k53m69N09
6457A28M2j071J122Q50m24j467J091J183j720M6M71n68J685r50j010l5N43N74
6475D90J85k48m41J44r0N58k78n61J99K24n11K65N46k66J75L17j7r00J44M21j461
6496a105J459k59%q05l68oR82q02M16J11R3j38J806m90k086J156k72l0K75Q87
6516H24j313K24l48L43Q9k45J63l16J547l36p52M76j89J42q00J192q85M60L90
$$ y = [-204, -160, -768, -137, 804, 949, -451, -109, 695, -329, 658, 17, 876, 412, -417, -559, 59, 480, -440, -560, -441, 347, 37, -158, 20, -302, -506, 258, -398, 80, -308, -44, -731, 452, 114, 810, -15, -756, 307, 351, -419, -109, -660, -370, 214, 235, 263, -60, -355, 606, 198, 155, 265, 172, 495, 782, 531, 94, 403, 942, 664, 114, 752, -673, 383, -177, -166, 732, -490, -191, -444, 1077, 370, -765, -344, 449, -71, 341, 88, -381, 128, 170, -901, 221, 1071, 647, -820, 271, 1454, -266, -220, 251, -317, 1368, 418, -592, -627, -84, 490, 675, 427, -14, 130, 40, 598, 320, -241, -42, 182, -329, -64, 482, 216, 391, 708, 691, -209, -65, 356, -1105, 354, 95, 95, -710, -1078, -1084, -102, -904, -488, -377, -284, -422, 1384, 894, -1192, -36, -308, -338, -63, 824, -489, -265, -613, -270, -181, -426, -263, -579, 968, 632, -120, 356, 167, 309, -491, 701, -184, 276, 666]
6535F66m84j25K2k08O46j02m9m53P16j626N03PN99o29P76r22o2P14p07J187j94
6556B75n76K84M22j086J05R99n12k83K82J76M31M6k04j09n12Q84p47N41j111J302
6576F07l34o02O13M35o93k61n73k56J413l40J00l32j95k17J073j141J527n17n65
6595b58J521j577L34L66n95M7K13p59j61J15L77N94n23R25L90j248J190j333J209
6614H27n63k86j47o6M3O51n41N75j047J061j453L49Q47J387r69K84o34n83N11
6633B46Q72o52l33P78j650K00N63N98o46p14J368k37M7k32r90J49Q93m14k59N53
6653A40l23L74L03n90j307J698p80L34o37M4J90K41K16J37P54J61j315L23K35
6672A98n73kP28q11N90p02P00n42J248j738L42J002o45n06M61R31j420L70k95
$$ y = [666, 182, 57, 79, -129, 517, 415, 366, -87, 629, -997, -494, -487, 112, -517, 259, -663, -725, -11, -718, 469, 275, -301, -17, 405, -681, -576, 423, -89, -372, -90, 86, 517, 563, 359, 250, -262, 622, -125, 416, -695, 607, 273, -329, 284, 719, 26, -235, -808, -1064, 349, 9, 109, -223, -418, -635, 438, -703, 824, 307, -258, 1263, -314, 20, 386, -209, -162, 51, -708, -869, -754, -377, 217, -306, 619, 1009, -239, 951, -382, 827, 264, -22, -169, -235, -192, 459, -82, 493, -554, 507, -946, -597, 250, 1637, 668, 952, 318, -265, 246, 1118, 466, 133, 911, -739, -539, 24, 622, -24, -738, 630, 393, 440, 208, -782, -633, 260, -154, -413, 140, -183, 191, 494, -96, -1403, 295, -485, -151, -788, -744, -554, -313, -97, 40, 794, 955, -360, -37, 198, -375, -377, 351, -460, 130, -572, 128, -414, 834, -904, -562, 440, -205, -711, -250, 681, -739, -369, -664]
6691f64P3K67O01m71l68O44q6j40J02p9J575j755R26m67l47K8l46p1M66N87k57
6712B18m81Q48k85m01k17O91n49l22k41M31M55k5Q1j370N88M96k01k61J98n63
6732i10k2J008L39r89R97k30J83m24M15j771J492J134j610L11N99j094MP91p90
6751e67J13R66n73q5O22o98j62J62k44N90k02j4N06k24k05n66L45K4N56j071J353
6772F26L48j254l48K03l61J445q38r1Q86j559Q29N54l83L80P90j657O17j271P33
6791c51P65j401L74J027k14r46j44K24J003j2o86O02m1N7q36O43j74Q49j063m8
6811c72P69k17j20o60K65J041j268N65L80l14N70k17r68R57j211N89k53P13j093
6830h44O31r05O44K81p3Q33j529L76J137p21P12p94R9K86m90o8N01o88K78J722
$$ y = [-664, -591, -324, 277, -194, -562, 82, -4, -144, -42, -121, 1454, -301, 625, 158, -189, -161, -507, -578, -112, 475, 218, -263, 585, 300, -101, -318, 373, -176, -498, -739, -308, 147, 122, 203, -1167, -579, -83, -284, -545, -347, -910, -932, 76, 415, -574, 423, 193, 376, -48, 367, -1404, 88, 1222, -388, -77, 522, -572, -568, 223, -567, -454, 512, -61, -146, 476, -222, -384, -222, -466, 124, -78, -92, 414, 190, -15, -581, -236, -212, 344, -727, 626, 974, -280, -628, -425, -786, 659, -179, -270, 616, -943, -114, 440, 57, 437, 1227, -430, 187, -1084, -351, 414, -987, -613, 414, 200, -746, -890, -666, 337, 325, -361, 241, 200, 257, -579, 64, -110, 739, -324, -372, 397, 180, 60, -600, -335, 706, -562, 3, 383, 69, 639, 422, -546, 411, -800, -211, -464, 249, -844, -213, -1118, -474, -193, -266, 567, -962, -586, 551, -170, 542, -252, -153, 133, -357, -425, 76, -612, -334, 1388]
6850A388j330J5o22J3J33L35Q36o72L8j601J502L68m94N78M43j032K77Q36j014
6869cR41j145P76l96P25r10J33m75J670j052o74r73J038J049j439J64R14K26n24
6888D5L30n32M98o86J051J99l92o61P63j6j044L34O4O00O26n82O7q71j68R82j510
6909i03P68n52J619n13m39p10Q50m71J182m91n98m30k41N60R9N75o71m50J096
6928B80L45j168N82n25Q04j454N13N00J555o71j374R99M03j113J036p1k29j388
6946i76L87J322q01J51j37n43N88m27J43m64J488n29n23L37j536J260Q25Q3q62
6965b14L35o89O44j146K055j752J012j125O09J82l69O12m9m09J31J17kK29j027
6984h56K521j620J16N01p98M21l08o06J00N66O6L02l03m41r45Q09J99K91k54M71
$$ y = [1388, 58, 73, -549, -536, -403, -68, 768, 96, 134, -1467, 35, 403, -91, 487, 930, -102, 175, 1011, -3, 938, -207, 569, 173, 898, -12, 121, -354, 1316, 264, -410, -1383, -345, 704, -735, -571, 343, 569, 45, 375, -157, 341, -345, 706, 905, 513, -148, 615, 599, -445, -111, -47, 553, 1179, 597, 664, -207, -375, 607, -903, -135, -687, 932, 419, -20, -730, 120, -351, 831, 340, -258, -688, -929, -369, -270, 305, -366, -816, 280, 625, -543, 39, -486, 318, -1136, -623, -123, 1432, 761, -613, 386, 789, -324, 712, 641, 412, -976, -589, 733, -68, 83, -54, -597, -9, -436, -293, -757, 731, 202, -321, 16, -1520, -260, 565, 648, -214, 121, -568, 76, -1070, 985, -767, 245, -880, -271, -89, -458, 154, 105, -304, -173, -56, -58, 171, -856, 1665, 45, 161, 662, -136, 285, -23, -629, -529, 37, 103, 405, 102, -339, -1284, -475, -276, 15, -239, 232]
7004B32l82L32N68j173J422k219J183J247j352J066j320J081j012J68K29j95N38
7021D13k83Q99j592K3o62J436l15n98J271p46M76m78K25k27O13k04j188O41P53
7040D57N61j64K05j531R84O13j818O52m52P62k3o44N48l10O31m58j122J759m67
7059A83l07j82P17n90n51O63k12O58m90J3j84O21r21L22p02Q08k36p6O03k96r79
7080a138J133k19k7J176j125j47J449q56o69P28OK23n94M28n21N68l56j32Q49
7099G76j46P50j232l01p35N11K34J89R4r97O48J044K32o18p39m87Q16j617Q72
7118g06J417o51k50m39J064n88l2J01l84J24J96m92L27l8o06R93n5j39J51o98
7138g05M14J39o08O61J66k10J85l88K54j38n6L80J03l80J44p06P47o51O11J82
$$ y = [232, -150, 182, 750, -423, 999, -1220, -37, 1210, -142, 924, -396, 685, -327, -159, 70, -125, 413, 130, 1029, -563, -540, -1202, 234, -81, -679, 592, -154, 322, -156, 69, -158, 455, 251, -937, -296, 457, 1018, 854, 1059, -472, 512, 1125, -693, -41, -493, 269, 246, -398, 150, -160, 471, 13, -1109, 650, 183, -124, -306, 411, -179, -730, -67, -279, 379, -111, -98, -282, 339, -582, -260, -962, -154, -390, -466, 137, -159, -1138, -5, -224, -251, 925, -200, -347, 1102, 246, -423, 305, 311, 534, -60, 368, -153, 415, 59, -73, 776, 630, 1380, 148, -153, -888, -377, -143, 46, 140, -857, -209, 835, 1067, 449, -290, -777, 39, -1578, -706, 711, 60, -190, -629, 435, -153, -185, -84, -468, -344, -148, -640, -313, -351, -957, 36, -19, -158, -7, -705, -291, -152, -760, -99, 67, -143, 42, -346, -92, -230, -286, 94, 197, -183, -39, -745, 2, -649, -38, 144]
7158A44N19j0p03J36lJ0n25M46k94K50J397j358J71n05P0R53o85R33j133K09R78
7179A000q86j72J44L88j156J115n96J177l95j233N59N03j211J235p57l32L55j32
7197c94J231l45m10L8O78r92L63J38M81K30j081L98j379O99o64J812l32n6O35
7216A050j196R09m42l31n10P86j86K94p85J75M91K3m56l87LJ426j708J181p8j016
7236g57J10M39J020j77j274O51N31j301k15M29K18N36k72J98j061R81O07j119
7254d56R71l64M1n50J95M6K46l28M51j151R00q21m69J061j64O87k73Q3Mj080Q51
7275a20q16O21l27Q13k0j041Q07q46l34J457L88k97l89J59J582j170l18k73l0
7294a54N78p75O77l37n60M26M91J00q0j029O98Q2J53L38r64J102p67k77j40n86
$$ y = [144, 663, 653, -50, 86, 83, 93, -432, 14, -280, -30, 1367, 9, 180, -325, -255, 698, 13, 946, -187, 22, 1000, 114, -58, 86, 474, -682, 433, -163, 1014, 619, -614, -55, 448, -763, 472, -285, -617, -262, -394, 837, 492, 82, 120, 798, -194, 169, 307, 788, 1018, -63, 335, -1044, -345, -1009, 803, 471, 415, 1050, -146, 763, 321, -10, -520, 266, 80, 374, -411, -236, 255, 278, -178, -565, -562, 864, -844, 337, 259, -757, -647, -208, 812, 635, -639, 12, 543, -758, -973, -544, -326, 210, -62, 136, -925, 56, 663, -456, 515, 151, 192, -358, -163, -117, 129, -199, 252, -899, 1, -820, -1289, -228, -392, 295, 22, 105, 109, -971, -120, -936, -315, -642, 171, 151, -890, -83, -929, -1263, 194, 582, 285, -104, 55, 1637, 467, 149, -124, -154, 424, -351, 326, -11, -571, -145, 346, 446, 366, -663, 35, 117, 270, 608, -356, 746, -21, -298, -438, -1024]
7314a024L33K105j728O0N87o37J168l36o99j51K10j04m8N05l80j36K77m16M04
7333a0P4M94L0l99l83m2K06j017J364j770J623p76J031m88N17N02j069L5p25n60
7353a363P35O08k40L77O15p79N34o40J27N66l48k02m09P98O9J54p92J81N68p67
7373b08J81o1o62l9R13p26M96m80Q31q27Q10k45o66N37K51q71Q16J51K50k93p36
7394e78J93K50K9R30L64m95k16o04Q19j240J043l6k27Pj110N82K02q01J010N0
7414A72p58J927j225L38q17L26l37K33K06N45n23M55j60J217j708l57R6K54R06
7433G90k85j276Q40m25n4K54M2J005j136K76P13m46K89l06l55Q25p33k41J455
7452A232p90j122P80l2m97J287j638O27K51Q7M30j161L58J177n18p20r29J937
$$ y = [-1024, -691, 1414, -314, -254, 333, -304, 864, 528, -171, -322, -112, -216, -264, 241, -139, -275, 2, -414, -10, 64, 558, 588, 189, -194, -236, -30, -1047, 317, -1453, 170, -606, 425, -63, 454, 956, -113, -78, -803, -1363, -628, -20, -260, 117, 732, -47, 487, -153, -26, 540, 192, -10, -419, 379, 448, 602, -190, -9, 559, -208, -27, -88, -750, -789, 124, -602, -106, -586, 245, -582, 228, -17, -683, -146, 105, -766, 50, 201, 451, 158, -578, -385, -135, -106, 824, 1188, 693, 477, -127, 692, -548, 495, 459, 232, 239, -871, -289, -87, -888, 122, 172, -586, 1341, 116, 454, -363, -37, -374, -141, 65, 610, 87, 542, 382, 1599, -109, -466, -370, -116, 790, 505, -771, 69, -356, -410, -156, -114, 891, -245, 31, 744, 298, 587, 281, -74, 751, 18, -223, 1232, 442, -680, 100, 68, -429, 858, -780, -153, 98, 185, 615, -546, -188, 989, 471, -249, -1178, 759]
7470G59j014J051l69n28K47j419P37M76j443P00Q11q24O75k08P3O66K86j701J381
7489C56j62O2l44q9J74n46O77q40J011J6n14r68R66o13O46O38j02j52M07J045
7509A668j412l9j16M60J20K10j547J37J058o09R2M81j68m59N83j472J469j078
7527f22N05n93J599j099j19J0M41j63J404j147m58J2j4P29j553N67J72J56l79
7546e52R70l45M78P8j325J101L07q74L75k44n56J13P46K64q93l73j11L85M57M9
7566E0Q75j036j87k96J455j507R60r39m4L94P65j012M65k48J045k74j200J253
7584E19n39k51Q04q07N62m43O2K26j18j044J711M9l71j43K46p0q99M51L19M45
7604G09m69N32J165k218K49J11Ok1M51q99L20O38p19K66l49O67j017L32m43M67
$$ y = [759, -255, 796, 427, -101, 146, -1273, -536, -60, -1503, -803, 8, -816, -141, -349, -276, 390, 676, -1025, 356, 194, 256, -88, -177, -3, -549, 128, -712, 299, 315, -199, -1167, -201, -814, -168, 470, 368, 216, 623, 1668, 256, 217, 101, 561, 681, 891, -656, -519, 539, -70, 22, 503, 335, -124, 459, -1013, 456, -622, -117, -710, 889, -210, -329, -319, 122, -41, 1363, 216, -242, -230, -244, 485, -1068, -501, -329, -173, -552, 418, 73, 551, 629, -696, 405, 712, -162, 213, -31, -587, -474, 272, 536, -357, -730, -841, -456, 1, 50, 925, -111, -298, -594, 861, -646, 314, -625, -669, -275, 490, -522, -57, -305, 740, 466, -734, 519, -20, -271, 533, -274, 288, -155, -93, 133, 15, -1029, 682, 731, 360, 217, 463, 393, -506, -55, 264, 709, 240, 772, 1937, -281, -32, 79, 85, 64, 515, -384, -64, 574, -145, 121, -228, 439, -578, -246, -689, -222]
7624b22L8p2L10K87n06L33k16L30j207R69n14K2n1N04m91N46k32J65r25M03P54
7645B25p4l22o71J325j082J54j5O34m49P29M15j174n24N87K11N29n28p19K05J22
7665d22R18Q31j131N1qk45J05M30j170M70j33r3R03n45j972K257Q3l05J0Q46m05
7686D75l38r1j095r4Q59k80M33q6M4K33j008P17j16R21l69k05r02P65J006n90
7706B79K14N35j455k7J07R64k88N4p31K00m83P69k04l21k82J031r5j43N54j119
7726d41o2j90R01n26P71n5o01o17O66J084j098k53L22M91r17P36O87j270k79J52
7746d99J190n08p33l06k39J757j42r60Q86k78l21n92J364Q37j514l99N34r8PL4
7766B0K24J2o78O98K55m77q87j83j97J331j72J048o77n66l1R45j016R1N71o02
$$ y = [-222, -184, -256, 54, 341, -165, 168, -48, 282, -925, 44, -470, -448, -499, 5, -486, 60, -172, -7, -932, -529, 225, 151, -171, -842, 483, -599, -445, -460, 174, -275, 454, 869, -305, -829, -242, -31, 498, -30, -749, -544, -422, 496, 1327, 196, 247, 239, -6, 99, 529, -641, -171, -304, -397, 506, -39, -2011, 246, 329, 24, 34, 880, 475, 137, 46, -1049, -1143, -284, -564, -131, -217, -173, 60, -948, -231, -347, 574, 205, 0, -902, -137, 869, 279, 493, 1028, -427, -454, -347, 617, 329, 383, -348, -148, -631, 138, -66, -387, -669, 362, 267, 124, 678, -441, -503, -693, 208, -318, 453, 398, -203, -820, -154, 930, -168, -421, -99, 392, -525, 211, 898, -372, -651, -499, 691, 183, -550, -856, -1095, 662, 520, -440, 446, 168, -153, -745, 619, 1456, -58, -457, 77, -21, -14, 20, 244, 256, -422, 276, 531, 54, -833, -1016, -1213, 118, -54, 994, 317, -249, -280, 665, -351, -260, 311, -291]
7786b91N35j341P18p5N98n68l03Q73l71l70O69k1J15Q1R09j983K14Q08Q70k099
7806a032J289J66k73J68J3k54P04j424P89K82n07j87k08O11j036P46p07P14rJ7
7826a38P9k45P68k63o06K73o43R84m29r89J063N48M26j416M06j186J929l51M27
7845F37p94Q18p43r60J755r80L11J02M57j186n69R25L77k71J007j479J50N92j166
7864a017J548L66j051N60q84J103o63P33o37j23R60j137Q3q7R27J46n55m05p39
7883h72O72R92l74N5q74J46k65M33J095r91J1J178p67n73k9l35M85m10J420l67
7903F30j184P48o14P82j22j08L9j223K39J357m33J85o9l95K92p56J28J371L62
7922A229j073j26J5j57n0l94P29N2K9o25J202j056m7j6L38l26p5J983k343J086
$$ y = [-291, 244, -1097, -379, -454, 144, -424, -727, 146, -225, -595, 74, 53, 168, 249, 1158, -825, -611, 197, 1067, -1032, 257, 423, 150, 318, 331, 77, 781, -643, 146, 428, -79, -266, -474, 137, -899, -153, -860, -146, -155, -138, -59, -304, 464, 201, -405, -132, -775, 209, -220, -1209, -146, 402, 828, -588, -182, -1368, 561, 210, 637, -157, 661, -82, -1042, 713, -267, 44, 146, 603, -583, -1152, -227, 150, -121, 886, -593, -443, 149, -1017, 531, 897, -154, 406, -478, 625, -38, 695, 58, -65, 895, -242, -159, -246, 681, 827, 272, -133, -872, -200, 792, 418, 473, -401, -255, -520, -87, 1008, 17, 28, 1206, 439, -134, -163, -498, -13, -423, 997, 630, -554, 194, -420, 362, 240, 132, 171, -1052, -813, 544, 111, 296, 227, -168, 124, -632, -504, 867, 1229, 156, 30, 45, -112, -162, -556, 173, 225, 254, -371, 831, -225, -272, -288, 50, -276, -351, 1632, -711, 375]
7942C75k16j88M63j227J023n4R47j349K47L06j0r3P74n87j28k57J265r50J10m70
7962a9j44M58m81L39K98p00O17R0l01m23n7M50j069k95J352L2o50J063n19j40
7982i9l32L94m7k39J031j323N56J149r56N10o97j85m16Q03R0Q1m61L85l55Q32
8002G21j086N94p82Q61N72q88n79N1J364n92l10L49J366j908O3L01q44J419L96
8021A068j657J063j98J93o39Q82q12O42j14N0n99j06P1n62O93n84l39N41R6O42
8041C31m23j017R09n2k80P14m50J339p32L33j257J074p57J73k10M75l7O56L06
8060A095j830O34K95n88O08j74J51N17n28L13J72n53q5O83o3o20r58Q28P9R0n63
8081d97l16Q11L32m86P19j162J59J421k01r83M11k65N00l3j104J493j334Q66o98
$$ y = [375, 159, -29, 434, -793, 230, 176, 1123, -226, 21, 327, 317, 224, 998, 411, 283, 26, 1291, 341, 451, -19, -163, 295, -186, 153, 451, -249, 368, 458, 157, -266, -323, 127, -942, -1237, 115, 147, -503, 560, 41, -99, -431, -37, -84, -323, 708, -615, -59, 1090, 134, 644, -53, -238, -654, 149, 239, 320, -141, 244, -111, 721, -365, 229, -553, 308, 880, -8, -587, -536, 828, 236, -74, 275, 1641, -267, -204, 97, -747, 672, 1068, -589, 474, 276, 469, -170, 712, -100, 542, 428, 478, -121, -227, -156, -718, -25, -609, -948, -407, -311, 331, -92, -1109, -200, -252, -532, 182, -268, 1071, 339, 672, -585, 489, -268, -95, -305, 170, 133, 789, 1095, -735, -101, 194, -394, 214, 40, 191, 708, 180, 493, 665, 112, 27, 710, 647, 27, -931, -103, -24, 66, -497, -813, -2, 330, -156, 563, -599, -440, 981, 780, -203, 208, -57, 443, 410, -694, 799, -535, 331, -367]
8100c67K15l15L31J324j005o56O40M06o17J169j666J270p2o87N47k78q48Q27j0
8119B08m82R50l15q8j108J154j220K75K04J468n38o73m44M58j38l52M54J051l79
8138D85o9Qn04K24p73J247l21q55J65R07N13j2n98O20j234O84r60M99O04q21L96
8159B05K17J25p00N24m33m41N99N38n65o51K20K10n03P26K97k23n53J101q10K80
8179A63p0P39n80k49J087j659O30k53L96O62j18p95
$$ y = [-367, -152, -467, -136, 1188, 183, -473, 167, 573, -44, 1125, -541, 729, 657, -30, 517, 239, -609, 218, 208, -274, 676, 361, 273, -835, 319, -901, -626, -422, 1046, 508, -165, -609, -151, -289, -641, -187, 864, 485, 416, 424, -80, 144, -629, 618, 297, -558, -393, 514, 1027, 1015, 417, 1037, -197, 487, -473, 26, 630, -191, 205, 422, 547, -153, 371, -62, -503, 96, 634, 69, -582, -362, -152, -655, 71, 368, 145, -408, 693, -117, 163, 93, 832, 252, 3, 1090, -569, 61, -192, 204, 866, 748, -47]
8191d7
$$ Imaginary data points
##PAGE= N=2
##DATA TABLE= (X++(I..I)), XYDATA
0@MmOrK8l4N5p1R1j18J40j70J99k30K66l15L63m17M79n45O09o99P94q97J004j130
26f01J269j421J590j779J992k233K508k822L171l591M090m687N421o354P598r333
42e182J1921j6187K2717k38930l1326L7368k2745J3459j1806P667n638P860m61
55b31283J0312L370J2720P393J5718J1099J7259J3156J8642J5014J7993J6933
67g1674J8183J4887J7752J5204J7423J3196J3918J1275J1353J0469Q105P329N622
80I3042L821L816N12m56k673k928l922n607n969p893q762q754q960j1002j0215
95B4050j0258j0244j0068j1490r490q130r055q179p600o548m714m318m779j865
109h2688j361q7Q5R78K590L689L598M825N754O812O818Q059O181P204P015P390
$$ y = [0, 4, 0, 6, -3, 25, -9, 46, -25, 66, -52, 88, -82, 117, -113, 153, -162, 201, -216, 263, -282, 327, -372, 422, -475, 529, -601, 668, -753, 837, -942, 1050, -1183, 1325, -1497, 1674, -1917, 2173, -2514, 2907, -3447, 4151, -5182, 6739, -9448, 13269, -225661, -256987, -219619, -242364, -228905, -240711, -233044, -238682, -230822, -231283, -220971, -217601, -204881, -197488, -181770, -170671, -153412, -140256, -121614, -106600, -88607, -71674, -53491, -38604, -20852, -5648, 11775, 24971, 38889, 50164, 61517, 71986, 80091, 87420, 93042, 96863, 100679, 101191, 100735, 98062, 95134, 91212, 85605, 79636, 71743, 62981, 54227, 45267, 34265, 24050, 13792, 3548, -6520, -18010, -27500, -35630, -44685, -52864, -60464, -67012, -71726, -76044, -80823, -82688, -84049, -84136, -84051, -83073, -80483, -76794, -73196, -68371, -62617, -55805, -48987, -40928, -34747, -27543, -20528, -13138]
125a3138P271P818P087N626O608N072M523M106L159L786J661J25L93O48j190k471
141D1084j811l792m091m586l733n084o808m586p360m907n441o627m700n374n762
156c3578m948l881n313j603l897J07k169j533m32J006O29N18L619K431K837M228
172d1979M251L889N211M270N102M370M859M770M181N333M470L366L469K023M654
187B2239J909J600J577J11O74o72j357j197j467k225l163j177m340l119l088m889
203A416l852l141m170l254m947l585k527l610k889j728k002k029j693k69j767
218d0047P52p36J786J053J500J631L789J298K849L377K690K692L033M647K124
233g562M676K757L554J042L255J308J774L214j75J547M20Q87p56j610p47J99j527
$$ y = [-13138, -5867, 1951, 9038, 14664, 21272, 26344, 30867, 34973, 38132, 41918, 43579, 43704, 44097, 44745, 43555, 41084, 39273, 35481, 31390, 26804, 23071, 17987, 11179, 6593, -767, -5674, -11115, -17742, -22442, -27816, -33578, -38526, -42407, -47720, -49323, -53220, -53113, -55282, -56815, -57247, -56241, -55612, -55094, -51475, -49044, -46207, -41979, -37728, -33839, -28628, -24358, -19256, -14886, -10027, -5257, -1076, 4257, 8727, 12093, 15562, 17585, 22239, 24148, 25748, 27325, 27436, 28110, 27438, 26081, 24884, 23417, 21192, 18029, 16852, 12512, 9393, 6305, 1416, -2436, -5577, -9747, -13001, -17948, -21533, -24060, -27670, -30559, -32287, -34289, -36318, -38011, -38280, -40047, -39295, -40031, -38245, -37192, -35692, -34061, -30272, -28974, -26125, -22748, -20058, -17366, -14333, -9686, -7562, -2886, -129, 3425, 4467, 7722, 9030, 10804, 14018, 13843, 15390, 15810, 16697, 15941, 14331, 13584, 13783, 12256]
250A2256k636j574k859l333k309k327j297l718l760j751l201k902p92l335j914
265b5452j775k306j428j833J193l73j84J691L64P57J802J280K174K833J132K718
281a7407K168L369L324K099K617K921L191J680L288J290K366J10K756P22J505
296A5999q04J776n0j124K00r80k607j068n50k450j717j914k939k376l158j800
312e562k246l173j028l920j456k541r56j912j870q31j608O77r64J82J209N94r17
329b6322K074M83J542J976J340K196J969J559K995K582K010K119J738J749K395
344B405K785O18J970L83K191J92P76P68M1j370M33n75J238k141j812j80l191r07
362C624r03l446j205j627k150j272k502j952p68k250o49j760k18j508l3r68p07
$$ y = [12256, 9620, 8046, 5187, 1854, -455, -2782, -4079, -7797, -11557, -13308, -16509, -19411, -20203, -23538, -25452, -27227, -29533, -30961, -32794, -31601, -31974, -32158, -30467, -30103, -29346, -27544, -26264, -24090, -21257, -20125, -17407, -15239, -11870, -8546, -6447, -3830, -909, 2282, 3962, 7250, 8540, 10906, 11016, 13772, 14494, 15999, 15195, 16971, 16921, 15797, 15997, 15017, 12410, 11342, 10792, 8342, 6625, 4711, 1772, -604, -3762, -5562, -7808, -10981, -12009, -15929, -17385, -19926, -20882, -22794, -24664, -25495, -27103, -26426, -27390, -27208, -25999, -25405, -26322, -24248, -23765, -22223, -20247, -18907, -16711, -14742, -13183, -10188, -7606, -5596, -3477, -1739, 10, 2405, 5190, 5808, 7778, 8161, 10352, 10544, 11320, 12088, 12129, 10759, 11192, 10617, 11855, 9714, 7902, 7722, 4531, 3624, 2721, -725, -1930, -3557, -5707, -6979, -9481, -11433, -12201, -14451, -15100, -16860, -17078, -18586, -18619, -19587, -20294]
379b0294K32j119J675R99j34J291R70J362K449M24J737J680R55K694J998J924
395a157J899J225O26K064J202J093K245K90O4Q86K5Q60o34r4J9l83j143r51j471
414F665j123j007q81k422j288m25l337q75k022o13k942p26j788o35n38j015j264
431a6236N94j065j038J11Q28P01J83P73O03J502J17J216J063J899K664Q30M48
448d807O47K456J445J778N31K941Q56q59J945P69J209n19J661r92J498o63M6j848
466H094J76q77L53k049n27j024j368k013o71k423J59k289m69j625j446r71p10
483i680J09j681m75o76l45J088k185J606P03Q4M47P20m5J524J582L53K505J38
501d228M22J354K033J552l1K627R43o93J454P59Q45J00N82l09k0l25J115o54m69
$$ y = [-20294, -20062, -21181, -19506, -18507, -18641, -17350, -16380, -15018, -12569, -12145, -10408, -8728, -7773, -5079, -3081, -1157, 742, 1967, 2593, 4657, 5859, 6952, 9197, 9487, 9551, 10437, 10462, 11322, 10688, 10594, 10613, 10230, 9087, 8136, 6665, 5542, 4535, 3654, 1232, -56, -481, -3818, -4693, -6715, -7328, -10270, -10996, -12784, -13419, -13957, -14972, -16236, -15642, -16707, -17745, -17634, -16806, -16105, -15922, -15149, -14546, -13044, -12927, -11711, -10648, -8749, -6085, -5255, -4807, -4160, -1704, -259, 1519, 2050, 4991, 5847, 4988, 6933, 7702, 8911, 8392, 10053, 9061, 10559, 9896, 9942, 8094, 8270, 7393, 7746, 5697, 5170, 4146, 2778, 765, 94, -2329, -2170, -4459, -4928, -6553, -7999, -8970, -9680, -9571, -11252, -11727, -12403, -12748, -11660, -13845, -12239, -11536, -11452, -11005, -10285, -10330, -8806, -7224, -6871, -4366, -4228, -3806, -2452, -419, 1133, 1102, 3729, 4672, 3979, 5433, 6192, 7037, 7137, 7719, 7410, 7390, 7065, 8180, 7526, 7057]
520G057M32p37n49k003n56p49j929l24k396K0j070r29j564k90j715n13p33j571
538a0119Q28j301L90K33j118o33J329N75r1N04N05J366Q76J86J517J233P20J238
556a762R20J921j10K513L72J483Q02l74J118P67M83Q46j048O52N85n68j599M17
574G418L61j333o76j663P59j893n88j595o06j431n87o83q5k388p39r96m35j577
592h737J51q73n07J227j484N09o97Q16N62Q71K46O29Q34P78J124K220P1R22P90
611e48J235J702j67J747L15J158o09K314o14M69J017l48L07q01l71M24l1p25j463
630E011m79j07j022o32m26j093j625j517m48j572r58N76j378m59j333M92n40l48
648g858m1n54k01L2J365M53k43m0K146O40K57M58J428M1J021J812R12M84P74J356
$$ y = [7057, 7489, 6752, 6203, 4200, 3644, 2895, 966, 642, -1754, -1734, -2804, -3733, -5297, -5587, -7302, -7815, -8548, -10119, -9291, -10592, -10202, -9969, -11087, -11720, -10391, -9816, -9907, -9403, -8898, -7532, -6656, -6470, -4953, -3720, -3000, -1762, -842, 1079, 969, 3482, 3854, 5337, 6139, 5765, 6883, 7650, 8133, 8979, 7931, 8583, 9168, 8600, 7001, 7418, 7779, 6446, 5770, 4107, 4866, 2973, 2385, 790, 184, -1247, -1834, -2517, -2602, -4990, -5729, -6725, -7160, -8737, -8586, -9459, -9966, -8739, -10223, -9714, -10411, -9595, -9033, -8162, -7916, -7287, -6453, -5675, -4551, -2331, -2260, -1338, -548, 687, 2389, 2222, 3969, 4284, 5442, 4833, 7147, 6533, 7002, 8019, 7671, 7978, 7177, 6806, 7230, 7199, 6474, 5011, 4532, 4425, 3403, 2771, 2345, 1252, -373, -1890, -2338, -3910, -4868, -4292, -5670, -6129, -7462, -6970, -7510, -7858, -7899, -8453, -8654, -8622, -7257, -6804, -7047, -7087, -4941, -4301, -4044, -3586, -2158, -2117, -1096, 716, 1628, 2112, 2886, 4242]
668D242O14J013n76l93K667P14MM83o83Q92j181K99o43o64j068J46j582l52j255
687B677j287n57q53p84j34j967q60K90j480o37r23j140N49l28o76j187J149qM54
706g702N79K28j69J441M03L06K01J202J358J505J39J177P09J059J540N6K76J034
724E342M06j42J878o30Q50R71j098j227R67J04k04j512N7j467O56k022P05j920
742A714o74p30j202l06n96j061r22n77q34j1q73j039P32q1m19K3P61r60Q61P01
762e493p13J238r4J970J534m29J359P44Q44N55J50M11J770N14L51N99N99P04K53
781F866M62j653R88P07j333q8n50m70L37j423j69K31j437n23j422j225k70j12
799a084j056j541O58o50j586M83j217O93j164N93p90J009P08k42j10k92P17k61
$$ y = [4242, 4856, 5869, 5293, 4900, 7567, 8281, 8285, 8768, 8085, 8977, 7796, 8095, 7452, 6788, 5720, 5866, 4284, 3932, 2677, 1390, 833, -20, -804, -938, -2905, -3765, -3475, -4955, -5592, -6515, -7655, -7106, -7434, -8110, -9297, -8148, -8156, -7702, -7123, -6895, -7064, -5623, -5220, -4914, -4713, -3511, -2153, -648, -509, 668, 1377, 2436, 3976, 4032, 4308, 5342, 5748, 5606, 7484, 6854, 7704, 8675, 7577, 6350, 7317, 7421, 7217, 5705, 5762, 4295, 4951, 2929, 3634, 1714, 1040, 310, -892, -1198, -1794, -2855, -3777, -4354, -5188, -5199, -6072, -7111, -6379, -6460, -6879, -6856, -6095, -7055, -6194, -5493, -6206, -4968, -5062, -3092, -1558, -1987, -628, 116, 960, 1515, 1665, 2076, 3846, 4360, 4711, 5310, 5909, 6613, 6866, 7328, 5675, 6663, 7370, 6037, 5949, 5399, 4929, 5266, 3843, 3674, 3905, 2468, 1945, 523, -702, -972, -1084, -2140, -3681, -3023, -3673, -5259, -4776, -5993, -5300, -6464, -5871, -6661, -5652, -4944, -5186, -5296, -5588, -4871, -5132]
817e132K311k56O55K93L58J094L56J356K61J698k1J46J082J161j55P09j83K65
835E998M71N40q06o94N23q63O9K11j918q9j65k004O57r15j26j115j533O86m69
854a542j598L58j287P62j048L58o66o12J02L16K13R27p85J629q85Q90L7m2J360
873a513q61J446J537l24J85J693N81O62p21P77M2J986o37L4L94J33N97r40j121
892C950L21r04P26o30m78q88k19m82p24M97j418q61m70n39N69j558o29L19r87
911d405N38N45j314N30j85L99N26k88Q38l24P11j39R64N99M44mk44J350m43J425
931A523J753n74J302J56p69l4J716n01Q97j096L11m5j78n89L53p4q11k31j88l06
951B615k350J010L79o7j821J37o59j202k88J34K39j118o0J96j002M55q86K71M4
$$ y = [-5132, -2821, -3077, -2422, -2129, -1771, -677, -321, 1035, 1296, 2994, 2973, 3119, 4201, 5362, 5207, 5916, 5733, 5998, 6469, 7009, 6203, 5509, 6032, 5169, 5238, 5449, 3531, 3442, 3277, 1273, 1930, 1015, 889, -226, -1759, -1073, -1542, -3140, -2782, -4069, -3307, -4355, -3997, -4663, -5275, -5173, -4857, -4644, -3717, -4502, -2873, -3758, -2868, -2831, -2873, -1513, -2374, -928, 609, 285, 470, 2163, 2744, 3406, 2685, 3462, 3504, 5490, 4853, 4887, 5281, 5414, 6011, 5071, 3950, 4271, 3367, 4093, 3463, 2985, 2097, 1878, 1396, 672, 1169, -249, -1110, -1580, -2119, -1550, -3108, -3737, -3418, -4405, -3867, -3322, -4636, -4106, -4291, -3892, -3366, -3654, -2816, -3140, -2429, -2568, -1604, -1005, -561, -565, -809, 541, 98, 1523, 3276, 2702, 4004, 4160, 3391, 3357, 5073, 4572, 5469, 4373, 4684, 4639, 4461, 3872, 4225, 4151, 3340, 3109, 2921, 2615, 265, 1275, 1654, 1587, -234, -97, -756, -1958, -2246, -2112, -1873, -2991, -3051, -2855, -3857, -3402, -4288, -4017, -3973]
970c973L21j05Q01p8J485q05j226K738N22N5L82O08O76J245o85R63k74L7R4L27
990C108Q67M56r35J195r83P43r88K52j058J126o53L14k42p30j008M40l20j198
1008C86l06l39j554R84j238P90p77o86M52j235l22J282j327J487r47K65J009j427
1026c503J352J11Q46n85M64K09J167K30L86o6J158n0R07m26R73k01N63j44K5k5
1046C391n74M32K33J36J13j384O02l7J85j015q3j278M73l20m03L19j218k24j224
1065a876r2J163j267m07K2k66R48j339J536o88m60J31NN17O37k19M40N76p91q9
1085a519J427P86jq08N78O99O19P09q94J938m60j087O83J92k56j90k02Q76p28
1104B362J126r81L45j61n63j263J024q90P35j071r93P83r95M3j637O86p52M37
$$ y = [-3973, -3652, -3757, -2956, -3034, -1549, -2354, -3580, -842, -320, -265, 117, 725, 1401, 2646, 1961, 2924, 2650, 2687, 2781, 3108, 3975, 4431, 3496, 4691, 3708, 4451, 3463, 3715, 2657, 3783, 3130, 3444, 3202, 2472, 1464, 1904, 1584, 386, 80, -259, -1813, -829, -2067, -1277, -2054, -2740, -2288, -3523, -3845, -2563, -3890, -2403, -3350, -3085, -2076, -3503, -2151, -2040, -1194, -1779, -1315, -1106, 61, 291, 677, 611, 1769, 1719, 2626, 2200, 3173, 2972, 3535, 3391, 3416, 3391, 2817, 3249, 3482, 3618, 3731, 2347, 2949, 2912, 3097, 2082, 1999, 721, 1194, 874, 471, 790, -428, -652, -1876, -1968, -805, -2072, -2479, -2457, -2723, -1775, -3114, -1578, -2266, -2726, -2595, -2590, -2073, -1436, -1655, -1215, -639, -1430, -1519, -92, 694, 693, -115, 463, 1162, 1781, 2490, 1596, 3534, 3074, 1987, 2670, 2862, 2606, 2416, 2214, 3090, 2362, 3488, 2507, 2852, 2691, 2128, 865, 1889, 999, 1734, 663, -330, 453, -542, -499, -2136, -1450, -2202, -1765]
1122a765m82Q88r80M23K02J8K15q65n70J551k25m7L48j56K056r36J77K49J41M71
1142G13j49m8J437k41n40r5J511P7p48j4M56j57N85J25j15q19J142k202J044m66
1162A496n57L13L63j100k20J42p36j259L49L9q72Q27o40Mq27M29J269m59k02k93
1182a934o30Q77L6J71N61r70J238J167j897Q39L68L77p7M17J453r77j5K78J65
1201A447k4Q44o00R77J80n7j19r76j25M10r32Q58k54n22M31n35p05M34n21l83
1221a72J098q22m38J45q64J84n05k8q46J947j265k70M34j140m64J421j33q60J994
1240e84j00J46j078P97q0Q18k06M40L81q54J271PJ811k25q44K19l42R64o0o46
1260A835o8R0M54l94j243J460l21J076j140l27j145L08R18j693J97J237j915q53
$$ y = [-1765, -2247, -1359, -2339, -1916, -1714, -1696, -1481, -2346, -2916, -1365, -1590, -1637, -1289, -1445, 611, -325, -148, 101, 242, 713, 564, 516, 1953, 1712, 1172, 1077, 2588, 2665, 1917, 1903, 2359, 2202, 2787, 2912, 2797, 1978, 3120, 918, 1962, 1496, 939, 1252, 1615, 515, 295, 437, -299, -1558, -1209, -1170, -2042, -1215, -1855, -1851, -2678, -2249, -980, -1439, -1641, -1934, -2564, -1687, -1651, -1480, -919, -1889, -651, 516, -1381, -542, -174, 203, 126, 543, 1996, 1019, 1004, 1282, 1447, 1423, 2267, 1667, 2644, 2824, 2767, 2648, 1672, 1547, 1957, 1025, 1883, 1629, 1107, 1538, 1003, 298, 732, 211, -172, 926, 104, -334, -189, -1053, -869, -1374, -1402, -2248, -301, -1566, -1836, -1402, -2542, -3006, -1585, -1718, -2578, -584, -684, -538, -1616, -819, -899, -81, -287, 153, 534, -320, 951, 958, 2769, 2544, 1700, 1919, 1577, 2541, 2481, 1835, 1767, 1857, 2311, 1917, 674, 2134, 1813, 2889, 1749, 1422, 277, 585, 1503, -190, 7, 1244, -671, -1524]
1278a524J762j867L72J83L03P4j051K39J045j278om34K01o56J178L57o7O8J21
1297i80Q67m00%l61KJ617n45M22O00J36J038j654N18N10L50M05j04m74m04Q65
1317B408n69N4j117J01L77l23J058j132J197j341qo06q67P60n42j002Q55k75m38
1336a410J335n17j521r6J70J56P97p83M0L34O15o72P92j053O67L86p58J642r02
1355g78R94J151j318N03P12k91l55r4L22Q86r62P13K79m71R2J64k17l44Q18K22
1375B026q02J3N3K6r63l01m26L2K01k116K285r00k38K92q16J124p39j050P49J38
1395a412n29M3J011n19j061J688r03M63j76q31J946m22J218n85J039L56j226K93
1413C93n79P88j80M66K24J026j185N97O91M87q75l26K21j189J106J32j873J719
$$ y = [-1524, 238, -1629, -1257, -1074, -771, -697, -1748, -1509, -464, -1742, -1748, -2182, -1981, -2637, -1459, -1102, -1169, -1101, -980, -113, -513, -513, -874, -872, 745, 200, 622, 1222, 1358, 2396, 742, 1260, 1770, 2120, 2525, 2421, 1947, 1543, 2408, 1839, 1893, 776, 877, 1254, 931, 1989, 857, 2054, 713, 705, 99, -768, -8, -550, -1552, -697, -972, -1410, -75, -592, -2113, -2209, -2039, -1883, -1086, -1869, -1829, -1495, -880, -1552, -760, -1813, -1146, -760, -1518, 124, -778, 216, 1367, 49, 552, 1264, 973, 618, 524, 846, 1732, 770, 1483, 1762, 1291, 1383, 1547, 1330, 986, 1804, 2026, 1224, 1237, 1290, 1316, 353, 52, -374, -342, -141, -2257, 28, -872, -1110, -818, -1634, -510, -1249, -2299, -1550, -1412, -1941, -1898, -887, -1406, -2467, -779, -1682, -1219, -1395, -2226, -280, -702, 516, -69, 970, 1326, 100, 393, -186, 602, 422, 888, 1112, 2138, 953, 1550, 2241, 2728, 1853, 1527, 1748, 559, 1665, 1797, -76, 1643]
1431A643j283Qj46K02o35O62p11k44J70km31M43j081J74j084K028j607R5K79N12
1451a008o25j181J591p91M43P21o13R22k79J89J11m89K74L82N35R95m23M02j07
1470A049K22O17j599O81j29J17J356k12n70R2r51Q58k258J003M16K43n16J90j71
1489D38j060N02q25P62j237M12n21M32J9N17k111J560q82O01j312R48j47P5k27
1508b056J373q81m7R61k56J23J9J158p01K58k09N37n57P85J214l66O4k8n8l33
1528A000M87R63r37q42J250n82q94J251j696M64K73m47j66o92M34r33J336l59
1546i0p10r86Q01K03r12rL89N50o97J4Q46q18L39L79k30P36q34L98M78Q6j01O23
1568D55p17n18M46M07L25qM04r28J078j41p18J005M42l06q39J526j322J76J349
$$ y = [1643, 360, 368, 222, 424, -211, 451, -260, -504, -334, -336, -767, -324, -1405, -1231, -2315, -287, -1894, -1799, -1520, -1008, -1633, -2814, -1223, -2014, -1571, -850, -1463, -541, -820, -631, -520, -1009, -735, -353, 182, 1177, 754, 1156, 1049, 1271, 1888, 289, 970, 841, 958, 2314, 2102, 1532, 1624, 673, 1531, -727, 276, 692, 935, 419, 609, 438, -622, -120, -945, -183, -1420, -1008, -1529, -1097, -1078, -561, -2672, -1112, -1994, -1393, -2705, -1757, -1904, -1829, -2056, -683, -1564, -1611, -650, -906, -783, -764, 394, -307, -49, -258, 279, -278, 507, 1721, 1355, 1419, 1391, 1333, 1000, 1487, 2450, 1513, 671, 1921, 1339, 445, 1696, 0, 464, 737, 290, 124, -568, -134, -1067, 269, -90, -800, -1786, -985, -782, -1694, -1703, -1314, -764, -1461, -1447, -601, -1419, -1080, -701, -931, -195, -1029, -631, -153, -67, -168, 455, -262, -780, -334, 73, 398, 390, 794, -134, 944, 803, 85, 1090, 1532, 1226, 387, 1913, 591, 767, 2116]
1587B116j97j601K395j340j102j19M20l52m48j097R9l49L05J13N36j188L45N00
1605i64m34N69j605J282M65l51L2n3k83K99J90r07O13K25j61n8J221m30N90r63
1625g23K064n73j00O88m89mm86M29K40n76Q20q35J003k09o75M57k27j257J66K270
1645A983j173o57p09J52j67L09J149j874K2q2o71K61N25K5K45n45J45j24o83R38
1665i31m18Q42k45k97M41m18q1J602j379J262J55L78j020O8N13K68K24N8Q61q76
1685A007O18r5l8l34n98P80M31j310K58O54N47p60j256P0M39j073K94Q3m0m13
1705g36n51K05m17J099o3n43K36Q3r89N18k27K30m37N18N6l01R90j294k23Q26
1725a020j41j12J439n65K94l30N41R19j24n04j08M93O66n67j20P92K04k121J024
$$ y = [2116, 1919, 318, 2713, 1373, 271, 152, 572, 220, -228, -1325, -1226, -1575, -1270, -1157, -621, -1809, -1464, -964, -1398, -829, -2434, -1152, -687, -1038, -1006, -1059, -1342, -1043, -853, -1760, -1147, -922, -1083, -1141, 80, -350, 240, -723, 1341, 768, 668, 1356, 867, 863, 377, 806, 1046, 470, 1290, 455, 1458, 1249, 574, 1031, 804, -453, -287, 1983, 810, 153, -556, -404, -571, -262, 887, -987, -965, -1047, -1718, -1457, -932, -907, -662, -1207, -1062, -1186, -1869, -931, -1349, -507, -752, -1049, -608, -1026, -1107, 495, -884, 378, 533, 911, -109, -41, 472, 740, 964, 1022, 1883, 1007, 1625, 1530, 1492, 1158, 560, 1340, 1771, 461, 719, 1373, 1920, 1160, -96, -26, 413, -660, -366, -283, -323, -736, -1287, -1082, -1499, -400, -463, -1006, -770, -687, -1676, -1158, -1385, -1155, -1592, -1074, -1018, -1319, -329, -1623, -1846, -1020, -1161, -1273, 166, -399, -105, -435, 106, 1025, 901, 397, 289, 782, 1448, 881, 761, 1553, 1757, -364, 660]
1744F60J189j584J142l66k53K14j286Q31j045J286k48j800J324K77j213p94J324
1761c42q99N76n85q05R78ro34O15P81r31j97R21n55o19R82k76N40n55P4P04J179
1782I43K02r45k91K95L06Q64Q21k120R19l09P49o08r02M27l01J106o66o74J567
1801A383j615L06l25k89O63k36J020q70q54K05O20k76J13j123L62p70l48J828
1819b06j196j59P48n95n8M10j090P10m6J142K39o02o81J644o90O1l45J195j19
1838C62O8n6j57O39N8J46o28j76Q84j10Q6m70K81K59p65j53K75l14L66n03q97
1859h05J169L69q90n32P02r09O81q53O44n36m58J050m7o63J135j161j32K40L65
1878f31J54n47N32o00Q49l63N8j24J140j862J573L16L8O47m94j73o66J065o07
$$ y = [660, 1849, 265, 1407, 1041, 788, 1002, -284, 547, -498, 788, 540, -1260, 64, 341, -872, -1666, -342, -1241, -665, -1250, -2055, -1077, -1086, -1720, -1105, -324, -1255, -1452, -531, -1086, -1705, -723, -999, -459, -1014, -940, -236, 943, 1145, 200, -91, 204, 510, 1374, 2195, 75, 994, 685, 1434, 826, -76, 351, 50, 1156, 490, -184, 1383, -232, 74, -251, -540, 123, -113, 907, 37, -817, -612, 8, -268, -155, -1278, -916, -1686, -2034, -206, -1402, -1561, -813, -1408, -1466, -1056, -2146, -1436, -1482, -340, -101, -703, -1384, 260, -430, -369, -714, 481, 362, 430, 374, 217, 856, 914, 1060, 432, 256, 1140, 1030, 1116, 646, 927, 1186, 421, 268, 543, 229, 595, 92, -805, 364, 733, -157, -689, 13, -896, -215, -1068, -424, -960, -1418, -368, -415, -1078, 57, -1104, -1236, -996, -631, -477, -1024, -492, -1092, -243, -606, -548, -672, 468, -1394, 179, 495, 533, 1180, 686, 513, -153, 912, 305]
1897C05J67K4J491j287P02k5j132J535j164j69O50j707J007Q74j020P73j460J274
1915H38j040m80K19j539K146j024J485j032o24P89r52l77P23n22J075k22j01P11
1933G3p06J203q76j68Q56j448Q70m04N02L38K3n39Q57m03L93P06r98M47Q00q15
1953G11M64L64n50M64q46L75k94o70R97m83m52N95j5r1L80o4j100j28Jp07L20
1974g29k08R15r4o40K54K50m12M89k8j53l08k04P35l15l70J76P48k42l34N06q25
1995g89R40j188J452r99K85j95J287q9P72j141M08j102J202o31l39R97j328R19
2013D61m06O72p30K9mP87M02o74r43m9O15J07o75L76m82m83J329l29p01Q17j3
2034A06o91q4O53q9J19j208J925j000J17j07k73P81o14l46J347M9n56l1p19R96
$$ y = [305, 472, 496, 1987, 700, 1402, 1377, 245, 1780, 616, 447, 1097, -610, 397, 1271, 251, 1024, -436, 838, -202, -682, -463, -2002, 144, -880, 605, -427, -1051, -262, -1214, -1591, -868, -1390, -315, -537, -638, 73, -633, 570, -306, -474, 382, -1066, -196, -600, -98, 240, 263, -276, 581, 178, 571, 1277, 279, 726, 1526, 711, 1175, 1539, 989, 1453, 607, 982, 688, 18, 1015, 532, 80, 675, 660, 569, 949, 885, -215, -343, -342, -1049, -729, -937, -22, -116, -756, -502, -252, -664, -175, -203, -356, -664, -868, -133, -448, -818, -642, 106, -136, -470, 36, -789, 151, -1037, 415, -584, -299, -494, 793, 704, 1476, 335, 743, -359, 843, 212, -127, 870, -458, 461, 55, 727, -3, 26, 22, 809, 1211, 537, -406, -455, 160, 267, -408, -32, -514, -997, 332, 3, -698, 119, 106, -585, -669, -16, -105, 14, -1194, 731, -269, -152, -259, -532, 249, -365, -711, 636, 685, 129, 98, -621, 375]
2054C75k75k77J35R31k93j123O22R7Q24m53L66J05K11r98R41p88k23L70N71j261
2074a43O41nl44r87O9N36M58n22m24R87j913Q37N14J98q71J181q00Q50j292P3
2094i57Q52r2k46M89L37p16R11q09R29k116J626p05Q23K45p06L38p4L05m12J365
2114A387o75m50O72m41l17M16N04k26M04j378M66m2j15l73k69O25n43M96N69o91
2134A9N00j939J550n87p85P16N23N68j560j01L3J005l46q98O27r2J267m06J55
2153B49j16o10O52N96p20J4J075k105L28L86P18L85j302P22M70j169R24k98J87
2172C86K40J46j076rL37o13Q26N25r01N61N68p60P76j041R37j728J138j28K53
2191D37j549J233r41L37l36N78N48j353J80L61k56n8Q24l88k21N73o92J5J302
$$ y = [375, 100, -177, -42, 889, 596, -527, 95, 192, 1016, 563, 929, 1034, 1245, 247, 1188, 400, 177, 547, 1118, -143, 498, 493, 149, -838, -769, -233, 225, -297, -721, 266, -1647, -810, -296, -98, -969, 212, -588, 262, -1030, -957, -105, -197, -443, 46, 383, -333, 578, -231, 698, -1418, 208, -497, 326, 571, -135, 203, 129, 434, 22, 1387, 712, 262, 934, 493, 176, 592, 1096, 870, 1274, -104, 362, 320, 205, -168, -437, 188, -355, 141, 710, 19, 519, -1420, 130, -457, -1242, -526, -3, 565, -995, -1096, -1063, -58, -404, -1302, -675, -767, 500, 94, 249, 133, -477, 175, 771, 51, 65, 1140, -965, -637, -251, 467, 852, -450, 272, 742, -427, 497, 199, 386, 626, 772, -304, -313, 24, -589, 237, 762, -139, 422, 990, 230, 1006, -35, 902, -826, 312, 184, 437, -1112, 121, -820, -483, -819, -241, 307, -1046, -866, -505, -761, -819, 5, -383, -604, -31, -723, -708, 594]
2210E94p70j072J865j265N15LN68p44J426j11n51L64J54k50M32pp11P61q14j8
2230C69J350k094N43N81o85M54j179K019j692n12L76L42p16L18K155j099q56Q6
2248b40m01q0j81P77p06J182n07r91J616m50L47p59Q52p66O97j071J152k87l62
2267a78P33J34n06j331P97l53J550R60k031O06p52P85L18l50J08l60m43J070n37
2286B20p18P50M75K53n08n95k95J156p88l48o9L50j83o17Q09j03j063M71k56J782
2306G23j661J064j518J068m15n75P61L33J260j010K05Q9j06M32q98J181r11J37
2324A59J69L23m56k05O06k15L54l2q22M1J665k070J385j004R65j479K94L88O88
2343G54l04n27N65N06j622Q6J130r64Q59r73o29J01N82m26J084o73k47M72m81
$$ y = [594, -176, -1248, 617, -648, -133, -130, 438, -306, 1120, 1009, 458, 822, 976, 726, 1158, 1151, 440, 1201, 387, 369, 1719, -375, 168, 749, 64, 518, -661, 1358, -334, -846, -470, -128, -844, -526, 1629, 530, -326, -240, -641, -721, -902, -125, -831, 351, -156, -1147, 469, 19, 366, -393, 459, -307, 390, -681, 471, 184, -178, 555, 689, 183, -1148, -351, -704, 846, 1806, -225, 381, -371, 414, 732, 382, 490, 130, -313, 757, 220, -498, 252, 727, 980, 472, -123, -418, 738, -50, -398, -467, -117, -300, -917, -108, -211, -1274, -803, -1059, 723, -938, 126, -1392, -324, -739, -1314, -553, -220, 1040, 30, 235, 324, 218, 650, -248, 933, 22, 159, 328, 651, 195, -10, 596, 381, 735, 703, -119, -78, 1587, -483, 902, -102, 863, -616, -322, 66, 754, 450, -77, 488, 994, -628, -542, 588, -376, 483, -490, -1119, -1018, -436, -862, 222, -451, -698, -226, -707]
2362g07Q55r94L34Q02j418Q80J155p30O4o40O00O75q8J09q02M54L42r57R13l72
2382D75m28j46J207j68j177j057K913q98j89j423J565k79J30o4j300J847n46p57
2400b95J067j026k77M67j243J813p82O5M26m64Q9L28j186Q72r12J77R06q63l22
2419a160R62K47j744P68L57L74m6J317m66o10o66M40l8J26P96l90L57j112M21
2438f7o69J068j69j2K95q93k3O05n3j70j50K94J80n9Q41j114j78l04R83p53M51
2459A03J324l95o47j173l53J391m85L25l39r1N24M88n50q81M47m38O68k89kk72
2479f45N86l08l1P72o6q2q94J550j027L50M71k8j343J79n4O36k04K8l39Q16m09
2500d2K60J59l32L37j77n28P45o55P82j93j04p69J020p29j73L45p61J960n57L44
$$ y = [-707, 148, -846, -512, 290, -1128, -248, 907, 177, 241, -399, 201, 876, 788, 897, 95, 549, 891, -66, 847, 475, 47, -99, 1108, 940, -237, -1294, 1619, 721, 532, -891, 674, 395, 525, 461, -839, 1008, 462, -295, 772, -254, -531, -64, -1307, 506, -276, -211, 215, -249, -160, 168, -1018, -146, -1058, -881, 25, -838, -1160, -198, 49, -1695, -927, -570, -196, -242, 1075, 609, -1, -667, -227, -265, -139, 657, 267, 624, -488, -67, -736, 332, 163, 151, 446, -447, -470, 135, 82, -88, -238, 56, 236, 177, 1018, -96, -274, -578, 405, -348, 103, 1427, 1032, 385, -788, -1141, 250, -235, 90, -249, -340, 184, 672, 122, -759, -312, -750, -82, -371, -373, -645, -59, -367, -398, 374, 308, 226, -668, 882, -145, 205, 676, 648, -695, -516, -570, 66, -138, -110, -449, 367, -42, 218, 377, 45, 382, 205, -323, 422, -233, 549, 356, 252, -517, 503, -226, -399, -54, -815, 1145, 588, 932]
2520I32q53J113k034R87p52J215j343R72K00j328J906j814J645p95n86J770j926
2537f91L63j81M14J90K72K03q62L75M3L48M0q49Q55j691L69R20k5n01K73O80J31
2558F76p70k53K06j103J880j332R59j505J137N63j032J282l71p51k6N70o44N42
2576B8q6l14J185k35n00n07J50O54L56p69q78J172J048r09p71R68q55O63N08j802
2596h94M99J394j080L81k61K04L86j87m43L04n18m11R79L34p75K4j57r7k54Q50
2616B78m69n86P28l57K15n62J210K35p41L20j267O7J154k93l21p74J136P49j431
2635g09Q53j07L95j180K05K65j35M75k1n78R48j79M32p6n49R4L39n38k4K98L10
2656E18l95O48j123J106r37j73J365j476J55j18Q86n06J266o15m6n15k75M63n45
$$ y = [932, 79, 1192, -842, 145, -607, 608, -735, 237, 437, -891, 1015, -799, 846, 51, -535, 1235, -691, -328, -509, -95, 95, 367, 570, -292, 83, 126, 474, 514, -335, 520, -1171, -802, 118, 93, -408, -135, 545, 676, -94, -347, -141, -1244, 636, -696, 263, -1242, -105, 458, -574, 708, 337, -414, -440, 130, -514, 28, -58, -372, 813, 578, 78, -429, -279, 375, 731, -38, -916, 256, 1304, 395, -376, 592, -263, 400, 908, -894, -395, 999, -81, 300, 39, 243, 629, 442, -1, 303, -215, -626, 353, 687, -88, -64, -221, -318, -572, 278, -191, -777, -49, -406, -191, -753, 457, 692, -49, 271, -996, -929, 225, -68, -389, -1163, -27, 722, -709, 144, 37, 432, -748, -543, -278, -413, 62, 41, -537, 411, 232, 664, 588, 39, 133, 472, -66, -90, 208, 518, 123, 771, -352, 754, -183, -356, 1009, -467, -312, -430, 456, -50, 1216, 601, 555, 40, -235, 228, -317]
2675c17j85l6J470r97N13j294N48R7n3J089j222j1L76L48r76O63L57M17j190M09
2695FO16q71P65j119O42q63K492k120j1J386m76l05k46J504o21p36J319o46l36
2714C80J0q37L52k3L78J21m33q0L06k2m67M27q3L26L51J18j490N08K20M97o08
2735d9q82R26K38k76P40j772J457r30q6Q00J58l03J029j06r91k66j093K517j950
2754h39J13L79J431p71k32k53J25N71j780J036m0m56J096ml8L7K21p0p00l72J67
2775c79R32r16Q4K14J18l63P68r49J8O15J07Or12J008l88J4K14o64J021j562J44
2796h70P2J23Q04l97J65p97k80J205k22J886j400j91n96R81o42J301l11m87N1
2815C95K35m66K28n13N80J82p5j851J303r80R88p65J0K86q2R74J02j079L53m90
$$ y = [-317, -502, -538, 932, -65, 448, -846, -298, -201, -254, 835, -387, -398, -22, 326, -650, 13, 370, 787, -403, 6, 622, -249, 516, -603, 39, -824, 1668, -452, -463, 923, 447, 142, -104, 1400, 779, 43, 1362, 716, 380, 390, -447, -95, -118, 260, 381, -52, -132, 174, 152, -315, 112, 29, 355, 706, 824, -666, -158, 62, 559, -49, -931, -5, 233, -43, 697, -1075, 382, -548, -634, 166, 324, 21, 1050, 944, -47, -313, -1406, 1111, -839, -726, -347, 1084, 313, 81, -172, -47, 524, -1256, -220, -260, -716, 380, 376, 338, 375, 596, 526, -174, -546, -379, 553, -363, -279, -65, 53, -310, 458, -491, -473, 142, 249, 255, -657, 351, -37, -23, 191, -473, 548, -1014, -870, -798, -675, 129, -268, -103, -900, -1180, 25, -197, 1689, 289, 98, -498, 483, -159, 1142, 831, 344, 395, 630, 164, 392, -121, 459, 641, 566, -1285, 18, -962, 26, -739, -729, -443, -525, 449, 551, -528, -175, -665]
2835f65L56L5n31Q32J64n72J27OO81r36j86L13O22r0j311J108M07r67J153j197
2855f51N64k40J53J428n08k255J049m10J099q4R61q29p83J776j427q6J141q66
2873C2O45K28r65n2R8J132n59l23Q2n6n64O98N67m03o11l15N14J96o44L83l73
2894b90K46R38r15k72J418j559Q1J58l13J643j886R42M04q12J170P77j828N91
2912D93j2l65M69p26K76L29j7l71j58P84p22m6L76K75m11k16km55P75J61p19M04
2934A22J11l85Q88k70m5O69j703J007l76M24O4N17p06j44l93m77M03J00K41l82
2954c35l22K21J179j193P27P3r57P42n39N86p3j39m25M30L30O52j301M71m67n51
2974h91N03r8N15P49k52j133O65J80j405K79J092r92P28J94l36L61p31n91J884
$$ y = [-665, -309, -274, -805, 27, 191, -381, -254, -248, 433, -503, -689, -376, 246, 156, -1155, -47, 360, -607, 546, -651, -87, -327, -174, 1254, 746, -1509, -460, -870, 229, 145, 1106, 277, -506, 1270, -157, -243, 898, 32, 677, 905, -60, -112, -14, 1118, 559, 236, 318, 262, -302, 396, 963, 560, -51, -366, 148, 344, -300, 83, -290, -44, 894, -21, -293, 1125, -434, -353, -195, -508, 1135, -751, 191, 595, -217, 953, 1730, -98, 493, 481, 116, 585, -141, 135, 464, 447, 76, -82, 702, -20, -66, 310, 585, 174, -42, -44, -499, 276, 437, -282, 122, 233, -152, 736, 466, 421, 1090, -613, 394, 18, 442, 506, 1023, 317, 173, -220, -697, -294, -194, 47, -335, -657, -436, 743, -450, 277, 350, -607, 135, -404, 182, 109, -30, -455, -25, 305, 957, -344, 127, -340, -891, -388, -486, 29, 778, 526, -607, 58, 238, -1167, -888, 204, -788, -60, 134, -202, 159, -572, -1163, 721]
2993G21j234O83j28L14m03J47L61O28K39o80j195O71R70j149L51k56K55r07K70
3012c42j141K639r53m68J31k97l01R6N90m72n48J262Q3k36O19n79j58R26j472
3031f21J306r72k11m21J66J706p56m26n00K04Q27o33j31j12J172q08M90M68j390
3050f42R08j232J428o19m82M90K60N25j617J099J87K72l09o09J70l91N33r4m79
3069f02J78J340m59l17l74P86m40n1k29m47L91n85J148M58k10j12n96q21O00J668
3089A326j230M61K50j372M12J62lN00o41k24J162m80p35K70M75p13O32j00j17
3108C5m08J064j181L67O51o92o9j46O94j13k50m66N1r43J349k49L9L77n43P43
3128C10m89P14O50j384P96K24p69J179k215J154j098l57J616J9j031j11o4M33
$$ y = [721, -513, 170, 42, 356, -47, 100, 461, 1089, 1328, 648, -547, 124, 1094, -55, 296, 40, 295, -612, -342, -1483, 1156, 203, -265, -134, -431, -732, -636, -46, -518, -1066, 196, 279, 43, 662, 83, -75, 851, -621, 685, -287, -498, -919, -753, 953, 197, -229, -729, -525, 302, -331, -462, -574, 598, -210, 280, 748, -642, 266, -966, 462, -157, -639, -149, 111, 636, -981, 118, 305, 577, 268, -341, -171, -562, -29, -123, -602, -424, 916, 457, 140, -234, 552, 112, 61, -168, -615, -224, -809, 339, 797, 587, 475, -121, -942, -342, 1326, 96, 557, 807, -565, -153, 9, 6, 506, -135, -359, 803, 323, -412, -142, 333, -380, 252, 152, 35, -373, 691, -490, -123, 528, -164, -233, -379, 315, 202, -48, -514, -463, -1406, -57, -306, -267, 110, -433, 310, -179, 535, 1185, -199, 597, 821, 52, 1231, -984, 170, -928, -1285, 331, 350, -681, -792, -856, -423]
3146d23P09q20M72L36n73N15Q5o52M42o19K66L29K11p92N67P41j512N94p53J475
3166E98Jr27N58j05O93p0o88m67J657j494K85j80j241J210K17P01l33k63O96j125
3186b77O32k19M2l78P57r81l68N06R61j609Q96Q8k71Q84o97J228r3r79l50m9Q41
3207E64q00Q12p90K61o63J657j230j80j23J73k79L66o39O51o75R79N63n86k90
3226b29M06M93j077j6O21n30k61r0Q46q52J107o92m41j63J589r39K50N42n93N80
3246E51j110J493j447K40N91o52l1N73l64L78p25J015o15L04o46K66J46M41o17
3265b09N90O0Q63j172P90o52l12j08k61J016l94N5L15J0o03P34q04Q3k29l80n35
3286a143J440K44p24n65J369o89P34p78j35R1P29j250O27k31M73l46r50Q85M41
$$ y = [-423, 286, -534, -62, 274, -299, 216, 301, -351, 91, -528, -262, 67, 278, -514, 53, 794, -718, -124, -877, 598, 599, -328, 230, 125, 818, 748, 60, -407, 1250, -244, 41, -139, -1380, -170, 47, 748, 415, 152, 848, -277, 355, 136, 178, -200, 557, -424, -792, -286, 675, -934, -38, 50, -221, 663, -34, 1194, 1101, 122, -228, -277, 564, -236, 576, -214, 47, -616, 1041, -189, -369, -492, -319, -598, -232, -871, -220, -895, 84, 647, 61, -229, 177, 670, -407, -423, 198, -332, -593, -683, 163, -689, 418, -274, -715, -878, 711, -228, 22, 564, -29, 551, -559, 934, -513, -273, 318, -334, -365, 208, -156, 222, -503, 512, -103, 201, -445, -179, -33, 408, -209, 381, 441, 1304, 132, 922, 270, -42, -150, -411, 605, 211, 266, 581, 591, -12, 722, -82, 1, -228, -608, -1143, 297, 541, -183, -748, 621, -68, 666, -112, -247, -156, 573, -677, -50, -281, 192, -154, -1104, -219, 222]
3305B22r38L62L67M30r2l60J46N84p46m19P3m08M69N31p0O75j531N82o88J171
3325C60k53j117M35J64P03l90n69J71m04J009R20j313o2K93K27j224J154Q07q19
3344I2J84n09L49M5pj86Q88j869J262M46q4K31j043l03J003n89p42L95Q58j268
3364h47J61R31J87r35J082j165M09O08L1J136r33m84J76k42r9j201Q35j25M84
3383Ij96M99P46j177k33L72jo17j49J410j526J521m6j059m79P15l5P86j132j70
3403g62N15k5M83l57j088J249k28l46p82N06p1P85j066K071n45M42l81l70J70
3422B00q90J49K29j68M24j55q6M65o18J042o16K5m61L77M04p02R7J126l37o65
3442a60O91j07n31m58M56M6M66o97n7J398j040K79n66M0O48j440P6J349j434R45
$$ y = [222, -716, -354, 13, 443, 351, -9, 137, 721, -25, -444, -371, -779, -310, 221, 151, 826, -705, -123, -811, 360, 107, -1010, -575, -411, 292, -98, -667, -496, -900, 109, 1029, -284, -346, -53, 174, -1050, 104, 911, 92, 276, -233, 116, 161, 154, -32, 856, -1013, 249, 695, 611, 842, -201, -504, 499, -90, -832, -437, 421, -847, -686, 245, 432, -503, 579, -586, -177, 431, 462, 1598, 665, 181, 357, 115, 16, -1185, -350, -475, 9, -187, 312, 1058, -119, -352, 20, 19, -598, -747, 663, -863, 658, 612, -447, -926, -211, -246, 540, -592, -762, -247, -272, 211, -146, -1234, 15, -213, -559, -1341, -835, -906, -121, -1187, 884, 339, 781, 400, 30, 200, -690, -541, -312, -480, -56, -211, -297, 168, -450, 592, -24, 1, -460, -83, 321, -381, -284, 842, 505, -160, 531, 424, -107, -565, -109, -63, 403, -294, -351, 1047, 7, 286, -280, -240, 408, -1032, -956, 393, -1041, -96]
3462i6L36R88j446m4M36q39M84M80k04pk4l05o27L69Q07q17j99N28r52J210l10
3483b32j04J039j332O20M68k52k34n14N88M37L79o22q51L32L45L8l46M65m87Q25
3503E62J83k79l97n8n26J210j028J56O09r78J015l89j32o66P73Q61j359n78M74
3522e47P6O89k16J067k000K1J072q16q7J586j257k87J085k63j087J233j319R17
3540a33jq0N50j22p48N80J77o2o01K01P16j120J711j249k91J116j52n8j74K62
3560E22m4j55n07K93K46q71O5J276q46r88J265r43L81K73j63j167J208k35m8M69
3580C1k99L72m19k27Q4P9K84o26M27R65j183N69m58N86J4k08J57p92R3j97O24
3601a24L53L10J89q47K65j297P40K79L89M43k84p39O30r50K98O77r88J261n4n68
$$ y = [-96, 240, 1228, -218, -262, 174, -665, -181, 299, 95, 88, 64, -241, -868, -499, 308, -509, -708, -180, -1132, 78, -232, -336, 703, -629, -9, 459, 207, -27, -541, 47, 484, 863, 241, -610, -278, 67, 105, -241, 224, -263, 562, 745, 466, 69, 11, -515, 695, -333, -177, 432, -546, 469, 80, -52, -718, 55, 916, -443, -1021, -547, -471, 218, 2, 1069, -931, -910, 162, -654, -741, 845, -412, -699, 386, 123, -964, 269, -1050, -133, -134, -214, 336, 214, -534, 46, 223, 161, -440, -239, 477, -643, 1068, -181, -472, 644, 492, 434, 260, 522, 478, 323, -184, 109, 355, -516, -451, 825, -21, -1009, 256, -687, -306, -33, -196, -1363, -155, -390, -438, 31, -268, 104, -315, -542, -458, -379, -95, -721, -294, 671, -512, 57, -401, 185, 199, -9, 148, -644, -551, -748, -124, 229, 539, 728, -119, 146, -1151, -411, -132, 257, 700, 416, -323, 307, -643, -345, 332, -656, 605, 551, -17]
3621a7q55J198n91R1M2N98r16K70k41Q77N64j215M30L64j038J76R43m91Q3L30
3641F02m13l62l05L62O0q4n39O40k04m8Q41j690J441k60K72k25P75j158l87O30
3661e2k64n20J500j027j40N03q0Q30j586J02L67K63j01M58j59j99j54O89N04p28
3681B06r37O82K56j449J237P42p54O56j047J96O71p80m51L80n17N79P43j059L75
3700b71P85p01M20m81P40j64N6o32P11m18N18R6p9l27r0K7Q26k06j095L72J14
3721B01o90O53p4j92J50P60k97K00l39j192P39O12o03K94k42m97j04j75J000o21
3741d17M12l59o25P13n06p67Q57J395r22Mq41J396j26r28M10N95q1p29L02O3o63
3762h17O58J222l73o32j78l09N34k32L19j226J348O6k99L98k03K21K58L16j337
$$ y = [-17, -872, 326, -265, -174, -132, 466, -450, -180, -421, 456, 1020, -195, 235, 599, -439, -263, 680, 189, 272, 602, 189, -173, -478, -116, -56, -140, -679, -39, -243, -291, 550, -1140, 301, 41, 313, 88, 863, -295, -682, -52, -316, -836, 664, -363, -503, 0, -80, 750, -836, -734, -367, -104, -205, 253, 94, -105, -259, 430, 934, 206, -731, -49, 207, -1242, -5, 737, -17, 639, -408, -212, 459, -321, -772, -392, -909, -330, 413, -646, -271, 514, -187, 233, -248, 492, 328, 384, -248, 463, 45, 563, 659, 580, 253, 163, 190, 1016, 810, -285, 87, 201, -489, 164, 90, -102, 48, 808, 511, 711, 372, -820, -81, 531, -72, 222, -20, -517, -621, -796, 204, -417, -5, -364, -989, -276, -782, -1549, -692, 703, -219, -215, -1056, 340, 214, -714, -304, 291, 210, -519, -217, -154, -817, -159, 1063, 690, 58, -120, -429, 105, -127, 192, -1034, 314, 380, 81, 479, 276, 497, 755, 1071, -266]
3781b66k17N54O13q99M49k25L72q1j399O35N9K00K94Q47j15O0j480L24J366j166
3801g5k57O80r63O66Q89m51L51l34q86O94j026K73K39R28j217J278p68m23M00
3820bO8J37k68l81m27N46O12J46j595J154m78P57q20K9K42J11P96p04J195j021
3840I7j7j128L43J026j124P06N06r78J696j151K89o99P68q39L90P26p25j00J000
3859G86j117j92O22p95O22r45J045k49R83j182J155L0j140J30M12k72M54n32J81
3878dL55p80Q14r42R15j84K75L68m60p3l32L75l76N14j196Q04P21r19l26j47O58
3899F0j75P56p80N08O25o87r60O8O93K05k64k81J292p74K6n17L12J28j85Q40r38
3920d8O30p7j021J405q90o14N60P84kj369M44L33P17N0r18j6J37j014M19J5p21
$$ y = [-266, -483, 71, 684, -215, 234, 9, 381, 300, -1099, -464, -405, -205, 89, 936, 821, 881, -599, -275, 1091, -75, -332, 348, -615, 51, 940, 489, 840, 506, -380, 314, -712, -439, -200, 728, -489, 789, 21, -402, -2, 66, 203, -65, -446, -873, -327, 285, 431, -1164, -10, -488, 269, -551, -522, -280, -169, 627, -77, 1118, 97, 80, -1048, -705, 321, -803, -97, 409, -569, 1127, -24, 265, -434, 334, -505, -115, 611, -114, -214, 786, -331, -523, 99, -696, -74, -1019, 26, -223, 760, -422, 733, 763, -377, -247, 165, -107, 347, -185, -4, 351, -429, 385, -557, 358, 174, 449, 817, 357, 284, -48, 327, -49, 465, -731, 73, 794, -125, -451, -598, 60, -115, 641, -139, 369, 994, 307, -653, -585, 108, 313, 49, -232, 1060, 286, 312, -205, 107, 235, 50, 890, -48, 582, 505, -516, 889, -1, -615, -55, 729, 727, -642, -198, 135, 852, 902, -16, -32, 105, -909, -490, -475, -1196]
3941a196J245o36M21q92J523q4j13j24K41p03L60r54N42o1J447o24K50p83j52
3960b93J109n10K01j42j052O66L22l40J95P51n46M11j361K86P07k77o97P06k06
3979g0J48p03J354p31M37K28p79l65j6R17n78N08l44n7R84n41p3n9n15L9P67k52
4001B99n02k40O63p22Q43k63L14n61L35O17r12n9J522j477k95Q04p89O16m14j22
4021c43j74m01J159j65N23j618L47J166k50k31L5o92K77L57q07J225l75L50o58
4040b75Q28q18N98j58l39J10J33n90j43O55l55J089j278L79N62k30k61N02o86
4059b77q4l12N75n41N44L7N0N90m23N8K35j209J112j0O31j130j74M52n95J253
4079G82k06p35j63R12n93j00O81n13L29j672O59J089j57j88L59r16M41q05N73
$$ y = [-1196, 49, -587, -166, -1058, 465, 381, 268, 144, 385, -318, 42, -912, -370, -431, 1016, 392, 642, -141, -293, 816, 306, 507, 365, -687, -21, 301, -39, 156, 907, 361, 772, -589, -303, 404, 127, -570, 136, -70, 78, -625, 729, -2, 435, 663, -116, -481, -497, 420, -158, 350, 6, -51, 933, 392, 319, 260, -255, -216, 551, 299, -203, -443, 220, -502, 341, 78, 392, -169, 166, 783, -129, -188, 1334, -143, -438, 366, -423, 193, -221, -343, -517, -918, 241, 76, 599, -1019, -672, 494, 244, 13, 48, -644, -367, -10, -817, 408, 33, 383, -275, 553, -265, 333, 175, -164, -54, 79, -511, -654, 1, -354, 735, -543, -164, 398, 168, -93, 409, -277, -361, -673, -98, -639, -95, -58, -8, 582, 159, 217, 452, -757, 355, 345, 976, -154, -328, 124, -471, 782, 576, -159, -322, 590, -3, -103, 578, 65, 394, -1278, -619, 470, 313, 125, 484, -432, 9, -796, -223]
4098b23p02J269n13k77Q75q56N44m31O78j356J095J73l81O12n43n28L3k2O6Q80
4118C93j149R78K59J97p71O60j98o18k79k74J63R31J30k14K97j048P93J01O24
4137I75j322K44l0J4K69P73j284J447k93j439j42J318j3n72k61K24J44K06m61
4156b03O64j9N62j803O42l94P27J28j512J817K4o94N05j199P65K34q65P7j68R70
4176B58J8N24q15p50J177nq11Q98l79p7K14l97J99l85L47L74J056j202n0j69r08
4197h83L03J673p31j45M93m80m06N93N27o67j651J064J034r64l04O6P76O64l4
4216I28n14m62L39N84q65r81j27K95M99L02r39J131l04K9l87l99m5j6R93p47M50
4237b36M76j282J55J367n11k52M22N9J05o31p90P51m70l93R50M3J397j386j99
$$ y = [-223, -925, 344, -169, -446, 429, -427, 117, -314, 364, -992, 103, 276, -105, 507, -36, -564, -531, -553, -487, 393, -756, 222, 481, 678, -93, 567, 369, -249, -528, -802, -639, 292, 422, 208, 505, -543, 250, 351, 975, -347, -103, -133, -119, 150, 923, -361, 1086, 793, -646, -788, 530, 517, -55, -316, -92, 52, 258, -203, 461, 442, 1004, -799, -157, -551, 176, 304, -1208, 609, 633, -61, 444, -755, 10, 244, -621, -544, -712, 258, 276, 800, -15, -765, 412, 407, -404, 494, 115, 38, 252, -145, 54, -331, 16, 390, 1446, 244, 194, 25, -883, -580, 1093, 362, 217, 710, 230, -176, 417, 944, 277, -1374, -310, 724, -240, -544, -478, 298, 962, 928, 414, -48, 291, 875, 10, -971, -1098, -803, -304, -2, -941, 190, -114, -85, -472, -871, -916, -932, 61, -686, -236, 240, -1042, -887, 480, -31, -283, 139, 198, 303, -328, -1118, -367, -837, -1230, -280, -237, 1160, -226, -425]
4256d25O0P11R26j150L55n91K46m06o9m3K72N42q18O93j423J45P86L9O90o26K27
4277A41pO82k95j375J055j150J190k96N67q52m81M74K38J021l77L95p10KM37r19
4297b60NL71q16J052n06M39n04K32r47P08M59j530J342p12J402o00j92j50l53
4316e60J80J55P70j407N34p1Q27j314J848o44p07N75K77r77Q16j84m69M97l88
4335b42N77n68K46o11P75j250J237K9l9J74j68N32k03j345J36L55j07m14J058
4354A72R52j449R83o85J17P76l75o21R49q50L17r24Q77n23j25N42k88J96p41J601
4374I01n69j032Q45k48N51q0q00J9P26j264J263q38qM63J06j00l84N32l12R17
4394F88j143Q81p84L31J66M39j34M0j029p00J740q41J239o71L88l83l45J39K91
$$ y = [-425, -365, 346, 1272, 122, 477, -114, 132, -274, -343, -386, -114, 428, -390, 303, -1120, -975, -189, -150, 540, -86, 141, 134, 816, 521, -854, 201, -949, 241, -55, 512, -340, -821, -347, -109, 912, 535, 930, 220, 222, 659, -260, -255, 116, -700, 352, -154, 285, -219, 13, -934, -226, 233, -1297, 45, -667, 735, 135, -57, -207, -560, -380, -225, 545, -862, -328, -399, 428, -886, 962, 318, -389, 186, 463, -514, 302, 118, -351, 146, -242, 335, -233, 13, -598, 177, -1073, 164, 193, 154, 328, 160, 692, 489, -856, -720, -365, -472, -886, 172, 1124, -325, 658, -27, 90, 866, 491, -130, 819, -31, 286, -638, 239, -284, -409, 133, -155, 41, -700, 901, 332, -700, 145, -103, 448, 368, -432, -413, 313, -951, 312, -526, -534, -71, 35, -65, -449, 83, -229, 688, -455, 426, -358, -27, 139, 578, 444, 484, -545, -1245, 495, -346, 893, 222, 610, 227, -118, 21, 312]
4413C12m13O38m59k40l39M97j39M73p36m00O95J110j444j46R4N04j291J368J14
4432A98N62m86P33j001r6R25p89J38m0M67l05o88l5P58J80m24P9j1R02q0j680
4453f93M79J67%J47M4N5r1m05L18J218j354M80m32o84Q05P6L3l40N73p27J18n11
4475g24N00k82k7J309r35J210q56p40P47m03k84m9M73N05j227m05P62k42M71N5
4495a42K18o2K30q49Q92p80K034j396j315R70L96J68p76j62R60r20M19j51K02
4514f4j295P20J32J98j07J88J9k24P43j270R18k34J153p37M11p53n52J86M09P19
4534E60l27k66O90k35l75j046J804r40K71o19Q44j062J769j344P91J68j061K35
4552a43j12J418k120J670n04N88p42l63P02k71k4K70j156j4L66J884k078J31k86
$$ y = [312, -101, 537, 78, -162, -501, -4, -143, 330, -406, -806, -111, 999, -445, -591, -497, 7, -1284, 84, 198, 760, 274, 1007, 6, -90, 835, 46, 184, 144, 611, 306, -382, -417, 341, 521, 97, 176, 165, 1067, 987, -693, -214, -47, -47, 100, 144, 199, 108, -297, 21, 1239, -115, 365, -67, -751, 54, 130, 163, -177, 396, -331, -213, -724, -224, -506, -533, 776, -159, 1051, 195, -545, 202, -201, -485, -534, -61, 444, -783, -1188, -426, -668, -197, -142, 76, 14, 244, -605, 287, -493, 1541, 145, -1170, -200, 196, 364, -412, -574, 386, -534, -115, -266, -64, -1359, -639, -507, -309, -416, -228, -209, -433, 310, -960, -42, -276, 877, 140, 551, -202, -754, -568, -159, 560, 233, -33, 657, 422, 47, -999, 805, -135, 136, -483, 361, -701, 1068, -276, 515, 683, -378, -143, -255, 1163, -957, 713, 209, 797, 55, -308, 394, 123, 99, 369, -787, -801, -435, 1449, -629, -498, -784]
4571g84J184j25j081O96J38n10N09m11K02j54J57M67N38p35K02o96J00R10j657
4590a050J781j403L20L23j37N98j7m9j585J447q03P33J63J42n17j33R74j103P43
4609D27m84Q62p26J005q22M44P06j453Q93j249k48J451j096k6J27J311J18j568
4627c28Q46p86L05k17P17k40P11j210J02l55k62K31Q19j222R82P96p35r58L80
4646d24P96j036P13K61L81l04o55l21p27J910j033R97N3N5j145L54K6N66K66p72
4666c9O60m12j35J55m79m77J070N34L78j836J1J051k42q30J56k4K73K1n59K57
4686d67Q06k34j210K135r94k11M79r92J576j204j50J4Q19p6p98J035m51Mr0k72
4706b81M5J78j014P08N45p68J396L04m20n16J24J9m45P5k58K11l00O17J72N6j056
$$ y = [-784, 400, 275, -806, -110, 28, -482, 27, -384, -182, -336, -179, 288, 826, 91, 293, -403, -303, 607, -1050, 731, -672, -352, -29, -166, 432, 415, 366, -1219, 228, -575, 158, 321, 463, -54, -187, 787, -316, 427, -57, 805, 79, 1084, 262, 706, 1412, -41, 852, -397, -645, 806, -290, -316, -189, 1122, 1240, -328, 518, -268, 37, -180, 537, 297, 1008, -202, -100, -455, -717, -486, 333, -889, 93, 889, 154, -804, -424, 372, -664, 49, 310, 691, 387, -268, -589, -1316, 594, -439, 558, 611, 666, -479, -125, -99, 467, 733, -39, 621, 209, 74, 229, -250, -727, 343, 877, 1255, -581, -570, 481, 239, -591, -435, -459, -186, -165, -724, -467, 339, 105, -1105, 1030, 36, -175, 304, -688, 888, -316, -466, -452, 367, 291, -507, 528, 77, 81, -9, -281, -236, -58, -1072, -364, 181, -587, 809, 1113, 693, 177, 301, 320, -125, -50, -308, -97, -397, 220, 392, 448, -608]
4727f08Q40j37J56j666J554R8K39P7N31j311k31k78N66J09Q26q01o48L19J78K58
4747G1j72p98Q81K71n51l9j96L84j32M81K86l21j277J851q37R2Q53q18L32l36
4767B5noj185R12k81N0J155j049Q31q5o97Q48j323J037R48j041J49j125P89N51
4787D98k64L50j135m56N30J212o6r95R00n89j003Q13J63k04Q8O03rj139J108n40
4807a35M02R60j067j63R34k31k31k99j483P87J87J02p63J196J12O09j720N22p
4826b88k86N25q58R70r31J84l78J333o16J254q56J67p00N27p09M51k48ML74l57
4846d38J207r60j61n80J549l71n44J717n41j036O9J77M89n57j64K08N32j644J142
4865I4M61o76O49j69o92l94K85P95p53L66J026j253M40P6j104K002j230O22n58
$$ y = [-608, 232, 95, 251, -1415, 139, 237, 476, 553, 1084, -227, -458, -736, -170, -61, 765, -36, -684, -365, -187, 71, -101, -899, -18, 253, -298, -337, -533, -149, -281, 200, 486, 165, -1112, 739, -98, -6, 847, 29, 361, 25, 20, 14, -1171, -259, -540, -490, 665, -384, 447, 362, -335, 513, -810, 227, 1175, 134, 283, -842, -53, 498, 234, 584, -551, -1007, -477, 735, 669, -326, 574, -15, -1018, -205, -42, -246, -158, 445, 436, -703, 405, -135, 267, 1227, 160, -3, 931, 700, 469, 170, -1313, -526, -339, -237, -1000, 196, 308, 917, -803, -281, -288, -574, -49, -907, 63, -868, -684, -1062, 271, -345, 909, 53, 220, -480, 47, -662, -211, -459, -455, -81, -438, 769, -191, -352, -932, 617, 246, -298, 1419, 878, -158, -89, 88, 577, 20, -144, 64, 596, -1048, 94, 555, -121, 528, 359, -333, -727, -442, 353, -400, -34, 992, -261, 179, 255, -849, 1153, -77, 545, -13]
4884a3p4r5n12Q1J492P3j156J179j2j403P16L28j280K40O16K68o76M19m58Q48
4904E81j120J54P62N76m48r19O09j78k26J35O57m65O49n29p73k55J370m64K43
4923C59j50r64J361r41q40P56L04l83N59l19n3J466j465q3L29N14m40j36P83j729
4943a072J676q63qj59M37R72N21q14p65O78j184P4j3n70R91m73K44K04Q91J277
4963B044k071o01L86N91K48m50k94RM09n79k77J218m60K47l42l41l23J96J14l5
4983c11J85L52r2p89J341q44M71q2j077J392j045m44J47k05J28L00R68k62m30
5002b97j91j28J54K37L1K52l4M91n45j126R53n21P58P57m06r42K64J26n82R68
5022B19N40K07j282m77k99J437o95N57k85J190j882P55l90R80k04k28N2N32j335
$$ y = [-13, -87, -182, -694, -613, 879, 952, -204, 975, 963, -440, 276, 604, -676, -436, 180, 448, -228, 191, -267, 581, -539, -385, 377, 953, 505, -414, 195, 17, -209, -74, 583, 118, 767, 238, -535, -790, 580, 116, 359, 209, -755, 606, -335, -1175, -419, -115, -498, 61, -258, -311, 1155, -310, -393, -64, 450, 10, -126, 657, -1072, 604, -259, -267, -426, 11, 983, 1504, 690, -75, 603, -581, -507, -520, -1090, -99, -572, -328, -124, 767, 2044, -27, -628, -242, 349, 597, 147, -147, -138, 271, -308, -585, 633, 173, 420, 78, -263, -586, -390, -276, -311, -126, 226, 134, -655, 686, -158, 313, 231, -846, 546, -499, -943, -796, -1001, -873, -573, 395, 133, -297, -488, -616, -462, -225, -194, 58, 24, 515, -30, -1156, -203, -724, 34, 791, 385, -557, -293, -167, -749, 219, 759, 966, -316, -793, -1092, 345, -350, 207, -78, 1112, -770, -15, -405, 575, 371, 143, 195, 727, -608]
5041f08K96k27O32J250r65j009J359k49L91o91O43j513M03O50j110J033k94l2
5059d1r18Q79j42j56j076J534k32J31J40P6q89Q41m2p23M0L8K171j163r59M5L87
5080e9L86N96p25o49P48n26M30j87J143j705J27O19J5p80K68R48j344R41o8n06
5100c28J45M20k2N47j258Q29k5j48Q88j562L80Q4L68m81R07n73Q53j118O42q8
5120D60L1J38k018J907j457P74L75N77j304P16l61L86N85j149P20r08K99j04P9
5139b54%m18K26Q05o52r90J411O80j279N65m39j23P22j80P03o93m86M04J42K19
5159C63k345K932j007K92O0L27J27q5j045J132k14q06k04j94R53m6n76K50p0p75
5179i31R31j32q38J864j195j54P95M34m15J83j437J47J403p30K59m90P19j393
$$ y = [-608, -312, -539, 93, 1343, 378, -631, 728, 479, 870, 179, 822, -691, -288, 362, -748, 285, -9, -41, -959, -80, -222, -378, -1454, 80, -152, -21, 119, 195, -694, 147, 105, -618, -578, -540, 1631, 468, -491, -446, -59, 327, 923, 198, -451, 297, -229, 201, 14, 1157, -548, -421, 198, 213, -567, -299, 649, -695, 246, 178, -328, -183, 237, 215, 762, -496, 333, 308, 160, 1048, -514, -134, -50, 318, -163, 744, 171, 1024, -94, 548, 460, 491, 629, -1389, 518, -939, -165, 210, 787, -517, 199, -162, 224, 809, -340, 380, -528, -229, -333, -254, -254, -672, -446, 359, -293, -1283, 128, 808, -471, 94, -345, -468, 254, 74, 777, 84, -402, 2, 144, 363, -1982, 950, -57, 235, 295, 622, 749, 664, -381, 751, 537, -269, -473, -667, 286, 240, -336, -86, -156, -931, 0, -132, -970, 894, -301, -455, 340, 774, 359, 542, -895, -748, 655, -75, 184, -306, 413, -980]
5197i80M87k89O02K7k70k15Q40o6q02J055n3m40K57M28l41q76J245j459Q88m77
5217d39q63J644P96q12o2m42m47k46p2J293L54q95o5j48j89Q87K11o88K69l48
5237b62Q17j00K17J10p09m14l41J386j035M11j68M09K95o35P3J88j31qk67O20
5257D56j88j242J202r40J130l25j39K8J56J03K22K31j548J277j142J473k302J478
5275g0k50N35N46j804J048K01j137P62Q80m40p91l92R76J00n84K54q08J069n27
5294d32O90J57m11j157J281k30Q40j286j57P85L05K22j126j70R01m83Q32m82k84
5313b05J93N10o31N25O76j203p9o90M71J62M35nj113N90j3N6L43J408n79j430
5333e79L0J357m26n31K1L96j646O81n07Q80O87p88M31O96j164Q37L40j125m87
$$ y = [-980, -493, -782, -180, -153, -423, -638, 202, 136, -666, 389, 336, -104, 153, 581, 240, -636, 609, -850, 38, -439, -1302, 342, 1138, 326, 264, -178, -625, -871, -943, 350, 704, -191, -256, -404, -593, 294, 505, -183, 86, -262, 555, 455, 672, 782, 73, -341, -682, 704, -331, 80, -88, 321, 616, -19, 54, 242, 111, 103, -164, 456, 268, -974, 228, -712, 418, 93, -46, -18, 138, 241, 463, 694, -854, 423, -719, 754, -1548, -70, -320, 215, 761, -1043, 5, 206, -931, -169, 711, 271, -520, -912, 64, 164, -420, -166, -974, 95, -432, 258, 415, 4, -1153, 128, -102, 738, -548, -705, 80, 385, 607, -519, -689, 212, -271, 561, 79, -205, -12, 498, -133, 392, 1068, -135, -214, -904, -433, -271, 164, 159, -954, -364, -377, -321, 22, 1430, 851, -579, -549, 808, 382, -149, -128, 268, -1378, -697, -1204, -324, 363, -425, 6, 702, -462, 375, 715, -410, -897]
5352h97P02J05r92J422j09p65O67r18O53n52N21M48M48m49k97O15k86r42L8j36
5372g24J430N52j651j47Q13j652J109j13j55j72O31k41PQ24r22N31p30N17M3R60
5392I10n63O2m70M78p79J23O53j48M96l5m36L04r01N17q53M39L77K74n40k22R
5413c05r03R98l64N96o43K7k47J837j192KO70j184J163l25k42q33O01J734j560
5432a70J134m84j189L11J357j55j43p77j289J753n40K30O75q11J275j481j71J50
5450c25P2Q05k00l91Q31k58n32K67r32P9L55M85q63M91M59N97j523O71M06L22
5470H16n73M56j882Q18M51N46o99l0Q93q61j36j84P37J93n56lR37q24q46Q05O75
5491G33p64j258R43K51p4J2OJ99J71j109J415K4n09J70M23j077N95j87M94l63
$$ y = [-897, -195, -90, -1082, 340, 231, -534, 133, -785, -132, -684, -163, 285, 733, 284, -13, 602, 316, -626, -588, -724, 706, 1258, -393, -540, 273, -1379, -270, -383, -538, -710, -79, -320, -313, 511, -411, 120, -610, -93, -50, 910, 347, 409, -61, 417, -362, -239, 414, 266, 762, 727, 291, 595, -306, 211, -642, -203, 174, 448, -92, -314, -305, -1208, -210, -574, 22, -621, -594, -841, 996, -196, -194, 476, -708, 455, 130, -112, -945, -344, 1390, -170, 964, 480, -709, -398, 959, 804, 661, -116, -1405, 348, -192, 38, 713, -98, 1177, -304, -475, -325, -253, 552, 352, -39, 792, 534, 2, 269, -663, -584, -229, 256, -607, -116, 343, 940, -583, 88, 494, 816, 243, 699, -1183, -365, 86, 632, -67, -97, 796, -65, -201, -385, 352, 545, -11, -14, 923, 99, -747, 58, 733, -31, -1289, -346, -95, -169, -157, -151, 48, 219, -890, 525, 549, 40, 210, 633, -444, 151, -36, 458, 95]
$$ [...]
8191c3
##END NTUPLES=NMR FID
##END=
