##TITLE=1H_KYU-20
 CDCl3, 108 sc, 
 13.3.2019
##JCAMPDX= 6.0         $$ Bruker NMR JCAMP-DX V2.0
##DATA TYPE= NMR FID
##DATA CLASS= NTUPLES
##ORIGIN= UXNMR, Bruker Analytische Messtechnik GmbH
##OWNER= root
$$ XWIN-NMR		Version 3.5
$$ Wed Mar 13 16:28:42 2019 Russian Standard Time (UT+4h)  she@DPX200
##.OBSERVE FREQUENCY= 200.1315
##.OBSERVE NUCLEUS= ^1H
##.DELAY= (6, 6)
##.ACQUISITION MODE= SIMULTANEOUS
##.ACQUISITION SCHEME= undefined
##.AVERAGES= 108
##.DIGITISER RES= 16
##SPECTROMETER/DATA SYSTEM= spect
##.PULSE SEQUENCE= zg30
##.SOLVENT NAME= CDCl3
##.SHIFT REFERENCE= (INTERNAL, CDCl3, 0, 15.7039)
##AUDIT TRAIL= $$ (NUMBER, WHEN, WHO, WHERE, WHAT)
$$ ##TITLE= Audit trail, XWIN-NMR		Version 3.5
$$ ##JCAMPDX= 5.01
$$ ##ORIGIN= Bruker BioSpin GmbH
$$ ##OWNER= she
$$ F:/spectra/data/she/nmr/H-F/1/audita.txt
$$ ##AUDIT TRAIL=  $$ (NUMBER, WHEN, WHO, WHERE, WHAT)
(   1,<2019-03-13 16:28:01.17 +0400>,<she>,<DPX200>,
      <continue with go, POWCHK disabled, PULCHK disabled
       configuration hash MD5:
       00 E9 B6 7A A2 85 ED C7 34 08 36 98 17 FE 4E 26
       data hash MD5: 16K
       CF E7 7D 5B 50 76 C9 91 A3 8F 0E 5E CC 6F B1 14>)
$$ ##END=
$$ 
$$ hash MD5
$$ 68 F1 A9 A8 DA E5 3C AF A1 D6 DC 4F 2A 7F 5E 9E
##$RELAX= 
##$RELAX= 
##$RELAX= 
##$RELAX= 
##$RELAX= 
##$RELAX= 
$$ Bruker specific parameters
$$ --------------------------
##$DU= <F:/spectra>
##$EXPNO= 1
##$NAME= <H-F>
##$PROCNO= 1
##$TYPE= <nmr>
##$USER= <she>
##$AMP= (0..31)
100 100 100 100 100 100 100 100 100 100 100 100 100 100 100 100 100 100 
100 100 100 100 100 100 100 100 100 100 100 100 100 100 
##$AQSEQ= 0
##$AQ_mod= 1
##$AUNM= <au_zg>
##$AUTOPOS= <>
##$BF1= 200.13
##$BF2= 200.13
##$BF3= 200.13
##$BF4= 200.13
##$BF5= 200.13
##$BF6= 200.13
##$BF7= 200.13
##$BF8= 200.13
##$BYTORDA= 1
##$CFDGTYP= 0
##$CFRGTYP= 5
##$CHEMSTR= <none>
##$CNST= (0..31)
1 1 145 1 1 1 1 1 1 1 1 1 1 1 1 1 1 1 1 1 1 1 1 1 1 1 1 1 1 1 1 1 
##$CPDPRG= <>
##$CPDPRG1= <>
##$CPDPRG2= <>
##$CPDPRG3= <>
##$CPDPRG4= <mlev>
##$CPDPRG5= <mlev>
##$CPDPRG6= <mlev>
##$CPDPRG7= <mlev>
##$CPDPRG8= <mlev>
##$CPDPRGB= <>
##$CPDPRGT= <>
##$D= (0..31)
0 1.2 0 0 0 0 0 0 0 0 0 0.03 0 0 0 0 0 0 0 0 0 0 0 0 0 0 0 0 0 0 0 0 
##$DATE= 1552479917
##$DBL= (0..7)
120 120 120 120 120 120 120 120 
##$DBP= (0..7)
150 150 150 150 150 150 150 150 
##$DBP07= 0
##$DBPNAM0= <>
##$DBPNAM1= <>
##$DBPNAM2= <>
##$DBPNAM3= <>
##$DBPNAM4= <>
##$DBPNAM5= <>
##$DBPNAM6= <>
##$DBPNAM7= <>
##$DBPOAL= (0..7)
0.5 0.5 0.5 0.5 0.5 0.5 0.5 0.5 
##$DBPOFFS= (0..7)
0 0 0 0 0 0 0 0 
##$DE= 6
##$DECBNUC= <off>
##$DECIM= 2
##$DECNUC= <off>
##$DECSTAT= 4
##$DIGMOD= 1
##$DIGTYP= 9
##$DL= (0..7)
0 120 120 120 120 120 120 120 
##$DP= (0..7)
150 150 150 150 150 150 150 150 
##$DP07= 0
##$DPNAME0= <>
##$DPNAME1= <>
##$DPNAME2= <>
##$DPNAME3= <>
##$DPNAME4= <>
##$DPNAME5= <>
##$DPNAME6= <>
##$DPNAME7= <>
##$DPOAL= (0..7)
0.5 0.5 0.5 0.5 0.5 0.5 0.5 0.5 
##$DPOFFS= (0..7)
0 0 0 0 0 0 0 0 
##$DQDMODE= 0
##$DR= 16
##$DS= 0
##$DSLIST= <SSSSSSSSSSSSSSS>
##$DSPFIRM= 0
$$ [...]
##$SUBNAM2= <"">
##$SUBNAM3= <"">
##$SUBNAM4= <"">
##$SUBNAM5= <"">
##$SUBNAM6= <"">
##$SUBNAM7= <"">
##$SUBNAM8= <"">
##$SUBNAM9= <"">
##$SW= 330.908255636489
##$SWIBOX= (0..15)
0 0 2 0 0 0 0 0 0 0 0 0 0 0 0 0 
##$SW_h= 66225.1655629139
##$TD= 16384
##$TD0= 1
##$TE= 0
##$TE2= 300
##$TE3= 300
##$TEG= 300
##$TL= (0..7)
0 120 120 120 120 120 120 120 
##$TP= (0..7)
150 150 150 150 150 150 150 150 
##$TP07= 0
##$TPNAME0= <>
##$TPNAME1= <>
##$TPNAME2= <>
##$TPNAME3= <>
##$TPNAME4= <>
##$TPNAME5= <>
##$TPNAME6= <>
##$TPNAME7= <>
##$TPOAL= (0..7)
0.5 0.5 0.5 0.5 0.5 0.5 0.5 0.5 
##$TPOFFS= (0..7)
0 0 0 0 0 0 0 0 
##$TUNHIN= 0
##$TUNHOUT= 0
##$TUNXOUT= 0
##$USERA1= <user>
##$USERA2= <user>
##$USERA3= <user>
##$USERA4= <user>
##$USERA5= <user>
##$V9= 5
##$VALIST= <valist>
##$VCLIST= <CCCCCCCCCCCCCCC>
##$VD= 0
##$VDLIST= <DDDDDDDDDDDDDDD>
##$VPLIST= <PPPPPPPPPPPPPPP>
##$VTLIST= <TTTTTTTTTTTTTTT>
##$WBST= 1024
##$WBSW= 4
##$XGAIN= (0..3)
0 0 0 0 
##$XL= 0
##$YL= 0
##$YMAX_a= 560181
##$YMIN_a= -256710
##$ZGOPTNS= <>
##$ZL1= 120
##$ZL2= 120
##$ZL3= 120
##$ZL4= 120
##$ABSF1= 10
##$ABSF2= 0
##$ABSG= 5
##$ABSL= 3
##$ALPHA= 0
##$AQORDER= 0
##$ASSFAC= 0
##$ASSFACI= 0
##$ASSFACX= 0
##$ASSWID= 0
##$AUNMP= <proc_1d>
##$AZFE= 0.1
##$AZFW= 0.1
##$BCFW= 1
##$BC_mod= 2
##$BYTORDP= 1
##$COROFFS= 0
##$CY= 11.3945322036743
##$DATMOD= 1
##$DC= 2
##$DFILT= <>
##$DTYPP= 0
##$F1P= 18.9103706918063
##$F2P= -1.10871071338519
##$FCOR= 0.5
##$FTSIZE= 0
##$FT_mod= 4
##$GAMMA= 1
##$GB= 0.15
##$INTBC= 1
##$INTSCL= 1
##$ISEN= 128
##$LB= 0.24
##$LEV0= 0
##$LPBIN= 0
##$MAXI= 10000
##$MC2= 0
##$MEAN= 0
##$ME_mod= 0
##$MI= 1.114404
##$NCOEF= 0
##$NC_proc= 0
##$NLEV= 6
##$NOISF1= 3.799351
##$NOISF2= 2.8
##$NSP= 1
##$NTH_PI= 0
##$NZP= 0
##$OFFSET= 15.70392
##$PC= 1
##$PHC0= -9172.744
##$PHC1= 19.60026
##$PH_mod= 1
##$PKNL= yes
##$PPARMOD= 0
##$PSCAL= 0
##$PSIGN= 0
##$REVERSE= no
##$SF= 200.130013532006
##$SI= 16384
##$SIGF1= 3
##$SIGF2= 2
##$SINO= 400
##$SIOLD= 16384
##$SREGLST= <1H.CDCl3>
##$SSB= 0
##$STSI= 0
##$STSR= 0
##$SW_p= 3612.71676300578
##$SYMM= 0
##$S_DEV= 0
##$TDeff= 0
##$TDoff= 0
##$TI= <>
##$TILT= no
##$TM1= 0
##$TM2= 0
##$TOPLEV= 0
##$USERP1= <user>
##$USERP2= <user>
##$USERP3= <user>
##$USERP4= <user>
##$USERP5= <user>
##$WDW= 1
##$XDIM= 8192
##$YMAX_p= 0
##$YMIN_p= 0
$$ End of Bruker specific parameters
$$ ---------------------------------
##NTUPLES= NMR FID
##VAR_NAME=  TIME,          FID/REAL,        FID/IMAG
##SYMBOL=    X,             R,               I
##VAR_TYPE=  INDEPENDENT,   DEPENDENT,       DEPENDENT
##VAR_FORM=  AFFN,          ASDF,            ASDF
##VAR_DIM=   8192,          8192,            8192
##UNITS=     SECONDS,       ARBITRARY UNITS, ARBITRARY UNITS
##FACTOR=    1.51e-05,      1,               1
##FIRST=     0,             0,               0
##LAST=      0.1236841,     0,               0
##MIN=       0,             -256710,         0
##MAX=       0.1236841,     560181,          0
$$ Real data points
##PAGE= N=1
##DATA TABLE= (X++(R..R)), XYDATA
0a1J1k0K5n2Q4j01J34j69K05k48L05l57M23m89N67o55P56q68R94j130J282j449
22g63J645j852K078k337K620k937L287l682M125m623N199n869O641p557Q669j0055
38e411J1819j4180J7504k2617L1601n1935J49192M44208k55771p201o9591j4953
50B12665m9035j8195l9395j8210l3203j9610k8927j5850k3611j5182j8578j1130
62g8261j5305p256j1705m118n176j382j820K080K687N305N279Q038Q933J1065
76h1636R657J3027J1662J3604J3236J3484J2617J3420J3087J2373J1865R842J1470
89G7708Q217Q159O453N138M416K265K304M04q34k698k640m748o286m881o986q258
105G7733q265j0416p935r039r458r815q825q625r226p697p696p038n844n206m486
$$ plain form
0 -11 0 -20 5 -47 37 -64 70 -99 106 -142 163 -194 229 -260 307 -348 408 -460 534 -596 686 -763
22 -763 882 -970 1108 -1229 1391 -1546 1741 -1941 2184 -2439 2760 -3109 3532 -4025 4644 -5411
38 -5411 6408 -7772 9732 -12885 18716 -33219 115973 560181 304410 297209 227618 212665
50 212665 163630 145435 106040 87830 54627 35017 6090 -9760 -33371 -48553 -67131 -78261
62 -78261 -93566 -100822 -112527 -116645 -121821 -123203 -125023 -122943 -120256 -114951 -109672 -101634 -92701 -81636
76 -81636 -71979 -58952 -47290 -33686 -20450 -6966 5651 19071 32158 44531 56396 66238 77708
89 77708 85925 94084 100537 105675 110091 112356 114660 115064 114230 111532 108892 104144 97858 92977 85991 77733
105 77733 69468 59052 51117 42078 32620 22805 13980 5355 -3871 -11568 -19264 -26302 -32146 -37352 -41838
120d1838k590l456j226j007P72J444J464K070M645M171M530N676N796N980O101
135g468P849O442O952N969O743Q070L294O415N744L658M290K475J991K552J259
150F6235j99M94k167n08l605l361m410l822l986m703n709n598n949m525n914o270
166F003m117n996m978m952m457l381l381k262k387k688J15J02k63N70J504K207
182b8361J259L685K830L289L257M699M497L885M538M284N628L335N027L648K296
197B7796M955K590R62K761J768J101O66P08n55j088j779r37j619l654k669l765
213B7241k725l879l042l669m003k996l649m156l087l266l031k181k262k379j216
228a8300j890r63p97N76m5l86J700J302K617K635K394K586K835K291L273K981
$$ plain form
120 -41838 -44428 -47884 -49110 -50117 -49345 -47901 -46437 -44367 -39722 -35551 -31021 -25345 -19549 -13569 -7468
135 -7468 381 6823 13775 19744 26487 34557 37851 44266 50010 53668 57958 60433 62424 64976 66235
150 66235 66036 66530 64363 63855 60250 56889 52479 48657 44671 39968 34259 28661 22712 18187 12273 6003
166 6003 1886 -4110 -9088 -14040 -18497 -21878 -25259 -27521 -29908 -32596 -32481 -32379 -32642 -32072 -30568 -28361
182 -28361 -27102 -23417 -20587 -17298 -14041 -9342 -4845 -960 3578 7862 13490 16825 21852 25500 27796
197 27796 32751 35341 36303 39064 40832 41933 42599 43307 42752 41664 39885 38948 37329 33675 31006 27241
213 27241 24516 20637 17595 13926 9923 6927 3278 -878 -3965 -7231 -10262 -12443 -14705 -17084 -18300
228 -18300 -20190 -21153 -21950 -21374 -21419 -21805 -20105 -18803 -16186 -13551 -11157 -8571 -5736 -3445 -172 2809
244B809L721J395L781K906J946L368J205K662R69J458J603P73J32n3q35l53j877
261B5610j048j477k925j517k363j851k975l161k090l762k548l046l113k565j644
276a0475l297j474k358l72j487j094j001l89J0l20J773O52J606J013J670J821
292a3722L081K133K752K647J191L544K805L096K099K671J531J490L076K251J328
307B1973Q56J183N93K95L03l27j148j238n92q50k116k315k339j910k150k514j779
324E925k597k736k954k972j819j965k887q0k323k324k55o14p10j097K20j60M43
341a8905J084j32J823J58K412J182J057K501L133J841J744J856K603K698R9L018
357H172K611J416J448J91J770J809j372L96N45M07o52l26j180j196p92j254j964
$$ plain form
244 2809 6530 7925 11706 14612 16558 19926 21131 23793 24762 26220 27823 28596 28728 28675 27840 27487 25610
261 25610 24562 23085 20160 18643 16280 14429 11454 8293 6203 2441 -107 -3153 -6266 -8831 -10475
276 -10475 -13772 -15246 -17604 -17976 -19463 -20557 -21558 -21947 -21937 -22257 -20484 -19832 -18226 -17213 -15543 -13722
292 -13722 -10641 -8508 -5756 -3109 -1918 1626 4431 7527 9626 12297 13828 15318 18394 20645 21973
307 21973 22829 24012 24605 24900 25203 24876 23728 22490 21898 21048 18932 16617 14278 12368 10218 7704 5925
324 5925 3328 592 -2362 -5334 -7153 -9118 -12005 -12085 -14408 -16732 -16987 -17601 -18311 -19408 -19188 -19348 -18905
341 -18905 -17821 -17953 -16130 -15972 -13560 -12378 -11321 -8820 -5687 -3846 -2102 -246 2357 5055 5154 8172
357 8172 10783 12199 13647 13838 15608 17417 16045 16441 16986 17393 16741 16415 15235 14039 13247 11993 10029
374A0029j353k115l11l269j537k469k357k302j459o92k973p11j773j300n10j615
390a6717Q2K70l41j43J19m14J792O58J232R49J332J969J800J825Q92J919K691
407h5J027J601K582J379K314J222J084M09J758J560j97K94K2K48p28j5o03j366
425A2506r63j201p34k30k152l050j013k637j086j621j314k042j547j866j159q98
441a1007k334j316j12o63n09oQ7q5O10MQ28M26Q88J306O67Q40J928J501J338J410
461d199J628L000M21R59K336R49J267J427L43J491M23P04N18O58n83p51J406j507
479A0490m00j676J4j391j314j455j140j097o21j445k186l30l157r51o08o30j034
496h931j688p08l52n87n42j33J011o37K91j255L138K31J61J918K7J002K107J160
$$ plain form
374 10029 8676 6561 6250 2981 1444 -1025 -3382 -5684 -7143 -7835 -10808 -11519 -13292 -14592 -15102 -16717
390 -16717 -16635 -16365 -16706 -16849 -16730 -17144 -15352 -14694 -13462 -12513 -11181 -9212 -7412 -5587 -4695 -2776 -85
407 -85 942 2543 5125 6504 8818 10040 11124 11533 13291 14851 14654 14948 14970 15218 14490 14475 13872 12506
425 12506 11543 10342 9608 9378 7226 4176 3163 526 -560 -2181 -3495 -5537 -7084 -8950 -10109 -11007
441 -11007 -13341 -14657 -14769 -15432 -15941 -15947 -15860 -15945 -15335 -15331 -14503 -14077 -13189 -11883 -11216 -10376 -8448 -6947 -5609 -4199
461 -4199 -2571 429 850 1809 4145 5094 6361 7788 8131 9622 10045 10749 11267 11925 11342 10591 11997 10490
479 10490 10090 8414 8428 7037 5723 4268 3128 2031 1410 -35 -2221 -2551 -5708 -6659 -7267 -7897 -8931
496 -8931 -10619 -11327 -11679 -12266 -12808 -12941 -11930 -12567 -12276 -13531 -10393 -10162 -10001 -8083 -8056 -7054 -4947 -3787
514c787Q46K295m46K468J715K06J701l15N03J572O11Q97J7R41N63k27M6j217p3
533H316j519r30p65Q2j076r67j487k480j433o79j116j058m37k306q13k20j349
550a0237r56n80q32l67P42O78j490J056p29J405O98K87R84R1K607R20L11J908
568c504K283J82J264M56J502P03L211m98P66J265p0J325q6M17R3j31m29j13k90
587H346j809O43r66n77j179j437j503r13j335j382j081j377j592L32j878j482
603i190Q78p41k276o05P87j179Q15r30O00L85R85j27J234r8J310P85K002J245
621d120M63K614J591p22J324J575J247L1M94J419J311J70P94p02k07M29k02l92
639G117j104j2j87k21p73p79j791j261o07r40j568r41q03m02j896o79j678j37
$$ plain form
514 -3787 -2941 -646 -1092 1376 3091 3297 4998 4683 5186 6758 7369 8266 8283 9224 9787 9560 9606 8389 8316
533 8316 6797 5867 5102 5184 4108 3141 1654 -826 -2259 -2938 -4054 -5112 -5549 -7855 -8668 -8888 -10237
550 -10237 -11193 -11773 -12605 -12972 -12230 -11552 -13042 -11986 -12715 -11310 -10612 -10325 -9341 -9250 -6643 -5723 -5412 -3504
568 -3504 -1221 -1039 225 681 2183 2886 6097 5599 6365 7630 7560 8885 8799 9216 9309 9178 8749 8636 8346
587 8346 6537 7180 6214 5637 4458 3021 1518 605 -730 -2112 -3193 -4570 -6162 -5830 -7708 -9190
603 -9190 -8312 -9053 -11329 -11934 -11147 -12326 -11511 -12441 -11841 -11456 -10471 -10598 -9364 -9462 -8152 -7367 -5365 -4120
621 -4120 -3657 -1043 548 -174 1150 2725 3972 4003 4497 5916 7227 7397 8191 7489 7282 7711 7509 7117
639 7117 6013 6001 5814 5593 4820 4041 2250 989 382 -558 -2126 -3067 -3870 -4272 -6168 -6847 -8525 -8662
657h662j576L46j020K8j59m14J136n07p7J006L25R65M43L19K296M48K45J634O67
676b557J961J60J415J408J348N43J280J266k8j89R95M44R52q59J047r69j065N57
694G709m87j182j89j213p56R3k643j138o84j841M29j858n06o62l142L77q67j061
712i621M13o8j914M1P58Q18l95n25R22K28m29R05K024O38M54J010R51Q45K053
731h92O97LK324J439K3M61M28k91J054J601M84o1N3M68j31r33n15k32q5p45j714
752C436j00q63k384n07l33q84j075j026j009k97j152q97l46l11q96q63j45J23
770i529N51m35J062N67k90J281j4R8J658M28R5J275J262J058J452N74M61P59Q95
789C208P73L68P15N11M02P22M02l2j503R52m21k5j029p77J66j451r20J04r87j295
$$ plain form
657 -8662 -10238 -9892 -10912 -10884 -11043 -11457 -10321 -10828 -10905 -9899 -9574 -8609 -8166 -7847 -5551 -5103 -4858 -3224 -2557
676 -2557 -596 -436 979 2387 3735 4278 5558 6824 6796 6607 7602 8046 8998 8139 9186 8217 7152 7709
694 7709 7222 6040 5851 4638 3882 3975 1332 194 -490 -2331 -1902 -3760 -4266 -4928 -8070 -7693 -8560 -9621
712 -9621 -9208 -9276 -11190 -11149 -10391 -9573 -9968 -10493 -9571 -9343 -9772 -8867 -6843 -6205 -5751 -4741 -3790 -2945 -892
731 -892 -195 -192 2132 3571 3594 4055 4483 4192 5246 6847 7331 7270 7323 7791 7660 6727 6212 5980 5895 5150 3436
752 3436 3336 2473 89 -418 -751 -1635 -2710 -3736 -4745 -5042 -6194 -7091 -7437 -7748 -8644 -9507 -9652 -9529
770 -9529 -8978 -9413 -8351 -7784 -8074 -6793 -6807 -6709 -5051 -4623 -4528 -3253 -1991 -933 519 1093 1554 2313 3208
789 3208 3981 4349 5064 5575 5977 6699 7101 7069 5566 6518 6097 6072 5043 4266 4432 2981 2061 2165 1178 -117
809a17j59j589j113k75o81j165O7j079n88p91l41M5q30K30P18L11q92J136j71
828g284J144K20K4O33K038q96J655J574k54J610k45J879R01O90l26J685N01l61
846E188K94L15J05O28q22R2n34k47l06q51j4j055k494J435p58j8n22j051j166
865a781j179j076p67o85P10j107N40r64n80P82j931J762N20q02k17O26Q43P57
883d549l45R31Q71J433l61P86J842M20L52O77N36M28R47j17O2j45L95J08J74Q99
903E344j056k26M83k95N0j095j134L5R6j003n79j869P99p70j104j512L42q71M72
922c893j838l56N9O49j751Q15n72J254m81N03k95Q29K50O37O93J55K034j134J623
941h19p04J395J737m12N49l24J314K48J249l80J320m78k89M64l64r83O01m99m26
$$ plain form
809 -117 -276 -1865 -2978 -3253 -3934 -5099 -5032 -6111 -6699 -7490 -7831 -7786 -8616 -8386 -7668 -7357 -8249 -7113 -7284
828 -7284 -6140 -5920 -5896 -5263 -3225 -4121 -2466 -892 -1146 464 219 2098 2999 3689 3363 5048 5549 5188
846 5188 5482 5797 5902 6530 5708 5800 5266 5019 4713 3862 3848 2793 299 1734 976 958 436 -615 -1781
865 -1781 -2960 -4036 -4803 -5488 -4778 -5885 -5345 -6309 -6889 -6107 -8038 -6276 -5756 -6558 -6775 -6149 -5306 -4549
883 -4549 -4894 -3963 -3092 -1659 -2020 -1234 608 1028 1380 2057 2593 3021 3968 3851 3913 3768 4163 4271 4445 5344
903 5344 4288 4062 4545 4250 4300 3205 2071 2106 2202 1199 620 -1249 -450 -1220 -2324 -3836 -3494 -4365 -3893
922 -3893 -5731 -6087 -6028 -5379 -7130 -6315 -6887 -5633 -6114 -5611 -5906 -5077 -4827 -4190 -3497 -3342 -1308 -2442 -819
941 -819 -1523 -128 1609 1197 1746 1422 2736 2984 4233 3853 5173 4695 4406 4870 4506 3523 4124 3625 3199
960C199L14p10o68o38P66j195j44o33m83j890L89r57L40n12p45l04r12k01j09
979e093K91L10o84P62n36n40J147Q51j57m92Q79O6Q29O14J013M05LO14n43J540
999A279J044M71r8L70j10P80L49J83P6j476J264q78n7L51p81m14o71L10j198K49
1019A043m74q56n05P0j148l5l59l24k12L67j843J236p94r27j26J082l77p4M62
1038c794K85J28J449L42n64Q31o46R08R66M9o84K264m74Q53K90k70L11J170Q5
1057C499J68p49K57m98O92M30n85q29m75J623j659p98m90N52l03j205K50r68M76
1076f12j408M06k35K87n82n83J77n95j17o93K25k16N25N46k09K8K03J117J22o91
1096b305J249O91j181J156n08n6J688N18K76j049J536P32o94M83J318p29P90k41
$$ plain form
960 3199 3513 2803 2135 1497 2263 1068 924 291 -192 -2082 -1693 -2650 -2310 -2822 -3567 -3871 -4783 -4984 -5093
979 -5093 -4802 -4492 -5176 -4414 -4950 -5490 -4343 -3492 -3649 -4141 -3262 -3196 -2367 -1753 -740 -335 -332 282 -261 1279
999 1279 2323 2794 2696 3066 2956 3736 4085 4268 4344 2868 4132 3254 3197 3548 2767 2353 1682 1992 794 1043
1019 1043 569 -287 -792 -722 -1870 -1905 -2264 -2588 -2800 -2433 -4276 -3040 -3834 -4761 -4887 -3805 -4182 -4256 -3794
1038 -3794 -3509 -3381 -1932 -1590 -2154 -1323 -1969 -1061 -95 -46 -730 1534 1060 1913 2203 1933 2244 3414 3499
1057 3499 3667 2918 3175 2677 3369 3799 3214 2385 1910 3533 1874 1076 586 1138 835 -370 -120 -1088 -612
1076 -612 -2020 -1614 -1849 -1562 -2144 -2727 -2550 -3145 -3262 -3955 -3730 -3946 -3421 -2875 -3084 -3056 -2853 -1736 -1614 -2305
1096 -2305 -1056 -365 -1546 -390 -898 -954 734 1252 1528 479 2015 2747 2053 2536 3854 3125 3915 3674
1114C674p27N86j410Q30N16j252n11P82j005k40l71k34k47j015O60L88o56k89
1132e21l83l93n99O9o98N54m83Q9q66n07J910q3n31R6J799k041J879J194r94P9
1152d30O00k04R67m82M31L91O61j26J026o51l37R43j22m9k90M95L88j020L79L94
1172B964j366M48l22n23L03r46n47Q97p15K39J79j579L75l15p8j22m01K90l25
1191a544k21o88N12N27j96r18J439l96q25J231k6L77o78M82Q93k0Q83m60j30k97
1211e5J195L61O32p91P09M97n19o06Q49pj76P82j586Q15L37n06k15m56Q31j762
1231C29J574q75m44j14j645L58o53o3o89M94J186p69K34o9n35P65p87r8l27N24
1251a604k9l64K65J651j057k05Q52q58K429m69p55J175J98Q70j065P56l1P16m09
$$ plain form
1114 3674 2947 3533 2123 2953 3469 2217 1706 2488 1483 1243 872 638 391 -624 36 424 -232 -521
1132 -521 -904 -1297 -1896 -1827 -2525 -1971 -2454 -2365 -3231 -3738 -1828 -1911 -2442 -2346 -547 -2588 -709 485 -509 -430
1152 -430 170 -34 933 451 882 1273 1934 1808 2834 2183 1846 2789 2667 2618 2328 2823 3211 2191 2570 2964
1172 2964 1598 2046 1724 1201 1504 558 11 908 193 432 611 -968 -593 -908 -986 -1108 -1509 -1219 -1544
1191 -1544 -1765 -2453 -1941 -1414 -1610 -2528 -1089 -1485 -2310 -1079 -1105 -728 -1406 -924 -31 -51 832 372 242 -55
1211 -55 1140 1501 2133 1342 2051 2548 2029 1423 2272 2265 2089 2871 1285 2100 2437 1931 1716 1260 2091 329
1231 329 1903 1028 584 470 -1175 -817 -1470 -1533 -2222 -1728 -542 -1311 -1077 -1146 -1681 -916 -1703 -1801 -2128 -1604
1251 -1604 -1633 -1997 -1732 -81 -1138 -1343 -491 -1349 1080 611 -144 1031 1229 2099 1034 1790 1759 2475 2066
1270B066p24J459k74r3L02p85R01o14M54p25n94OO58j620M06Q8m27N5P33m37n64
1291B71m88q45N42k99k64m51Q81j245J318r09j29N02K2l01N15m00J05m00J38K108
1311F71j036Q50m77J151p75J152j274J531j81O08r08O07J7L09K8l88J345q97J113
1330C446o40o9p17P83o0j339P77J72r38j069N92Pn05Pn80l4n09j048O87N42r31
1351a426J468k363l99Q67K34k03Q32q45o18L44P00o2J171K18m60L57j98O38N81
1370H36m05Q34k25n66Q50NR87K45r59M38M98L8m43P29j51j179Q85p45r9P69j90
1391B152r94r3k5K39m19l98p0O4p72Q24r49o3j146O42L44r02N20M88p02J25m81
1412a616L86j83J002j041J373m01l79J15J302J14p09O18m0L84lM94N16j076J217
$$ plain form
1270 2066 1342 2801 2527 2434 2736 1951 2852 2238 2692 1967 1373 1379 2037 417 823 911 484 539 1272 835 271
1291 271 -217 -1062 -520 -819 -1083 -1534 -653 -1898 -580 -1489 -1618 -1116 -1094 -1395 -880 -1280 -1175 -1575 -1437 671
1311 671 -365 485 8 1159 384 1536 262 1793 1612 2220 1312 1919 1936 2245 2273 1885 3230 2333 3446
1330 3446 2806 2737 2020 2803 2743 1404 2181 2353 1415 346 938 945 440 447 -133 -167 -676 -1724 -1037 -495 -1426
1351 -1426 42 -2321 -2720 -1853 -1619 -1822 -990 -1835 -2453 -2109 -1409 -1471 -300 -82 -542 -185 -383 255 836
1370 836 431 1265 1040 474 1324 1329 2316 2561 1602 2040 2538 2576 2133 2862 2711 1532 2417 1672 1573 2342 2152
1391 2152 1158 1065 1040 1279 860 462 392 456 -316 508 -441 -504 -1650 -1008 -664 -1566 -1046 -558 -1260 -1135 -1616
1412 -1616 -1230 -1413 -411 -1452 -79 -480 -859 -744 558 672 -37 581 541 925 922 1416 1932 856 2073
1431B073m50o8J17L71k4o97Q81k32q05J464j191m64K51n81P03J67R8j383M31L21
1451I82n07l46N6K70n76r01o11J027M7j45j102n58Q15O90n66n4N92N48m70k43
1471a052K79R49k37L1M15l22J188l64m60O92n25J137n78M88L27K78M23l93K1k44
1491B053J94n53j62m90L48l2M28r65Q34r74m69n71N00J284j071q06k46j34P25
1510a07j158L09J6n67O88J179r12n40O55r39J510j245m99J745p98Q53o93J250
1528G47j243R31N4N09n96J243P08m41j469J981j415J619j153Q60q17K96J301j103
1546B012o45p72J365n14l93j29R45m2j878O54j142N03j166j11R66q45N83l95m25
1565a429M49o48R53P14j464o94P50j0q11J160N3l62L30J709j725J365k70o71P75
$$ plain form
1431 2073 1623 1555 1672 2043 2019 1322 2203 1971 1166 2630 1439 975 1226 645 1348 1515 1613 230 661 982
1451 982 475 129 185 455 -121 -1022 -1633 -606 -559 -704 -1806 -2364 -1549 -859 -1425 -1479 -887 -339 -809 -1052
1471 -1052 -773 176 -61 -30 385 63 1251 887 427 1119 594 1731 1153 1641 1968 2246 2669 2276 2297 2053
1491 2053 2247 1694 1532 1042 1390 1358 1786 821 1655 681 212 -359 141 1425 354 -452 -698 -832 -107
1510 -107 -1265 -956 -940 -1507 -819 360 -552 -1092 -437 -1376 134 -1111 -1610 135 -663 190 -503 747
1528 747 -496 435 489 998 402 1645 2353 1912 443 2424 1009 2628 1475 2335 1518 1814 3115 2012
1546 2012 1367 595 1960 1446 1053 924 1869 1827 -51 603 -539 -36 -1202 -1313 -347 -1192 -609 -1004 -1429
1565 -1429 -980 -1628 -675 39 -1425 -2119 -1369 -1379 -2190 -1030 -977 -1339 -1009 700 -1025 340 70 -601 174
1584A74R12N3m74L68O08j189J858M41N8j122P26M04j546Q8m66J64M73m0n67l7
1604H86L69m96r90L81kk87K2m34L76j012N87k41o64l23L82P32m10on37J288j24
1625e03o22K84lm36K4j36J000M69j22Q66o23R50m24J693r39n65J339o73k00q29
1645E50Q12o1J9Q92q74k17M69j69P89j167q35P37j12J12j083P99N14j681kO98
1665A90m51j46r35j81J523k117J323r24M96P60j106J087n83k39Q78L19k94j006
1683a406Q20l54Q71l75M04M30N45j04q1q4M99L22L2n88L44m65Q08K4k10j84K01
1704A449N03m37l03N12l92M66k40j584J123p41M66p67j06m57J056j789J86K6l45
1723a374M99L31o37K19j00j2r24J520J59j63j083J117K13J44o74Q36j054K992
$$ plain form
1584 174 1086 1139 665 1033 1641 452 2310 2751 2809 1687 2413 2817 1271 1359 893 1057 1530 1490 923 886
1604 886 1255 759 -231 150 148 -139 -117 -551 -175 -1187 -600 -841 -1505 -1828 -1446 -714 -1124 -1130 -1667 -379 -503
1625 -503 -1125 -841 -844 -1280 -1256 -1392 -392 77 -45 821 198 1148 724 2417 1478 913 2252 1579 1379 550
1645 550 1362 1301 1320 2212 1338 1121 1590 1421 2210 1043 208 945 833 945 -138 661 1175 -506 -508 190
1665 190 -261 -407 -1342 -1523 0 -2117 -794 -1718 -1222 -462 -1568 -481 -1064 -1303 -425 -106 -400 -1406
1683 -1406 -586 -940 -69 -444 -40 390 935 831 750 666 1165 1487 1519 931 1275 810 1618 1642 1432 1248 1449
1704 1449 1952 1515 1212 1724 1332 1798 1558 -26 1097 356 822 55 -51 -508 548 -1241 -1055 -1029 -1374
1723 -1374 -875 -544 -1181 -962 -1062 -1074 -1998 -478 -319 -482 -1565 -448 -235 -91 -765 71 -983 2009
1741B009q14j133J506j440J250L97r36l11K04P55L49J3l16j62n47J072q60L49
1759A385j49K62q54k33P68J91j746J486j339J073r3j733j05P51m14J58j94k66
1777a052j68j49L57r99N60K39L40M60l37L86n39k87J026o50O32l10K41O06J36
1796D92J25M9J69J155q52m40J066j157J290K53p55J107j076q1J46N53r91mr45
1815A04J92Q67q13N50J13r48L72o49p16K47J0k01j38M24j119j17N51O68p78J063
1835c18n52j090R2m47J821k06M38m40l81M42O3J83K75J3K19J896j915O95O83l53
1855A118N91M69j421Q59m8K3L78j322O88j96l66L3Q3k2l38k4P04p41j525J248
1875A91p67R15k66n31J87M02o69j94K01k06J12M21j12p26K11Q03l76K54j762J470
$$ plain form
1741 2009 1195 62 1568 128 1378 1775 839 528 732 1487 1836 1849 1533 1371 824 1896 1036 1385
1759 1385 1236 1498 644 411 1179 1370 -376 1110 -229 844 751 -982 -1087 -336 -750 -592 -786 -1052
1777 -1052 -1220 -1369 -1012 -2011 -1451 -1212 -872 -412 -749 -363 -902 -1189 -163 -813 -181 -491 -250 356 492
1796 492 617 666 835 1990 1138 698 1764 607 1897 2150 1395 2502 1426 1345 1491 2044 1053 1049 104
1815 104 296 1163 350 900 1013 65 437 -212 -928 -681 -671 -872 -1010 -586 -1705 -1822 -1271 -603 -1381 -318
1835 -318 -870 -1960 -1868 -2315 -494 -700 -262 -702 -1083 -641 -578 -395 -120 -107 112 2008 93 788 1471 1118
1855 1118 1709 2178 757 1616 1568 1591 1969 647 1335 1139 773 806 889 867 529 505 1209 468 -1057 191
1875 191 -576 339 73 -458 -271 131 -538 -732 -531 -737 -625 -204 -316 -1042 -831 -28 -404 -150 -1912 -442
1895d42k64K99R37j641J282J7l22L57K49o02J512j655Q82l15M36L22m8N39j132
1914D11N90j134J713j66J13j423P85p36J48M11o13L60p0p0K0L89j073m65j79J169
1934A80j564R8R17m19M3N30r76k64J235o49l60P68M5j13j3O92j65p97K95J077
1954E60m27q11N20Q97k49k1k74Q97r38M99O2M47q99R94p5p50P32p5K16j24n03
1975F78j9R23j564P15k96j75m1o87J00K79j58L0L63k7o69K25J47j111l58L79l72
1996a638R07l54M71r14J113k03L79j013J468M92q81m65LQ90m09L1l7N37M70n18
2016C29l37L40J149j80j502N64N11k26R28j250J57L48o56j28k63l1m96Q44O59
2035G60o85R62r40j034N38j08l33l07L84R60j057P40q32J178q87n42O73k34j75
$$ plain form
1895 -442 -706 -407 530 -1111 171 188 -134 223 472 -130 1382 -273 609 294 730 1052 1004 1543 411
1914 411 1001 -133 1580 1414 1527 104 889 153 301 712 99 459 389 319 339 728 -345 -810 -989 180
1934 180 -1384 -1286 -369 -788 -745 -215 -1191 -1455 -220 -869 -1229 -461 -416 -529 -542 150 -15 -812 -517 560
1954 560 133 -678 -158 739 490 469 195 1092 154 653 715 1162 263 1257 1182 432 1164 1089 1305 1181 678
1975 678 659 1582 18 733 437 262 221 -466 -366 -87 -245 -215 148 121 -548 -323 -176 -1287 -1645 -1266 -1638
1996 -1638 -731 -1085 -614 -1528 -415 -618 -239 -1252 216 708 -173 -638 -635 255 -154 -123 -160 377 847 329
2016 329 -8 332 1481 1301 -201 363 874 648 1576 326 483 831 175 47 -216 -247 -743 101 760
2035 760 75 1037 97 -937 -399 -507 -840 -1147 -763 197 -860 -120 -952 226 -661 -1203 -530 -764 -939
2054i39L06O33j86N35l60j209M00N06n0L40M14p02R92J36r36J06J861j277N38
2073A108l75j12J85l1k01J082j278k76m8M78R25j027O60j456R00p87J140j517
2091f30Q40o22M61K89n30q48J141m77j51r82J490r75M75K19j9K54r63Q36J035
2110H43q90K64m05O27m45J40l61n59L22P95N26p07n3J251j123O3J42K91o28N60
2130F53l41k41J473j498j82L57K64L61j268J30P66n69O78p83P32j292Q55j75O57
2149E77j76j217J565q70q70J654r75p42M2N0O10l27n1lm73Q62N22K5O6j34j86
2170e1k6O84Q7m15m51M22J01j61J72Q1N40K48p6l7R35j902J152q68k20J69L92
2191G76r77J0O51o85l5q44J914k70k97k38o47M86j43q71J204q58K35Q6o93P00
$$ plain form
2054 -939 -633 0 -186 349 -11 -1220 -820 -314 -364 -24 390 -312 680 816 -120 -14 1847 570 1108
2073 1108 733 621 806 775 574 1656 378 102 54 532 1457 430 1090 -366 534 -253 887 -630
2091 -630 210 -412 49 338 -192 -1040 101 -376 -527 -1509 -19 -994 -519 -300 -319 -65 -1028 -192 843
2110 843 -47 217 -188 439 -6 134 -227 -786 -464 331 857 150 97 1348 225 288 430 721 93 653
2130 653 312 71 1544 46 -136 221 485 846 -422 -292 474 -95 583 -200 532 -760 95 -80 577
2149 577 401 -816 749 -121 -991 663 -312 -1054 -1012 -962 -352 -679 -730 -733 -1206 -344 178 203 269 135 -51
2170 -51 -77 607 694 279 -172 250 351 190 362 443 983 1231 1155 1118 2053 151 1303 435 215 384 776
2191 776 -201 -191 460 -225 -260 -1104 810 540 243 5 -642 -156 -299 -1170 34 -824 -589 -503 -1196 -496
2211d96J7m23L24P1L49q60P9J117K07n28J60j81J39l77L66L2j23J20J50P58k42
2232F59J70o62Q34j280J082M33o89q12J81L22n4k30N97L87q35L18P17j253l46
2251d61J428p45j036R5P83n04K18m95J380j042q7j44j68M27l78N76R1j81j044
2270a287L76J83N42J11l11O37j032K17J26K75MK98J56Q5J193j528P22j043J173
2289H97p9j007J039j074J916m72r15m76M19l55J047o17m93J003j209o29R00J0
2307i5j22j73O73n09k34k67Q72r32L8P31k52M53j183J024k04J73n41K62m74P07
2327e3j248K93Q04L79r50K35P22P3k91j70R75j340J152r11L06O55n89P74p73J202
2347A245p15J50N20q40o8M79o5q97o80J125N65j79k57l53L25j264J769r02r15
$$ plain form
2211 -496 -479 -902 -578 -507 -158 -1018 -939 178 385 -143 17 -164 -25 -402 -36 -4 -127 -7 143 901 659
2232 659 829 167 1001 -279 803 1236 547 -265 -84 238 184 -46 551 938 103 421 1138 -115 -461
2251 -461 967 222 -814 -719 64 -440 -222 -717 663 -379 -466 -610 -778 -351 -729 -153 -62 -243 -1287
2270 -1287 -911 -728 -186 -75 -386 251 -781 -564 -438 -163 -159 139 295 380 1573 45 767 -276 897
2289 897 818 -189 850 -224 1692 1220 305 -171 248 -107 940 323 -170 833 -376 -1005 -105 -95
2307 -95 -217 -390 283 -226 -460 -727 145 -787 -749 -18 -270 183 -1000 24 -180 -7 -548 -286 -760 -53
2327 -53 -1301 -1008 -204 175 -775 -540 182 255 -36 -206 769 -571 581 -330 -24 631 42 816 43 1245
2347 1245 530 680 1200 360 292 771 706 -191 -871 254 819 640 383 30 355 -909 860 -42 -957
2366i57M32P6l56M4P9J098j52o68L45j98j90P07j092K51N34q94M52P57q2K14j724
2387a324J723J83p71M33J71o75n0J098p59L64O56j021k2Q06n98N4K81l07K71M46
2407I59l92n43N18p41k7n66O95J18R15r16n18O59lJ12r23J074L18j483P99r8r67
2428a010N74J104j286J087p67J04O77l95J238j875J44Q04p75J081K36j219J039
2445G61j504J024j67k51J042l23J237j250j097M40Q21j038l56R10K02q89R1L26
2463b1n26J216o76J073j104j077O02j20j08J019l25j271J468p48j03K22O03j44
2481b0M44p96K31m37n68J79J846j267P66J17J18l04k11Q66m92q40R59n28J169
2500A232j597J128j02J268j885L55M36p38J342j169N82K94K40n29r24N08j32l99
$$ plain form
2366 -957 -525 -449 -805 -761 -682 416 264 -404 -59 -257 -447 260 -832 -581 -47 -941 -489 268 186 400 -1324
2387 -1324 399 582 -189 244 415 -260 -310 788 29 393 1049 28 6 812 214 268 549 242 513 959
2407 959 567 24 542 -199 -226 -792 -97 21 936 20 -498 161 158 270 -653 421 739 -744 55 -43 -1010
2428 -1010 -436 668 -618 469 -298 -194 483 88 1326 -549 -405 399 -376 705 941 -278 761
2445 761 -743 281 114 -137 905 582 1819 569 -528 -88 733 -305 -661 249 451 -438 -347 -21
2463 -21 -547 669 -7 1066 -38 -1115 -513 -633 -741 278 -47 -1318 150 -598 -701 -479 124 -20
2481 -20 424 -372 -141 -578 -1146 -967 879 -388 378 495 613 309 98 964 472 -368 591 63 1232
2500 1232 -365 763 661 1929 44 399 835 97 1439 270 852 1146 1386 857 -67 441 309 -90
2518i0K3m58M21j90k92J06q4K61P8p46L92L55j71O33m4q34M10k52K1lk61N05j73
2541c93L6j72L17o4J93j17j20P55Q0M32m17M51p13J068n27j007j88L05%Q95l6
2562G78j128J431k164K165n55k3M39j181m62Q89r10Q72l63P00j18r31K73n17M96
2581c09j221J188j56J026K1L32q19k42M21J30l90m33O86L56R3m99q9o88K3N8N20
2602HK50m60N32p27P08q87l21J395k05m14R13o43l49M56J34r2l92J64n83r3J493
2623H87n66j90l08L45k30O80j326l14J213j98K40n85q13J895r03n00K75Q13p9
2642C36p55J29O22J49K88j877J462K56q98P06k61K96o1p2M50p45M29m47o2m6N39
2663D38q64O08l86J258m62l7r54N95r05N64j043K60P99N07j67n92J350m37j102
$$ plain form
2518 -90 -67 -525 -104 -294 -586 -480 -564 -303 -225 -971 -579 -224 -395 238 194 -640 -230 -482 -461 -464 -725 -220 -393
2541 -393 -357 -529 -212 -276 -83 -200 -320 435 515 947 530 981 268 1336 809 -198 -386 -81 -81 814 778
2562 778 -350 1081 -1083 1082 527 504 943 -238 -700 189 -721 151 -212 488 370 -561 -288 -805 -309
2581 -309 -1530 -342 -498 528 549 881 62 -180 241 371 -19 -452 234 590 683 184 95 -593 -570 -512 8
2602 8 258 -202 330 -397 311 -576 -897 498 293 -121 792 149 -200 256 390 298 -94 70 -513 -606 887
2623 887 321 131 -177 168 -62 618 -708 -1022 191 -7 233 -352 -1165 730 -173 -673 -398 415 336
2642 336 -419 -290 332 481 769 -1108 354 610 -288 418 157 453 392 320 770 25 454 7 -55 -101 438
2663 438 -426 182 -204 1054 592 555 -399 196 -709 -145 -1188 -928 -129 378 211 -381 969 532 -570
2682e70J52P8n89O84n54j90Q65K00j260J138L44m20p34J047o34j54j25J145j3
2701D10j31J92l71M1p05M19o71R17p7K95m81J024j107K59o16P60o14R05K99j76
2721E72m01K1p88L80O89L8K32k08m07k70J72l30K58m96L58K87k51r4j295J106
2741d27Q29o94P72q81q78O14k88K00LJ733j096J42r91J164n63K95J32p60J357
2760F63n34k44J40ON80j25N91j070r48J026P09j180J035j58o04j43l51K77O72
2779C42K36p4j60n95K2Q29n89J040n78O5r8k80j78M43k42j011k77J519m17N41
2799E38J07j495M94k28K7R03j042J083j077Q37j342Q43P04p39k1K3P85p29K86
2818d3J43j035Q64l73n94M68P11o13Q94P75j603R98j018N86n25o84J579j109P42
$$ plain form
2682 -570 -418 -340 -929 -245 -799 -989 -124 76 -1184 -46 298 -122 -856 191 -443 -597 -722 423 410
2701 410 279 471 100 141 -564 -145 -816 101 24 319 -162 862 -245 14 -602 158 -456 449 748 572
2721 572 171 192 -596 -216 473 511 743 535 128 -142 30 -300 -42 -538 -180 107 -144 -238 -1533 -427
2741 -427 402 -292 480 -401 -1279 -665 -953 -753 -750 983 -113 29 -962 202 -361 -66 66 -694 663
2760 663 129 -115 25 31 611 486 1077 7 -941 85 794 -386 649 491 -113 -256 -607 -330 342
2779 342 578 504 344 -251 -229 600 11 1051 473 538 440 160 -18 425 183 -828 -1105 414 -3 538
2799 538 645 -850 -356 -584 -557 346 -696 387 -690 147 -1195 -352 352 -387 -408 -385 400 -329 -43
2818 -43 100 -935 -71 -444 -1038 -570 141 -472 422 1197 -406 592 -426 160 -365 -1049 530 -579 163
2837A63M19N44q65p99j67m58J405r6n73P78L19j326R74K28j065M15k0l11L88R8
2857E1n69P06p44L4O52K51m87L1pn60K109j241m56J81N86n00m33N3K94N93j086
2878e42L05L53l33N61j292J58M99J131m1j317J51L74j233J054m88N66J07O40j059
2897d06N28n62M67l39L71n30M84n20l4J137j030N5O1L4k70kN20J64j026n2J232
2918B82k48J98K97j282Q40L63j65L5M52l71p28L75Q7n94Q89k79m50N04J86r0J000
2939A301k282J674r37J43n67J181l44n26K85j41O34p45L84r59K92K35K60L33l85
2958a64q14J098n90O20l81Q8N95j104O60m91O2P73r88Q15N21k72o04k13P28m76
2978a37O16l89R91p82L9O8j088J238P06j048K77l04k62j93N99p08N71j357J862
$$ plain form
2837 163 582 1126 261 -538 -705 -1163 242 146 -427 351 670 -656 318 546 -519 -104 -124 -435 -47 51
2857 51 -518 188 -556 -522 130 381 -106 -75 -82 -642 1467 226 -230 -49 537 37 -396 -343 -49 544 -542
2878 -542 -237 116 -217 344 -948 -790 -291 840 799 -518 -367 7 -1226 -172 -660 -94 13 653 -406
2897 -406 122 -440 27 -312 59 -471 13 -507 -541 596 -434 -379 -318 -284 -554 -556 -36 128 -898 -950 282
2918 282 34 232 529 -753 87 450 285 320 772 401 -327 48 135 -459 430 151 -299 205 391 301 1301
2939 1301 -981 693 -244 -101 -668 513 169 -357 -72 -213 421 -324 60 -899 -607 -372 -112 221 -164
2958 -164 -978 120 -470 150 -231 -143 452 -652 8 -483 -421 352 -636 179 700 428 -176 -389 339 -137
2978 -137 479 90 1081 299 338 406 -682 556 1262 214 491 187 -75 -268 331 -377 194 -1163 699
2997F99j012M00LL93l87j470J166l7Q3K69M1k88K86K5p37J142l74k62N88j225
3017f97N40L85M82j196n22J196m16O12o5o10J304j523K51J64L12m35j44N19k61
3036a04Q2J69l89J8K78O74j270R24j010j67J239o48k84J035o73J078l39q51J213
3055I75j084m92P67j71p23J624j129l35J237l20O26o33j461J590j95j14J80n01
3073a59K94o51J185L59p35p76l50N91J61M11M58j615Q47N94k22p41L09R1r33P29
3093a53o87J28R28J10q66L54j34M85K78k00j2n79M30m85M03k46K17L59o33J676
3113A373j363n54m23j43J169J36J77p42L58m23J29P38j43j100O80n37P18k19N12
3132C43l01M73r84J000j236K52k37L17N09l07J95K05k35L02o14N5q40J441m10
$$ plain form
2997 699 -313 87 90 483 96 -1374 -208 -245 -162 107 148 -140 146 171 -566 576 202 -60 528 -697
3017 -697 -157 228 710 -486 -1008 188 -228 384 319 -291 1013 -510 -259 -95 217 -218 -362 157 -104
3036 -104 -22 147 -242 -224 54 728 -542 382 -628 -795 444 -204 -488 547 -126 952 613 -238 975
3055 975 -109 -601 166 -5 -728 896 -233 -568 669 349 975 342 -1119 471 276 162 342 -159
3073 -159 135 -516 669 1028 293 -483 -833 -242 -81 330 788 -827 20 614 392 -349 -40 51 -882 -153
3093 -153 -840 -712 216 326 -540 -186 -320 165 443 243 231 -348 82 -403 0 -246 -29 330 -303 1373
3113 1373 10 -544 -967 -1110 59 195 372 -370 -12 -435 -306 432 289 -811 -131 -668 50 -169 343
3132 343 42 515 -469 531 -705 -453 -690 -373 136 -171 24 229 -6 296 -318 -263 -1103 338 -72
3151g2J113q50O45j484Q52p19J345j784Q35K18J62L51q29Q52p60N90r73Q61j230
3170h77J029L9K51q32M8J55L56L2nm14J110j087N98k50N85p05O8O22r44l12O44
3191A11o85O30J82q53J627j613N08k29K42k37P6l01M61n18l19O14O00l94R3j157
3211a162N17J59j17N73K64n16j006M28M91M4K68O07q34N31l36Q2J73n71l75M07
3231c73M73m46R1p20J220l59n54J468j028M96J47j54j162R84j81K4M85R56j57
3250A210j108r17M53M60k77l2L92K35m42m86L30M17j69N00n59P48k46o96J056
3269H69q61J71M25k42M72o89K04M36q72k55J89o66L42L51O87j083O39M33l31R16
3289A135q58p35o28N65m61J230J431k136K42J44L07R64j823Q37L34j254J174K7
$$ plain form
3151 -72 1041 191 836 -648 204 -515 830 -954 -119 99 261 612 -217 635 -125 465 -508 353 -877
3170 -877 152 191 442 -390 -342 -187 169 201 196 -218 892 -195 403 153 738 33 101 723 -221 -533 111
3191 111 -574 56 238 -615 1012 -601 -93 -322 -80 -317 -241 -542 -81 -599 -918 -304 296 -98 -5 -1162
3211 -1162 -645 -486 -603 -30 234 -282 -1288 -860 -369 -325 -57 550 -284 247 -89 -7 166 -405 -780 -373
3231 -373 100 -346 -255 -975 245 -114 -668 800 -228 268 415 261 -901 83 -98 -74 411 1367 1210
3250 1210 102 -815 -362 98 -179 -211 181 416 -26 -512 -182 235 66 566 7 755 509 -187 869
3269 869 8 179 604 362 834 145 349 785 -87 -342 -153 -819 -477 -126 561 -522 117 550 219 1135
3289 1135 277 -458 -1086 -521 -982 248 1679 -457 -215 -71 236 1200 -623 214 548 -706 468 495
3307D95r42Q19m77p67J232o24j91J145r47l09L42r10J737j66n14n43m13l83J106
3326c10Q96r48K90N50q33MK36O43p80n1J63o49M98K93m53Q0M98M00j083m81J002
3347c5m24N40m87P46L5q99R19M43j165J265o57m81K59o83N28J89M14j17m37k8
3367g5N19l88n20j41R86l88j052J131o0l47P6L11P05L11q18j37q83Q71l44M05
3387A62n41O13m08n16P87n98R4l0K93P92p28O61l7J72m41p44R32n91M73j22m89
3408b66J61O12r34L44q16J395r98l90N77k31N91m62m37R92k65l52j90K174j611
3427a06M64j34l82J28O4k21K14l68N82q96k42J118j175M80j82J020k74l81j07
3446c98O76K57o83j25M77r99J197o99O35j42n40O78l43n2j00L99m4j408Q79J76
$$ plain form
3307 495 -447 372 -105 -872 360 -264 -455 690 -257 -566 -224 -1134 603 437 -77 -620 -1033 -1416 -310
3326 -310 586 -362 -72 478 -355 -351 -115 528 -252 -303 -140 -789 -291 2 -451 -371 127 527 -556 -1037 -35
3347 -35 -459 81 -406 340 375 -524 395 838 -327 938 281 -200 59 -624 -96 93 507 390 -47 -75
3367 -75 444 56 -464 -605 381 -7 -1059 72 12 -335 -259 52 757 1068 250 113 -770 101 -243 162
3387 162 -379 234 -174 -690 97 -501 -407 -437 -144 648 -80 581 544 716 275 -469 463 -128 345 223 -266
3408 -266 -105 507 -427 -83 -899 496 -502 -892 -315 -546 45 -417 -854 138 -127 -479 -669 1505 -106
3427 -106 358 224 -158 -30 34 -187 27 -341 241 -655 -897 221 -954 -474 -656 364 90 -291 -398
3446 -398 278 535 -148 -273 204 -795 402 -297 338 196 -344 334 -9 -61 -161 238 194 -1214 -335 -159
3466a59o20L05l4J79M19l36Q82j816K300l72J67j649P91P0n16P59m79j40N83l40
3486fJ25J50P5j34n02J358j146l12O72j124M56P46q8l56L93P5J230j936K41n16
3506e99P22M61q69N00K99m28N75j018n36J043P21j44m87N76o37p58n31P10M34
3525C4L41m78o26K91j0N0R74j15q7j114K3P77O26J89o74q25J050M14p67j78J22
3546A7P5J54q41N65o40N22L68p2n97J150K49p79k93M27r87K58K17K5J477j265
3566C0J162j576Q52m19k20L52r31m35J446j250M96L90p95J273r60M61k33O14J18
3585C75n01K30N2P30o77n02L40j40j97O81r37K47M51L62m28j80J518j217q1o23
3605d97L95j16Q59k68n28R88j111K24J109q44n56J033j042n15J548M70j375j387
$$ plain form
3466 -159 -779 -474 -508 -329 90 -246 636 -1180 1120 748 915 -734 57 127 -389 370 -109 -249 334 -6
3486 -6 119 269 344 210 -292 1066 -80 -392 280 -844 -388 358 270 -86 307 382 1612 -324 -83 -599
3506 -599 123 584 -285 215 514 86 661 -357 -893 150 871 727 240 816 179 -579 -1110 -400 34
3525 34 375 -103 -729 -438 -448 -398 576 461 374 -740 -717 60 686 875 201 -624 426 840 73 -105 17
3546 17 92 246 -595 -30 -670 -148 220 148 -449 701 950 171 -122 305 -682 -424 -207 -182 1295 30
3566 30 1192 -384 468 49 -171 181 -750 -1185 261 -989 -493 -103 -898 375 -585 -124 -357 257 375
3585 375 -126 104 156 886 209 -293 47 -93 -290 391 -546 -299 152 514 86 -94 1424 207 126 -497
3605 -497 -102 -218 641 373 -155 833 -278 -54 1055 211 -345 688 -354 -869 679 1149 -226 -1613
3623a613J625K71M93j349m48K074m01m45J84q08m75J213j169m78J080P78p51j157
3641a376N61k48J603j443J034j23l17J482j570J848k153L03N86q66N2P85L94p42
3659a90M16j85r90Q86R93k145J124P91o25j15k72P7K86q38Q61J096m5r49m63Q08
3679E21o18k69n01R33K98j19l48l41N94O61n13L55q54O16j113Q4J95N54r27P91
3699aM39k68j26J68j75j21Q09q23l26j326J762l45P16p53n43Q09l58N7O31m67
3719b41p35R37O53j442N68k58P11P46j108l09J848p23o10n0n55J287j276J087
3737E30j006J92j50O21M79o05P03j367O48J99k21O68Q3j532M2Q00J50K88j089
3756e67J01K35J34K98l33O50J36n59J61j82N99l36m93n10M6P61o47R31q28J363
$$ plain form
3623 -1613 12 283 776 -573 -1021 1053 652 207 391 -417 -892 321 -848 -1326 -246 532 -219 -1376
3641 -1376 -815 -1063 540 -903 131 8 -309 1173 -397 1451 -702 -399 187 -679 -627 158 552 -190
3659 -190 226 41 -949 -63 930 -1215 -91 700 75 -40 -312 -235 51 -787 74 1170 1125 176 -287 521
3679 521 -97 -366 -867 66 364 245 -103 -444 150 811 298 653 -201 415 -698 -614 -419 135 -792 -1
3699 -1 438 170 44 212 37 -84 725 -98 -424 -1750 12 -333 383 -370 -913 -104 -462 -405 226 -241
3719 -241 -976 -39 614 -828 -260 -518 193 939 -169 -478 1370 647 37 -13 -568 719 -557 530
3737 530 -476 -284 -434 187 666 61 764 -603 45 244 23 691 774 -758 -716 84 234 522 -567
3756 -567 -466 -231 -97 201 -132 518 654 95 256 74 673 337 -156 -666 -620 141 -506 425 -403 960
3776I60j129j76R57J52k39j199J002R3j071L44J70Q05k59l74n37l3O32j436J696
3795C58k224J485n23J421r32k92N94j02N08n64l85K96J40M65K10n16j68Q47n92
3814B6j71J00L97n06K25o17M39r25R77Q81m27Q97j425l36l49P54J378r61J313
3833A670n93j064M67l41K21K96q35J2O18o51j08J130j242N60N95j236O91n28Q34
3852D96k033J418j5j58q2P25p88O22O62q39M68j539Q96j512K786p30q01N46L26
3871D48r08j79k02K06k39P96k92J297m31L83j416J344j460P37k04k80n05N93K18
3890i4j87M03o45O89K77J100k89j816K67M61p18r5J901j610l58R78j188M80j43
3909e87J18M03J43N61k018J502j94r48J046o21J151j053N22j01o66P26L47n95
$$ plain form
3776 960 -169 -345 612 764 525 -674 328 421 -650 -306 -136 669 410 36 -501 -534 98 -1338 358
3795 358 -1866 -381 -904 517 -415 -707 -113 -215 293 -271 -656 -360 -220 245 455 -61 -229 618 26
3814 26 -145 -45 352 -154 71 -546 -107 -1032 -55 826 399 1296 -129 -465 -814 -60 1318 357 1670
3833 1670 1077 13 480 139 360 656 -179 -167 451 -200 -308 822 -420 140 735 -501 190 -338 496
3852 496 -1537 -119 -134 -292 -374 351 -437 185 847 8 476 -1063 -167 -1679 1107 377 -424 122 448
3871 448 -460 -639 -841 -635 -874 -78 -370 927 496 879 -537 807 -653 84 -120 -400 -905 -312 -94
3890 -94 -281 122 -523 166 443 1543 1254 -562 -295 166 -552 -647 1254 -356 -714 264 -924 -444 -587
3909 -587 -469 -66 77 638 -1380 122 -72 -1020 26 -595 556 -497 25 -76 -742 -16 331 -264
3927b64J94R85j554P52P24l31J86q55n3J150p43M02o49L34Po90m86P40O8j16J57
3948d2N26j694P63o5lM73j32rN51L38L80j602J616n12q30N21p65J55p12J531J78
3969F66m86l59M02j366K376m04j280O29j78j61L43L66m1l19j29N42M69o21O11
3988A060j278O13j03M14m55Q9j104P19N03p88k20J55R76l73J85p7r73J643j038
4007e2r98J293m86o1n18K55J327r53m97N67N78m97P55j398L28n23j29J248q67
4026f28N20k75m38N71L51k16o18Q78L11j43l04O48l38q60J59K50l1J91j55O10
4046D83M9O9O97o86j205P17J52J95j652O61l21J143O60j130j68K43l59J43R02
4065E93n56K36K19p13k70R08q99j57m43J674r39P59k75j13o59K21j70J389q48
$$ plain form
3927 -264 -70 915 -639 113 837 506 692 -163 -216 934 191 593 -56 278 285 -405 -891 -151 -83 -199 -42
3948 -42 484 -1210 -447 -512 -515 -42 -174 -183 368 706 1086 -516 1100 588 -242 279 -486 -331 -1043 488 666
3969 666 180 -179 223 -1143 1233 829 -451 178 0 -161 182 548 507 188 59 601 1070 449 1060
3988 1060 -218 395 292 706 251 340 -764 -45 458 -330 -550 -395 581 208 393 316 -657 986 -52
4007 -52 -1050 243 -243 -304 -822 -567 760 -193 -690 -123 455 -42 713 -685 -357 -880 -1009 239 -628
4026 -628 -108 -383 -821 -250 101 -115 -733 145 456 313 9 657 319 -541 -382 -132 -163 28 -127 483
4046 483 532 601 1298 612 -593 124 276 471 -1181 -520 -841 302 962 -168 -336 -93 -452 -309 593
4065 593 37 273 492 -221 -491 417 -482 -639 -1082 592 -347 412 137 24 -635 -414 -584 805 -43
4084d3m84N01J098o55o22N00m21J35J45n57J180n27o71P29L1j42r88J118n53j20
4104c46p23J735n4m30m70r3J641j985O47Q47p06P11p33L33n72P97o42j25m63J043
4124D12r90J239K13j061L76m27J29J21j21q33J141R6o01R01m94q5M60L68n83n03
4144b42M26n1j58k43K03n91Q94J66n48L63K65p96l48O3O14j87O2L12j54P11j321
4165e60M27k72j87K86J024j087L44p15R80q96J291n39j94O7N03n07n06O58K61
4184C78m76J13n48N69R90j820Q14P73K76j460M6M56O62o44m64O81r27P70q04l15
4204i30J219k5j93q23N64J1N55p81Q01p07n40R59L34j327J88J293j937J893r27
4223c73M81K04n35P18k67j224O12q28L12J067N8N36q61m32L84J151j083N33r38
$$ plain form
4084 -43 -527 -26 1072 417 -205 295 -126 9 154 -403 777 250 -421 308 339 197 -791 327 -226 -346
4104 -346 -1069 666 612 182 -288 -381 1260 -725 -78 769 63 774 41 374 -198 599 -43 -168 -631 412
4124 412 -578 661 874 -187 189 -238 -109 12 -109 -942 199 295 -306 595 101 16 476 844 261 -242
4144 -242 184 133 -25 -268 -65 -656 238 404 -144 219 484 -312 -660 -597 17 -170 -108 204 50 761 -560
4165 -560 -133 -405 -592 -306 718 -369 -25 -740 240 -656 635 96 -98 -31 472 -35 -541 117 378
4184 378 -98 15 -533 36 1026 -794 20 793 1069 -391 -345 111 773 129 -335 346 -581 189 -615 -930
4204 -930 289 264 71 -752 -188 -177 378 -403 398 -309 -849 110 444 -883 -695 598 -1339 554 -373
4223 -373 108 312 -223 495 228 -996 -384 -1212 -900 167 225 761 -100 -532 -148 1003 -80 453 -485
4242d85j82K38K82M70L68p10m3O88J3p25R78p68J084j330L71n3K15l72N76j98
4262D17o24K62R36n90q26Qo31o83K307J70r70M14o77N86M27j489O52J30L75p1
4282A23m53M41o09K04J67q08M03K71o5J77m18N02O11j177J141q41M30l03N87J34
4302E17j116N42N11r08j67M46N88j315J699n68L48p00O09k89M14j335L26J488
4320A090j144O67n60q23J023m56P35n85l00N12j053J095l96L33q9r52R59K27p29
4339d46K14K96j45l24o98J188J64K04j99o7L42r36K15j98K03p44O59o8R1n8N86
4360B79r2p06J104o85j03n80J68J359q25o42L58l64P00J07m80m89K67N6P45J220
4380A397k051J092l93k53N47k88m2M07j24j16l85n86M61O92L86r69O36J91n02
$$ plain form
4242 -485 -667 -429 -147 323 691 -19 -62 626 639 -86 892 124 1208 -122 249 196 411 39 615 417
4262 417 -207 55 991 401 -425 -417 -1048 -1731 576 746 -224 190 -487 99 526 -963 -311 -181 194 123
4282 123 -330 111 -498 -294 -127 -935 -532 -261 -326 -149 -567 -65 546 -631 510 -331 99 -204 383 517
4302 517 -599 -57 454 -454 -621 -175 413 -902 797 229 577 -123 486 197 611 -724 -398 1090
4320 1090 -54 613 53 -770 253 -203 532 -53 -353 159 -894 201 -195 138 49 -903 56 283 -446
4339 -446 -232 64 -81 -405 -1103 85 249 453 254 187 529 -407 -192 -390 -187 -931 -272 -340 -249 -307 279
4360 279 187 -519 585 -100 -203 -783 -615 744 -81 -723 -365 -729 -29 78 -402 -891 -624 -568 177 1397
4380 1397 -654 438 45 -208 339 51 9 416 292 176 -209 -795 -334 358 744 -225 411 602 100
4399A00K3j84l10l05J35J341j460J466j482P74r20J434q78M84m17n95J022J67
4417C95m56j058J242M92j450P58l22O32K58M12q69j190J055r7M07j049J631j152
4435c61N31p65N05q00M45J063q98M55n12M38o55K34p6R28l36k07k1k41J71J043
4455I41N06p87k34P2n0j328J9J265m42L81l85P08o42o73K90J060n75j37L91j48
4475B32J66l85K43l27p18J735j177K22Q77j906L50Q27K49j314K014j691O57p03
4493f49J070r48m73P14M31l88K06O95p51o19p54N57J297p21r81J473m23l42J134
4512E28j87j224J791P9M67j611l31J38J229o70r95N14p8k01R79r3o11k56J071
4531E39l84K88j01q87L57l65J087m89J66k50Q55j726J309q85k69K6Q89j504K308
$$ plain form
4399 100 123 -61 -371 -676 -541 800 -660 806 -676 98 -822 612 -266 218 -199 -794 228 395
4417 395 -61 -1119 123 615 -835 -77 -399 233 491 903 34 -1156 -101 -198 209 -840 791 -361
4435 -361 170 -595 -90 -890 -445 618 -280 175 -337 101 -554 -320 -396 532 196 -11 -32 -273 -102 941
4455 941 1447 660 426 498 448 -880 -861 404 -38 343 -42 666 24 -649 -359 701 126 -11 380 232
4475 232 398 13 256 -71 -789 946 -231 -9 868 -1038 -688 139 388 -926 1088 -603 54 -649
4493 -649 421 -527 -1000 -286 145 -243 -37 658 -93 -712 -1466 -909 388 -333 -1314 159 -264 -606 528
4512 528 341 -883 908 987 1454 -157 -488 -350 879 209 -786 -272 -350 -551 428 335 -276 -532 539
4531 539 155 443 342 -545 -188 -553 534 45 211 -39 816 -910 399 -486 -755 -729 160 -1344 964
4550I64q34j79J93j249J118N7J18q69m66J397k2j121o8J189m27n06R97J38p90
4569c60K35r5L91M4p23M99k93J51k69K41J56o1O01o1m76j47RJ08j4K48L15l40
4591A59M43j356P64Q5o55R12q82J060p94N04k14J63m97J02J21L91l61r07P75Q5
4611a02k62J351p19n34J179j316m4J229j190j61J132r12M95q18P38l81j95J59
4629c51k5N51J39J22k13l97M83k35J34o02n34J701l62m18P1q55K025j668m49N43
4649c40N35q98J522p56l62R01O01j052k20K78J29kj362J710j058P65j422J859
4667H28m84n95J109j474Q12P9j15j12P00o82R47j271j88P71q1J40k98p02Q47k55
4687b4n94J675j850J268j313J813j194J264o95o02K05k11R27j080J261j307l07
$$ plain form
4550 964 130 -49 144 -1105 13 70 188 -681 -1147 250 228 -893 -961 228 -199 -705 292 430 -360
4569 -360 -125 -220 171 215 -508 -9 -302 -151 -420 -179 -23 -84 517 456 -20 -167 -158 -50 -64 184 499 159
4591 159 602 -754 10 95 -560 352 -530 530 -264 240 26 189 -308 -206 -85 306 -55 -962 -187 -102
4611 -102 -364 987 268 -266 913 -403 -447 782 -408 -569 563 -349 146 -672 66 -315 -510 -351
4629 -351 -376 175 314 436 223 -174 309 74 208 -394 -928 773 411 -7 64 -791 1234 -434 -883 -340
4649 -340 195 -703 819 63 -299 602 1203 151 -69 209 338 336 -1026 684 -374 391 -1031 828
4667 828 344 -251 858 -616 196 275 160 48 748 66 1013 -258 -446 325 244 384 86 -616 231 -24
4687 -24 -618 1057 -793 475 -838 975 -219 1045 350 -252 -47 -258 669 -411 850 -457 -764
4704g64K0P61R11j939J245q29J79K65K48o83K59K53j29J15m44P29J43l17j354
4723a331P64q1L85M5l38P00k24J017r07O51l30o73J415j359P7n15J222l04j32
4742H2j3l77m92R15L86l69J027p17j53P49j856R43L43n41M46p82L99m33J39r81
4762a285J106j91K07j76J267j606N75J057p10p24M81L85o44Q32L6K37q00M98j407
4781h62L46J97q42J625m79j62R75j349L38J121j513J502j321Q69j258J079O52
4798I18j023Q28m55j031J724o70n47n1j98L51Q4J37K24q4P25m51n04N51j346R50
4818A32N66p10M26p03K39J09R8p12J54P29J75n68m58l11R11N01j586J213J311
4837A516j593K51l81j93o54J595q8r00l56Q44L74o40O41P6M57j370J156P9l58
$$ plain form
4704 -764 -744 17 928 -1011 234 -595 -416 -151 97 -586 -327 -74 -203 -88 -532 197 340 23 -1331
4723 -1331 -567 -648 -263 -218 -556 144 -80 937 30 681 351 -322 1093 -266 -189 -704 518 214 82
4742 82 69 -308 -800 115 501 132 1159 442 289 1038 -818 125 468 -73 373 -409 -10 -443 -304 -1285
4762 -1285 -179 -370 -163 -339 928 -678 -103 954 244 -480 1 386 -258 574 610 847 47 545 -862
4781 -862 -516 -319 -1161 464 -15 -177 798 -551 -213 908 -605 897 -424 445 -813 266 918
4798 918 -105 723 268 -763 961 291 -256 -307 -505 -154 -70 67 291 207 932 481 -23 528 -818 132
4818 132 698 -12 414 -289 -50 59 157 -555 -401 328 503 -65 -523 -834 77 578 -1008 205 1516
4837 1516 -77 174 -207 -400 -1054 541 453 -447 -803 41 415 -225 416 492 949 -421 735 814 456
4856D56k84j84o80n31J053l44J392Q2j346L16M48o00j041J106M75J003q67q00
4874c46O36p10k57J345p21N04l53J94j50o64P74k02n67O68R13j05j185Q21k83
4893C12j65Q8q72J78l77J048j65j43q93J537j376R05j029J176J92n33R07j532
4911g42J456j003P46j409N42k1P45n74P6K18N62l52j9m7l36n50Q3K023q96o55
4931a53m39R28m18k85p10J749j576Q48P40l74K23n20k33J154o43O33j446L46L20
4950A44J95o1l92J162k362J292K42P0o53J023m46k88J02n28J68L35m08J83m16
4969f38N37k15P78k82q33O17o6Q3m10N95L75m62j021R98L66N37j005L10o00Q51
4989E15l54J65J72l22K3k9R20j100r79P71M40j356J650l73p2O2m43O53J62m53
$$ plain form
4856 456 172 -12 -692 -1223 -170 -514 878 960 -386 -70 378 -222 -1263 -157 318 1321 454 -346
4874 -346 290 -420 -677 668 -53 451 98 292 142 -522 252 50 -517 151 1064 959 -226 595 312
4893 312 147 235 -637 -459 -836 212 47 -96 -989 548 -828 77 -952 224 416 -117 790 -742
4911 -742 714 -289 457 -952 -410 -431 314 -260 -184 34 596 244 225 178 -158 -708 -625 1398 502 -153
4931 -153 -592 336 -82 -367 -1077 672 -904 -56 684 310 533 13 -220 934 291 924 -522 -176 144
4950 144 339 278 -114 1048 -1314 -22 220 290 -363 660 214 -74 28 -500 -332 3 -405 -222 -638
4969 -638 -101 -316 462 180 -653 -36 -102 -19 -429 166 541 79 -942 56 422 959 -46 264 -336 515
4989 515 161 326 498 176 199 170 1090 -10 -989 -218 222 -1134 516 143 71 133 -310 343 505 52
5009E2j20k69m70L34N26p89R10O26l65j00k16j047J459m08o98Q53K24k48k14n65
5029e25M50l12J96m1J031p70n88J01j06M57K24j35K69m53r6l20O6R27r10P79r9
5050A45o66L29L23m08k19R98k84l07L17l93P8N79j028R10q43P94n81N43j28J10
5070B69j19l28k9P0R6m70K81L14p3j34J91k61Q68r41L40km12m65Q43j75j09M86
5092B40l17J191j683M52o12J190q15o32n8J110k83N7K17j210J327n40k69J290
5110F55j84O48m09m79l41R45j082L44o60O32j22K73l34K6L31Q02r98j33L39m31
5130a78J28L18q86J67k63J477l23r22p2L89r16P14K25n17L16P38j736K270m25
5149E04j18j076n29R58L79q41L08k36Q14N10m60j03n23P51j24J18R4o77L51n48
$$ plain form
5009 52 -68 -337 -807 -473 53 -736 174 800 435 335 119 -928 531 123 -575 278 502 254 40 -525
5029 -525 -75 -387 -191 -232 799 29 -559 -458 -564 -107 117 -18 251 -202 -298 -618 -552 375 -535 244 145
5050 145 -521 -192 131 -277 -496 502 218 -89 228 -165 -87 492 -536 374 -469 325 -256 287 159 269
5070 269 150 -178 -207 -137 -41 -511 -230 84 11 -123 68 -193 675 -266 74 72 -340 -805 38 -137 -246 240
5092 240 -77 1114 -569 -117 -729 461 -354 -986 -1044 66 -217 -160 57 -1153 174 -366 -635 655
5110 655 471 1119 710 231 -110 835 -247 97 -563 69 -53 220 -114 -88 243 1045 47 -86 253 -178
5130 -178 -50 268 -618 -451 -714 763 440 -482 -554 -165 -1081 -367 -142 -659 -343 395 -1341 929 504
5149 504 386 -690 -1219 -261 118 -723 -415 -651 163 673 213 110 -413 338 214 332 426 -251 100 -448
5169d48m66J092n08k37L98n4O40o07J90qo19K17P50K84k494J881M35q16J13J519
5189A262j340l08L96j97j63M0L50Q67m6o93J85l42r8K60j045J109Q8p93j98J585
5209I19o71j008N38N25R0q00P2N64Q38j093n02N33M28l07l71j89K72L95J35p09
5229c41J8K67R00o78M6n18N18N79r22J01o11O40L36l04R8q76L09j024J186O95
5249D19j308Q68M95j417R90q97J92L17R65q37K32N42k22j099R22j67M6J04l52
5268b07Q88j168n4M93N31k66n40M83j15J56k35J015P9j486Q64r09J55p27Q22m45
5288f66J028j010R82j92N06j052J281q21O46o69K5K84k14q65J163o08M80j43N31
5307F86j13j96Q9O81p03m40Q20j095J347m52o41Q68l0j84m50R2Q3k31n17J35O83
$$ plain form
5169 -448 -914 178 -330 -567 -169 -223 417 -190 0 -8 -627 -410 340 624 -1870 11 446 -370 -257 1262
5189 1262 -78 -386 10 -187 -350 -310 40 907 861 168 353 11 -87 173 -872 237 325 -468 -666 919
5209 919 248 -760 -222 303 393 -407 -335 229 1067 -26 -528 5 433 126 -245 -434 -162 233 368 -341
5229 -341 -323 -56 844 166 212 -306 212 791 -131 -30 -641 -1 335 31 129 -747 -438 -1462 -276 419
5249 419 -889 -21 474 -943 47 -850 -658 -341 624 -213 19 561 339 -760 162 -5 41 145 -207
5268 -207 681 -487 -541 -48 483 217 -323 160 45 201 -34 981 1060 -426 438 -471 -316 -1043 -221 -666
5288 -666 362 -648 334 142 648 -404 877 56 702 33 58 342 128 -737 426 -182 298 155 686
5307 686 573 377 466 1147 444 4 824 -271 1076 624 -17 851 821 637 187 279 362 131 -386 -251 432
5328D32q42Q31k26m71Q07r67Q26R14k322J222n72o60J646k85j018L73K31p52L98
5347d35R39J73p01l33L63M11j619J374j50o16P71J86k29j092J085k98j53l10J401
5366G67o35R5r48J313j140R2N00k14j5l67J407j3j498R47o08N29M81m06n01K65
5386E1Q0j89Q54j03r03j587J926K86r4m85j047J591j48p96R18j84j484J315l93
5405c92O68n49L69q62Q85q93J455n51n06j070J429q1J90P82p54m68Q98r73M09
5424a4o09J053n10K84o91R3O74j4J13p6p46O68k07o29k7J407m32n81j176J738
5444C18r73P62j25M93j79k25jN38m42j275J74J409n86M42j48M35j20q72P30l66
5464a1l4j295P13R25m10q95P80K14r31O48K68o64J010K75n22p09K13j21Q94N82
$$ plain form
5328 432 -410 421 195 -276 531 -436 390 1304 -1018 204 -368 -1028 618 333 -685 -312 -81 -833 -435
5347 -435 504 677 -24 -357 6 417 -1202 172 22 -594 177 363 134 -958 127 -171 -324 -634 767
5366 767 132 227 -721 592 -548 -456 44 -170 -185 -552 855 842 -656 291 -317 212 693 287 -214 51
5386 51 131 -58 796 693 -210 -1797 129 415 321 -164 -1211 380 232 -564 354 170 -1314 1 -392
5405 -392 276 -273 96 -766 119 -774 681 130 -376 -1446 -17 -98 92 874 120 -348 550 -423 -14
5424 -14 -623 430 -80 204 -487 -394 280 266 379 303 -443 225 18 -611 -638 769 337 -244 -1420 318
5444 318 -655 107 -18 475 296 71 70 608 166 -1109 -935 474 -112 330 182 617 497 -375 355 -11
5464 -11 -45 -1340 -627 298 -112 -1007 -227 -13 -944 -296 -28 -692 318 593 71 -638 -425 -546 348 930
5484I30j034K50J79J59o60K79R2l3j015J580j660J450j050L51n18J017n75m2J003
5503G03r42K191j636k37p13o4p3J351k34p39L40k50M11k0L58m53j96m20J031j127
5523g19Q29k15K4N67j264j03N57l13O92j61l70P39o34J12J410r06p62j20P01J68
5543B32j081J143l37j033L50J080k90L27n68J61M87p99N34k82n25j82Q70k19N29
5562C97q92L77m2Q86K46m64k14R1P3J15n3n75M96j558K070j049R1j52N40N9m54
5583a2M25j77L07L26j649J569M80j674L53M49K22M5j903J649k84n68M34o77J043
5602C58l76k55J153j476l7J6K58K70k24MK39r18J377N94p98R36m86n75k32Q81
5622G09r72M40m53O01L48n16L09l17j57p19J587q68M14r11m00J550j049M11N11
$$ plain form
5484 930 -104 146 325 484 -176 103 195 162 -853 727 -933 517 -533 -182 -700 317 -258 -300 703
5503 703 -239 1952 316 79 -634 -698 -771 580 346 -393 -53 -303 108 88 446 -7 -203 -623 408 -719
5523 -719 110 -105 -81 486 -778 -881 -324 -637 55 -106 -476 263 -371 -259 1151 245 -517 -637 64 232
5543 232 -849 294 -43 -1076 -726 354 64 391 -177 -16 471 -328 206 -76 -601 -783 87 -132 397
5562 397 -495 -118 -160 726 972 508 294 385 458 573 520 -55 441 -1117 953 -96 -5 -157 383 442 -12
5583 -12 413 236 543 869 -780 789 1269 -405 -52 397 619 664 -1239 410 126 -442 -8 -685 358
5602 358 -18 -273 880 -596 -633 -617 -359 -89 -313 -309 -70 -988 389 983 185 1121 635 60 -172 709
5622 709 -263 177 -276 325 673 157 466 149 -8 -727 860 -8 406 -505 -905 645 -404 7 518
5641E18OJ03l93R94r81k50J315m26o57q3n14J085K9m00p8j081j91J781r44M15
5661B48q87P80p66k03M91j42J19J261j069L33j25J082j519J42R9R5%l08k52M62
5681a59m8J46o16M1J056j285R92o50J297j342O02O51o93j349J816m52R59j313
5699c47M15K78j198M43M36J7J50m4j82k42O62Q00j075j90m55R73J10k84m33n76
5719g42O33K53Q65j660L43k34J045m70p11P80R4r04P02j085O96R00j131p38J364
5738@n54K48J32K70o30l60J650p06L19o33K61m97P28O43p19j043J845q35k89Q18
5758F48r11M52K94l95p09R95l47M36o67k66K49Q37k83K6o22Q7m48J89J011n35
5778D1k1m89O25j64o8R26m43l79R11K34k330L60J378m14k96L09r76R99j30R19
$$ plain form
5641 518 524 627 234 1228 247 -3 1312 886 229 146 -368 717 746 346 268 -813 -1004 777 -167 248
5661 248 -639 141 -625 -828 -337 -479 -360 901 -168 165 40 1122 -397 -255 -156 -61 -61 -369 -621 -159
5681 -159 -207 -61 -677 -636 420 -865 127 -523 774 -568 34 685 -8 -1357 459 7 966 -347
5699 -347 68 346 -852 -409 27 44 194 150 -32 -274 388 1188 113 -77 -532 441 551 267 -166 -742
5719 -742 -109 144 1009 -651 -308 -542 503 33 -678 102 196 -708 -6 -1091 -395 505 -626 -1364 0
5738 0 -554 -306 -174 96 -534 -894 756 50 369 -264 -3 -500 228 871 152 -891 954 119 -170 648
5758 648 -263 189 483 88 -621 374 27 463 -204 -470 -221 616 333 359 -263 -176 -624 -435 576 41
5778 41 20 -469 156 -8 -76 850 407 28 939 1173 -1157 -797 581 167 -129 180 -796 203 73 992
5798I92j538L95N18m19P77o83k58N17M4k61j352M90J016m19J85l63K35k59j7J20
5818b80o74O62J256r07M07o99O04M79p93r7K0n25pK12K57l56J37Q58j16Qn35L68
5840B79j07k98n66J030j9m09M68j99J007j143n43J053l42j76N78j44k06l79K74
5859A58Q5J20N00j324P66o47k4M90O00k88m10l33m2Q31n55O13q1p87J278j408
5879d58K28n73L55j84M68j1o47k47j45J111L03q72K28J71R01j009N43p61N41P43
5899F85p35L41l7n82M38J83l30q75J79J844m47j484J450l34o49O64K67j345J518
5918G51N93L01k64j716L36L38l96P25j543J035M37n63N08p96O06Q14j63j372K82
5937h7N36o3n85K22j93R5p73N77p58J600J70p41M49J6k70r57J313j780J453o04
$$ plain form
5798 992 -546 -151 367 -52 725 42 -216 301 345 84 -1268 -778 238 -181 4 -359 -124 -383 -400 -280
5818 -280 -954 -292 964 57 464 -235 369 848 55 -42 -22 -547 -554 -342 -85 -441 -304 554 438 446 -89 279
5840 279 172 -126 -692 338 319 -90 378 179 1186 43 -500 553 211 35 613 469 263 -116 158
5859 158 243 363 863 -461 305 -342 -366 124 724 436 26 -307 -349 482 -73 540 459 -328 950 -458
5879 -458 -230 -803 -448 -632 -164 -175 -822 -1069 -1214 -103 200 -672 -444 -273 628 -381 162 -599 -58 685
5899 685 -50 291 254 -328 110 293 -37 -912 -733 1111 664 -820 630 296 -353 311 578 -767 751
5918 751 1344 1645 1381 -335 1 339 -57 668 -875 160 597 34 542 -254 352 1166 1003 -369 -87
5937 -87 449 386 -199 23 -170 -75 -848 -271 -1029 571 741 0 449 465 195 -762 551 -1229 224 -380
5957c80J033j039P5L60m58R95j468J269Q77j079j372J303l25O77q44J568j726
5974e34J303q78o17J537o93j68k7J64j061N16j70J41r6M73J34P89m53l51l72P18
5994C55K39j276J501j441J2O95k26l31P29r8k03J020r26m64J63p54J183k27R6
6013D7O72j621m14K061r29L65L18p38L70J01o74J81N62q88K09R65n40K59r3n51
6033c38m4j18L69O01o95k48M47j55J483j810o35J449M2n41J72J81J0p19P17K33
6053D01q20M83n05K61N23r80M49Q07J1n6r35K97J165o11k7J18m89l68L22L68L39
6074G53q24p7J127r11J87l49k52J128j316J53N11N44j382L55j97N94P6o66O34
6093H8L13o94jN97k84R8P8l41J100j204k2L83k07j68M4L22j070M88Q55n88mN87
$$ plain form
5957 -380 653 -386 -311 49 -409 586 -882 387 1264 185 -1187 116 -209 468 -376 1192 -534
5974 -534 769 -109 -726 811 118 -50 -77 87 -974 -458 -628 -487 -583 -110 24 813 360 9 -363 355
5994 355 594 -682 819 -622 -610 85 -141 -472 257 159 -44 976 50 -414 -251 -1005 178 -49 47
6013 47 719 -902 -1316 745 -184 181 499 -239 131 232 -442 -261 301 -587 -378 587 47 306 213 -338
6033 -338 -382 -500 -131 470 -225 -473 -26 -181 1302 -508 -1143 306 348 -193 -21 160 170 -549 168 401
6053 401 -419 64 -441 -180 343 -637 -188 619 630 574 -361 -64 1101 490 463 581 92 -276 46 414 753
6074 753 -71 -148 979 68 255 -94 -346 782 -534 -381 130 674 -708 -353 -550 44 120 -546 88
6093 88 401 -293 -294 303 19 117 195 -146 954 -250 -272 111 -96 -264 -220 102 -968 -480 375 -213 -217 370
6115C70j43j21M6k02j007P76m9p1O93k84P00M3m47k10P43j668R89O27k078J667
6135C74j352J635j250J28J007j010k19R37j45j370J914o15P4N39o92m85O37j59
6153e2Q04r19N88Kj543J995l86n38k25M52j410J091P71o80k18n76J68m22J116
6172A8k47R51o13L03l99j23j740J851k03M28R77p42q48J9K86N6j92q32J011L64
6192C25m6j011M25R55j442Q10j0J04q22N33J73j59N80k68k28l83R46r31N96j781
6212a634K200j167L86J44M59K1o6o48m9M46o00P36J49m57o76J089m60n19P93q74
6232g27L90J15j295J832o60j13Q46p3k1j73J74o50J091n09J01K37l97P45j108
6251a95J253j976m4O96J14P76n99J268p52o77L74K92n63Lj73l23O65O32P8j089
$$ plain form
6115 370 227 106 152 -50 -1057 -281 -330 -401 292 8 708 751 304 94 837 -831 158 785 -1293 374
6135 374 -978 657 -593 -465 542 -468 -687 250 105 -1265 649 34 108 647 -45 -530 107 -52
6153 -52 752 -167 421 423 -1120 875 489 -49 -274 178 -1232 -141 630 -50 -268 -844 -676 -1098 18
6172 18 -229 722 109 412 13 -110 -1850 1 -202 226 1203 461 -387 -368 -82 -26 -218 -1050 -39 325
6192 325 279 -732 -307 648 -794 16 6 110 -712 -179 -6 -165 415 147 -81 -464 482 -449 147 -1634
6212 -1634 566 -601 -215 -71 388 409 343 -305 -354 92 -508 228 377 -80 -756 333 -127 -646 147 -727
6232 -727 -337 -222 -1517 315 -345 -458 388 315 294 121 295 -355 736 227 328 565 168 913 -195
6251 -195 1058 -918 -962 -266 -152 624 25 1293 541 -136 238 530 -33 -30 -203 -526 139 771 849 -240
6271b40O97N21j067K43N13kj194J007p47p13J291m76J19N50r01j43K26R84r26
6290b58L66K01K41P9r74l59L80kQ00j541J493r04j43P81n17n55J225K2J11q04
6310c58K63P05j397M39M52m85R87R6j174J144n38q5m17J01K07l94J073m20K41
6329D40l39j84M81q41M39n39q22J588o06J160j392O96M31m14o55P20O21J98k67
6348G15n22k01K72j401L65m7P97L23m48o3j06L35N71m71n83J358k310J827J36
6367E47J37q48L91k82q19J176n04M93q66Q81j598J485q79R99r68l27Q95o48J255
6386E20j157J162l57n34O23q3l10LP1n94J549J6m10k12o95M46m23R00K81%j075
6407b79O86o55p82J128k29M30k96k77Q5Q8M95n56J80K96R49k837J672J16r37J649
$$ plain form
6271 -240 457 978 -89 154 667 665 -529 478 -269 -982 309 -167 -48 502 -399 -542 -316 668 -258
6290 -258 108 309 550 629 -345 -704 -324 -326 474 -1067 426 -478 -621 160 -357 -912 313 335 446 -358
6310 -358 -95 610 -787 -348 104 -381 606 702 -472 672 134 49 -368 -267 -60 -454 619 199 440
6329 440 101 -83 398 -443 -4 -543 -1365 223 -383 777 -615 81 512 98 -557 163 784 982 715
6348 715 193 -8 264 -1137 -772 -819 -22 301 -147 -210 -316 19 590 119 -464 894 -1416 411 547
6367 547 684 -164 227 -55 -874 302 -202 291 -575 306 -1292 193 -686 313 -655 -982 -87 -735 520
6386 520 -637 525 168 -366 257 174 -136 -133 -62 -656 893 909 499 287 -408 38 -385 515 796 796 -279
6407 -279 407 -248 -1030 98 -131 299 3 -274 -189 -101 394 -162 18 314 1263 -1574 98 214 -723 926
6427I26p00N10m8m04l38K3L97o72l86P10M91K54j036O86l5Q9m57j52r14J383J035
6448A362k071R69Ll01M92j323J121o37M74R63r24n71o65J533n61p52J301M5m72
6467a4k85P44o79j09J313o64N35p61l92L99M85Qr08P07j80j577J709n34J21J76
6487I4J00m67N09k68m5P49j203L64p78O81L59L55m39r1O95j053R64o23m80J806
6507A229j687K74K29N5j093J248J91k95k48j06J615j280j385J305O43r93m49Q53
6525A06P08r06m70J314j537J603j06j092J083l52l61j04l87P08r3N5J97l63r37
6544i34J45Q5J265q07r13J923m91k90m38L00m58J364j033M66O26p94n08m73P95
6563a70R90j607k68J072r5J37m68R72m9p79J387j474m2j14Q27p8J28n76J572r23
$$ plain form
6427 926 226 736 688 284 -54 -31 366 -306 -692 18 509 763 -273 413 378 467 10 -142 -1056 327 1362
6448 1362 -709 260 263 -38 454 -869 252 -385 89 1052 128 -443 -1108 425 -136 -888 413 458 -14
6467 -14 -299 445 -234 -343 970 306 841 80 -312 87 572 580 -328 379 199 -1378 331 -203 -82 94
6487 94 194 -273 236 -32 -77 672 -531 -167 -945 -264 95 450 11 -80 615 -438 526 -97 -577 1229
6507 1229 -458 -184 45 100 -993 255 446 151 -97 -203 1412 132 -1253 52 695 -298 -747 106
6525 106 814 -92 -562 752 -785 818 712 -380 703 351 -10 -114 -501 207 114 169 366 3 -934
6544 -934 -789 -704 561 -246 -1159 764 273 -17 -455 -155 -613 751 -282 184 810 16 -492 -965 -170
6563 -170 820 -787 -1055 17 -78 59 -409 563 514 -265 1122 -352 -394 -508 319 241 369 -207 1365 442
6583D42m21L6K61r28O99P98j673J573j749L74J124k16Q76j311L6O36o11O53j177
6602e78O86p00P81N05J38k134O29N49r06J206O88l99n73M82n80N37n91J67r96
6621a089M92l2J245l60O01o97P49j738Q05M50r74L63P26m68K02m71k62J003L39
6640H84K19j629J208o69j009J519j106J342q95n35R23J40m44r25J219r60O10m20
6658e28j40J179m98m6K59m23l16J069m05l12o25J112K36o47J95N03n13L5O44j253
6678d74P39K4n57P81k96o60O93n80J017o43n79K57M0j00qJ251j227m05P24j290
6698a293Q04LJ026M8j355J48K40P83j07N1r86M17K90J92p45M79O07r6o76P04l66
6719A68j076L20O49n87J003j59L07M19r41J28O58n70j9q01K64R67j841K497j111
$$ plain form
6583 442 21 57 318 -610 89 887 -786 787 -962 -588 536 320 1196 -115 -79 557 -54 599 -578
6602 -578 108 -592 189 694 832 -1302 -673 -124 -1030 176 864 465 -108 374 -206 331 -260 -93 -1089
6621 -1089 -597 -629 616 256 857 160 909 -829 -24 426 -548 -185 541 73 275 -196 -458 545 884
6640 884 1103 -526 682 13 -996 523 -583 759 -136 -671 252 392 -52 -977 242 -718 -108 -528
6658 -528 -668 511 13 -33 226 -197 -513 556 151 -161 -786 326 562 -85 110 613 100 135 779 -474
6678 -474 265 289 -268 513 217 -443 250 -330 687 44 -535 -278 -238 -338 -346 905 -322 -727 -3 -1293
6698 -1293 -489 -486 540 588 -767 -619 -379 404 297 348 -638 -221 69 261 -484 -5 602 506 -170 534 168
6719 168 -908 -588 61 -526 477 318 625 1044 103 231 889 319 300 -501 -237 730 -1111 1386 275
6738B75j33o79Q31K16n18K91k061J932n39O1k08J380o78J095j65j882J118k48
6756H8N25m97K30J10l40J46p6l07R4J25n14N11k06Q46o67J99N90n20j76j49j83
6777a71m60M66j92L90j85Q61j092O41l14l95N66j41p12J095J6n50l42L17l94M92
6797a04j0R39p38J43o23O28M41j012L38R64j051p42N36O62r63L36M10k17n80J084
6817D41J01j16j077k69P83n0K93L69L8k32k9o67K47L6J244j519J188j048q9R57
6837F01p23j41J42j055R46J418p67q00L65l89R49K93n77m15K4p13N13L1J19q21
6857a000J191K35r47K95l60O13n33Q6J06P72m99p80R78J116r42j332K41m76R12
6876c24K11L28M26q70J071r02r1o7l68J053M8j06L31k008J565N20m07j80j002
$$ plain form
6738 275 142 -537 294 510 -8 283 -1778 154 -385 -324 -532 848 170 1265 1100 -782 336 88
6756 88 613 116 346 456 116 262 186 -121 -27 98 -416 95 -111 735 68 267 857 337 161 12 -171
6777 -171 -631 -165 -357 33 -152 709 -383 258 -56 -451 115 -26 -738 357 373 -177 -519 -202 -596 -104
6797 -104 -114 825 87 230 -393 235 676 -336 2 966 -85 -827 -291 371 -592 -256 154 -63 -643 441
6817 441 542 426 -651 -920 -137 -187 106 475 513 281 252 -415 -168 -132 1112 -407 781 -267 -356 601
6837 601 -122 -263 -121 -1176 -230 1188 421 -379 -14 -403 546 839 262 -153 -129 -842 -329 -298 -179 -1000
6857 -1000 191 426 -521 -226 -586 27 -506 -420 -314 458 -41 -821 157 1273 331 -1001 -760 -1236 -324
6876 -324 -113 215 641 -229 842 -60 -151 -218 -586 467 515 409 740 -1268 297 817 410 230 -772
6895g72R20M97p29O41K99r42N88q3j76J42l00n40O88n79j62O41K76r47J166l64
6915B64l21N45n13j82Q74L71j109J70N26k18n95N69l99j214L42J444n66l3o80
6934g25P17L93m51o22M91J64j61m35P75k07K41R92j204k45Q03Q3k50N06l61q21
6954c17M90q63J141l47O21r03P17j165J065M5k11q61J043n26j20Q17n62J14o06
6973d28N90J498q40p07J58j244L12K28J83M42j73K43j3j53n73K07O66p58l11L83
6993b90N80o22M50l17o02L12J50O68k10L00L88r65k08j60m01J292J67l11J3o79
7013d45K99P4N10m47O46op14L86p96Q05q44M8Q08j68j020P13r8L58K43M69n66
7034B55J6j078P76L14pn36Q92l48j64M45o26P93j186k59o6K75J38N10m08p01J386
$$ plain form
6895 -772 148 645 -84 557 856 -86 502 419 243 385 85 -455 233 -346 -508 133 409 -538 628 264
6915 264 -57 488 -25 -207 667 1038 -71 99 625 407 -188 381 -18 -1232 -890 554 -12 -45 -725
6934 -725 -8 385 -66 -688 -197 -33 -194 -629 146 -61 180 1172 -32 -277 526 609 359 865 504 -317
6954 -317 173 -690 451 104 725 -178 539 -626 439 484 273 -588 455 -71 -191 626 64 178 -428
6973 -428 162 1660 820 113 271 -973 -661 -433 -250 192 19 262 249 96 -477 -270 396 -362 -673 -290
6993 -290 290 -332 118 -199 -801 -489 -339 329 119 419 807 -158 -366 -526 -927 365 532 221 234 -445
7013 -445 -146 -72 438 -9 637 631 -83 303 -493 312 -532 -484 324 156 -864 -151 -249 109 352 821 255
7034 255 271 -807 -31 283 276 -260 632 284 120 565 -61 732 -454 -713 -779 -504 -366 144 -264 -965 421
7055D21p95o47K228j639J100j315Q22q94P36L23j072J238n45J6L66j67p35M72
7073h7j55j211J179P37r31J145j092N31L9o90J274j065O96L64j800O05J090j177
7091e48R36q36j29Q56r56J430p78k65J067j001k34L42L02L07j09q54k06P78q4
7110A8M90o03q70J79J72N17O4m86J709j092p22Q01o28nM33l67m86l41J500j29
7130A54j31P90j283M43J89K13o59M36P4J0o3l81l53j7p4P30n06q52J424M48q64
7151b72L80J303j611k99L77O52P09j570J681j261r27J439j19j51k43J301j160
7168B29r05J029r04j32O13J14N48k13k47J054j061k12K39k80Q2l72M65p7R96j147
7188a81p97O40L15m80n6q1J507r97jn13%N46O41r1r6j504K085j137L83Q9o50O48
$$ plain form
7055 421 -374 -1021 1207 -432 668 -647 175 -719 17 340 -732 506 -39 -23 343 176 -559 -87
7073 -87 -242 -1453 -274 463 -468 677 -415 116 155 -535 739 -326 370 734 -1066 -461 629 -548
7091 -548 388 -448 -577 279 -677 753 -25 -290 777 -224 -458 -116 186 493 384 -470 -676 102 18
7110 18 508 -95 -965 -786 -614 -97 -33 -519 1190 98 -624 177 -451 -456 -23 -390 -876 -1217 283 154
7130 154 23 813 -470 -27 162 375 -284 152 226 236 173 -208 -561 -578 -652 78 -428 -1280 144 592 -272
7151 -272 108 1411 -200 -499 -122 530 1239 -331 1350 89 -838 601 482 331 88 1389 229
7168 229 -676 353 -551 -683 -70 44 592 379 132 1186 125 -87 152 -128 -46 -418 47 -30 966 -181
7188 -181 -978 -338 -23 -503 -559 -640 867 -130 -131 -644 -644 -98 543 452 356 -1148 937 -200 183 272 -378 270
7210B70k61l43o0J105q72N69Q1j2q8n95n23M00L92M00j201J549j729Q25K43M31
7230E81k38l47j41o7M38l0L50P5o73j83J58j95J53P61m93Q79L78j151o4q79N57
7251a31M17O5o67o9M63r9q23P46m33J18J360j282R90r97M84N92q99N63r12J384
7271H70p22j023P30m3o55J796j167J032l72j11R6m57P62r09R62j022J316j028
7289E5m03m13J191N1l31m47K91q1J28K80J61%m30Q8l10J17P03q52K93j034N05
7310d38l86J809j268R06p16j22o5N42L95l35q51j04N80n03J623j138k60O35k96
7329HK61k50R6l45K78k41N62o72O15j241J772q67l6o34R13q0j94N06j02j118l00
7350a069O27K84l86M45N7J43k09m4K80o97Q17O62n45n18J553o83q78P43M9k423
$$ plain form
7210 270 9 -334 -394 711 -161 408 489 477 389 -206 -729 -329 63 463 -738 811 -918 -93 150 581
7230 581 343 -4 -145 -212 226 196 546 621 -52 -235 -77 -272 -119 642 149 1028 1406 255 191 -688 -131
7251 -131 286 351 -316 -385 78 -21 -844 -98 -531 -413 947 -335 655 -342 142 734 -165 398 -514 870
7271 870 148 -875 -145 -188 -843 953 -214 818 446 335 431 -26 736 -173 789 -233 1083 55
7289 55 -348 -761 430 481 150 -297 -6 -87 41 321 482 482 52 140 -170 -53 650 -202 91 -943 -438
7310 -438 -824 985 -283 623 -93 -215 -280 262 657 322 -529 -633 -53 -556 1067 -71 -331 304 8
7329 8 269 19 115 -230 48 -193 369 -303 312 -929 843 -24 -60 -694 219 139 -55 451 349 -769 -1069
7350 -1069 -442 -158 -544 -99 -42 101 -108 -152 128 -569 248 910 365 -153 1400 717 -161 582 631 -1792
7370a792K016K28l62P79j012n03O38n7o5M15L84j25l94N58n48o20j71J615p81
7389B03R7pQ0r06M29m77R91n21k92Q69j075n21O10N71M88j207R71j30j542K511
7409A142j704J37J63J8M36M86m35P87k391J537j17L40k339Q36Q99k16O28j028
7427h21Q96r5r8m42N65J392j233j59l22k69J005p24K83r50Q70J84m84p79J737
7446E56Q12j994J343p54m8J617r95L44jq89n56L78P66o25n97N92O02j312P36R51
7466I26n17P4k87L13n40k87L91K72P4P9l08q21N03q79O56rL34j5j284J554j91
7487C8l00p07M79P42q13j16J063k81M86o01K90O76j236J008m69q51J047m25l88
7506c58p3r8J99O74K46j277j1P43lk83m07L54k20O02l09K69P28l24j142M75N75
$$ plain form
7370 -1792 224 452 90 869 -143 -646 -8 -65 -130 285 669 544 150 708 160 -460 -631 984 203
7389 203 300 293 373 -533 -104 -581 410 -111 -403 466 -609 -1130 -520 51 539 -668 303 173 -1369 1142
7409 1142 -562 -425 -262 -244 192 678 243 1030 -1361 176 59 399 -1940 -1104 -205 -421 207 -821
7427 -821 75 -20 -118 -560 5 1397 164 5 -317 -586 419 -305 -22 -972 -102 82 -402 -1181 556
7446 556 1368 -626 717 -37 -85 1532 537 881 880 -9 -565 -187 579 -46 -643 -51 551 -761 -25 926
7466 926 409 483 196 509 -31 -318 73 345 419 498 190 -631 -128 -1007 -351 -360 -26 -41 -1325 229 38
7487 38 -262 -969 -490 252 -561 -677 386 105 591 -10 280 956 -280 728 259 -592 455 30 -358
7506 -358 -431 -529 -330 344 590 -687 -698 45 42 -241 -648 -294 -514 88 -221 48 776 452 -690 -215 360
7527C60J18j230O6Q58k88M80l63L33l51m2m06M71P99n82J53p4r85Q26r53L18L86
7548a06p03J709q84m96L74P15r05O00K09k30j44j14N29o05N51r75P71K68p25l75
7568e36O0J306q59L6L7l84M30Q03o94o02N02n75M64O16p40N05j409J307J56l44
7588G9o47K05O47j336J959l63j264O00m60N13J80J60j92J116k89j74r47O8K97
7607A52l82Q7Q06q15N14m39O03j353J328K36j081O35j415J840m54n24J17j12L68
7626A11Q00j476l63N96j79K15k%M51o86Q72k56o4K68N24r12K91R07n56p73M15
7647A83j111O65O03o43j226K101j041J7P24M10j57l19N13j591N13r0k36M22l42
7666f05m8M69L96K19o57r2L0O18M8r36q3R05P28j085J67j54O2Q03q98M41Q4o33
$$ plain form
7527 360 478 -752 -686 172 -116 364 1 334 -17 -59 -465 6 805 223 376 302 -683 143 -810 -492 -106
7548 -106 -809 900 16 -480 -106 609 -296 304 513 283 139 25 554 -51 500 -475 296 564 -161 -536
7568 -536 -476 830 -29 7 44 -340 90 893 199 -403 99 -476 -12 604 -136 369 -1040 267 423 79
7588 79 -568 -363 284 -1052 907 544 -720 -120 -580 -67 113 273 81 1197 908 734 -213 -145 152
7607 152 -230 -143 663 -152 362 -77 526 -827 501 737 -344 291 -1124 716 262 -262 -145 -257 111
7626 111 911 -565 -928 -332 -511 -296 -298 -298 153 -533 339 83 19 287 811 -101 190 1097 541 -232 183
7647 183 -928 -263 340 -303 -1529 572 -469 -452 272 682 525 206 719 -872 -359 -449 -685 -263 -605
7666 -605 -653 -184 212 431 -226 -318 -288 330 378 -558 -641 264 992 -93 74 -80 -18 785 -113 328 412 -221
7688b21N24j063Q28k45M93j489M26O44N48J63j149J317J06k110J565L87r0R2m9
7707F77r01m66N69M98jq09J323j265M84P82r70K42j314J056N35k77j27pR16j459
7727e14k52Q86R78j675P96p82J036o56L72P45j048N91J37q43l9L16j9J42j27j123
7747a079N41J059n2l07n79R09q38P17q92J337j442J289k05k6j64J77l4j04L1p41
7767d03J124j216l82J058l63o85P54m11j43Q08M11j63q07J131r56J084o64K48
7785D25m10Q59j206J72q76Q64J146p62K16q87O22p01N54p95J138O5L52n61N30
7804G45k30p86N66m89J296l77m47KL0m71r39J013J37p14J256M55q68o97L30o39
7824h27p1R04n10N76M11j147J188K89j223M54N54j029K31N35q59P34R9j045J009
$$ plain form
7688 -221 303 -760 68 -177 316 -1173 -747 -103 445 608 -541 776 882 -1228 337 724 634 726 677
7707 677 -224 -690 -121 377 376 -433 890 -375 109 891 -79 163 -1151 -95 440 163 36 29 945 -514
7727 -514 -766 120 1098 -577 219 -563 473 -183 189 934 -114 477 614 -229 -268 48 29 171 44 -1079
7747 -1079 -538 521 469 162 -417 492 -346 371 -521 816 -626 663 458 432 268 445 411 307 338 -403
7767 -403 721 -495 -877 181 -182 -867 -113 -524 -667 141 552 389 -418 713 -243 841 177 425
7785 425 15 874 -332 -160 -1036 -172 974 212 428 -459 163 -538 16 -779 359 424 776 215 745
7804 745 515 -271 295 -194 1102 725 278 280 310 -161 -1100 -87 50 -664 592 1047 179 -518 -188 -827
7824 -827 -898 6 -504 72 483 -664 524 813 -410 44 598 -431 -200 335 -524 210 309 -736 273
7843B73r12M60M77m77M35m12K48J78k47L49k85M56k12K31n86j87j67KN64j09J217
7864A296j429k79k26J061q58N72P53j098O35N28m72q95J74O96j73r4N6q15R43
7883C75r86L73J22P27k39r55J463j330J85L88P12K8j095Q79j954J278k20Ln13
7902g59O39l7J03K66j186J673j77m0n33l84J7j09N29N72j082J075j28m32Q4p25
7922f34J075q05R25k09k49o66K03l67P10m71J024J04q14Q51o20r7M95p26k87J078
7942E20j449N36L01K38J5M8K04j15N98Q1j193K51JQ27j202j52J547j162J51k69
7962b24O73R1l73j08j064P83O22j77o25N41N73j284J48N8J126k182J696l53K91
7981B12p02K43n59J195j256P70N6o49Q95O92K88J08j750P38L18p17j37P64j484
$$ plain form
7843 273 -639 -179 298 -179 256 -156 92 270 23 372 87 543 331 562 -24 -211 -378 -376 188 79 1296
7864 1296 -133 -412 -638 423 -435 137 890 -208 427 955 483 -412 -238 458 285 191 247 -568 375
7883 375 -611 -238 -116 611 372 -583 880 -450 -265 123 835 863 -232 647 -1307 -29 -249 -246 -759
7902 -759 -120 -157 -54 212 -974 699 522 482 -51 -435 -418 -527 2 574 -508 567 439 7 91 -634
7922 -634 441 -364 561 352 103 -563 -360 -727 -17 -488 536 640 -174 677 57 -40 455 -271 -558 520
7942 520 -929 -393 -92 146 161 209 413 298 896 977 -216 35 36 863 -339 -491 1056 -106 45 -224
7962 -224 449 540 167 59 -1005 -222 400 223 -402 139 712 -572 -424 -366 760 -1422 274 -79 212
7981 212 -490 -247 -806 389 -867 -97 -41 -690 205 897 1185 1293 -457 281 599 -118 -255 509 -975
8000i75J615m28o48j12k49Q75J431o74k56j171L06K67J16k49R23j139k01K65l64
8019f68P97l52L74o3j072J098J020r20O58o59l94K65m9O30l36n75p33R93J86k03
8039cL55j76o48M63O81n37j020L48j20P18R6R14j159L73j128J635n86M34o63P97
8059G74j336P0o5R03n24O72j67m78J363j181m20N12m69R5J62K88K26k10O84m23
8079D76j450J279n50J121r55O88n01o83N62K10L71j446L83J665n32q83J96O42
8097E93r77N55m52K36j2L98j490J215l62N30K67P85j449l2J75M16L97k061J272
8116Do7L43r13M00k1O86K76j597O70J256q85j6l9K9J11j74j34O04p31k36R72k31
8138C07j353J094R54r81K04j26R8j095P08J068j266R9J135n32o91K32m63J369
$$ plain form
8000 -975 640 212 -436 -548 -797 78 1509 835 579 -592 -286 -19 97 -152 771 -368 -569 -304 -668
8019 -668 129 -223 151 88 -984 114 1134 214 872 213 -181 84 35 665 329 -246 -979 14 200 -3
8039 -3 352 176 -472 -9 672 135 -885 -537 -657 61 157 1071 -88 285 -843 792 206 640 -23 774
8059 774 -562 -492 -557 346 -178 494 327 -151 1212 31 -389 123 -346 -251 -89 199 425 215 899 476
8079 476 -974 305 -245 876 -79 609 108 -575 -13 197 568 -878 -495 1170 638 -245 -49 593
8097 593 -384 171 -281 -45 -57 341 -1149 66 -296 234 501 1286 -163 -195 -20 396 793 -1268 4
8116 4 -63 280 -633 -233 -254 432 708 -889 -219 1037 152 136 97 126 237 63 -71 533 -198 -434 538 307
8138 307 -1046 48 1002 21 225 99 197 -898 -190 878 -388 -289 846 314 -377 -145 -608 761
8156G61m32N47o00K1l85L38k22o30P77o6r17J228r17M24L56n62J020l25P05q58
8176B63j250J182L96q90k26m15O35j18m75M01R2M33l10p69R96
$$ plain form
8156 761 329 876 276 297 -88 250 28 -602 175 109 -808 420 -497 -73 283 -279 741 416 1121 263
8176 263 -987 195 591 -299 -525 -940 -305 -423 -898 -497 -405 28 -282 -1051 -55
8191e5
$$ Imaginary data points
##PAGE= N=2
##DATA TABLE= (X++(I..I)), XYDATA
0@JjNrJ8j1L3m4N1o7P3q3J03j30J52j80K04k36K74l16L59m08M61n24N86o64P42
27C89q37R43j053J177j319J471j649J852k086K362k698L107l608M238n067O164
43C386p301J108k53903K462K6259j5962R089p094O103m070P576L86Q400N950J1829
58b05782R711J4126J3969J5317J5531J7334J6033J9526J5814J9053J7190J6358
70a5820J6761J5811J3541J4618J3662J0101J0066P583O830O705K697J900N81k85
84A04751l415l688l029q228o396q063r375q897j0801j1174j0206j1653j0509j1259
98a1942j2129q840r358r025q213q022m985o870m330j842k551j830Q67Q45N68L131
114h4526L946M049O333N871P771O388Q125P229P654Q636P186Q307O696P375P276
$$ plain form
0 0 1 0 5 -4 14 3 36 -8 43 -24 49 -34 69 -61 91 -89 115 -121 153 -163 196 -212 249 -275 311 -353 389
27 389 -448 495 -558 619 -700 771 -878 974 -1112 1250 -1448 1659 -1949 2289 -2778 3386
43 3386 -3915 -2807 -256710 -254248 -227989 -243951 -234862 -241956 -235853 -239923 -232347 -231961 -223561 -217611 -205782
58 -205782 -196071 -181945 -167976 -152659 -137128 -119794 -103761 -84235 -68421 -49368 -32178 -15820
70 -15820 941 16752 30293 44911 58573 68674 78740 86323 93153 99858 102555 104455 105036 104751
84 104751 101336 97648 94619 86391 79995 71932 62557 53660 42859 31685 21479 9826 -683 -11942
98 -11942 -24071 -32911 -42269 -51294 -59507 -67529 -72514 -79384 -83714 -85556 -88107 -89937 -89070 -88225 -87657 -84526
114 -84526 -80580 -76531 -70198 -64327 -56556 -50168 -42043 -34814 -27160 -18524 -11338 -3031 3665 11040 18316
129A8316O289M996N991K993L653J944K505K49J52r23k361q64l515l409m405m924
145B6687n453n766n520n427o156o028o720n524p009m984m450m885m565l711k765
160e2276k815j425k522j286M78J431N94K890K581J795L846M436L591M684M807
175b9191M493N722N612M287N110M445M305M789L755M146K608K735K308J282J085
190B7491l97J516r53o72k284j630k308j758l843k345n133k880n146m035l170m650
206a2197l302m271l342m094l412j013l382j026k115j989l31j318Q17P64N8J389
222c8764K506K059K765K635L634J577L890K927M708K839J469N615J929L597K544
237E930K416K505Q10J783J250Q21K66P25j365P55k622j622o71k012k212k707k709
$$ plain form
129 18316 24605 29601 35592 38585 42238 44182 46687 46936 47088 46165 43804 42940 39425 36016 31611 26687
145 26687 21234 15468 9948 4521 -1635 -7663 -14383 -19907 -26916 -31900 -36350 -41235 -45800 -49511 -52276
160 -52276 -55091 -56516 -59038 -60324 -59846 -58415 -57821 -54931 -52350 -50555 -46709 -42273 -38682 -33998 -29191
175 -29191 -24698 -18976 -13364 -9077 -3967 478 4783 9572 13327 17473 20081 22816 25124 26406 27491
190 27491 27094 28610 27657 26985 24701 23071 20763 19005 15162 12817 7684 4804 -342 -4377 -7547 -12197
206 -12197 -15499 -19770 -23112 -27206 -30618 -31631 -35013 -36039 -38154 -40143 -40474 -41792 -40975 -40211 -40153 -38764
222 -38764 -36258 -34199 -31434 -28799 -25165 -23588 -19698 -16771 -12063 -9224 -7755 -2140 -211 3386 5930
237 5930 8346 10851 11661 13444 14694 15515 15781 16506 15141 15896 13274 11652 10981 8969 6757 4050 1341
254A341k830l016j639m402k360k742j657m195j748j987k308j324k206j692L15
269c2450j334J603j29Q11M81J829J571K105J682J072L192K728K331L349K283L301
285e575L115K225K635L016K040J594K838J344R30J954r05P44j77O77r91q11O7
302A4720k265j950k466j451k410j646k781k627k270k211k429k799k269l163k246
317b0263j789k069m33j781k062M76j184M31o69M73N11J163J150J575J097K617
333b0757J523J412K510K355L312J299K507L049J754J245L200J423K215J154K348
348A0549L32K225m89j270J601j026N35j669m44q01j225j885j803j762j681j937
364g50j671l020r70k272k317j372j930j130k493j272m57j242p08J578r32m67o39
$$ plain form
254 1341 -1489 -4505 -6144 -10546 -12906 -15648 -17305 -21500 -23248 -25235 -27543 -28867 -31073 -32765 -32450
269 -32450 -33784 -32181 -32310 -31499 -31018 -29189 -27618 -25513 -23831 -22759 -19567 -16839 -14508 -11159 -8876 -5575
285 -5575 -2460 -235 2400 5416 7456 9050 11888 13232 14162 16116 15211 15955 15778 16455 15464 14653 14720
302 14720 12455 10505 8039 6588 4178 2532 -249 -2876 -5146 -7357 -9786 -12585 -14854 -18017 -20263
317 -20263 -22052 -24121 -24554 -26335 -28397 -27921 -29105 -28674 -29343 -28870 -28359 -27196 -26046 -24471 -23374 -20757
333 -20757 -19234 -17822 -15312 -12957 -9645 -8346 -5839 -2790 -1036 209 3409 4832 7047 8201 10549
348 10549 10881 13106 12617 11347 12948 11922 12457 10788 10344 9543 8318 6433 4630 2868 1187 -750
364 -750 -2421 -5441 -6411 -8683 -11000 -12372 -14302 -15432 -17925 -19197 -19654 -20896 -21604 -20026 -20958 -21425 -22064
381b2064J097J915j167K505J091L95L096J131L03K451J655K213L057R00K147K125
397B850J377J910J021J796n2J397P11K45J526j219O21r15o70m63j128l75j756
414F876j520j572j708k107j232j342j975k191j496k298q83j765o25k024j057j748
430a8667L92n76L19j79o02J654j203K135q22J738Q19Q67J826J881J021K073J280
447f044K226J442J022K696J824l5K622O32P20J267Q12Q59l72J712j601J902j670
464A0014P80j649j427L91k448k41q11k057r29k957K97j772q19k230j920n92pj819
482a0196j028r78J55j093o63j132Q39k08K25K57J457j75K71J040J515J48J982
499g584J200J369J775O74K061R27J263J296J291J725Q96OR81Q12m45l43J598j018
$$ plain form
381 -22064 -20967 -19052 -20219 -17714 -16623 -16228 -13132 -12001 -11698 -9247 -7592 -5379 -2322 -1422 725 2850
397 2850 4227 6137 7158 8954 8902 10299 11010 11255 12781 11562 12183 11268 10598 10135 9007 8632 6876
414 6876 5356 3784 2076 -31 -1263 -2605 -4580 -6771 -8267 -10565 -11448 -13213 -13838 -15862 -16919 -18667
430 -18667 -18275 -18851 -18532 -18711 -19313 -17659 -18862 -16727 -17549 -15811 -14992 -14125 -12299 -10418 -9397 -7324 -6044
447 -6044 -3818 -2376 -1354 1342 3166 3131 5753 6385 7105 8372 9184 10043 9671 11383 9782 11684 10014
464 10014 10794 9145 7718 8109 5661 5420 4609 2552 1623 -1334 -1037 -2809 -3628 -5858 -7778 -8370 -8377 -10196
482 -10196 -11224 -12202 -12047 -13140 -13803 -14935 -14096 -14304 -14079 -13822 -12365 -12540 -12269 -11229 -9714 -9566 -7584
499 -7584 -6384 -5015 -3240 -2566 -505 422 1685 2981 4272 5997 6893 6899 7880 8692 8247 7904 9502 8484
517H484L89q62p48j95m49j024k450j65j264o04j484j419j899l36j322j400j622
534h370l48q34j386k29r52N62r2l61j764J265O72Q4J290J143j401L028n5J745
552f003J298J581P38J026J823J541P32K034r71K086J275m19J926L28O69J38J70
569I972r78K048r76j337M80j600j4j500j420L5j321j367p66k415o76j736j066
586d637p12j428m72j091j032n9j017j72M9p53K2j55l45J464J20J0K005P09q9J795
606e788J147J168Q52J263J450J461R69J135O81J405J459j29O29M58K89k92P32
623H889j36J309j573MM24k513r71O34j234j301j414j647j39j78k339k31q37l277
641f530O28l02j303m61j483N11j309R47l47q09o09J785J85R90M33P29J764Q6K548
$$ plain form
517 8484 8873 8011 7263 7068 6619 5595 3145 2980 1716 1112 -372 -1791 -3690 -4026 -5348 -6748 -8370
534 -8370 -8718 -9552 -10938 -11167 -12119 -11557 -11649 -12010 -13774 -12509 -11837 -11753 -10463 -9320 -10721 -7693 -7748 -6003
552 -6003 -4705 -3124 -2386 -1360 463 2004 2736 4770 3799 5885 7160 6741 8667 8995 9664 9802 9972
569 9972 8994 11042 10066 8729 9209 7609 7595 6095 4675 4710 3389 2022 1256 -1159 -1835 -3571 -4637
586 -4637 -5349 -6777 -7249 -8340 -9372 -9431 -10448 -10620 -10571 -11324 -11302 -11457 -11802 -10338 -10218 -10208 -8203 -7494 -7583 -5788
606 -5788 -4641 -3473 -2621 -1358 92 1553 2522 3657 4338 5743 7202 7073 7702 8160 8449 8157 8889
623 8889 8753 10062 8489 8493 8917 6404 5433 6067 4833 3532 2118 471 332 154 -2185 -2416 -3253 -6530
641 -6530 -5902 -6204 -7507 -7968 -9451 -8940 -10249 -9302 -9649 -10458 -11067 -9282 -9097 -8107 -7674 -6945 -5181 -5095 -2547
660b547J50J226j5K086P95J165K23J865P24J221R79P75k21P06M62j320J273M58
678A0005j715P50q92l1j343l01j113k006j188K43q82j006j613k25k823M65k123
695e798q94l04K58r84j017q34j06j95K01M50n02J72P32L7J724M14n45J991N82
714d618J429J782R97J031J064J049J590K94Q56K51O04J327J144n31J808j216K62
731I123m34p30k76K1n37o62j493q2j147o55r76j536p68L43j683l29j868j496j380
750f565P72j001k76j09j75j39l83j48R36j660K729n71m88J411J335Q66Q77N27
768b062J88J286K14K130M89P99O00J251K70N77M02K105q74J074j411R47o98m5
786G242K95O4j132j242q80M17j599O05j432j729m24r57j585j194N01j452K33j861
$$ plain form
660 -2547 -2397 -1171 -1186 900 1695 2860 3083 4948 5672 6893 7872 8647 8426 9132 9594 8274 9547 10005
678 10005 8290 9040 8148 8117 6774 6473 5360 3354 2166 2409 1527 521 -1092 -1317 -4140 -3675 -5798
695 -5798 -6692 -6996 -6738 -7722 -8739 -9573 -9679 -9874 -9673 -9223 -9725 -9553 -8821 -8784 -7060 -6646 -7191 -5200 -4618
714 -4618 -3189 -1407 -410 621 1685 2734 4324 4618 5474 5725 6329 7656 8800 8269 10077 8861 9123
731 9123 8689 7959 7683 7704 7167 6505 5012 4930 3783 3128 2152 616 -152 191 -1492 -1821 -3689 -5185 -6565
750 -6565 -5793 -6794 -7070 -7179 -7354 -7493 -7876 -8024 -7088 -8748 -6019 -6590 -7078 -5667 -4332 -3466 -2589 -2062
768 -2062 -1874 -588 -374 1756 2245 3044 3644 4895 5165 5742 6144 8249 7375 8449 7038 7985 7287 7242
786 7242 7537 7601 6469 5227 4347 4764 3165 3770 2338 609 185 -772 -2357 -3551 -3050 -4502 -4269 -6130
804f130Q94j411R0K55j516J58J219o94J56J052j68J594q56R48N72R37R16R09q76
823a951J837J413N77R98N85L26K026q0M21n60R96J59K8p5k72P27p11M58m99j319
843E084k60k29k241M49j101O87k136R2j681j98l27k010j55R0j07n46r6m58r61
862f104M87l78l29J701p45J68L08O97J483o75R11K029k98J144O53j86R70J215
880C051p5J506R11n93P26o98O11K92N29r53l24J083n98m21n6j009p06k74j88M13
900C227k086j139k16j067o02l61r14j075J07j12Q53k403J950j092J25J65J063
917c577j695J211n57J373K93o27J468N42O71K13M52K152QK61J433j37r1K409p15
936E087j52L03J38N91R55n31n99p15k60Q73j111K02j248l74K35n83r34r12j433
$$ plain form
804 -6130 -5236 -6647 -6557 -6302 -7818 -7660 -6441 -7135 -6979 -5927 -6095 -4501 -5357 -4409 -3837 -2900 -1984 -1075 -1951
823 -1951 -114 1299 1876 2874 3459 3785 5811 5731 6152 5592 6588 6747 6775 6700 6428 7155 6444 6902 6403 5084
843 5084 4824 4595 2354 2803 1702 2389 253 345 -1336 -1534 -1861 -3871 -4026 -3936 -4043 -4589 -4685 -5143 -6104
862 -6104 -5617 -5995 -6324 -4623 -5368 -5200 -4892 -4195 -2712 -3387 -2476 -447 -745 399 1052 866 1836 3051
880 3051 2976 4482 5393 4800 5526 4828 5439 5731 6260 5307 4983 6066 5468 5047 4991 3982 3276 3002 2814 3227
900 3227 1141 2 -214 -1281 -1883 -2244 -3158 -4233 -4126 -4238 -3385 -5788 -3838 -4930 -4805 -4640 -3577
917 -3577 -5272 -4061 -4618 -3245 -2952 -3579 -2111 -1569 -898 -685 -233 1919 1927 2188 3621 3484 3393 5802 5087
936 5087 4935 5238 5376 5967 6922 6391 5792 5077 4817 5690 4579 4781 3533 3159 3394 2811 1877 965 -468
955d68J354k583P90j016l58n90j34n61L39j17L07m87n76q9o09Q66o87J446P98
974b375k27K6N27K95Q02J113j43J7J300Q26j46J111n00O06P01K01J212q70K34
993D710q0l58J0K45J24r6J52j555N99P04j309j269M71o73m32j407n50j297J26
1012a885m99O39m90l13m80K92p84M08o78q27J207r8N11p06Q37N31M09R46n08Q75
1032f13n58J547R26m69J08Q04J947j181J180L8p85J435p80O10l64P5P28k86o29
1051C733L76n09o08J62J34J28m47j139o77M24j118n04j302N08l23q70l93j009
1069c434J460q07K20O71q33L4m00R93j52o94J041Q35r06j054K197P25j700J266
1087e38Q77L75O48m8Q49p5P12R7j81N90J13J87l36O27p66J086L04k473J117k12
$$ plain form
955 -468 886 -1697 -907 -1923 -2281 -2871 -3005 -3566 -3227 -3344 -3037 -3524 -4100 -4189 -4798 -3932 -4619 -3173 -2375
974 -2375 -2602 -2576 -2049 -1754 -952 161 18 35 1335 2161 2015 3126 2626 3232 3933 4134 5346 4476 4710
993 4710 4630 4272 4282 4527 4651 4555 4707 3152 3751 4455 3146 1877 2348 1675 1243 -164 -714 -2011 -1885
1012 -1885 -2384 -1745 -2235 -2548 -3028 -2736 -3520 -3112 -3790 -4617 -3410 -3508 -2997 -3703 -2866 -2335 -1926 -980 -1488 -613
1032 -613 -1171 376 1302 833 941 1745 3692 2511 3691 3729 2944 4379 3599 4209 3845 3920 4648 4362 3733
1051 3733 4109 3600 2992 3154 3288 3416 2969 1830 1153 1577 459 -45 -1347 -839 -1162 -2032 -2425 -3434
1069 -3434 -1974 -2781 -2561 -1890 -2723 -2689 -3089 -2096 -2248 -2942 -1901 -1066 -1972 -3026 -829 -104 -1804 -538
1087 -538 339 714 1362 1314 2163 2088 2800 2897 2716 3306 3419 3606 3270 3897 3131 4217 4521 2048 3165 2953
1107B953j56j649J052J85j563N47o36M23j144j124R65j105L6q67Q26n34M52j13
1125a452j551J144j265m6J475M67QQ9j19R0N50p70J729k48o99J078P14k91L17
1144A220N78O18k82J69R07j526J236M98j248L41j27J338n57o97L00p69M06j25
1162B280q01j24l32l6P7q72m69L02q95j79K47j189K02N7j16n78J09k92J575o62
1182a696q04j63O92l66J114O79l80J368k056K009R7j74P7J7K21J99J322O11j74
1201B593N5J11O66k32l30n1l8n35k2M76N4r1r20J34p21J07K78j545M98J462k206
1222b57p12J93j4j44p91K01J485j277l91j65L52m42o99N50J91K9m62R96k65M27
1242a195J060l23l86K99O5J576l8p79Q98k36L91j4K30o18N02J235n96r4O97j202
$$ plain form
1107 2953 2797 1148 2200 2385 822 1369 733 1156 12 -1112 -147 -1252 -1216 -2083 -1257 -1791 -1339 -1452
1125 -1452 -3003 -1859 -3124 -3170 -1695 -1228 -1220 -1131 -1250 -1160 -610 -1380 349 101 -598 480 1194 903 1220
1144 1220 1798 2416 2134 2303 3210 1684 2920 3418 2170 2511 2384 3722 3165 2468 2768 1999 2405 2280
1162 2280 1479 1355 1023 987 1064 192 -277 25 -870 -1049 -802 -1991 -1789 -1732 -1848 -2426 -2317 -2609 -1034 -1696
1182 -1696 -2500 -2663 -1971 -2337 -1223 -544 -924 444 -1612 397 494 320 397 414 635 834 2156 2767 2593
1201 2593 2648 2759 3425 3193 2863 2812 2774 2239 2217 2693 2747 2656 1736 1870 1149 1256 1534 -11 487 1949 -257
1222 -257 -969 -776 -790 -934 -1725 -1524 -39 -1316 -1707 -1872 -1520 -1962 -2661 -2111 -1920 -1891 -2353 -1357 -1622 -1195
1242 -1195 -135 -458 -844 -545 -480 1096 1058 279 1177 941 1332 1318 1548 930 1432 2667 2071 1977 2674 1472
1262A472J599j451N96l98o94J91N87j047Q3L53m18j003K68j49k32n7J25l88k29
1281g92p23j46J250j174N3q3O56j669N27R70o06N87o40N07l05N56n26J026J73
1300c59k82R22p99J203m71J933L20j868l06K228n40k48j24Q1K29J00N40K7j281
1319A305O48j021m44J419j619J279o81j27j003N08n60L3m50m5r15k23P31j055
1337b220N35j53o96N42L81l33m15J001J49j062M51J016j123r9J885n97n65P33
1355e70O01n49M86P26J77q8K69j04M43N44L11m99k85L80L2J097k315L73Q18O39
1375B486r65n1J79j375J559j986R13k11j223R19R4n47L83j280J115j203j028J178
1393a043l22p5M79n90m37M48j33q24J299n16L37M42q32M61k72Q31N46M33n50N
$$ plain form
1262 1472 3071 1620 2216 1818 1124 1315 1902 855 938 1291 873 -130 138 -11 -243 -300 -175 -563 -792
1281 -792 -1515 -1661 -411 -1585 -1532 -1615 -959 -2628 -2101 -1131 -1737 -1150 -1790 -1283 -1588 -1032 -1558 -532 -359
1300 -359 -641 281 -518 685 214 2147 2467 599 293 2521 1981 1733 1609 1690 1919 2019 2559 2586 1305
1319 1305 1953 932 488 1907 288 1567 886 759 -244 264 -296 -263 -713 -758 -1673 -1896 -1165 -2220
1337 -2220 -1685 -1838 -2534 -1992 -1611 -1944 -2359 -1358 -1209 -2271 -1820 -804 -1927 -2026 -141 -738 -1303 -570
1355 -570 31 -518 -32 694 871 783 1052 948 1391 1935 2246 1747 1462 1842 1874 2971 656 1029 1847 2486
1375 2486 1521 1470 1649 274 1833 -153 760 549 -674 245 339 -208 175 -1105 10 -1193 -2221 -1043
1393 -1043 -1365 -1440 -961 -1551 -1988 -1540 -1673 -2497 -1198 -1714 -1377 -935 -1767 -1306 -1578 -747 -201 232 -318 -313
1413c13Q28J30N10M9P62r99L22Q69R7r27o7P41l61n73m86J12O47K02j206P75j077
1434C5M10j008Q40p02q54N15n13K29p9j92m44l45K06l74J036j035J604j576J022
1453a225J05j462J907j645M68J771j521J002L88N05M18j464J466L07k17Q8K64
1470A155O28m31J37jL45m36j24N90q84J153j254L73J93l20j071L68k49J09r3j098
1490i10R58K13o90j069J354j413k71J216m69j081J81N18K17j203J94m13L30J66
1508b172J634o05l27K58m5N81K08K91r54P58K00O60p95J532l78L06M72J97r30
1527H91O5O82p19J49P24j633J516m49m91o07Q38k86J014r77q78K55L3o03k24n67
1547a267k29Q42j248P02j435O54N05k77J65k12J17j93q37J678j38K02m01l80J091
$$ plain form
1413 -313 515 645 1155 1204 1966 967 1289 2158 2255 1328 1261 2002 1641 1068 582 694 1341 1543 337 1112 35
1434 35 445 -563 277 -425 -1279 -764 -1277 -1048 -1127 -1319 -1763 -2108 -1902 -2276 -1240 -2275 -671 -2247 -1225
1453 -1225 -1120 -2582 -675 -2320 -1852 -81 -1602 -600 -212 293 711 -753 713 1020 803 891 1155
1470 1155 1783 1352 1489 1488 1833 1397 1273 1863 979 2132 878 1251 1444 1124 53 421 172 281 188 -910
1490 -910 48 261 -429 -1498 -144 -1557 -1828 -612 -1081 -2162 -1981 -1463 -1246 -2449 -2255 -2668 -2338 -2172
1508 -2172 -538 -1143 -1470 -1212 -1257 -676 -468 -177 -1131 -373 -173 487 -308 1224 846 1152 1624 1821 891
1527 891 956 1638 919 1068 1792 159 1675 1226 735 128 966 680 1694 717 -161 94 127 -476 -700 -1267
1547 -1267 -1496 -654 -1902 -1200 -2635 -1981 -1476 -1753 -1588 -1800 -1683 -1876 -2713 -1035 -1173 -971 -1372 -1752 -661
1566f61r83J012N18k4K23M73J34o07R34l52J35K50L67l30K46k35K29L37n00p55
1586D11N22j11l9P5M8k75r97K7M98n01j37K3k00j136Q81q86J3R6m2P42l79j5K93
1609a089j338K67R88p4K46p63m43J122j69N83M23J41J51L9L49l91L31O57l89N26
1629A167L76n89N06r72J267o35M30l79k1P3l45M97J70r37q34L89J97j013K75m16
1649g94Q6O80j393O91q67j03J605j926P14o9n62P54o31M24k07l60l36P33P22m35
1669a274Q86j10m88J296j014N62J375j915M01J148M57m10K11l38R44j24k93p94
1687E20J278n89O25k46q86J133j122m30K21j70R6O25j56k21j121k41m5P13j449
1706a465L25r70M63L22p27K74m91j33J342j96r93N94j038O94Q01J68n57Q66P35
$$ plain form
1566 -661 -1644 -632 -114 -138 85 558 692 85 1019 667 802 1052 1419 1089 1335 1100 1329 1666 1166 411
1586 411 933 822 783 858 906 631 -366 -339 159 -342 -479 -456 -656 -1792 -911 -1797 -1784 -1688 -1730 -988 -1367 -1382 -1089
1609 -1089 -2427 -2160 -1172 -1246 -1000 -1763 -2206 -1084 -1253 -670 -247 -106 45 84 433 42 373 1030 641 1167
1629 1167 1543 954 1460 488 1755 1120 1550 1171 1150 1223 878 1375 1545 608 -226 163 360 -653 -378 -794
1649 -794 -708 -28 -1421 -730 -1597 -1700 -95 -2021 -1307 -1376 -1938 -1184 -1815 -1391 -1598 -1958 -2294 -1561 -839 -1274
1669 -1274 -388 -498 -986 310 -704 -142 1233 -682 -281 867 1324 914 1125 787 1731 1607 1314 520
1687 520 1798 1209 1834 1588 702 1835 713 283 504 334 430 1055 899 678 -443 -684 -729 -16 -1465
1706 -1465 -1140 -2110 -1647 -1325 -2052 -1778 -2269 -2402 -1060 -1256 -2249 -1655 -2693 -1999 -1198 -1030 -1587 -721 14
1725A4l48L49j4p3l11P84r07J590k5N69j022J093n07K58M62j327K05K12k85J96
1745I13K07K77k35l18L17j117O32j206J450j748J258o91j122K29m80M88l96J650
1763A08p66r56k08J2r86J881p76M27j367J607k45J53k4O11M18j099Q75k00J088
1782E53k75O22o62j67j11J276k92j40o11Q7J082M9n5p7l39O88j656J365j39m38
1802G60j301P84K06m04M65j141L29O97q0j422n3M64o16L51k87p77N27J86k78j6
1822a606L16k73M75l57N43n6J79M71j3O88m07n11P31Q6J71K43q57O87J147r42
1842G15Lm60J219m41j88m11L28J091n17m16l83J78n08J51k19j41O22N4j248O44
1862G3l3l07L19q81l46O66M30j120l96Q23o26R74m21p53J38P52k65l89J41L39
$$ plain form
1725 14 -334 15 1 -72 -383 401 -506 1084 1059 1628 606 1699 1192 1450 1912 585 790 1002 717 913
1745 913 1120 1397 1162 844 1161 44 676 -530 920 -828 430 -261 -1383 -1154 -1634 -1146 -1542 108
1763 108 -658 -1614 -1822 -1810 -2796 -915 -1691 -1264 -2631 -1024 -1269 -1116 -1140 -529 -111 -1210 -335 -535 553
1782 553 278 900 238 71 -40 1236 944 804 193 280 1362 1411 1356 1279 940 1628 -28 1337 1198 760
1802 760 -541 243 449 45 510 -631 -302 395 315 -1107 -1160 -696 -1312 -961 -1248 -2025 -1498 -1312 -1590 -1606
1822 -1606 -1290 -1563 -1088 -1445 -902 -958 -779 -308 -321 367 -40 -551 180 266 437 680 -177 510 1657 715
1842 715 718 258 1477 1036 848 437 765 1856 1339 923 540 718 210 361 142 1 623 677 -571 73
1862 73 40 -267 52 -829 -1175 -509 -79 -1199 -1595 -772 -1398 -424 -845 -1598 -1460 -708 -973 -1362 -1221 -882
1882h82m59R36O84j650J672k9k79O64Q0n97O70m33n14Q50j29R08j614J716n45
1901A049J05n01P31j322P70K30j640P37O3K34l40O33j880J812j097J103j168n30
1919a011k37l02J600j140K93kj34k30N8p68R90O83q11K5J4K28J96K24l30K92K62
1940a00M05r18N57K28o82K62K48J0J358p51M95K16p43K85Kk18R48k39m79N96m09
1961A071k28r99J31O2k52M9J710j559K50j302O46j60J161n16p84k31l15J04R24
1980b38m00r2M90q79R41o23K18o42J89K0R61R6q08N11N11o29Q77q28Q70j481J435
2001D99R69O58j241j83O9L67n37N27j151J074p4j607J196j96J0o80N18o09L62
2020b9M26R2m95K33J5J62k82j5j016J122o02l16L78l40j28n4k58L79j15p4M07
$$ plain form
1882 -882 -1341 -405 279 -1371 301 272 -7 657 737 140 810 377 -137 713 584 1492 -122 1594 1049
1901 1049 1154 653 1384 62 832 1062 -578 159 222 456 116 749 -1131 681 -416 687 -481 -1011
1919 -1011 -1248 -1550 50 -1090 -797 -799 -933 -1163 -1105 -1873 -883 -200 -1011 -986 -972 -744 -548 -324 -654 -362 -100
1940 -100 305 -613 -56 172 -510 -248 0 10 1368 617 1112 1328 585 870 872 654 1602 1363 884 1480 1071
1961 1071 843 -156 -25 37 -215 -166 1544 -15 235 -1067 -421 -581 580 64 -720 -951 -1266 -1162 -238
1980 -238 -638 -730 -240 -1119 -178 -801 -583 -1225 -1036 -1016 -55 41 -767 -256 255 -374 503 -325 545 -936 499
2001 499 1468 2126 885 702 771 1138 601 1128 -23 1051 977 -630 566 370 380 -300 218 -391 -29
2020 -29 397 489 -6 227 242 404 122 107 -909 213 -389 -705 -327 -667 -795 -849 -1107 -728 -843 -917 -510
2041e10P45n85N05q12l6M40l65R51p02R49N63q31Jk5Q66j166P58n09J91L55Mn96
2063A91K50J80K57o41N40m74O47j549J188k9l61J691j494m11q2J45j514J163k66
2082e69N09j024J135q27k36J092j131R9l20J41Q64o41J282k46m05m13O02k26p33
2101a047J073o40K52P87l72O68p32o60N74J244n05L50q04J15K88J96J017j245
2119E59P24m70p6l91l54lP98p12K28m96n78Q01q36J150o83L28j260J046j011J263
2139B7j544P56n81J002j09Q8P9p20J84j160J211O77P00j101j38J474j266O7K33
2158a21p5Q99l27j10O44j309J001L86p48J46R3K24k10p5n26O6j29O42N24q35o5
2179I5k95R99m27L51n68j020N4P69l44M46n58J94l4k9o40M57k31J016j388L0J020
$$ plain form
2041 -510 235 -350 155 -657 -693 -253 -618 333 -369 580 1143 312 313 288 1154 -12 746 237 428 783 787 191
2063 191 441 621 878 237 777 303 950 -599 589 560 199 1890 396 -15 -97 48 -1466 -303 -569
2082 -569 -60 -1084 51 -776 -1012 80 -1051 -952 -1272 -1131 -267 -908 374 128 -277 -690 -88 -314 -1047
2101 -1047 26 -614 -362 425 53 721 -11 -671 -97 1147 642 992 188 303 591 787 1804 559
2119 559 1283 813 737 346 -8 -11 787 75 303 -193 -771 30 -806 344 -339 -11 -1271 -225 -1236 27
2139 27 -1517 -761 -1342 -340 -449 -361 -282 -1002 -818 -1978 -767 -90 610 -491 -629 845 -421 -354 -121
2158 -121 -196 703 376 266 910 -399 602 988 240 386 479 703 493 418 -108 -42 -171 471 995 160 95
2179 95 -200 799 372 723 155 -865 -811 -42 -386 60 -498 -304 -338 -367 -1007 -550 -781 235 -1153 -1123 -103
2200a03j039Q2N54l11L17n09J152o06J604j091k12L33m73P83l15N0J193k074J243
2219E78K7o56J804j418Q7q22J652j279P77n82J102m74n76O9k22q92O50P42K26
2238G93q19q03J226n65K85k60J19r00K87P04j034R94j127L22p84J130o41l26O91
2257g08L72j59P91j211O58M59r0k24q0K60n61M72j20R09q58Q88j289J815r11j030
2277f17K734j789L54m25O2P86q64Kj90n09L62m88O8J750q80K57j535P80N1lj042
2298a136N0J247o43l28M81l44O72p60L53m01k82P86j71Q64q30q1O74j21p6M90
2318D44n68J62M95l14J09m30k04N38Q60j110O50n40J137K7o91l81n3j31P26m39
2338B87l8N20m12M37M33r90m64Q2m58O45J8j236Q30m43P98r0J76j239J164K66
$$ plain form
2200 -103 -1142 -1060 -506 -817 -500 -1009 143 -463 1141 50 -162 171 -302 481 166 216 1409 -665 578
2219 578 605 -51 1753 335 422 -400 1252 -27 750 168 1270 796 220 289 67 -825 -175 567 793
2238 793 -26 -829 397 -168 117 -143 -24 -924 -637 67 -967 27 -1100 -778 -1562 -432 -1073 -1399 -708
2257 -708 -336 -495 296 -915 -257 202 112 -112 -192 68 -493 -21 -141 768 -90 798 -491 1324 413 -617
2277 -617 2117 328 682 257 319 1105 241 243 53 -456 -94 -582 -514 1236 356 613 -922 -142 -91 -94 -1136
2298 -1136 -1086 161 -482 -810 -329 -673 -1 -761 -408 -809 -1091 -305 -476 388 -442 -523 151 30 -46 444
2318 444 -124 38 533 219 328 -102 -306 232 1092 -18 632 92 1229 1256 565 184 131 0 726 287
2338 287 249 769 357 794 1227 237 -227 -145 -603 42 60 -1176 -346 -789 9 -81 95 -1144 20 286
2358B86o23L41n1p0r65K90l84M54J253j138R73j818J861p29J189n67n32P59r56
2377d27J406l47N76p62M94k56N29o58m16N14m58O53j143J87R72m47j121J11P19
2396A26J09J3p0k26n38N43j70Q72o85n87J07k9m56N43k33k62P21J19o79o34J284
$$ plain form
2358 286 -337 4 -47 -117 -1082 -792 -1176 -722 531 -607 366 -1452 409 -320 869 302 -230 529 -427
2377 -427 979 632 1208 446 940 684 1213 555 139 653 195 848 -295 -108 864 417 -704 -593 126
2396 126 235 248 178 -48 -586 -43 -213 659 -26 -613 -506 -535 -991 -448 -681 -943 -222 -103 -782 -1416 -132
$$ [...]
8191i90
##END NTUPLES=NMR FID
##END=
