##TITLE=1H_KYU-20'+DMSO
 CDCl3, 108 sc, 
 13.3.2019
##JCAMPDX= 6.0         $$ Bruker NMR JCAMP-DX V2.0
##DATA TYPE= NMR FID
##DATA CLASS= NTUPLES
##ORIGIN= UXNMR, Bruker Analytische Messtechnik GmbH
##OWNER= root
$$ XWIN-NMR		Version 3.5
$$ Wed Mar 13 17:05:06 2019 Russian Standard Time (UT+4h)  she@DPX200
##.OBSERVE FREQUENCY= 200.1315
##.OBSERVE NUCLEUS= ^1H
##.DELAY= (6, 6)
##.ACQUISITION MODE= SIMULTANEOUS
##.ACQUISITION SCHEME= undefined
##.AVERAGES= 108
##.DIGITISER RES= 16
##SPECTROMETER/DATA SYSTEM= spect
##.PULSE SEQUENCE= zg30
##.SOLVENT NAME= CDCl3
##.SHIFT REFERENCE= (INTERNAL, CDCl3, 0, 15.7039)
##AUDIT TRAIL= $$ (NUMBER, WHEN, WHO, WHERE, WHAT)
$$ ##TITLE= Audit trail, XWIN-NMR		Version 3.5
$$ ##JCAMPDX= 5.01
$$ ##ORIGIN= Bruker BioSpin GmbH
$$ ##OWNER= she
$$ F:/spectra/data/she/nmr/H-F/1/audita.txt
$$ ##AUDIT TRAIL=  $$ (NUMBER, WHEN, WHO, WHERE, WHAT)
(   1,<2019-03-13 17:03:06.65 +0400>,<she>,<DPX200>,
      <continue with go, POWCHK disabled, PULCHK disabled
       configuration hash MD5:
       00 E9 B6 7A A2 85 ED C7 34 08 36 98 17 FE 4E 26
       data hash MD5: 16K
       17 D0 FE 64 7F C5 78 B7 03 37 B8 19 FC DE D6 60>)
$$ ##END=
$$ 
$$ hash MD5
$$ 54 5B 27 32 51 F0 93 E3 47 34 FF D2 32 8A 28 C4
##$RELAX= 
##$RELAX= 
##$RELAX= 
##$RELAX= 
##$RELAX= 
##$RELAX= 
$$ Bruker specific parameters
$$ --------------------------
##$DU= <F:/spectra>
##$EXPNO= 1
##$NAME= <H-F>
##$PROCNO= 1
##$TYPE= <nmr>
##$USER= <she>
##$AMP= (0..31)
100 100 100 100 100 100 100 100 100 100 100 100 100 100 100 100 100 100 
100 100 100 100 100 100 100 100 100 100 100 100 100 100 
##$AQSEQ= 0
##$AQ_mod= 1
##$AUNM= <au_zg>
##$AUTOPOS= <>
##$BF1= 200.13
##$BF2= 200.13
##$BF3= 200.13
##$BF4= 200.13
##$BF5= 200.13
##$BF6= 200.13
##$BF7= 200.13
##$BF8= 200.13
##$BYTORDA= 1
##$CFDGTYP= 0
##$CFRGTYP= 5
##$CHEMSTR= <none>
##$CNST= (0..31)
1 1 145 1 1 1 1 1 1 1 1 1 1 1 1 1 1 1 1 1 1 1 1 1 1 1 1 1 1 1 1 1 
##$CPDPRG= <>
##$CPDPRG1= <>
##$CPDPRG2= <>
##$CPDPRG3= <>
##$CPDPRG4= <mlev>
##$CPDPRG5= <mlev>
##$CPDPRG6= <mlev>
##$CPDPRG7= <mlev>
##$CPDPRG8= <mlev>
##$CPDPRGB= <>
##$CPDPRGT= <>
##$D= (0..31)
0 1.2 0 0 0 0 0 0 0 0 0 0.03 0 0 0 0 0 0 0 0 0 0 0 0 0 0 0 0 0 0 0 0 
##$DATE= 1552481990
##$DBL= (0..7)
120 120 120 120 120 120 120 120 
##$DBP= (0..7)
150 150 150 150 150 150 150 150 
##$DBP07= 0
##$DBPNAM0= <>
##$DBPNAM1= <>
##$DBPNAM2= <>
##$DBPNAM3= <>
##$DBPNAM4= <>
##$DBPNAM5= <>
##$DBPNAM6= <>
##$DBPNAM7= <>
##$DBPOAL= (0..7)
0.5 0.5 0.5 0.5 0.5 0.5 0.5 0.5 
##$DBPOFFS= (0..7)
0 0 0 0 0 0 0 0 
##$DE= 6
##$DECBNUC= <off>
##$DECIM= 2
##$DECNUC= <off>
##$DECSTAT= 4
##$DIGMOD= 1
##$DIGTYP= 9
##$DL= (0..7)
0 120 120 120 120 120 120 120 
##$DP= (0..7)
150 150 150 150 150 150 150 150 
##$DP07= 0
##$DPNAME0= <>
##$DPNAME1= <>
##$DPNAME2= <>
##$DPNAME3= <>
##$DPNAME4= <>
##$DPNAME5= <>
##$DPNAME6= <>
##$DPNAME7= <>
##$DPOAL= (0..7)
0.5 0.5 0.5 0.5 0.5 0.5 0.5 0.5 
##$DPOFFS= (0..7)
0 0 0 0 0 0 0 0 
##$DQDMODE= 0
##$DR= 16
##$DS= 0
##$DSLIST= <SSSSSSSSSSSSSSS>
$$ [...]
##$SUBNAM2= <"">
##$SUBNAM3= <"">
##$SUBNAM4= <"">
##$SUBNAM5= <"">
##$SUBNAM6= <"">
##$SUBNAM7= <"">
##$SUBNAM8= <"">
##$SUBNAM9= <"">
##$SW= 330.908255636489
##$SWIBOX= (0..15)
0 0 2 0 0 0 0 0 0 0 0 0 0 0 0 0 
##$SW_h= 66225.1655629139
##$TD= 16384
##$TD0= 1
##$TE= 0
##$TE2= 300
##$TE3= 300
##$TEG= 300
##$TL= (0..7)
0 120 120 120 120 120 120 120 
##$TP= (0..7)
150 150 150 150 150 150 150 150 
##$TP07= 0
##$TPNAME0= <>
##$TPNAME1= <>
##$TPNAME2= <>
##$TPNAME3= <>
##$TPNAME4= <>
##$TPNAME5= <>
##$TPNAME6= <>
##$TPNAME7= <>
##$TPOAL= (0..7)
0.5 0.5 0.5 0.5 0.5 0.5 0.5 0.5 
##$TPOFFS= (0..7)
0 0 0 0 0 0 0 0 
##$TUNHIN= 0
##$TUNHOUT= 0
##$TUNXOUT= 0
##$USERA1= <user>
##$USERA2= <user>
##$USERA3= <user>
##$USERA4= <user>
##$USERA5= <user>
##$V9= 5
##$VALIST= <valist>
##$VCLIST= <CCCCCCCCCCCCCCC>
##$VD= 0
##$VDLIST= <DDDDDDDDDDDDDDD>
##$VPLIST= <PPPPPPPPPPPPPPP>
##$VTLIST= <TTTTTTTTTTTTTTT>
##$WBST= 1024
##$WBSW= 4
##$XGAIN= (0..3)
0 0 0 0 
##$XL= 0
##$YL= 0
##$YMAX_a= 600576
##$YMIN_a= -299287
##$ZGOPTNS= <>
##$ZL1= 120
##$ZL2= 120
##$ZL3= 120
##$ZL4= 120
##$ABSF1= 10
##$ABSF2= 0
##$ABSG= 5
##$ABSL= 3
##$ALPHA= 0
##$AQORDER= 0
##$ASSFAC= 0
##$ASSFACI= 0
##$ASSFACX= 0
##$ASSWID= 0
##$AUNMP= <proc_1d>
##$AZFE= 0.1
##$AZFW= 0.1
##$BCFW= 1
##$BC_mod= 2
##$BYTORDP= 1
##$COROFFS= 0
##$CY= 11.3945322036743
##$DATMOD= 1
##$DC= 2
##$DFILT= <>
##$DTYPP= 0
##$F1P= 18.9103706918063
##$F2P= -1.10871071338519
##$FCOR= 0.5
##$FTSIZE= 0
##$FT_mod= 4
##$GAMMA= 1
##$GB= 0.15
##$INTBC= 1
##$INTSCL= 1
##$ISEN= 128
##$LB= 0.24
##$LEV0= 0
##$LPBIN= 0
##$MAXI= 10000
##$MC2= 0
##$MEAN= 0
##$ME_mod= 0
##$MI= 1.114404
##$NCOEF= 0
##$NC_proc= 0
##$NLEV= 6
##$NOISF1= 3.799351
##$NOISF2= 2.8
##$NSP= 1
##$NTH_PI= 0
##$NZP= 0
##$OFFSET= 15.70392
##$PC= 1
##$PHC0= -9172.399
##$PHC1= 25.40026
##$PH_mod= 1
##$PKNL= yes
##$PPARMOD= 0
##$PSCAL= 0
##$PSIGN= 0
##$REVERSE= no
##$SF= 200.130013532006
##$SI= 16384
##$SIGF1= 3
##$SIGF2= 2
##$SINO= 400
##$SIOLD= 16384
##$SREGLST= <1H.CDCl3>
##$SSB= 0
##$STSI= 0
##$STSR= 0
##$SW_p= 3612.71676300578
##$SYMM= 0
##$S_DEV= 0
##$TDeff= 0
##$TDoff= 0
##$TI= <>
##$TILT= no
##$TM1= 0
##$TM2= 0
##$TOPLEV= 0
##$USERP1= <user>
##$USERP2= <user>
##$USERP3= <user>
##$USERP4= <user>
##$USERP5= <user>
##$WDW= 1
##$XDIM= 8192
##$YMAX_p= 0
##$YMIN_p= 0
$$ End of Bruker specific parameters
$$ ---------------------------------
##NTUPLES= NMR FID
##VAR_NAME=  TIME,          FID/REAL,        FID/IMAG
##SYMBOL=    X,             R,               I
##VAR_TYPE=  INDEPENDENT,   DEPENDENT,       DEPENDENT
##VAR_FORM=  AFFN,          ASDF,            ASDF
##VAR_DIM=   8192,          8192,            8192
##UNITS=     SECONDS,       ARBITRARY UNITS, ARBITRARY UNITS
##FACTOR=    1.51e-05,      1,               1
##FIRST=     0,             0,               0
##LAST=      0.1236841,     0,               0
##MIN=       0,             -299287,         0
##MAX=       0.1236841,     600576,          0
$$ Real data points
##PAGE= N=1
##DATA TABLE= (X++(R..R)), XYDATA
$$ [...]
2745a537J566J41o58N90M8p10L83K2j26n14J014n41J407o70K07n24q84M43R60
2764F17q1r80l43j07Q67N59p97o06J448P15m09j671J5J677j091m37P15M87q28
2783b50J81J94q61Q83l05P78j354P5j31J930m49p65l76J050%r46l17R76J15R6
2803E24j261M62q01J227j299L20J347j787J430n51j10R1R43k97k11M83L28r86
2821a48O49j107M16o47J179o00j86J298j092j17n2J132j01j47r78P97O88r71q1
2840f8k87P8J037p19K64L40j012J465j443N33m58j58K37K11N60n79j41o31Q2Q34
2860A45l23r47N62M94k2l83P06M65n02p55L66L30j86r62J617j575J096J405j353
2879A78K9m69J009k24o89k1J690j365j633J714k61j80M13PJ65k38P59o81o46K01
$$ plain form
2745 -1537 29 170 -488 102 150 -560 -177 -155 -281 -795 219 -322 1085 415 622 98 -786 -343 617
2764 617 536 -444 -787 -894 -27 532 -265 -871 577 1292 883 -788 -773 904 -187 -624 91 578 -250
2783 -250 -69 125 -736 147 -158 620 -734 -659 -790 1140 691 -74 -450 600 600 -346 -663 313 428 524
2803 524 -737 -275 -1076 151 -1148 -828 519 -1268 162 -389 -499 -408 535 238 27 510 838 -148
2821 -148 501 -606 -190 -837 342 -258 -444 854 -238 -355 -407 725 624 477 -501 296 984 13 -68
2840 -68 -355 -277 760 41 305 645 -367 1098 -345 188 -270 -428 -191 20 580 1 -140 -771 -689 145
2860 145 -178 -1125 -563 -69 -91 -474 232 697 195 -560 -194 136 -50 -1012 605 -970 126 1531 178
2879 178 207 -262 747 523 -166 -187 1503 138 -1495 219 -42 -222 191 198 363 125 884 203 -443 -242
2899b42k65J173j191K99kmP03j440Q88j39L89q47Q89j9L92r53lR00o28on28L48
2921b86J584j973Q79k14O24o78M7J108m27R6j629J647n64k38R9Q3m6m54J129J62
2941I49j631L9O69m13j17n88P9p9J539O2j126R8J373j309N83k85M17k52J036p93
2961B51K52J48k11o8K09J14J59j023l3N38L35o45J74m34L19m34K36M63J46J34
2981F30k45J76q55j14M11j534K104M6p25K67J65m92J296j003m14l16L33O3L06
3000I9Q8r46J272p2k64q89L09M7L89k55m63J559j432N21K32p62N27k11L3K74k1
3021C5j41J76j042K182j877K91N95J8r68L95j99k62M82O80Q94r42L44q87M53j09
3041A18J029O4j14j353R9N39L26j769N97J711j173m52P95o47K04L82j077k44R37
$$ plain form
2899 -242 -507 666 -525 -226 -228 -232 471 -969 -81 -220 169 -678 211 192 584 -369 -372 528 -100 -106 -634 -286
2921 -286 1298 -675 204 -10 614 -64 -17 1091 664 760 -869 778 214 -24 75 158 112 -342 787 949
2941 949 -682 -643 26 -387 -504 -1092 -1013 -1092 447 509 -617 -519 854 -455 128 -157 260 8 1044 251
2961 251 503 651 440 372 581 695 854 -169 -202 336 671 26 200 -234 85 -349 -113 350 496 630
2981 630 385 561 -294 -408 3 -1531 573 619 -106 161 326 -166 1130 127 -287 -603 -270 -207 99
3000 99 187 -759 513 441 177 -712 -403 -356 33 -222 -685 874 -558 -37 195 -567 -40 -251 -218 56 35
3021 35 -106 70 -972 1210 -667 -376 219 237 -731 -336 -535 -797 -315 365 1259 317 661 -226 227 118
3041 118 1147 1211 1097 -256 -157 382 708 -1061 -464 1247 74 -378 417 -230 -26 356 -721 -965 -28
3060b8j18p13Q47O09p53l5k89R9J64L82O9k26n77R0M96r2N71j367N12Q94j65m13
3082d3n2k71N82L57n18J061j012l6J84l81k15l57M22qJ170n95k46o33J254m64
3102A99l28L27n0j11l75J98Pm20J22R97j167M1k60J025n99M56q11L29N3J400p62
3123B71j112J085P3n26o5K83o9j77L14o27M29k31J160j184M32j169J037P39r91
3142c28N39j138R93o57P66k8R21j795J359j140Q16L50l30K82m04n03N20O5j71
3161A17L2M53n33M88n06M62L48j130o99N83l21J107n08L13K4N07l65o38j40j53
3181e59R30p62O54K37j274J217M77j456P44K97l20p05M97l75k78M31N2J144q33
3200A18N06j528J85O19M18o15O9l79P59m17n44O25m44M28J79N16R5j025J299r28
$$ plain form
3060 -28 -146 -859 -12 597 -156 -191 -480 -381 -217 165 234 8 -569 -479 17 -75 496 -871 -359 535 370 -43
3082 -43 -95 -366 216 573 55 1116 104 68 252 -129 -344 -701 -279 -287 883 288 42 -591 663 199
3102 199 -129 198 148 37 -338 -140 -133 -553 -431 566 -601 -560 -820 205 -394 62 -749 -420 -367 1033 271
3123 271 -841 244 317 -209 -274 9 -60 -237 77 -550 -121 -352 808 -376 56 -1113 -76 663 -328
3142 -328 211 -927 66 -591 175 147 1068 -727 632 -508 308 658 328 610 206 -297 223 288 117
3161 117 149 602 69 557 51 513 861 -269 -968 -385 -706 401 -107 206 230 737 372 -266 -406 -559
3181 -559 371 -391 263 500 -774 443 920 -536 208 505 185 -520 -23 -398 -676 -245 -193 951 118
3200 118 624 -904 -719 -100 318 -297 -228 -607 152 -265 -809 -184 -628 -200 -21 495 590 -435 864 -64
3220f4k91K14J57Q67m41j139J141M27j027l41N94m8J06Q60j453J290N88j82j145
3239A13j76J72L56r89M85k28N63j17Pj53o74K81L15o70J525n56o72R32j093J224
3259F45j64j76L2l31O69j150J94kN8P41m94j99N9n81p4J168m10j06q7p53J678
3280G17p89n17J021q94M63j22Q37j595P74l32q7Q85J50o01n97J624q08M52j237
3299f56R25j007J641j506J257o11j91l2M03K35j001j83J026j53K36q6r16L19Q57
3318E57l86r42L07M2N39q19J294k72K11m82L78m17K08m88j98K063j522M70o34
3337i1J231k467J997J89p21N91j382R4LL57o91P85n13J96J79L44M69j364J277
3356D83l73K06o81j29J183j399M09N71n03P35m9p08P11J64J41j407J028o02N37
$$ plain form
3220 -64 -355 -141 16 883 442 -697 444 871 -156 -497 97 49 155 1015 -438 852 1440 1258 113
3239 113 -63 109 465 -524 -39 -267 296 179 186 33 -641 -360 -45 -715 810 254 -418 514 -579 645
3259 645 481 305 337 6 675 -475 -281 -283 -225 516 22 -177 -118 -699 -773 395 -15 -121 -208 -961 717
3280 717 -72 -589 432 -462 1 -121 716 -879 -105 -437 -524 361 511 -90 -687 937 129 581 -656
3299 -656 269 -738 903 -603 654 43 -148 -180 223 458 -543 -726 300 147 383 297 -619 -300 557
3318 557 171 -771 -464 -422 117 -702 592 320 531 49 427 10 218 -270 -468 1595 73 543 -91
3337 -91 1140 -1327 670 859 138 729 -653 -559 -556 -199 -890 -105 -618 -422 -243 101 570 -794 483
3356 483 110 316 -365 -494 689 -710 -301 270 -233 502 453 -255 456 620 761 -646 382 -220 317
3375C17n85J59m65R38o59N80n22r20R84M41M64p55M29k92k20L34M39n74L60m40
3395A3n70M76j52M04l09J010p89r88J126k07n1j65q1N10N1j171j25K162j374p84
3415a014J610p6r49J86O75N1p8q75M57o5J09p96O33O32q02K60j97m28J135r61
3435d93L47O9J48L85M02j491R65m52J58L96q96j98P39k3J69r00N64n34J287l70
3455B72m28m6J69Q29j473J494j095k32o21O68J01J126n91p29q88J223j8lM09K05
3475C72K43p69N52n40K27r39P96K16k42j55n49K73O47N22m85l53pJ51N50q9q90
3496d69n07J008o57L15J315o17m44N3N28j19n65N10j100l02M18R31L27q75J55
3515i5o10l58J110q80Q43l16N95r11M55J85N38k93n22j15O0J6R38q13k00N95P74
$$ plain form
3375 317 -268 -109 -574 364 -295 285 -237 -1157 -173 268 732 -23 406 114 -106 228 667 93 453 13
3395 13 -557 -81 -233 171 -138 872 83 -905 221 14 -37 -202 -283 227 278 -893 -1018 1144 -230 -1014
3415 -1014 596 520 -429 -243 432 483 405 -470 -13 -78 31 -765 -132 500 -302 -42 -239 -667 468 -493
3435 -493 -146 -77 71 456 858 -633 332 -120 38 434 -462 -660 79 56 225 -675 -111 -645 642 272
3455 272 -156 -202 -33 796 -677 817 -278 -510 -1131 -463 -362 764 173 -556 -1444 -221 -239 -242 167 372
3475 372 615 -154 398 -142 85 -854 -58 158 -84 -239 -788 -515 132 654 169 -184 -191 -40 510 421 -469
3496 -469 -976 32 -625 -310 1005 388 -56 -3 525 406 -159 351 -749 -1051 -633 298 625 -250 -95
3515 -95 -705 -1063 47 -833 10 -306 289 -622 -167 18 556 263 -259 -374 -314 -298 640 -173 -373 222 996
3536I96K13r64M83p34L79l35l37m26R53j77J29K54q69qJ485r64J22k37Q32q87
3556i2r31J083K55l48K24l48o36J153J82k07l04q90J894m25q79j53R47k91l79
3575a45K92k21j62l12N26m29N10l15m04o62J134J52O65q28j081J453m7m87J1L51
3595Aj089P03J059r34M08M52r98O46j047Q60K25q63M22L24j050M76o59P99O56
3614C91q43Q56J58j5k65J77p57m10O42J096j482R59q20k8j19j1M96K16r89J503
3634G55j353K10j09M79J03K2m58j18L65J03q6o16J762o10K62n39n76K2l41P37
3654A4l29J231n3p70k81M27O3j63K0l22l13J579r31r4MPpM9q53O71M60j231J309
3677D87o34K12p6R55j334J134j623L04M99m16o6M70J01j77Q06m54m77j708K697
$$ plain form
3536 996 1209 245 728 -6 373 38 -299 -725 228 51 180 434 -435 -443 1042 78 200 -37 795 -92
3556 -92 -1023 60 315 -33 191 -157 -793 360 542 335 31 -859 1035 610 -269 -422 525 234 -145
3575 -145 147 -74 -236 -548 -22 -451 59 -256 -660 -1322 -188 -36 629 -199 -1280 173 126 -361 -350 1
3595 1 -1088 -385 674 -260 148 600 -398 248 -799 61 286 -577 -155 169 -881 -405 -1064 -265 391
3614 391 -452 404 562 547 282 459 -298 -708 -66 1030 -452 507 -313 -341 -460 -471 25 241 -748 755
3634 755 -598 -388 -497 -18 85 107 -351 -469 -104 -1 -87 -703 1059 449 711 172 -404 -382 -723 14
3654 14 -315 916 863 93 -188 239 302 139 159 -163 -476 1103 172 78 82 89 82 131 -722 -51 409 -822 487
3677 487 -147 65 -11 944 -390 744 -879 -575 -76 -492 -558 -88 13 -164 642 188 -289 -1997 700
3696G00m17r3N10j46k54j36j418J344r1L26l71j093J393n94P1M15M4r20J351k40
3716C81p76Q37j059R98q69R20L23o41l28N90j031K72J16J376j854Q58m08l09k44
3735h48l09R83L37j293J875K68j767J520r65o28m91J378J92n59R66n69o52J105
3753E43j338M74j68M66j074L20P46L16j038J087p4j70K2n03L94n83M76J21J76
3772A93J297j023m84o33J7L12P63r58J001q21m22Q60P41n54n81j06l29J543j47
3791F69n41J47k58L50o71P66k19L66J00m23n61P13n34j92K18j59N45n15j221J376
3811d4K10j08K78m79l93l66P48O04J57m94On30M27k40l30O12o71n56P19l03K19
3832e34p01J00K414n78L91q85L2p07J6R1L05Q6n65J02P55p7J68J82o09l26K41
$$ plain form
3696 700 283 190 700 554 300 164 -1254 90 -1 325 -46 -1139 254 -340 -269 146 190 -730 621 381
3716 381 -395 442 -617 381 -488 432 755 114 -214 376 -655 -383 -267 1109 -745 113 -295 -604 -848
3735 -848 -1157 -174 163 -1130 745 1013 -754 766 -199 -827 -1318 60 252 -307 659 90 -562 543
3753 543 -795 -321 -489 -23 -1097 -777 -31 285 -753 334 260 90 112 -391 3 -580 -104 17 193
3772 193 1490 467 -17 -650 -633 -321 442 -516 485 -336 -758 102 843 289 -292 -398 -727 816 669
3791 669 128 275 17 367 -304 462 243 609 709 286 -275 438 -96 -288 -70 -229 316 -199 -1420 -44
3811 -44 166 58 336 -143 -536 -902 -154 450 607 113 119 -411 16 -224 -554 58 -613 -1169 -450 -753 -534
3832 -534 -1235 -1135 1279 701 1092 207 239 -468 -452 -361 -56 30 -535 -433 322 245 413 595 -14 -340 -99
3853i9J95j615J318J523j638K58L71K50j353J388o78m67k83R60l3J27K53l74J00
3872B03P3Q22p44m9j263J322n12o02R01j412J142k20J902k278Q02l4l76P72o88
3891b39m29Q64Nm98q20Q18k33N0n17J5Q25j64J203m76k3K23m69n63J5M70L44K42
3913F43r94P81k81o82j63J127l27J36l6O42P6j463Ql33J56Q22K40q18K21O41j31
3934B65j34p91P38K79r63Q58Q05j126P66l13l44M76J450k477k23J481j54j140
3952e47j94J537j500O00m42L26N8l12J23K64M69j07n26M42k01O00M73l56N43j857
3972f07J375j282R73p21p53J697p82n21J366o88J27N11l92m58J20K09J89k082
3990a719K546j256j09o18Q14L71q5l85K29J446p80k21l68L40j717J996j086J65
$$ plain form
3853 -99 96 -1519 -201 1322 -316 -58 313 563 -790 598 -80 -547 -830 130 97 224 477 103 203
3872 203 276 1098 354 305 -958 364 -148 -750 151 -1261 -119 -339 1563 -715 87 53 -323 449 -239
3891 -239 -668 196 201 -297 -1117 -299 -532 -482 -999 -984 -159 -323 880 404 381 604 135 -428 -413 57 401 643
3913 643 -351 430 149 -533 -696 431 104 240 204 846 922 -541 -533 -866 -710 112 352 -466 -245 396 265
3934 265 131 -660 78 357 -606 252 1057 -69 697 384 40 516 1966 -511 -734 747 593 -547
3952 -547 -741 796 -704 -104 -546 -220 -162 -474 -351 -87 382 275 -251 191 -10 590 1063 707 1250 -607
3972 -607 768 -514 459 -262 -1015 682 -100 -621 745 57 184 695 303 -155 -35 174 363 -1719
3990 -1719 827 -429 -538 -1156 -342 29 -56 -441 -212 1234 454 233 -135 205 -1512 484 -602 -437
4008d37R34m85P13l46K59j440J506j76p20q3L15l66P06p03L49J254q83n63Q21
4027F55k03j605O38O50j41R0l37J15N68J10q82J217j307R87j194P95n48O92j28
4046A72M46j80m33j12P01j100N00L6j06j28O85l53j543J353m03N55m11j72J088
4065E95j9L5k09j123l8L93N41o90N83r38J085j99n40N80O34o26O18j145R85l14
4085B08j541J389M9n51P29O3k85n10J34P55o8j651K03R67m65l50K8J224P7L39
4105G44p51J78M55k11k76n46J82M89n49k79N85l21L27Q67j247J49P99o83J03l65
4125c50J44j08j11o29P68J63L57n43n77R77l16m21J66N54l03Q56j039O8O71n80
4145b53P83k53m6O70n65j680K128k58o01k64M63p31M88n4k95N8J276m79l34n4
$$ plain form
4008 -437 497 12 725 379 638 -802 704 528 -192 -275 40 -326 380 -323 26 1280 397 -166 655
4027 655 452 -1153 -515 135 -6 84 -253 -138 430 540 -342 875 -432 555 -639 156 -392 300 172
4046 172 618 438 5 -107 594 -506 -6 30 -76 -204 481 128 -1415 -62 -465 90 -321 -493 595
4065 595 576 611 402 -721 -759 -366 175 -515 68 -870 215 16 -524 56 690 64 682 -463 522 208
4085 208 -1333 56 105 -446 283 346 61 -449 -315 440 372 -1279 -1076 -109 -574 -924 -896 328 405 744
4105 744 -7 171 626 415 139 -407 -225 264 -285 -564 21 -300 27 894 -353 -204 595 -88 15 -350
4125 -350 -206 -314 -425 -1054 -286 -123 234 -309 -886 91 -225 -646 -480 74 -229 627 -412 -344 327 -253
4145 -253 530 277 231 901 336 -1344 784 526 -75 -339 124 -607 -119 -173 -468 -410 866 387 53 -1
4165am13R66M4m7k59n03J70O99m31M14j554J278n77J034p84o47K73O26j133J213
4185C68N77r69J32m74j94N35L60k31j66o75L74o2K177j397j41J091j493Q76j026
4204c38K62j51K1L45J259q96p62R32j280M83J99L10j278J266l89o15J980j655
4222c07K96P67l34p50J85N48j020MM35K45l3K5Q38r63N27J39q05M81q29Q21q1
4243A89o89O44n42J085m20r03J416p05j41qk2O19p05N25k50N17p83M60o19J117
4263G85j597P22k74N94q31J56m50J238j017J93M00LL37p72J017k01o32K04J6o64
4283g73N81K66q6M37j93N90p22J20M63r70O72J68J9l46l23M07q52J06p05J566
4303D25n53K96o74m83J148j06o2oK82o66L2J51O0J012j146N85p08L28j9m9l39
$$ plain form
4165 -1 -414 552 596 549 290 -213 -43 656 225 639 -915 363 -214 820 36 -611 -338 288 -845 368
4185 368 945 -24 108 -366 -560 -25 335 104 -62 -737 -363 -425 1752 355 214 1305 -188 688 -338
4204 -338 -76 -227 -206 139 1398 502 -260 672 -608 -125 74 384 -894 372 -17 -632 1348 -307
4222 -307 -11 756 422 -328 -143 405 -615 -611 -176 69 36 61 899 -64 463 602 -203 278 -551 270 189
4243 189 -500 144 -398 687 267 -636 780 75 -66 -74 -96 523 -182 343 93 610 -173 287 -332 785
4263 785 -812 -90 -364 230 -601 -445 -895 343 -674 -481 -81 -78 259 -513 504 303 -329 -125 -109 -773
4283 -773 -192 74 -12 425 232 822 100 220 683 -287 385 553 572 226 -97 310 -542 -436 -1141 425
4303 425 -128 168 -506 -989 159 53 -9 -15 267 -399 -367 -216 -156 856 -290 295 -413 -85 -104 -153 -492
4324d92j90J371q76k4J24K67k32O41o83l93O16j436J649n07L46o90K14J22p3K34
4344a2p98J149r27J982k062K40j72O81K30m99M67k51Nk80L04M29l83L42Q1k64
4364B62N00j375J239p58J99M72o11o5J55K72l06K71N52o96k74j85o8P22r42J476
4384H40j113m34M19N72N06j136l5O58n28k92P51p34K65Q8k11J376j698Q39o49
4403e16L41p37J362r64J253j015J28J02O11k96j027J322o96P00q97M69K72k34
4421A78k36m93J048o47L66M8L26j865J473K1q70L46M95L66j58m7l4r69K12R25
4441D85q23J64N97r22J191k66m92j5P74M79j863K65l97R07q87J366o16P73o23
4460I7n3P78n07l72Q5k44k06O17n17O47n97N38K50j003J163p13K01m00J90M23
$$ plain form
4324 -492 -682 689 -187 -211 -87 180 -52 589 -94 -487 129 -1307 342 -165 181 -509 -295 -173 -246 -12
4344 -12 -810 339 -588 1394 -668 -428 -600 81 311 -188 279 28 33 -247 57 486 103 445 526 262
4364 262 762 -613 626 -132 67 539 -72 -137 18 290 -16 255 807 111 -163 -348 -416 306 -636 840
4384 840 -273 -707 -288 284 790 -346 -381 277 -251 -543 208 -526 -261 -173 -384 992 -706 133 -516
4403 -516 -175 -912 450 -514 739 -276 -148 -46 565 269 -758 564 -132 568 -329 140 412 178
4421 178 -58 -551 497 -150 216 264 590 -1275 198 219 -651 -305 190 556 398 351 317 -652 -440 485
4441 485 -338 -174 423 -499 692 426 -66 -81 693 1172 -691 -426 -823 84 -803 563 -53 720 97
4460 97 44 822 315 -57 28 -216 -422 195 -322 325 -272 266 516 -487 676 -37 164 -236 -46 377
4480C77r40M87l24P8j66J429j4r27P61k51o61O62l88N31m1j93O5q70N39q7j82
4501a15M60k29p6o02N12L58l84K00k41O63q9l55N05r28J270j616N09O90p2k77
4521A83J65l8L66j578R55l55n3K759k295m0M15n14m35J61j50R48O22j290J75n83
4541e82J140P4q12O1R0M5J94j4o41J044k0n34l45L84K84m05j068J041l14J37j4
4562b55P38o28q3P73N23j663l46J375l38q35J137j64o79P66J083j703R69L28q25
4581A73L39K24j191l3Q37M8j075J20j26L4L21l32M18M69p42K5k29J722q03o37
4601d38J075l51l46o34Q76o36k69J732j108K1m42J028k20j26j30m86o21L68J092
4620C85n55l89N25k29m46O17O6N1P82j064n19Q56k57Q61M26p90p65O43K5J47k33
$$ plain form
4480 377 -563 -76 -400 -322 -488 941 927 0 761 510 -151 511 123 654 613 420 485 -385 154 67 -115
4501 -115 345 116 40 -562 -50 308 -76 124 -117 546 457 102 607 -321 949 -667 -158 532 460 183
4521 183 348 310 676 -902 53 -302 -355 2404 109 69 484 -30 -465 -304 -454 494 1116 -174 1 -582
4541 -582 558 632 -180 -119 -29 16 210 196 -445 599 579 45 -300 84 368 -37 -1105 -64 -378 -241 -255
4562 -255 483 -145 -228 545 1068 -595 -941 434 96 -739 398 234 -445 321 1404 -299 670 998 173
4581 173 512 736 -455 -488 349 397 -678 -558 -684 -650 -329 -661 -243 226 -516 -491 -720 1002 199 -438
4601 -438 637 286 -60 -694 182 -454 -723 1009 -99 -78 -520 508 288 162 32 -454 -1075 -707 385
4620 385 -170 -559 -34 -263 -709 -92 -26 25 807 -257 -776 80 -177 684 1110 320 -445 198 223 370 137
4641A37L06m18p26P67n1P61o04p62J041p71NR38J8p20n1k88O33J05O0o25J74n6
4663a27k5p59Q89Q77j252m53J64L49J285o85m93q0j11K02o32J220o72j16J367
4682I48j017N80o23L91q63J058l10m31p11J069p66O91p72J257l46K99J007j399
4700F2R1r91O27j191J329j66j26p52J703j269Q96J94J18%p71J219p25n78O74k83
4720F1n51P31k63r0J228j178M15l16q18P24k75L71L70p06j6J221j045J137j003
4739cP06n79o5K32j162M55J311j672J225r54N33L39j264J731q51L2k34M40q4J23
4759B59m4n34R21j069j45J115r50O3J357p42m36J075o11o68J044k48l48J27o2
4778A04J84j33o2l99N99J87J42p88M55m71L23O3N13n49M81o24J7m54n4N73l71
$$ plain form
4641 137 443 25 -701 66 15 776 172 -590 451 -320 -315 623 641 -79 -130 -418 215 320 380 -245 -71 -127
4663 -127 -152 -911 -22 855 -397 -850 -686 -337 948 263 -230 -310 -421 -219 -851 369 -303 -419 948
4682 948 -69 511 -112 279 -584 474 164 -267 -978 91 -675 16 -756 501 155 454 1461 62
4700 62 153 -838 -211 -1402 -73 -239 -365 -1117 586 -683 213 407 525 525 -246 973 248 -330 344 61
4720 61 -490 241 -22 -112 1116 -62 353 37 -781 -57 -332 39 409 -297 -313 908 -137 1000 -3
4739 -3 703 124 59 291 -871 -416 895 -777 448 -506 27 366 -898 833 -18 14 -220 220 136 259
4759 259 215 -319 602 -467 -612 503 -447 -384 973 231 -205 870 259 -409 635 387 39 166 104
4778 104 288 155 93 -306 293 480 622 -166 289 -182 141 204 717 168 649 25 42 -412 -466 107 -264
4799b64l5j20J432j063N89n49R63j145R71p24o35R32j75L9m76L24j54k86o57J316
4819B83n06j66L12l5p8p8o21Q96J2p30Q13J124k307J773o14m09l63M25Q74k32
4839C73l78M69n62L88k91K74p03o25P67J327n49n99n13J020j49j66l87P56o20
4858a68J076j452N42K25l42O50j413M43k47J757j244o01O67O17n89J94o8O12J99
4877H58j338N18J48m15L69j443L28Q85J71L01p50K08n0P90l67n20M72j22K10n00
4897b47N4o20J628p68k47L85j205K18L89J173j48j370J556j272l3R30j68p75O78
4916A58J7l44M65m23K25n7r00R70p20J272k61o16L1J211j9j475M37j8J03J75p
4937B24p31l79J056k04M40o85J605j884K68Q39j308K51m2P20q79N89n98R47K09
$$ plain form
4799 -264 -299 -419 1013 -50 539 -10 953 -192 779 55 -580 352 177 216 -260 64 -90 -376 -1033 283
4819 283 -223 -389 -77 -112 -190 -268 -889 7 19 -711 102 1226 -1081 692 78 -331 -694 -269 605 373
4839 373 -5 464 -98 290 -1 273 -430 -1055 -288 1039 490 -109 -622 398 249 83 -304 452 -168
4858 -168 908 -544 -2 223 -119 531 -882 -439 -686 1071 -173 -774 -107 510 -79 115 47 659 858
4877 858 -480 38 186 -229 140 -1303 -975 -90 81 382 -368 -160 -210 580 213 -307 165 43 253 -247
4897 -247 -193 -813 815 47 -200 185 -1020 -802 -413 760 612 -758 798 -474 -507 423 255 -520 158
4916 158 175 -169 296 -127 98 41 -859 111 -609 663 402 -214 -183 1028 1009 -466 -29 -47 56 231 224
4937 224 -507 -886 170 -34 406 -279 1326 -558 -290 549 -759 -508 -550 170 -709 -120 -718 229 438
4956D38m68Q12j336O19j32J205j550l39l00P54O24p2L84L84r35l16m80J076p33
4975c65r3Q87j218J111l55l20m3P55o02J508r65J38p68O25j263J284m51L95l79
4994a19j88R3J28n25k95O82K59Q27j289N05j54l7O54J98r90Q42l88j04k08M39
5014C30m70J24n11M75P37k66q33l77Q12M78j816K672j399P7o2N21r51J197p84
5033d6j26O22M2n84K15m08j306J249K03R92j434Q96j182J388K96q72Q20l59p76
5052c70J33Q30r63m61M47Q90l81p45M40o48M82J191j397QN74l60N04L64m74K44
5072C08J090q74l49p68R42q21R48k46l37L38J49R3o63r45J223j047Q05L35n03
5091c22Q36r5n44r15J377q08j16K97Q66m75j48m64R24l71K87L8K75K76r78L5O07
$$ plain form
4956 438 -30 782 -554 65 -67 1138 -412 -751 -1051 -297 327 255 639 1023 88 -228 -708 368 -365
4975 -365 -458 429 -789 322 -33 -353 -396 359 -243 1265 300 438 -330 295 -968 316 -135 260 -119
4994 -119 -307 -214 -86 -611 -906 -224 35 862 -427 78 -76 -113 541 739 -251 591 203 99 -109 330
5014 330 -140 -16 -527 -52 685 419 -414 -791 21 499 -1317 1355 -44 33 -29 492 -459 738 -46
5033 -46 -172 450 492 -92 123 -285 -1591 -342 -139 853 -581 315 -867 521 817 -55 765 406 -370
5052 -370 -237 593 -370 -831 -384 506 125 -620 -180 -828 -346 845 -552 -544 30 -330 174 538 64 308
5072 308 1398 524 175 -593 349 -472 476 230 -107 231 380 473 -190 -1135 88 -959 -154 181 -322
5091 -322 514 419 -125 -1040 337 -471 -587 -290 576 101 -47 -511 413 42 329 367 642 918 -60 -25 582
5112E82J51j225M47R1K66l8j98r61J344P83n87n75k9M1q74L15L07J279j072J67
5132B14K88l71J079k228O89Q02l87P70j220N01K90n23N20P06j713L29j89J249
5150H06j087K37O79j038n10j20M62O45O8o76K51J092j642J069j047J059p48m13
5168i13J454n93L91n65P08l35k27J20N17j055M92n62M62O6O81j211Q86j201Q67
5187a8m46R39j61r77J083n75n17M40j18R00p88J17j28L15k88L73J01k39j35K04
5207H2l80r7R78n82k4k95Ql82L83K42o81O74K34O31j916J055M13j090P89K42n11
5228b27p3N37m47j201J429k8m37K07M96K1r9l03K56n7K95r3j049J047k70n3K58
5249B09q09R6N49K43l86O12j576J350m82M39j24N20m78m40p03J479j060p42M26
$$ plain form
5112 582 733 -492 -45 46 312 274 76 -885 459 1242 655 80 51 92 -782 -467 -160 1119 47 214
5132 214 502 131 1210 -1018 -329 473 86 856 -364 137 427 -96 424 1130 -583 -254 -443 806
5150 806 -281 -44 635 -403 -913 -1033 -571 74 142 -534 -283 809 -833 236 -811 248 -500 -913
5168 -913 541 -52 339 -226 482 147 -80 40 557 -498 -6 -568 -106 -40 641 -570 316 -885 -18
5187 -18 -464 475 314 -663 420 -155 -672 -232 -350 550 -238 -121 -249 66 -222 151 252 13 -122 82
5207 82 -298 -395 583 1 -23 -318 -310 -692 -309 -67 -748 -74 160 791 -1125 -70 343 -747 42 284 -227
5228 -227 -300 237 -210 -1411 18 -10 -447 -240 256 277 178 -125 131 74 369 276 -773 274 4 -49 209
5249 209 -600 -504 45 288 -98 514 -1062 288 -194 245 121 641 163 -277 -980 499 -561 -1303 -877
5268h77P02m38J038r89R59J4k11n99M44k27m66J561j078K01R05p26l26R23p39
5287G1m66k20J49L39J04n92M77J10P79m92J58n95o50J031j250N83N70j13j88j198
5307a393J306k22J119j126Q5K76q42n03M08J176j585J505r18R05q65R52j85r19
5325h26M08o97J204l31L90K90m14M21n23O1L98j024L65J41k32m74N99j66M73j
5345F2O12M14o53j224J05M57J024j301J88P00j38J8j071m1Q27p02J205n76N95
5364E01k42o7L4k00K40N27n86Pq29O20k57m95n09L25O9J346m56k62N8mK11o06
5386e75j85P68l31P66o18l53J2M75J01m33O25Q8o7n73J283r8p15N69r47L38L60
5407D90j133J255r4k72L72k97N99j112j216L05N21R04r24P75o8j3P43j338J125
$$ plain form
5268 -877 -175 -613 425 -564 395 409 198 -401 43 -184 -650 911 -167 34 939 213 -113 810 71
5287 71 -395 -615 -466 -127 -23 -615 -138 -28 751 259 417 -178 -828 203 -1047 -464 106 -7 -195 -1393
5307 -1393 -87 -309 810 -316 -231 45 -797 -1300 -892 284 -1301 204 -714 191 -674 278 93 -826
5325 -826 -418 -1115 89 -242 148 438 24 445 -78 -17 381 -643 -278 -137 -369 -843 -244 -410 63 62
5345 62 674 1088 435 -789 -684 -227 797 -504 -316 384 246 264 -807 -848 -21 -723 482 -94 501
5364 501 259 192 226 26 266 793 207 214 -615 5 -252 -747 -1256 -931 -862 484 28 -234 -176 -180 31 -575
5386 -575 -760 8 -323 443 -175 -528 -516 -41 60 -373 252 340 273 -300 983 885 170 739 -208 130 490
5407 490 -643 612 518 246 618 321 920 -192 -1408 -1103 -582 322 -602 173 105 92 835 -503 622
5426F22p42o04J175j053J20R5N76m45J788j444l14J04p35O81O87l47n30m92R30
5445G2n12l05L18N49k08n79N31N73j3J09m93l57J368q91j833J577o03JK95N12
5465A11o00O8M64j25N18m77k74K95J56l35P18r58J847j487n38L68R30q16M96j198
5485h37P04J074k56n53m23O20j15J93P6l65J57n45j49J97P20k03m31j70r5P06
5505C05q91J280o41j98q96N96J84O95o43p7m62K03J314j256l70O02R93q80o47
5524g89J426j139k0J329j065M66k73j3p58J355l33K12j378J421J50j094P91j432
5542a144J429o63L67k48Q49r83M90n55R92m30K08J07j134J350o89N01o78J405
5560A174J82q73r79J859r47L19n41J42J017q46j137N25K95j511J095l85N4J190
$$ plain form
5426 622 -120 -724 451 -602 -482 -387 189 -256 1532 88 -226 -122 -857 -176 511 164 -366 -858 72
5445 72 -440 -745 -427 122 -86 -665 -134 439 426 535 42 -315 1053 162 -1671 -94 -697 -696 -401 111
5465 111 -489 -421 43 -82 436 -41 -315 -20 136 -199 519 -439 1408 -79 -617 -249 681 -135 361 -837
5485 -837 -133 941 685 132 -291 329 214 407 483 118 275 -270 -419 -222 498 295 -136 -306 -401 305
5505 305 -586 694 53 -145 -1041 -445 -261 434 -209 -286 -748 -545 769 -487 -857 -255 738 -142 -789
5524 -789 637 -502 -522 807 -258 208 -65 -78 -836 519 186 398 -980 441 591 -503 288 -1144
5542 -1144 285 -378 -11 -259 590 -393 97 -458 534 104 312 419 -715 635 -54 447 -231 1174
5560 1174 1356 483 -496 1363 416 735 194 336 1353 507 -630 -105 190 -1321 -226 -611 -557 633
5578F33j181q0K002j036o23K05K26m48j33K16N46j29o03P98k62M67p26M39Q8m16
5598a7j71N04r46J684q56m55k29o54N57Q41k35R2j454J952j240J822k285K001
5616I11j216n44J816o53J64J48j217J78J214R37j402n96j68J76jK83l08p07J109
5635A24M07r62N93j47l46M08q82N54k2J44k56L07l70l62O29l59L51K53m90Q83
5655D57j88l50j078J758O89j162m72o7J125j626J112j074Q32n58m0J138n42L29
5673B83l59N8O30m55Q58o26o96r18J413k69K58J033j198N50q39K05L77n52j01
5692c48j51L8l77J031Q53k02j437O27n27J38k9l65J86K52p83P10r6N74K68M9q91
5713d80O9k77M55Q84r89J189n85n37Q0K01m04N24j256J318l8o30J141j094o56
$$ plain form
5578 633 -548 -628 1374 338 -285 -80 146 -302 -435 -219 327 198 -405 393 131 598 -128 311 399 -17
5598 -17 -188 316 -630 1054 198 -257 -486 -1140 -583 258 23 115 -1339 613 -627 1195 -1090 911
5616 911 -305 -849 967 314 478 626 -591 -413 801 1738 336 -260 -428 -252 -253 30 -278 -985 124
5635 124 531 -431 162 15 -331 77 -805 -251 -273 -129 -385 -78 -448 -810 -181 -540 -189 64 -426 457
5655 457 269 -81 -1159 599 1288 126 -346 -413 712 -914 198 -876 -44 -602 -642 496 -46 283
5673 283 -76 -18 612 157 1015 389 -307 -1225 188 -81 177 1210 12 562 -277 -72 305 -247 -348
5692 -348 -499 -461 -838 193 1046 844 -593 34 -493 -355 -384 -749 -563 -311 -1094 -384 -480 94 362 411 -480
5713 -480 -411 -688 -233 651 -338 851 266 -271 -191 10 -394 130 -1126 192 154 -476 665 -429 -1085
5732a085R55m22J067k36j404J473m22O76m88j29k42J31k97J31M84o08J332p08
5750B08q34J003P36j481M77n47Q93o11P7pp02O98L75L89M20j384j89R75l65m79
5770c48R28l99k81L09q4J192j511O69k62n39O14J0q04J230o51m89K99j96j76N16
5790B7O42n18k90L31M80p54M0m11L74P9n51L54K28j7J72M51n24j439N4J622m79
5811a29P81k21m41m89J124o51j53q46M41J50M59L00j35J45l49n54O21k35k79R24
5831D63k30J181q68p88J234j985N2J247l02R37m82o15O18m99P46o44N19o06Q14
5850G92m61l53j91j09N91o39K79j99p04L83J392j139j18M04l55K1Q89l50m84M36
5870H5O5p70J466r60O5K34j128L02N35Q26o68p30J272p18K22j180J413q19l85
$$ plain form
5732 -1085 -130 -552 515 279 -1125 348 -74 602 114 -15 -257 -126 -423 -292 192 -416 916 208
5750 208 -626 377 1113 -368 109 -438 455 -156 -79 -86 -788 -90 285 674 1094 -290 -479 496 131 -348
5770 -348 580 181 -100 209 125 1317 -194 475 213 -326 288 298 -506 724 73 -416 -117 -313 -489 27
5790 27 669 151 -139 192 672 -82 -42 -453 -79 0 -551 -197 31 14 186 637 113 -1326 -1272 350 -129
5811 -129 652 431 -10 -499 625 -26 -179 -1025 -584 -434 25 325 190 335 -14 -568 53 -182 -461 463
5831 463 233 1414 546 -242 992 -993 -941 306 4 941 459 -156 462 -37 709 65 584 -22 792
5850 792 331 -22 -213 -322 269 -370 -91 -290 -994 -611 781 -358 -476 -72 -427 -406 483 133 -351 85
5870 85 150 -620 846 -114 -49 185 -943 -641 -106 720 52 -678 594 -124 98 -1082 331 -488 -873
5889h73J258R46j003J71m61j156P23P00j131M74N54l34M6R77j233M65N17j000
5907c60Q57p58k17P16J345k695Q45J318r31L40n77J102j662k72J297p88J207j261
5925d94J233j684J254m83q78P87l3K87l03O68J58m89J13L5q41K21K96M04j294
5944a043M83N66n43M21J84m07K66O17q62J75K35k90J207j572N82J18l98K73K63
5963B75k42M83n92j16o51J151Q26k17j336k02N84n61O85m19L15J084P5r37L54
5982E59j606P27R10j177Q8M79n83J279n38L23j91j539J511k4o50J111l19l60k34
6001b34o82N13N00o92L85N10Oo71K32J459j597N46q06M98R37j411P6J334j404
6020e01O22J23K94r24J345p55n43M53N1P7l87N19O8m00O2k28O4m26L29m31J004
$$ plain form
5889 -873 385 1331 328 499 38 -1118 -395 305 -826 -352 202 -132 -86 891 -342 123 640 -360
5907 -360 497 -261 -478 238 1583 -1112 -267 1051 120 460 -117 985 -677 -949 348 -440 767 -494
5925 -494 739 -945 309 -174 -1052 -265 -298 -11 -314 354 512 23 136 171 -670 -449 -153 251 -1043
5944 -1043 -560 6 -537 -116 68 -339 -73 544 -318 -143 92 -198 1009 -563 19 137 -261 12 275
5963 275 33 516 -76 -192 -843 308 1134 917 -419 -621 -37 -598 87 -332 -17 1067 1142 205 559
5982 559 -1047 -320 590 -587 -499 -20 -603 676 138 461 270 -1269 242 218 -432 679 360 0 -234
6001 -234 -916 -403 97 -595 -210 300 306 -365 -133 1326 -271 275 -531 -33 904 -507 -431 903 -501
6020 -501 121 244 538 -386 959 204 -339 114 165 242 -145 374 442 42 104 -124 -60 -486 -157 -588 416
6041D16J21l24N05k95K77n97K94j015j14J312l68N61j081K39m55J009l03m39N82
6060C25k19n27N29k88l58J603j103J1M15N78j470M04O36O03j290k07R01J41j485
6079h01M04q5k72L10J022O41j355J25M96P70m26p89J3P77j726P30P1k12L67N77
6099F37m8j002J78J088q28M03L10j437J093r93P02P86n69P75j182M07l52q47J148
6118B69p97J80K95r90N3J875j340M48n42Q76n14p0N0L75K48r47k92M23R54n61
6138gM04L47o60L00j93n25j075J089J14m08R03m35M76J95q10J065j213N00O00
6157F67j101N74J195j350L07l03K47J102j341r4M91j378o1J345j86j242J989r26
6175f5L43J0K35J079j659R21q51K76n79M80L79k31m8r48J147K4j24j270J501J74
$$ plain form
6041 416 537 213 718 423 700 103 397 -618 -732 580 212 773 -308 -69 -524 485 182 -257 325
6060 325 106 -421 108 -180 -538 1065 -38 -27 388 966 -504 -100 536 1139 -151 -358 543 684 -801
6079 -801 -397 -482 -754 -444 578 1219 -136 -11 485 1255 829 40 53 830 -896 -166 -95 -307 60 637
6099 637 589 -413 -235 853 25 428 738 -699 394 -599 103 889 320 1095 -87 320 -32 -879 269
6118 269 -528 -348 -53 -1043 -990 885 -455 -7 -549 327 -187 -257 -207 168 416 -531 -823 -400 554 -7
6138 -7 397 744 84 384 191 -334 -1409 -320 -206 -614 289 -146 330 525 -285 780 -433 67 667
6157 667 -434 140 1335 -15 292 -11 236 1338 -3 -97 394 -984 -1045 300 114 -1128 861 -65
6175 -65 278 288 523 1602 -57 864 13 289 -290 190 569 338 290 -658 489 513 389 -881 620 794
6195G94m78k97k46R64j304R56q12J057r62j76P09j76P14r37o43M29J020j612J370
6214C70Q2q36j96N42k70J76K92L13j92n68J289J22j603O3M42k60L03O12j066j56
6234e41J287n57J21q38N17j25R63j034j0J193n79N10p12j4K54j053M57N9N46j63
6254B81P36j52n00J23k78M63K20o55M46n1m58j30K34L07o70n16L48p09Q40O01
6274D80l64J06J12M16o60J48j83p24L64M08l01J737k110q00J012K52J91n49J0
6293d55J98Q79l84j1J0j061J855k88j61j240k40l8J111k27K26r29R48j159J438
6312D72M97k107J234J05n19K52P54j250n57J221J385j038j010L34o76Q37K41L10
6330D85l0j123R26k27p5m99n7O55K74m02J59j212J117J5L02j441R76k61m64J334
$$ plain form
6195 794 316 19 -227 737 -567 389 -423 634 -328 -504 205 29 743 -194 -837 -408 612 -1000 370
6214 370 452 -384 -580 -38 -308 -132 160 473 281 -287 1002 1124 -479 -416 26 -234 69 681 -385 -541
6234 -541 746 189 310 -528 -11 -136 827 -207 -217 976 397 907 195 181 435 -618 -161 -102 444 281
6254 281 1017 865 365 488 210 673 893 238 684 633 175 45 279 586 -84 -600 -252 -961 -121 480
6274 480 116 222 334 750 90 238 55 -669 -305 103 -198 1539 -571 -1371 -359 -107 84 -465 -455
6293 -455 -257 622 238 227 237 -824 1031 743 582 -658 -898 -936 175 -52 174 -755 193 -966 472
6312 472 969 -1138 96 201 -318 -66 688 -562 -1119 102 1487 449 -561 -227 -903 -66 175 485
6330 485 455 -668 258 31 -44 -543 -600 55 329 -73 86 -1126 -9 6 308 -1133 -157 -418 -882 452
6350D52r92o37J386rj6p23L40p43K92N58l08J415j415J123j065M42K12p90P41
6369B63l60L73m07Q09j504P00Q6m6P46q02pj19k87O87J42k08RK30m46M88K92k130
6391a491K173o32m8j70k24J41K05m65L58J162j762J671j299L72m09O73P02q08
6409A49j159P09q7J046k63j022J060m33r50P49p51J219l50M11Q3p87j78Q06J15
6428C67p63n77J042N78j151r03K47J735Q74j410j93j52M58M01j576Q31O44K17
6446F69o06k1k004J781Q13r57J05p45O62K6K99N74j301Q68P68q10K32r60Q33q85
6466f59N51ln42P04l00j6n99K058j089k58j035Q18L56n30J249k0j036N96j60q7
6486bJ1j424K489j379Q62j050L93q9L62m21l51J5L19j47r0R99j561J440q93J15
$$ plain form
6350 452 -540 -1177 209 200 184 -539 -199 -942 -650 -92 -400 1015 -400 723 -342 100 312 -478 263
6369 263 -97 276 -131 678 -826 -126 -40 -86 660 -142 -149 -268 -555 132 274 66 75 305 -141 347 639 -1491
6391 -1491 682 50 2 -168 -392 -251 -46 -511 -153 1009 -753 918 -381 -9 -418 255 957 149
6409 149 -1010 -301 -388 658 395 -627 433 0 -950 -201 -952 267 -83 328 411 -376 -554 252 367
6428 367 -396 -973 69 647 -504 -1407 -1160 575 1449 39 -154 -306 152 553 -1023 -192 452 669
6446 669 63 42 -1962 -181 632 -325 -220 -965 -303 -277 22 596 -705 163 931 121 353 -607 226 -659
6466 -659 -108 -111 -653 51 -249 -265 -864 1194 105 -153 -1188 -370 -14 -544 705 685 -351 245 85 -2
6486 -2 9 -1415 1074 -305 557 -493 -100 -189 173 -248 -599 -584 -265 -412 -502 497 -1064 376 -517 -402
6506d02O67r81N46R52o61j48Q85q65J81k81p11N35K42J04J46r46J470k46O06j427
6526c34J185q71l16L34l65K39K67m85O68q33M50Jm05J57k3l20P30q5L11n6L64
6547F13o99k11L47j51L87j35j77Q62j094k95K93m68J478j084P30n30p29Q5P32
6566d6n8r26J99Q01l85o42K045j133N17q02L20N68j83J55O46j457R86o45n16L79
6586a77L65O46o74N2l3n46p1P35L16O94j769P07L12j039P02O1j307J252J002n61
6606F67j276O69j141J299O46j462o9O67m76j99J372J32k29k62m87l73J041m6k30
6625B43j132P35J37q87N32p4M08J38M4n68R5Q40L55q29P6j38L19O85j308K49R7
6646A7J12l87N59o64L6p65Q65L34J83n65O47j09m27R55N22j176l13J59M28n57
$$ plain form
6506 -402 265 -716 -170 782 121 -27 858 -7 174 -107 -818 -283 -41 63 209 -737 733 487 1093 -334
6526 -334 851 -20 -336 -2 -367 -128 139 -346 322 -511 -61 -60 -465 -308 -331 -651 79 -6 305 249 613
6547 613 -86 -297 50 -101 286 151 -26 836 -258 -553 -260 -728 750 -334 396 -134 -863 -778 -46
6566 -46 -104 -1030 -831 -30 -415 -1057 988 -145 372 -430 -110 458 275 430 1076 -381 605 -40 -556 -177
6586 -177 188 834 160 212 179 -367 -438 297 613 1307 -462 245 557 -482 220 281 -1026 226 1228 667
6606 667 -609 60 -1081 218 864 -598 -667 0 -476 -675 697 829 600 338 -149 -522 519 473 243
6625 243 -889 -154 -17 -904 -372 -446 -38 100 144 -424 -329 511 866 37 113 -25 294 979 -329 -80 17
6646 17 129 -258 301 -363 -327 -1092 -227 107 290 -275 372 263 -164 791 1313 137 -176 -17 411 -146
6666a46Q73r37J346q25m47k71R12K5j691K020o72p30Q99j021J748j345P34p2j474
6685a074O29k20J612r19M15o60j12J22K21N25Jo93R01q24m72q86L51K046r06j010
6705i53N60R41j098P33p39N3K32K43N31k31k82q68O35O88m55J13j90k51Q61l42
6725A81P34j450K39j88k20J028n9p17J44Q54l81O8l18L61o29J54J50j30j09J90
6745i8L7N6j61K45J85L52o71l0J784j078j62K40p78P33k35n34J42K75l98L24p32
6766e04L64L78L4o67O22J09K43m57K8L15N23o08m86P03q8M75n34N02j449Q15J14
6787D32l11k6O93o15k5L17p75O51L88p66O15n37J038r62p13J300j103O42n56J089
6807G76j077n17Q35P14k90l48P82o20o6j333J802j842N40J146j598J154n42L13
$$ plain form
6666 -146 727 -210 1136 311 -136 -407 505 530 -1161 859 187 -543 356 -665 1083 -262 472 400 -1074
6685 -1074 -445 -665 947 28 443 -217 -329 -207 14 539 540 -153 748 -76 -548 -1434 -1083 963 57 -953
6705 -953 -393 548 -550 183 -556 -503 -271 -28 503 272 -10 -878 -243 445 -10 103 -87 -338 523 181
6725 181 915 -535 -296 -484 -704 324 265 -452 -308 546 165 233 -85 276 -353 -199 -49 -179 -288 -98
6745 -98 -61 -5 -166 79 264 616 -55 -85 1699 621 459 699 -79 654 419 -115 27 302 -96 228 -504
6766 -504 -140 238 272 -395 227 336 579 122 150 465 988 380 -106 597 509 984 450 952 -497 318 432
6787 432 121 95 788 173 148 465 -310 341 729 -37 578 41 1079 117 -596 704 -399 243 -313 776
6807 776 -301 -818 17 731 441 93 875 255 189 -1144 658 -1184 -644 502 -1096 58 -484 -171
6825a71O78p90Q56q20l24L09R45m36j51j037J098N51p61k44O59K1l1j8q06J19
6845c53M20o8k53r6P33j81K23j32L91n87j248L51M87m02J072L20j127o0L47o74
6865h37K28M34R99r2o83L46k61L80m73M69m06k08J24l18J43J36J19j55k44o3M08
6886D6o13Q30r78O07j90k09N1M50k35j54L56o93n2J766p23j90o02O25o01O39O9
6907A99M96l07j507P74P47k37q36L82P54j52l77j180Q14J582P4j454Q66k99J58
6926D97j50j99o13r13J869N20o14j027J487K74r95l99M93p07N06j53R07o86rl99
6946c11J41L1k84O41Q0j163O96n08J189j476P93J02J22o48P93j298l11J710O31
6965I30j079l03o97M88O9J55N31r1L72O6q75O48L63m00N93K42j780k1K64N8J60
$$ plain form
6825 -171 507 -283 573 -247 -571 -262 683 247 96 -941 157 708 -53 -297 362 383 352 334 -472 -353
6845 -353 67 -1 -254 -350 383 202 425 293 684 97 -1151 -800 -313 -715 357 677 -450 -510 -163 -837
6865 -837 -609 -175 824 732 49 395 134 514 41 510 104 -104 20 -298 -155 -19 100 -55 -299 -362 46
6886 46 -567 263 -715 -108 -298 -507 -456 -6 -241 -395 -39 -732 -784 982 259 69 -533 92 -509 130 199
6907 199 695 388 -1119 -345 402 165 -671 -289 465 313 -64 -1244 -430 1152 1226 -228 638 339 497
6926 497 347 148 -465 -1378 491 1011 397 -630 857 1131 136 -263 230 -477 29 -124 783 97 88 -311
6946 -311 -170 -139 -423 218 298 -865 -169 -677 512 -964 -171 -69 53 -595 198 -1100 -1411 299 930
6965 930 -149 -452 -1149 -661 -592 -437 94 3 375 441 -434 214 577 177 770 1012 -768 -789 -525 -467 -307
6986c07j65K83N03k67r85N60J447j964P37M35j555J373l5n84K93J137j357j81
7004f32J108o38l08L56K70n38J308k81l68L39k53P35nl20j430J091j011K25J036
7023F84K48p12m97M29M10j107N08O00l67M0n88Q71K04j140J330j016m94R24j518
7042a191J259P14j153M61l4j45r8J006j088R6j4J5J44K54K28p15L01J74M6k39
7062B1M1l34P99j83K2q61N67M49p15K02k20m4l38J170q20p3J161l38P91j073L59
7083E83M4K26q91J34j88o96R58O91o93k12j84J27L88j7o22n39L27J159j65q4M44
7104G90n25J78O01j411M04r48Q33J49m41N33j98J61o82p64N58J300r52L76m4j76
7124b58p16J270k86r3l62L65J008l13o63o54N20p8P06M26j602Q55P69o43p62K58
$$ plain form
6986 -307 -472 -189 314 47 -938 -378 1069 -895 -158 277 -1278 95 60 -524 -231 906 -451 -632
7004 -632 476 -162 -470 -114 156 -382 926 645 277 616 363 1098 1093 773 -657 434 -577 -352 684
7023 684 932 220 -277 152 562 -545 -37 563 196 236 -352 519 723 -417 913 -103 -597 327 -1191
7042 -1191 68 782 -371 90 56 -89 -187 819 -269 -173 -187 -172 -28 226 454 -261 40 214 260 21
7062 21 62 -272 527 344 366 -495 72 521 -194 8 -212 -256 -594 576 -244 -317 844 506 1297 224 583
7083 583 627 853 -38 96 -92 -788 170 861 168 -44 -228 -101 287 270 -352 -891 -564 595 430 346 790
7104 790 265 443 1044 -367 37 -911 -78 71 -370 163 -35 126 -556 -1320 -762 538 -414 -38 -82 -258
7124 -258 -974 296 10 -83 -445 -80 928 615 -48 -702 -182 -260 446 872 -730 125 894 251 -511 -253
7144b53m08O66m56Q63n80m31N37M32K20m1N52j092N85n58P13n59N48j050K90j42
7164a64O40k53o15M68o90J261l84m75J018o4p39o62L57R43j54p82Q20m77q52L68
7184d36P52L08j531R49O33p56m59m20J073n60j12n23J455j51l32j02n1Q1qJ036
7204H46k52k95l90K98k80J39L2j154J304m26o98J888j760J571r30J048q52k51
7222a62n77k12J659j002M72o6L46o13J270j487O86j093M78L14J098j110j261K78
7240i82P58n3l56O24Q0M82q28N93o66q04J091L77r11P7J552o09j090O17N3k64
7260b59K0J43n38o1J157r51J011q24P46j023N80J22j358J527L52n95j005R75K35
7279B54o42M21p69J383j330Q16K81k57P08m99N64n06p93l15J54N27L51q87J613
$$ plain form
7144 -253 -661 5 -451 412 -168 -599 -62 370 590 549 1101 9 594 36 749 190 738 -312 -22 -164
7164 -164 476 223 -392 76 -614 647 263 -212 806 742 3 -659 -302 641 487 -295 525 48 -804 -436
7184 -436 316 624 -907 42 675 -81 -540 -960 113 -447 -559 -1082 373 222 -110 -212 -263 -182 -190 846
7204 846 594 299 -91 207 -73 66 98 -1056 248 -178 -876 1012 -748 823 -107 941 89 -162
7222 -162 -739 -951 708 -294 178 112 458 -155 1115 -372 314 -779 -301 13 1111 1 -1260 -982
7240 -982 -224 -277 -633 -9 71 553 -275 318 -348 -1152 -61 316 -595 -518 1034 425 -665 -48 5 -259
7260 -259 -239 -96 -634 -695 462 -489 522 -302 444 -579 1 123 -1235 292 644 49 -956 19 254
7279 254 -388 33 -736 647 -683 133 414 157 865 366 930 424 -369 -684 -530 -3 348 -539 1074
7298A074l10j179rP89m27N79o46N96j96L66l56n66J037j470L92Q98n6p26N52L
7318C45J95M7j293Q92k47R5M4k48j03J288p31j33q70Q02p87K85R21r33l89J305
7338D85L05p35k30l61M64J194j423m98K040m2k141J688Qq03O59l21n1N5k6o10
7358c43N22n85M57J52M02J91j060O04q27k1J15N5P72m50l5n70R76j073J097L03
7378F82n84r42J645p29m62O65j086J176j158P65n79J027L81j601L08K07J89L28
7396B32l66n09P97j395J598k42k14n45N93j08K20jj163J139P33m02m83K97Q62
7415A043o46m5K10l50Q0J40j202Q36n22P00j207O31k57J405j486J037o33R51p57
7434g2J30K4Q42j387n83p4J423p8n86J212j94m67lo36N56Ok85O88l71J030j918
$$ plain form
7298 1074 764 -415 -424 365 -62 517 -129 467 271 637 281 -285 752 -718 -326 572 516 -210 342 345
7318 345 540 587 -706 186 -61 34 78 -170 -273 1015 284 151 -719 83 -704 -419 502 -431 -820 485
7338 485 790 55 -175 -536 -72 1122 -301 -799 1241 1199 -942 746 754 -49 610 289 238 293 267 -343
7358 -343 179 -406 51 203 605 796 -264 340 -487 -508 -393 -338 434 -16 -51 -621 355 -718 379 682
7378 682 98 -844 801 72 -390 275 -811 365 -793 -28 -607 420 801 -800 -492 -285 -96 232
7396 232 -134 -643 154 -1241 357 115 -99 -644 -51 -159 61 60 -1103 36 769 367 -116 181 1043
7415 1043 397 352 562 212 292 432 -770 66 -456 244 -963 -332 -589 816 -670 367 -266 685 -72
7434 -72 58 82 924 -463 -1046 -1120 303 225 -361 851 657 190 187 -449 107 113 -172 516 145 1175 -743
7455g43N10l17L64k30N4o73O4O23j042O39Q20m24J114o94m3l37n44Q30J93p58
7475e94P59R6k31R7j71m8L8K36o2j76M20l84m31N61J062j537m92k39R71J234j110
7496aJ6o7J47M5j11p14K29L74k96L46L63p23O84M51q39j018L05O75J88P8J066
7517A198j218J50l22P80q93P85n11K00L33j037K02N12r4r6L99r89j49J177K26
7536F53j142J780j077p06Q57o32q16J181J89R81j430p43Q70n06P08Q0m31q3k7
7555b94K85N11q4o09q0N97M98j388R82L33n00M21p19m24R82L79p81J42n22J4n38
7576g95O76K70J02N89j089N35N4o83N64l64o6O21l46N04r16J261o32l36l76%Q32
7597D05m42J070l74j411P89L04j000J237m64p92P3J457j498J31J244o42j4q82
$$ plain form
7455 -743 -233 -550 -186 -416 -362 -1035 -971 -348 -1390 -751 69 -355 759 65 22 -315 -859 -29 164 -594
7475 -594 165 261 30 127 -44 -92 -54 182 120 -56 364 -20 -451 110 1172 -365 -857 -1096 -125 1109 -1
7496 -1 15 -52 95 140 29 -685 -456 -82 -378 -32 331 -392 292 743 -96 -1114 -809 -134 54 132 1198
7517 1198 -20 130 -192 588 -305 480 -31 169 502 -535 -333 179 85 -11 388 -601 -750 427 653
7536 653 -489 1291 214 -492 365 -267 -1083 98 287 1268 -162 -905 -35 -541 167 247 -184 -267 -294
7555 -294 -9 502 418 -191 -271 326 824 -564 418 751 251 672 -47 -471 511 890 109 251 -271 -257 -795
7576 -795 -119 151 253 842 -247 288 342 -341 223 -141 -207 414 68 572 -344 917 285 -51 -427 -427 405
7597 405 -37 1033 659 -752 37 341 -659 578 114 -678 -605 852 -646 -515 729 87 73 -809
7615h09J748j720O75j74m88J034L49p73n20N42J85p5L51m37P99p8j129Q91o92
7634c21J03M66m11p71J091Q40l58p19l9l78M54j37R68m40o09l99Q50p8J80J34
7654D26K53p83L44l00L94n4o45l08L26M3K34L78Q03j016r05O14m27M20N73k68
7674A02q19J489r27J70K25K4j29j40L6l44P29K65j057m69J52O86K30n88L11J009
7694I55m42N15j513N94N84j507J081j90l63J256j356P32J1O7m71p40J854p5k41
7713G51j077L50m23o3J24L48J1P26j319J6J179j045N05O59n40l84l41J209m1m84
7733A61q98J183j06K11q84O78r70P15k83r33J853m48N22M4K21j587N93m99J2j0
7753d25P79l7L26o30o21K80M42j95l16Q67o96M27k35q1K39Q33j38k22p91j11O33
$$ plain form
7615 -809 939 -781 -106 -280 -768 266 615 -158 -678 -136 49 -26 325 -112 687 609 -520 371 -321
7634 -321 -218 248 -163 -934 157 997 639 -80 -119 -497 -43 -180 788 348 -261 -660 190 112 292 426
7654 426 679 -104 240 -60 334 280 -365 -673 -347 -304 -70 308 1111 95 -810 -196 -623 -203 370 102
7674 102 -717 772 -155 15 240 264 135 -5 31 -313 416 681 -376 -845 -693 -7 223 -365 -54 955
7694 955 513 1028 -485 109 693 -814 267 77 -286 970 -386 346 357 424 -47 -787 1067 992 751
7713 751 -326 24 -399 -462 -338 10 21 747 -572 -556 623 -422 83 742 202 -182 -523 686 645 161
7733 161 -737 446 340 551 -333 345 -625 90 -193 -1126 727 279 801 845 1066 -521 72 -427 -415 -425
7753 -425 354 317 643 13 -608 -328 114 -81 -397 470 -226 201 -34 -115 124 957 819 597 -194 -305 328
7774C28l63K86k44M30l29m08N02o26J232r73J081o67p26J09k53P09M8L18P19k132
7794i59M20J591j199O66l61L78r18p6J26j93J261r60J3L08l44n52O3M59Q68l76
7814B15q35O46Pr35N03J60o6J146m76p31R10j039P20L85j077J148K15j740O32
7833b12L26j65k33n23%N84J313j120K67j04J164j780L24j21j07O29o46j74J842
7852A264j266l58J403p27o56J63m69J732j602j06M20Q28j418J673j550k8J581
7869H84j236N74K33r11K69k36R56l73L64k59j154k8j60J57Q75j016N46K0j30K83
7889c42k61M53p15q4K097j466J425j835O88Q66q07R37j252L23m60R25n13K16r07
7908g12J39J436l21p30O06n90J012o86n90N82p2l78J077j189J63N74P5j170P52
$$ plain form
7774 328 -35 251 7 437 108 -300 202 -424 808 -165 916 249 -477 -368 -621 88 136 454 1173 -959
7794 -959 -539 1052 -147 519 158 536 -382 -458 -332 -525 736 -224 -211 97 -247 -799 -736 -277 591 215
7814 215 -620 26 33 -902 -399 -239 -305 841 365 -366 544 -495 225 610 -467 681 896 -844 -212
7833 -212 114 -51 -284 -807 -807 -223 1090 -30 237 133 1297 -483 -159 -280 -387 242 -404 -578 1264
7852 1264 -2 -360 1043 316 -340 -177 -646 1086 -516 -622 -202 626 -792 881 -669 -697 884
7869 884 -352 222 455 -456 -187 -423 533 160 524 265 -889 -917 -1077 -920 -45 -1061 -515 -495 -625 -342
7889 -342 -603 -150 -865 -949 1148 -318 1107 -728 -40 826 19 956 -296 27 -433 492 -21 195 -712
7908 -712 -573 863 542 -188 418 -172 840 154 -436 146 74 -304 773 -416 -253 321 396 -774 -22
7927b2r51N70J261j470J46m88J223j222L90M70m39R48l93l51M06L97p35m73J031
7946B98m66L98M05k72m6j96o49P73K82p55p0j62Q89j545M85J3J268j73r4m09K81
7967B55J083j972J844j951Q90L91n47l8j96q54J456K35r27J67LR88m62q29J249
7986G85L07j500P96r68M45M99m11K98O76p27J65l83p75J371N1J4j391M23l25J546
8006H96j268LL47K26J8Q5J8q52P47p89m59J462o78l93L92m54J090k5r02N40L11
8027C15p1l28M13j68j009R31P0j40k43J11n37Q02M05l98O4J21j023P84K29m20
8047i2L28j126J680j159M91M68j503R55p28M61o1J211j651P57R62j658P45L21
8065D01l19j62R11n55m63N35j740J851m12k14R20k95m46P09n13k57R53j137R0
$$ plain form
7927 -22 -973 -403 858 -612 -466 -954 269 -953 -563 -93 -532 416 23 -328 78 475 -260 -733 298
7946 298 -168 230 635 363 317 121 -528 245 527 -228 -298 -460 429 -1116 -631 -618 650 477 383 -26 255
7967 255 1338 -634 1210 -741 149 540 -7 -45 -241 -1095 361 596 -331 -164 -161 827 365 -464 785
7986 785 1092 -408 388 -580 -135 364 -47 251 927 200 365 -18 -793 578 629 643 -748 -325 -650 896
8006 896 -372 -369 -22 204 222 307 325 -527 220 -569 -1028 434 -244 -637 -245 -699 391 366 -536 4 315
8027 315 244 -84 329 161 -848 83 153 13 -230 -119 -656 146 551 153 217 338 -685 99 328 -92
8047 -92 236 -890 790 -369 122 590 -913 42 -686 -225 -286 925 -726 31 993 -665 80 401
8065 401 82 -80 831 276 -187 348 -1392 459 47 -167 753 458 12 721 208 -49 904 -233 -143
8084a43m59O21Q50r86j07K17o33P32o12J579m22q72l15L52k28J58M16L61P7m16
8104A70l49P2j04o89Q07r57N09l77O87L9m28R24j497J405o86J31J63n01Q31o39
8124d89J085j733J164J36o40K07q9q8L71j586J739k50p74J462o91N01r03k05M01
8143c82l06M87R35j028p16J015m49R51l32m68M30n2N26q45l10K98l56J36q27N43
8163g50J317q23Q28j244J773j345K57k28L99R03j350j29Q36q15o1K19L48j293
8181a158J002l00P91p00q3N05O51n62l51L78
$$ plain form
8084 -143 -602 19 869 -117 -224 -7 -640 92 -520 1059 637 -235 -550 -198 -426 -268 148 509 586 170
8104 170 -179 -107 -211 -900 -93 -1050 -541 -918 -231 -192 -620 304 -1193 212 -474 -343 -180 -681 150 -489
8124 -489 596 -1137 27 163 -477 -270 -359 -447 -76 -1662 77 -173 -947 515 -176 325 -578 -783 -382
8143 -382 -688 -201 734 -294 -1010 5 -444 507 175 -293 137 85 611 -234 -544 -246 -602 -466 -1293 -750
8163 -750 567 -256 572 -672 1101 -244 13 -215 184 1087 -263 -392 444 -371 -432 -213 135 -1158
8181 -1158 -156 -456 335 -365 -448 57 708 146 -205 173
8191A73
$$ Imaginary data points
##PAGE= N=2
##DATA TABLE= (X++(I..I)), XYDATA
0@%%MlJ7k5M4n2P8r2J11j39J54j84K18k61L03l56L94m46N11n84O58p42Q38r55
26e09J068j198J350j515J694j899K125k388K683l030L448l944M547n311O309p666
42d236R603j2412J2056k69014k5751K7569k6520P034j5262M585o939M699m73Q418
56b86643P061J3793J0520J7783J6719K0498J8283K4788K1278K5980K3247K5000
68f1693K3495K4680K2749K2947K0249K0573J6640J7535J5072J1646Q684R279N860
81A57716K091J460j433l421n773o445j0712r481j2196j4413j5843j5763j6499
94D9288j7955j5940j8197j6111j5577j7051j4474j4525j2681j0746r672r548o623
107a29812n222l169j894N70J735L746L922P329O533J0946Q899J0904J1029J1949
$$ plain form
0 0 0 0 4 1 18 -7 37 -15 63 -29 82 -57 97 -87 131 -130 173 -183 211 -235 276 -308 350 -392 446 -509
26 -509 559 -639 711 -804 890 -1009 1116 -1272 1411 -1619 1829 -2115 2432 -2879 3430 -4236
42 -4236 5367 -7045 5011 -264003 -289754 -262185 -288705 -281671 -296933 -292348 -299287 -294588 -295061 -286643
56 -286643 -279582 -265789 -255269 -237486 -220767 -200269 -181986 -157198 -135920 -109940 -86693 -61693
68 -61693 -38198 -13518 9231 32178 52427 73000 89640 107175 122247 133893 142577 151856 157716
81 157716 159807 161267 159834 156413 150640 144195 133483 124002 111806 97393 81550 65787 49288
94 49288 31333 15393 -2804 -18915 -34492 -51543 -66017 -80542 -93223 -103969 -113641 -123189 -129812
107 -129812 -135034 -138203 -140097 -139527 -137792 -134046 -130124 -122795 -116262 -105316 -96417 -85513 -74484 -62535
121f2535J3390J1406J2962J4165J1996J0951J1081J0711J1449O286R161N375P188
134G3586K321J881J495k3r15l587l891n039n098p635q980p870p758j1195q426
149H866j1055r357r510r902r090r525q065o673p068o256l728l649k331k119N05
164h8957R88P73J605N110M292N108N403O410Q067P650P555Q436Q509P998Q759
179b294Q410O790O701P725M277O544L702M482K975K07J672j55J065k273q76m591
195D4361l508m504m633n803n934n071q164n745o879p342o326o283n596n856l321
210d0604o621m240j853l509k313q33m5n19J107M83L402K734L245M678M133L983
226c6772M814O259N409N911L996N127O066L394N647N389L517M299K018K137K240
$$ plain form
121 -62535 -49145 -37739 -24777 -10612 1384 12335 23416 34127 45576 51862 61023 66398 73586
134 73586 75907 77788 79283 79260 78345 74758 70867 65828 60730 53095 44115 36245 28487 17292 8866
149 8866 -2189 -11546 -21056 -30958 -40048 -49573 -57638 -64311 -71379 -77635 -81363 -85012 -87343 -89462 -88957
164 -88957 -87969 -87196 -85591 -80481 -76189 -71081 -65678 -59268 -51201 -43551 -35996 -27560 -19051 -11053 -2294
179 -2294 6116 12906 19607 27332 31609 38153 41855 46337 49312 49519 51191 51036 52101 49828 48952 44361
195 44361 40853 36349 31716 25913 19979 14908 6744 999 -5880 -13222 -19548 -25831 -31427 -37283 -40604
210 -40604 -47225 -51465 -53318 -56827 -59140 -59973 -60018 -60537 -59430 -58947 -55545 -52811 -49566 -44888 -40755 -36772
226 -36772 -31958 -25699 -20290 -14379 -10383 -5256 810 4204 9851 15240 18757 23056 25074 27211 29451
241B9451J004L77j18l15p06j037k421k820l257l960l374l935m461l797m573n219
257i161m924m140m395l250k258l426k573k924j875j567j576O33M39k56L025N64
273c7664K338L060K109L041M975L905K931M633L573M641N089L512L321L701K168
288A5333M135L877Q17J745J953o0J161m67k90j093j634j495k322k428l408l417
304A2407k523m941l403m710l504l167m069l543l884l356j968l541k805k425k97
319c5729j106q56L74j064J145J575J210K615K088K531K864M396K436L910K905
334a0706M239L223M167L625M151L488J960L145K601K418L163j09O80N78J266l62
350B7527j129n53k746o54j742k063l316k853l629k748k356m425k338n187j688
$$ plain form
241 29451 30455 30832 30714 30399 29693 28656 26235 23415 20158 16198 12824 8889 4428 631 -3942 -9161
257 -9161 -14085 -18225 -22620 -25870 -28128 -31554 -34127 -37051 -38926 -40493 -42069 -41436 -40997 -41253 -38228 -37664
273 -37664 -35326 -32266 -30157 -27116 -22141 -18236 -15305 -10672 -7099 -2458 2631 6143 9464 13165 15333
288 15333 19468 23345 24162 25907 27860 27800 28961 28494 28204 27111 25477 23982 21660 19232 15824 12407
304 12407 9884 4943 1540 -3170 -6674 -9841 -13910 -17453 -21337 -24693 -26661 -30202 -33007 -35432 -35729
319 -35729 -36835 -37691 -37317 -38381 -37236 -35661 -34451 -31836 -29748 -27217 -24353 -19957 -17521 -13611 -10706
334 -10706 -6467 -3244 923 4548 8699 12187 14147 17292 19893 22311 25474 25365 26045 26623 27889 27527
350 27527 26398 25845 23099 22445 20703 18640 15324 12471 8842 6094 3738 -687 -3025 -8212 -9900
365i900l483k963k678k298j742k712j014j001p85p89l26O4J103J139R91J083L127
382b2184J366L109K579K731K533L628L836J394L319K786L099J687L809K363N16
397A6571K949J578P30J407k68P28O0l25j954o19k338r39k881q37l048k681k717
414E416j596l751k726k236j927k809l524j040k759r18l364O16j885L94l71q19
430b3299J152P13j21J300J028K283P14K322K135L458J920K129L152J557K829L329
446F601O97L101K329N09K054K232P69L66P05p09q4l39N3k60p05j943j574j805
464A1997q34k957j608k237j918k327k931j839k298j305k533k25k830j017j437
479a6299n29M73j713K76R12O2n66J630P22J813J235J299J751K362K835J549R68
$$ plain form
365 -9900 -13383 -16346 -19024 -21322 -23064 -25776 -26790 -27791 -28576 -29365 -29691 -29627 -28524 -27385 -26394 -25311 -22184
382 -22184 -20818 -17709 -15130 -12399 -9866 -6238 -2402 -1008 2311 5097 8196 9883 13692 16055 16571
397 16571 19520 21098 21828 23235 22967 23695 23755 23430 21476 20857 18519 17580 14699 13862 10814 8133 5416
414 5416 3820 69 -2657 -4893 -6820 -9629 -13153 -14193 -16952 -17870 -21234 -20618 -22503 -22109 -22480 -23299
430 -23299 -22147 -21434 -21555 -20255 -19227 -16944 -16230 -13908 -11773 -8315 -6395 -4266 -1114 443 3272 6601
446 6601 7298 10399 12728 13237 15291 17523 18292 18658 19363 18654 18570 18231 18284 18024 17319 15376 13802 11997
464 11997 11163 8206 6598 4361 2443 116 -2815 -4654 -6952 -8257 -10790 -11015 -13845 -14862 -16299
479 -16299 -16828 -16355 -18068 -17792 -16880 -16818 -17384 -15754 -15032 -13219 -11984 -10685 -8934 -6572 -3737 -2188 -1220
496a220K319K300J884J016L001J699J755k68J957O32P74J16n46J203o86J010k244
513A4702q12j193r02k445j089k192j854q41j959k550k189k369j409j321j709j829
529a1961j181p09j391P35k060J84P38m33J662m04J11J550J357J906J691R26J815
546e464J722K424K366J764M27L557J556J403J295J441J274J769j07J004M43K27
562A7101K65j955L79k87j083j026j010j831j485K10m195K2k568k279r29j913k880
579e464j070r66j003l218j359p06p70j30j25r48Q54P12n15K07R34J553k21L429
597h806k41K703J754J900J242J427J856J663J822K060J108J695J449N62K49J469
613A3912J077j303P26o0J79j501N30j186j99j364j793q11l016k52k387l36k143
$$ plain form
496 -1220 1099 3399 5283 6299 9300 10999 12754 12486 14443 15075 15849 15965 15419 16622 15936 16946 14702
513 14702 13890 12697 11795 9350 8261 6069 4215 3374 1415 -1135 -3324 -5693 -7102 -8423 -10132 -11961
529 -11961 -13142 -13851 -15242 -14507 -16567 -16383 -15645 -16078 -14416 -14820 -14709 -13159 -11802 -9896 -8205 -7279 -5464
546 -5464 -3742 -1318 1048 2812 3239 6796 8352 9755 11050 12491 13765 15534 15427 16431 16874 17101
562 17101 17366 15411 15790 15503 14420 13394 12384 10553 9068 9278 5083 5105 2537 258 -671 -2584 -5464
579 -5464 -6534 -7500 -8503 -11721 -13080 -13786 -14556 -14686 -14811 -15759 -14905 -14193 -14708 -14501 -13567 -12014 -12235 -8806
597 -8806 -9047 -6344 -4590 -2690 -1448 -21 1835 3498 5320 7380 8488 10183 11632 12194 12443 13912
613 13912 14989 13686 14412 14352 14531 13030 13560 12374 12175 10811 9018 8207 5191 4939 2552 2216 73
630G3k035k075n18j568j250k234q60j635L56j78o71OR6J85L42j319K193J122O46
649i324J401j16K877O86R89K795R65J578J913J269R73O94O50O90K725O12L39R76
667A2692P60n30M30r53j036k25Q26j138j733o50k078q71q85j941j311q70j380
684h93r59j605j811j647O1j961j71r44r55j53n70R22m88K44j53J094j56J030J575
703g540J21J883M72J586Q51P83K624J061P23K110R21P28M48K267k99K60J651L05
721A0955k84p28m43L23n6p85j56N74r78j595j300n31j702r42q21j847j114n56
739a986j104j954p02j050O51j602j223J102q59m49M31k3J393p67J673q21l52J135
757f507K047Q79J78P73K657K53K97K262n76K482j69K82J470M81L17J0p0J580j011
$$ plain form
630 73 -1962 -4037 -4555 -6123 -7373 -9607 -10467 -12102 -11746 -11924 -12595 -12589 -12493 -12308 -11966 -13285 -11092 -9970 -9324
649 -9324 -7923 -8039 -5162 -4476 -3487 -692 273 1851 3764 5033 6006 6700 7350 8040 10765 11377 11716 12692
667 12692 13452 12922 13352 12399 11363 11138 11964 10826 9093 8443 6365 5494 4609 2668 1357 487 -893
684 -893 -1852 -3457 -5268 -6915 -6854 -8815 -8986 -9930 -10885 -11038 -11608 -10686 -11174 -10930 -11083 -9989 -10145 -9115 -7540
703 -7540 -7419 -5536 -5064 -3478 -2627 -1844 780 1841 2564 4674 5595 6323 6771 9038 8739 8999 10650 10955
721 10955 10671 9943 9500 9823 9767 8982 8826 9400 8422 6827 5527 4996 3294 2352 1531 -316 -1430 -1986
739 -1986 -3090 -5044 -5746 -6796 -6145 -7747 -8970 -7868 -8727 -9176 -8745 -8768 -7375 -8142 -6469 -7290 -7642 -6507
757 -6507 -4460 -3581 -3403 -2630 27 280 577 2839 2263 4745 4576 4858 6328 6809 7126 7136 7066 8646 7635
776G635J025j348J406j484l32o04o5j537j376m48k70j242p88p63j400o67j218
793c476j48j179j76p09m81J19j102O75p29j06j32J372R62q94Q22M32J171Q37n14
812c256Q61J718N59r0J772l37K102J174K91L56M78J116N94l28L58n58O18q21o92
831E915L06r1L81j264p18q30k22j16p78j974M67j668J82r56j305P5q82p71n35
850d784p95l08J54p18J96n04P74l09O87n97K455j208J178M46R37p76K757M9k13
869e79J818l90J940m27J731n95N95J568J66L35k36p0k81J468k243J514j007q55
887D452k45j77r79k14n65j001m39n25j530n9l05j162L66r58l22K3k01n72J66l47
907d594m71L42l06P1L99J562j213N02J076k11J967j82LQ84m23J736j79K78J613
$$ plain form
776 7635 8660 7312 8718 7234 6902 6298 6233 4696 3320 2872 2602 1360 572 -191 -1591 -2258 -3476
793 -3476 -3624 -4803 -4979 -5688 -6169 -6050 -7152 -6477 -7206 -7312 -7444 -6072 -5110 -6004 -5182 -4750 -3579 -2742 -3256
812 -3256 -2395 -677 -118 -208 1564 1227 3329 4503 4794 5150 5628 6744 7338 7010 7368 6810 7428 6607 5915
831 5915 6221 6130 6511 5247 4529 3699 3477 3361 2583 609 1076 -592 -410 -1366 -2671 -2596 -3478 -4249 -4784
850 -4784 -5579 -5887 -5733 -6451 -6255 -6759 -5985 -6294 -5607 -6204 -3749 -4957 -3779 -3333 -2396 -3172 -415 -366 -579
869 -579 1239 849 2789 2362 4093 3498 4093 5661 5827 6162 5926 5856 5575 7043 4800 6314 5307 4452
887 4452 4207 4030 3051 2837 2272 1271 832 307 -1223 -1282 -1587 -2749 -2383 -3341 -3663 -3640 -3841 -4413 -4247 -4594
907 -4594 -5065 -4723 -5029 -4958 -4559 -2997 -4210 -3708 -2632 -2843 -876 -1058 -1055 -171 -594 1142 963 1241 2854
926B854M95n22M78oP01k87J259m54O54O7m6j695J181j074O99o31o32p96o32J16
946A729Rj657J49n63J1K03j554k11q48p0j322P17M55q08J82q69K16R04J37M41
966b749P9N41K24l75n04Q80K481j053N35L13K021j111L71M05k41M76J197o36N95
985C449o66O68o06M84K25q82K16o16P54O53l10k101j52L10m80o96M48q23k22J23
1005b24j084J036k123l52K88Q10n66l21O19p58l44R70m37J422j239L75j56k31
1023b315J239n8K29J641q70J244j122K64J178M40k88O53j68K36N66n89K03k70
1041B213P55m14j52R6J195j143o35j563O91J98j187M58k89N07p40q64P93p75p05
1060a561K96q51J57K74J080r01R17p66o28K93p22J021n33N31J643q43n96Q0J004
$$ plain form
926 2854 3349 2827 3305 3299 4000 3713 4972 4518 5172 5239 5193 3498 4679 3605 4304 3673 3041 2245 1613 1729
946 1729 1738 81 230 -333 -322 -119 -1673 -1884 -2732 -2802 -4124 -3407 -2952 -3760 -3578 -4447 -4231 -3327 -3190 -2749
966 -2749 -2670 -2129 -1905 -2280 -2784 -1904 577 -476 59 372 2393 1282 1653 2058 1817 2293 3490 2854 3449
985 3449 2783 3451 2845 3329 3554 2672 2888 2272 3026 3679 3369 1268 1116 1426 946 250 698 -125 -347 -224
1005 -224 -1308 -272 -2395 -2747 -2459 -1649 -2215 -2536 -1917 -2675 -3019 -2049 -2486 -1064 -2303 -1928 -2084 -2315
1023 -2315 -1076 -1134 -905 736 -134 1110 -12 252 1430 1870 1582 2235 2067 2303 2869 2280 2483 2213
1041 2213 2968 2554 2402 2498 3693 2550 1915 352 1043 1241 54 512 223 730 -10 -874 -81 -856 -1561
1060 -1561 -1265 -2116 -1959 -1685 -605 -1506 -589 -1355 -1983 -1690 -2412 -1391 -1924 -1393 250 -593 -1189 -1109 -105
1079a05p9O23j44n29N50L50J603r90M39m65N31l01n63J083o51K27O19r0j331J009
1099A786N48j462J023k48j183k45k67L39J48K08n60r81O16l85M7j472R37m74J055
1118e70j148O56M63j461J174j29k9o57J057m81J06J117q42j84J706r77j41J015
1136F75m5k2k48L65J25m31Q77O16o35q28n8J439n74K79l96N75n15q68P46j5R4
1157A156m70p10O24r45j97J7k55J060m42j339N28N95j60r78j68Q22k16N12r79
1176a545q1K254j219j295P78P59N47o33O36k59J60P6P56n36O83l10Q5p60Q00L32
1196A228n06N78J72N27j346J454j403L20q70l74Q60l90L18l86n34R94Q3j46q01
1215b22n08L66j90q21J287R3k59n63M58j548J074L98o49j01O2O24q27R69Q2p11
$$ plain form
1079 -105 -184 439 295 -234 316 666 2269 1279 1718 1253 1784 1483 920 2003 1352 1579 2198 2108 777 1786
1099 1786 2334 872 1895 1647 464 219 -48 291 439 647 87 -894 -278 -663 -616 -2088 -1151 -1625 -570
1118 -570 -1718 -1062 -599 -2060 -886 -1015 -1044 -1701 -644 -1125 -1019 98 -744 -928 778 -199 -340 675
1136 675 630 608 360 725 850 419 1296 1912 1277 449 391 1830 1256 1535 1139 1714 1199 331 1077 1062 1156
1157 1156 686 -24 600 -345 -542 -525 -780 280 -162 -1501 -973 -378 -538 -1516 -1684 -862 -1078 -566 -1545
1176 -1545 -1626 628 -591 -1886 -1108 -349 198 -435 201 -58 102 178 934 398 1081 771 856 96 896 1228
1196 1228 722 1300 1472 1999 653 2107 704 1024 154 -220 640 250 568 182 -352 642 725 579 -222
1215 -222 -730 -364 -554 -1375 -88 5 -254 -817 -359 -1907 -833 -435 -1084 -1185 -1123 -499 -1326 -357 -275 -986
1235i86Q88q75J685j038K70pO21l3L96L3r7j557K667j214j28P49q84J89L46o23
1255D02K85K96N8n06j068k6J028j67Q44q46k59O55p80Q44r01o3o34P85k49k12
1275e14j029J109J76J42p51p90J273j279K054l48n02ON18j67m39k03j13J393j503
1294i67N20O30P43j006Q20j017O44L65m47J30J30Q36N77j507Q49j052Q03j330
1312b79j0R05M55j023j32j00q8l17R55j20K72M36r18j129P08j85j248J381P86
1331C49j410J230o0p94J64k28L22k01n30J009p30Q56q60K74Q55K51n17j094Q33
1350b81L25n74l9Q62q54j20Q06l58O44j11J62M06j268J246o08J13K03j555K12
1369g89J182O07j781J183J094j483m55k77J343q93Q43j010K10L76m63p95M39J62
$$ plain form
1235 -986 -98 -973 712 -326 -56 -63 558 525 921 954 857 -700 1967 753 625 1374 490 679 1025 402
1255 402 687 983 1041 535 -533 -559 469 302 1146 300 41 696 -84 760 -141 -204 -838 -53 -302 -514
1275 -514 -1543 -434 -258 -116 -867 -1657 -384 -1663 391 43 -459 -453 65 -102 -541 -744 -857 536 -967
1294 -967 -447 183 926 -80 740 -277 367 732 285 415 545 1381 1958 451 1300 248 1051 -279
1312 -279 -289 616 1071 48 -84 -184 -272 -589 366 246 518 954 36 -1093 -385 -570 -1818 -437 349
1331 349 -1061 169 109 -685 -521 -749 -427 -628 -1158 -149 -879 -23 -883 -609 246 497 -20 -1114 -281
1350 -281 44 -530 -569 293 -561 -681 125 -233 411 300 462 868 -400 846 238 351 554 -1001 -789
1369 -789 393 1000 -781 402 1496 13 -442 -719 624 -269 574 -436 -226 150 -313 -1108 -669 -507
1387e07M5m43nP32k11M58r90P79k11k51M95M66k56p99L59j070J499m53N24m82
1407c21R98K72k390R74J170q30L57p34N51M90j145J284K17j21J25j06j164K24
1425a49n23l9M20k31J79j87p01N97j62q71P92RN35j40l66J19Q01q71K1l20Q33
1446b54J66o0j092K76K164j046o80j32J702k178J475N81l28m04k13R74p02L74
1464F23l27J602r91l85n56l63O34K87l11m91k8R63j239j35M4p15J314k72o17N02
1484d61q21L75P93j677J593p91p34j1O36J265j325J701p99o45P42q21K06O59j3
1503a28R18r72r14J102L08m36M91l13k51j4M67m39n2Q81m89N96k94R46j67n84
1523F56K20p47L59L58q68L30O74j416J89Q15J51j598l7K09N3o17Q02p1P6k80l4
$$ plain form
1387 -507 -462 -905 -910 -178 -389 69 -921 -142 -353 -604 -109 357 101 -698 -339 -1409 90 -363 161 -321
1407 -321 677 949 -1441 -467 703 -127 230 -504 47 537 -608 676 893 772 897 791 -373 -149
1425 -149 -672 -711 -291 -522 -343 -530 -1231 -634 -796 -1667 -875 -866 -331 -471 -837 -718 83 -788 -767 -1087 -254
1446 -254 -88 -148 -1240 -964 1200 154 -526 -658 1044 -1134 341 922 594 190 -23 951 249 623
1464 623 296 1898 907 522 -34 -397 237 524 213 -278 -306 657 -582 -717 -673 -1388 -74 -346 -963 -461
1484 -461 -1282 -907 -114 -1791 -198 -989 -1723 -1734 -1098 167 -1158 543 -256 -901 -159 -980 -774 -115 -128
1503 -128 790 -182 -1096 6 314 -122 369 56 -195 -209 258 -181 -233 648 159 755 461 1407 1240 656
1523 656 876 129 488 846 -22 308 982 -434 -245 570 721 -877 -914 -705 -652 -1269 -467 -538 -462 -742 -776
1544g76r35O30O8l59R59p21P63n51R01j024K11O7j08O38m64j59N32o1J42K50J905
1565A908j703J6J52L08O7o82j99R05p09J01Q86j859N64O02O46oo17o09j15r4k61
1586f99l6M31J30O13n36M19j043k09j21O42j351Q67r30J534L10j601K72L00m45
1605a453J155j161M68L23J57J184o61n55kN51n1l9PR43j36j18j26M6j33n05O64
1626E58p05M9J686j513M37m34l30R30p34L21p53q71J126k95N73r46P42l08o22
1645a089L2n70M16J252m06k67j26J56o97J81K99o36P72N0L31l7J418j397K72j28
1665a74P90j373l28J324o04N93N60J7r42Q11m46J330j396L58m0n3N04p72nL56
1685E10q43R84r85K07p66k33J266p01l63O09k79j90K28k89n27O31K39k06J41j194
$$ plain form
1544 -776 -1711 -1081 -1013 -1372 -413 -1134 -371 -922 -21 -1045 -834 -767 -875 -237 -701 -860 -328 -389 -247 3 1908
1565 1908 205 221 373 681 748 66 -133 772 63 164 1050 -809 -245 357 1003 997 380 -229 -344 -438 -699
1586 -699 -735 -304 -174 439 -97 322 -721 -930 -1051 -409 -1760 -893 -1823 -289 21 -1580 -1308 -1008 -1453
1605 -1453 -298 -1459 -991 -668 -511 673 12 -543 -545 6 -45 -84 -77 866 730 612 486 532 399 -106 558
1626 558 -147 -98 1588 75 512 78 -252 678 -56 265 -488 -1359 -233 -528 45 -901 -159 -467 -1089
1645 -1089 -1057 -1627 -1211 41 -365 -632 -758 -602 -1299 -1118 -819 -1455 -683 -633 -302 -339 1079 -318 -46 -174
1665 -174 616 -757 -1085 239 -365 228 788 805 -137 674 228 1558 162 520 480 427 931 159 154 510
1685 510 -333 651 -334 -127 -893 -1126 140 -561 -924 -315 -594 -784 -556 -845 -1372 -741 -502 -708 -567 -1761
1705a761P74q69J277p25J242q98K18k3l36J811k070J052o29J784j602k6N25J072
1723H16j90k87K38M33R69k625J322n4j94M03M9j044J860k171R82Q55j159k07j36
1742a40O7K16K96j510M05r88R24j25R08k233K025K8j293P9N8%j62M39J41j68K64
1763g69j86K07M78k89Q16M28p27J84Q0m9N07j203J704j079m97K353j086J035p8
1782A829j823R38P0M55k52o96N07o08Q91p63l73l72L08M2j046J065m73o44m4J0
1802i79o63J075J120j365K14q15N56J57o54J52L06O54p42N35o8l22L00N11q97
1821i25R8Q15l50O81j216R09J51J65L49R68j299K12P8k09L70k04Q95j618R46o04
1841B12j99O08m15j085K314o80n60o05P49j7j504N82P15n23o40M37R33k6r80m43
$$ plain form
1705 -1761 -987 -1856 -579 -1304 -62 -960 -742 -765 -1101 710 -1360 -308 -937 847 -755 -781 -256 816
1723 816 626 339 577 1010 1979 -646 676 622 428 831 880 -164 1696 -475 507 1362 203 -4 -140
1742 -140 -73 143 439 -1071 -666 -1654 -730 -855 53 -2180 -155 -127 -1420 -1341 -1283 -1283 -1445 -1006 -865 -1033 -769
1763 -769 -955 -748 -270 -559 257 685 -42 142 222 173 680 -523 1181 102 -395 1958 872 1907 1829
1782 1829 6 944 1014 1469 1217 521 1028 420 1311 548 175 -197 111 153 -893 172 -301 -945 -989 -979
1802 -979 -1642 -567 553 -812 -598 -1413 -857 -700 -1354 -1202 -896 -242 -984 -449 -517 -839 -539 -28 -925
1821 -925 -827 -12 -362 319 -897 12 163 328 677 1645 346 558 636 427 797 593 1488 -130 816 212
1841 212 13 621 206 -879 1435 755 195 -410 339 322 -1182 -600 115 -408 -1048 -611 322 296 -684 -1127
1861a127R2N04m43K88O51r18O76N81j157j76l30M84m41R68l64O68O37J46q11R21
1881H49n63j040K26J453q34Q50K54p10N45o76L18m81j04O44r51P15L28j22r90
1900b89PK41r6M7K0j084O43j20J73J2j276R79R2L97K94p42j62N71K59k75j60L36
1922a33R08j872L22k54R80K0Q6N43j832J454l38K24J26N74L08l67j013J382r29
1941A89J28n91R91R17j757P34N0j271J182J765k565K64L1M06N86o89N4m43O53
1960F34l75r12J37K11P49r91N60l84J029j583n87J220M31p83r27J170l20J90j40
1979f71O72p43K02J042M74p49m94O57o30J08J68j10J139j115j02J12J70p18J208
1998F20L98J5j211K00P56j358J135p48l35R75n90k92P80j08j04K64j490N74J153
$$ plain form
1861 -1127 -1035 -531 -974 -686 -35 -953 -277 304 -853 -1029 -1359 -875 -1316 -348 -712 -44 593 739 -72 849
1881 849 286 -754 -528 925 91 941 1195 485 1030 354 672 191 87 731 -220 495 823 701 -289
1900 -289 -282 -41 -137 -90 -70 -1154 -511 -631 -458 -446 -1722 -743 -651 -254 40 -702 -864 -293 -34 -309 -469 -133
1922 -133 775 -1097 -775 -1029 -49 -29 57 600 -1232 222 -116 108 234 808 1116 749 -264 1118 189
1941 189 317 -274 717 1634 -123 611 661 -610 572 2337 -228 36 67 473 1059 370 424 -19 634
1960 634 259 -653 -516 -305 444 -547 13 -371 658 -925 -1512 -292 139 -644 -1571 -401 -721 -531 -671
1979 -671 1 -742 -540 502 976 227 -267 390 -240 -132 36 -74 1065 -50 -152 -40 130 -588 620
1998 620 1018 1033 -178 22 778 -580 555 -193 -528 447 -143 -435 345 237 133 397 -1093 -519 634
2017F34l0p43J92j002N32m0o91J768r72M7j08L83K39L51j184M28M20n41l31J68
2037d80RQ70k86Q0m44O5M46q44R81m03P31O99j131l3o13K152k001K04r40P13p7
2058c02m72J412q16J157j636N66N27n02L38o15k66n83J828j558L30j97j50R60
2076B1o75J147n03O30j156J11O54K96j462J046o70l66J424m42p87J013KQ3L24
2095F90n28J42L02q37n10P68j149J245L85j81o95L93q34Q39L28n76O71q57J419
2114A015j858J48J388r39J97P5n53R88j86M23j177L19M35m80L04n41K16l05M50
2133h1n79K70Q1n43R57l9m40J88P85r07j6k9P41m12j54P48j2l52n32P11o92J05
2155b02L61M81J12j254J292l86L88r2L16q81q08N53M90n65k45J126j119O07o72
$$ plain form
2017 634 604 -139 53 -949 -417 -457 -1148 620 -352 -305 -413 -30 209 560 -624 -196 224 -317 -648 -480
2037 -480 -471 399 113 193 -251 -186 260 -584 397 -6 725 1424 293 260 -353 1799 -202 2 -938 -225 -302
2058 -302 -774 638 -178 979 -657 -91 436 -66 272 -343 -609 -1192 636 -922 -592 -789 -939 21
2076 21 -654 493 -10 620 -536 -425 229 525 -937 109 -561 -927 497 55 -732 281 283 366 690
2095 690 162 304 606 -231 -741 27 -1122 123 508 327 -368 25 -809 30 358 -218 453 -404 1015
2114 1015 -843 -695 693 -246 -49 26 -527 461 275 698 -479 -160 275 -205 99 -442 -226 -531 -81
2133 -81 -660 -390 -309 -852 105 66 -374 -186 599 -308 -324 -353 388 -24 -178 570 558 206 -326 385 -307 -202
2155 -202 159 640 752 -502 790 404 792 700 1016 135 -673 -120 370 -195 -440 686 -433 174 -498
2174d98O17j17K97O86k170J752j806P11j33N1l69P63K81l69O1K83k47N06l58j66
2194b25Rn63N37n00N41P58q89k11M56K42l04m26N85j008J551l46M89R11o82l04
2214F21j200L08P41o84l7r0J21J351j508P01m09o88R42j316J651M26j766K98M68
2233g0k73L74j54P0K08J5o20N04l57K50o74J908p86q81J290p1k15o93M36l62r5
2254a96j50j6K35J160j318J331q83r0q81Q23R3O5N31N21r45o28P57p50P80k11
2274B28P74p84k43O35j246K58J042p93N27o05O8p26M60K64K33L12K55j158L60
2293a39K17o55M05M1k24N48J76K02K76o46m73R47k43m99k47l10K64M99P6P20j398
2314d63N38J327j329m22M81J91k08m48k50J35n3J378m54J4j45r0J22J53q08l37
$$ plain form
2174 -498 119 2 299 985 -1185 567 -1239 -528 -661 -610 -979 -216 65 -304 -243 40 -207 299 -59 -225
2194 -225 -216 -779 -242 -742 -201 557 -332 -543 -87 155 -149 -575 10 -998 553 207 696 1607 925 621
2214 621 -579 -271 470 -214 -251 -341 -220 1131 -377 324 -85 -773 169 -1147 504 930 -836 -538 -70
2233 -70 -343 31 -123 -53 155 170 -450 54 -303 -53 -727 1181 395 -486 804 733 518 -175 261 -101 -196
2254 -196 -346 -362 -127 1033 -285 1046 163 73 -808 15 108 173 704 1225 280 -348 409 -341 439 228
2274 228 1002 218 -25 610 -636 -378 664 -129 398 -207 -139 -865 -405 -141 92 404 659 -499 -139
2293 -139 78 -577 -172 -131 -355 193 369 571 847 201 -272 675 432 -67 -314 -624 -360 139 215 935 -463
2314 -463 75 1402 73 -349 132 323 115 -333 -583 -448 -501 877 423 437 292 202 324 477 -331 -668
2334f68j92J511j586J441r40L8Q53j521R51J18o5n6N92q93J172j152J218n17k54
2353E0j11p63O04r7L34j0m71K56m40R52j062R61O64j15r22K64m09K21K00n42K95
2374a41j1M80m54R39m29K38n77Q13p56l44p5L53j08m50q31J250k38J125j049l37
2394f02m46J280m31m77P23p65J201j383j93J517j336M63O17j247L32J446m68n85
2412c54n83R97p9P83q70l10P00n81K66n4N33k12K20oj91j65K68L36n86R10j335
2433c13J093L08j276j40N70k19J12J66R0N34k88j580J372j578J351K49L3q91K56
2452a51j98O23oq89J317l50j061n8N16m24M40J96k15P98L02m11Qo17L03K12k46
2473H9N0j148P74P63L49j207m56P03J05N74j055O66l23k7K74j21j225J856l46
$$ plain form
2334 -668 -860 651 -935 506 -434 -396 457 -1064 -113 5 -60 -116 476 -417 755 -397 821 304 50
2353 50 -61 -824 -220 -317 17 7 -464 -208 -648 304 -758 203 867 752 -170 94 -315 -94 106 -436 -141
2374 -141 -152 328 -126 813 384 622 45 858 102 -242 -317 36 -72 -522 -1353 -103 -341 784 -265 -602
2394 -602 -1048 232 -199 -676 47 -718 483 -900 -1093 424 -912 -449 168 -1079 -747 699 231 -354
2412 -354 -937 60 -19 764 -106 -416 284 -297 -31 -85 448 236 456 450 259 94 362 698 112 1022 -313
2433 -313 780 1088 -188 -328 242 23 135 301 391 925 637 -943 429 -1149 202 451 484 -407 -151
2452 -151 -349 274 268 -621 696 346 -715 -773 -257 -681 -241 -45 -260 538 840 429 437 -180 123 335 89
2473 89 139 -1009 -235 528 877 -330 -786 -83 22 596 -459 207 -116 -143 131 10 -1215 641 295
2492B95p89Q8N49K93n10N36m12J39J82o92L45m31J76L76J31l30l57P07p43R4L92
2513C9J62J32K53q97j58J2j52R82m57k98N4k06L51R97j431k47O34O04K48k62l60
2534@O21j402J444r09J122j265N67p41J123k96L50n0r68J192j099j1J471p92r24
2553e67M76k99Q50j8k59j387J724L36l09q73K37m73j72k69J594r13l91R00m7R58
2573A098k580J498K7M6n62N75l0N5N95l2m11j42M31l9j37K0r76J272p34K84L64
2594F22p73k07o79Q35J154j708J147q75M34J034j340K32k52L95M20j14m10R29
2612H44m1p66p2j255J575n63K21q1o73P89j60Q03o64nJ98M77j497J120p13M08
2632e5J14p64J741j622R2N51J06r17J141n95J89j84O64j374Q73N37q7j22M79L41
$$ plain form
2492 295 -494 -406 143 436 -74 462 50 189 371 -321 24 -407 -231 145 276 -54 -411 296 -447 -353 39
2513 39 201 333 586 -311 -469 -457 -609 373 -84 -382 -328 -534 -183 814 -617 -864 -230 374 622 360 0
2534 0 621 -781 663 -246 876 -389 178 -563 560 264 614 564 -404 788 -311 -322 1149 357 -567
2553 -567 -91 -390 460 442 183 -1204 520 856 547 -326 -89 -562 -734 -1003 591 -322 -713 187 140 1098
2573 1098 -1482 16 43 89 -473 102 72 127 722 690 279 137 568 529 392 412 -564 708 -26 258 622
2594 622 -151 -358 -1037 -202 952 -756 391 -484 -50 984 -356 -124 -376 19 439 325 -85 844
2612 844 803 37 -35 -1290 285 -278 -57 -138 -811 -22 -182 621 -43 -48 150 627 -870 250 -463 -55
2632 -55 59 -705 1036 -586 -494 57 163 -754 387 -208 -19 -203 461 -913 -40 497 410 288 767 1108
2652A108j796R06L38l97n82k32N15M90j75J33j90o37M31P43q04M64m19O34j42
2671C88j914J002N77o13L42n47Q36j98M60o28L40r21M69K30l30O03l6o52O04P4
2691H6m54J367p96k04k31j3K44k71K86K63M40l70J2p44Q05o86J15J266j477Q71
2711E09p86N88J47m80O36r98l18J244n88J02l66J196n06l92J023j832P11M65l66
2730a1k78q16L01R32j130R73P38m21m12k11J052j479J415j607J078o0l73q04J128
2749A5n17n3N31k89j50j24M51K55j004N97L88p4o16J437o76p38J575l47o03O00
2769F58j367M25l74l97J218L42o82J52J074j964O16J52l60O47M53l86L02k05N96
2788I00n79j09m70o9k88K61jK47q6L73n65R22n49p7O45o78L5L79p08Q21L57l90
$$ plain form
2652 1108 -688 218 556 159 -423 -655 -140 350 175 308 118 -519 -88 655 -149 315 -104 530 388
2671 388 -1526 -524 53 -560 -218 -765 71 -127 333 -295 45 -876 -407 -177 -507 96 60 -592 12 86
2691 86 -368 999 203 -1 -232 -245 -1 -272 14 277 717 347 359 -385 420 -266 -151 1115 -362 509
2711 509 -277 311 458 -22 614 -384 -702 542 -46 56 -310 886 380 -12 1011 -821 -110 355 -11
2730 -11 -289 -1105 -804 128 -1002 -29 709 288 -124 -335 717 -762 653 -954 124 64 -309 -1113 15
2749 15 -502 -555 -24 -313 -463 -587 -136 119 -885 -288 100 26 -590 847 171 -567 1008 661 58 658
2769 658 -709 -284 -658 -1055 163 505 -177 -25 1049 -915 -299 -147 -507 140 593 207 509 304 900
2788 900 321 212 -258 -327 -615 -354 -355 -108 -194 179 -386 536 -13 -90 555 -123 -88 291 -417 404 761 371
2810C71m12l07j41q53J704p57n17N60k79j80k53L83P63r96N75K20N0L4k0k50M37
2831A32l23J014q6k51p29L73lj013J206o71J154r3Q6n91k69j97J53j0l67L82N1
2852e2M48p68N42n03P2N85l15k91J084q35K77o62N17r10J622j091J56j90J02R30
2872G18n13L67j399J099j36P5m19P85k82k61J2o52Q21r57o83J599l39P73n44m74
2892d10J106q5j386J053R1j72k88K88l09r94J493M94r28J54K73o68n45J381o98
2911a50L83p5Np09k53J037j65K47q48N79k45K4J54L99r30Q31k16M62k36M7j47
2932A94M55j499K89R03n49p44p7j69J390m07l59P69l26k14Q72p75O0Q26j064J42
2952b83P57o24n13j11R32p58K063k387J238q53J71J024n52K01q58L87k87M64N96
$$ plain form
2810 371 -41 -348 -489 -1342 362 -395 -912 -352 -631 -811 -1064 -681 82 -914 -339 -119 -69 -35 -55 -305 132
2831 132 -191 823 737 486 -243 130 127 -886 320 -351 803 710 796 205 -64 -261 -108 -118 -485 -103 -52
2852 -52 396 -372 170 -333 -261 324 9 -282 802 -33 244 -418 99 -811 811 -280 -124 -314 -212 718
2872 718 205 572 -827 272 136 211 -208 577 295 34 46 -606 215 -742 -1425 174 -165 608 64 -410
2892 -410 696 611 -775 278 369 197 -91 197 -112 -1106 387 881 -47 107 380 -288 -833 548 -150
2911 -150 233 158 163 -546 -799 238 73 320 -528 51 -194 -170 -16 383 -547 284 68 530 294 341 194
2932 194 649 -850 -561 342 -207 -951 -1028 -1197 193 -214 -573 196 -130 -344 528 -247 -187 639 -425 -283
2952 -283 474 -150 -663 -774 158 -600 1463 -924 314 -539 -368 656 104 305 -553 -166 -453 11 607
2971F07q62L28M26r43l08m15J343p82L58K50r02M52L50l96N71M91m14p09O55L50
2991D50q19J024o98r9o1K00J38N40j060J71j19L50J032j121q25Q95K87j11Q54
3010A028l35n07j76o44N91L51l99J12Q81j196K1q10N72J338j47M43j882L70L00
3029h9K97K72n60L31m74R04q89r1j33M52K25K83J12K05l91m40o44M80N25l16N03
3050E62o92Q09n49j84q07P71n33M27R42j642R79k07r92J362N4k43P21n45k24l12
3070c03P06J11L38j35l62r08R43L20j101N40n37N5j36Q23m79o48J036k5j07P0
3090B01j31M56p4m19j26P49k95j073L01%R13m37m27Q7J0N77l71J72O11K96r13
3111A07k67M21M20j89q47L38K2P0j119M74L60K36k08N08K54q34r69J007O35m71
$$ plain form
2971 607 -255 73 499 -444 -752 -1167 176 -606 -248 2 -900 -448 -98 -494 77 568 154 -555 100 450
2991 450 -369 655 -43 -142 -203 -3 135 675 -385 -214 -333 17 1049 -72 -897 -2 285 174 1028
3010 1028 693 186 10 -634 -43 308 -91 21 902 -294 -273 -1083 -511 827 680 1123 -759 -389 -89
3029 -89 208 480 -80 251 -223 681 -208 -299 -432 20 245 528 640 845 454 14 -630 -150 375 59 562
3050 562 -130 679 130 -54 -861 -90 -623 -196 746 -896 83 -124 -1116 246 300 57 778 233 9 -303
3070 -303 403 514 852 717 355 -553 390 710 -391 149 -388 -333 -469 354 -125 -773 263 238 131 201
3090 201 70 526 452 33 -93 656 361 -712 -411 -411 502 65 -362 -275 -265 312 -59 113 724 1020 107
3111 107 -160 261 681 492 -355 -17 5 75 -1044 -570 -210 26 -182 326 580 -254 -1223 -216 419 -52
3131e2M3K75L08j185N93k81O73J04j279N01N19M97N7j303O7K23K19j22J059j249
3151c33O5J287j345Q44k33k80K82k00k04K13r70R09J206j305K94l86M60r25O93
3170G2l44Q68k47k96J35j514J128K93q63L75j39J44Q07p76j58J285j021P26r09
3189d34J062j314M93n60N71K85n74O83O2O9r23R08q6o22n86J278K96p06J136k067
3209a029J575n93l54j07p61K323q68l83l63P41P07q84q00N9J97J6J786j404M01
3228B59L03j434J409o63J29k69N77n50o3K30J528j247p83J236j058m96Q34m50
3246e08j81M03M27q9M9K6r63Q10p29K14N71o67P96n48l5J08L39j271P91Q36r4
3267B85M93j084K3L95j08j60K67P3k66R38j179K75m97O16R03j332Q99N58k138
$$ plain form
3131 -52 -9 266 574 -611 -18 -299 374 478 -801 -300 219 716 773 -530 -463 -240 -21 -143 916 -333
3151 -333 -268 1019 -326 518 285 5 287 87 -117 96 -874 35 1241 -64 230 -156 304 -621 72
3170 72 -272 596 349 53 188 -1326 -198 95 -768 -393 -532 -388 419 -357 -515 770 -251 475 -434
3189 -434 628 -686 -193 -753 -182 103 -471 212 274 343 -580 328 242 -380 -966 312 608 -98 1038 -1029
3209 -1029 546 -47 -401 -508 -1269 1054 186 -197 -560 181 888 4 -796 -737 -540 -524 1262 -142 259
3228 259 562 -872 537 -126 3 -266 311 -239 -302 -72 1456 209 -574 662 -396 -892 -58 -508
3246 -508 -689 -286 141 52 101 127 -836 -26 -755 -541 30 -637 159 -389 -424 -316 23 -1248 -457 379 285
3267 285 778 -306 -283 112 4 -156 111 184 -82 856 -323 -48 -545 71 974 -358 541 1099 -1039
3286a039J199n96Q33o15m26KM39M63n28J053j288J096j130O42o0m60M34J66r10
3305g25L08O39p24J242o42l01J444r85n49j03J75p1M7L95j39Q49j729Q80K84L89
3325F84k06n77N40p06L90k03o00J366l14j0q4l10K40N26q72j412O15P05n05N97
3345a36L3l17q0o72L43J207q54O08k55J040j841J845j861K23J88Q6P60o94M39
3364F2N4K37J1r45L40J097j892J068q92P65O98m19M01p79L82J99k59n07O33r18
3384f64N43J88L70O16L9j250j16L99k76M76m38Q65j702J245M10l13m21M79p63
3403c13N64o8j12p8m71N21P03o04q35O80j36K41j6r81J519p96P73m75O68j296
3423e12J205j122l84l24J268N74n20L66l71o03P34K43l72p76J056K14j175R04
$$ plain form
3286 -1039 160 -436 397 -218 -644 -642 -203 260 -268 785 -503 593 -537 105 45 -415 19 185 -725
3305 -725 -417 222 -502 740 98 -203 1241 256 -293 -396 -221 -292 -245 150 11 860 -869 11 295 684
3325 684 478 -99 441 -265 125 -78 -678 688 374 364 280 -30 210 736 -136 -1548 -933 -228 -733 -136
3345 -136 -103 -420 -500 -1172 -829 378 -476 132 -123 917 -924 921 -940 -717 -529 -443 317 -377 62
3364 62 116 353 364 -581 -241 856 -1036 32 -860 -95 603 184 585 -194 188 387 128 -379 254 -664
3384 -664 -121 67 437 1053 1092 -158 -274 125 -151 325 -113 752 -950 295 705 392 -29 450 -313
3403 -313 251 183 71 -7 -478 43 746 142 -693 -13 -149 92 76 -905 614 -182 591 116 784 -512
3423 -512 693 -429 -813 -1137 131 705 185 551 180 -423 311 554 182 -594 462 676 -499 405
3441D05j191J280l05q4m37q31R33k89p70J789q04k2p11N84K96L74o65n31J123
3460A44j90N82j760P86k64l14N16P67N4K21m24k19P50j611O36m43J271j07j22
3479B73k81K96R7n08N09p58K19j49O68j032K05Q74L05j094K33K27M42K27n81N17
3499F89l83J61j463R05J266j138L47n37K36R94j712J507n68k73j32R89k658J268
3517e02L77j74k51O19j42k83P1j071R89N09n36J0m23N67m42J259o06N50p94L69
3537I6j079M89J191j216J091k22n45M04M21r55k00k18O01R72J066j679P15l31
3555F01j200L7P01m3M35L99o95J810k299J29L49m85l28M26n01J867j489M58j4
3574A58J01M10j454J804j681K14J145j569N32M26m28O0R1n32N49J009o26L90j361
$$ plain form
3441 405 -786 494 189 105 -332 -1163 -230 -519 -1289 500 -304 -326 -1037 -453 -157 217 -448 -979 144
3460 144 -46 536 -1224 -438 -702 -1016 -500 267 321 542 118 -101 649 -962 -326 -769 502 395 273
3479 273 -8 288 385 -123 386 -372 -153 -302 366 -666 -461 413 718 -376 -143 84 526 753 172 689
3499 689 306 467 -996 -91 1175 37 384 -153 83 1077 -635 872 304 31 -101 888 -1770 -502
3517 -502 -125 -299 -550 69 -73 -356 -285 -1356 -367 142 -394 -384 -807 -240 -682 577 -29 521 -273 96
3537 96 -983 -494 697 -519 572 350 -195 209 630 -325 -525 -743 -142 830 1896 217 932 601
3555 601 -599 -562 139 96 531 930 235 2045 -254 -125 224 -261 -589 -163 -664 1203 -286 172 158
3574 158 259 669 -785 1019 -662 -448 697 -872 -340 86 -342 -282 -191 -723 -174 835 209 599 -762
3593g62J076l39L49P54j227J90p13N60P5K24N09k7r54k0O05j9n33Q97l70l60l92
3614d77J445j095N12J54j155K58J103j297K22M81j9O1j533J749r09L01N0Q57j360
3633f52O87l11P47P9j93n17j82Q97j744J337J89O19p88m49k8J535k02j431J367
3652I60r29k33j28K90n29l14J714n39n23M81l18l36O18o0k83O30n15J65l82K02
3672b9K07o20L58J04j3j005Q28k2J009o89J16j24l83L61p93O64L68n82J885j202
3692D38n1k66n81N70R31m41j241O58Q9m82o09L34n33L25J859o8j163M94J3K1o37
3713c40m1K49P22j85o04j12p34J153J19M21j079L34M04j099N37P32p07K26n43
3732e47M10k55l61J63L73K16L09o14O13q47J183L87j505N45j56O5n39L94K00L84
$$ plain form
3593 -762 314 -25 324 1078 -149 41 -672 -112 -37 187 696 669 -285 -305 300 281 -252 645 275 -85 -477
3614 -477 968 -127 385 539 -616 -358 745 -552 -330 151 132 193 -1340 409 -500 -199 -149 708 -652
3633 -652 35 -276 471 550 357 -160 -342 555 -1189 148 337 956 168 -281 -309 1226 1024 -407 960
3652 960 31 -202 -330 -40 -569 -883 831 292 -231 250 -68 -404 214 154 -129 501 -14 151 -231 -29
3672 -29 178 -442 -84 20 7 -998 -170 -192 817 128 244 120 -263 98 -695 -31 337 -245 1640 438
3692 438 387 121 -460 110 1041 600 -641 17 106 -376 -985 -651 -1184 -859 1000 932 -231 263 276 297 -340
3713 -340 -381 -132 590 405 -199 -311 -1045 108 227 648 -431 -97 307 -792 -255 477 -230 -4 -547
3732 -547 -137 -392 -753 -590 -217 -1 308 -306 307 -540 643 1030 -475 70 -86 -21 -560 -166 34 418
3752D18p90M40r23K130j119l38r3J042j297J048n38N17k95j79L94Q1j29p02K39
3771i4j23m23K97J420m19k85j072K27O77n87m00K31K60J06o06J332p84n7m00J167
3791D67n78o82O42M76j094Q47J436j777J205j411O83K9k37L91r86R87O7j682J434
3810B17P91m89O52q21O6R5k95j14Q3j68k43O70j173M78J47M3n41J427q90n3O06
3831D88j277J25R88m39l79L41J9j51Q48q58R13q32N65k83l04J346p60r56k98J225
3851C21n68L24r81J198q38O18m84P51n68N85J23k44l06m48Q32Q6lp80J144m61
3871C01K79o36J242j236j91J86J21L94p43k05j63O08K39k13N70n22n17M32J61
3890A07O92o32m62Q18r78J096j275K56j73M07K40l54j99J050q27p8M65n85O8J298
$$ plain form
3752 418 -372 68 -855 1275 156 -182 -275 767 -530 518 -20 497 202 23 417 498 369 -333 -94
3771 -94 -217 -640 -343 1077 658 373 -699 -472 205 -382 -782 -551 -291 -185 -791 541 -243 -300 -700 467
3791 467 -111 -793 -151 325 -769 78 1514 -263 942 -469 214 243 6 397 -589 398 465 -1217 217
3810 217 1008 519 1171 350 416 511 216 102 185 17 -226 444 -729 -251 -104 -61 -602 825 -65 -118 488
3831 488 -789 -664 324 -115 -494 -153 -134 -285 563 -295 618 -214 351 68 -236 1110 350 -606 -904 321
3851 321 -247 77 -904 294 -544 74 -410 341 -227 358 481 237 -69 -517 315 401 398 -382 762 301
3871 301 580 -56 1186 -50 -241 -55 66 460 -283 -488 -651 -43 196 -17 553 31 -486 -54 107
3890 107 799 167 -295 523 -455 641 -634 -378 -551 -144 96 -258 -457 593 -234 -312 153 -432 -364 934
3910I34r82k90k45P54j6m0j91k02J187r31m13j19N85k38O81k98q1K19R21j374
3930a39m56o29J528j81M76m74p91N92J72j014L71R5m17J066Q18m44n17j23n33
3949f00P53O43j191O80k87m24l93J169n11n11J97N07O03j057L07L28k07j11K12
3968A07k26N01M05p00l11P49R26j591M63n07L48K18p16K74J358j621n55O02P2
3987b04K94J86n74l67P15q72J085J05m31j61k21N27j94J477k134R04m34J469q53
4006C17j800J491j9n9L97m61k51N82M97j568J238l23l26L99J486j399M01q15L15
4025A02M33o87M43p52j075J756l8j94R03n33M45j009K62P41m32P0l60n54O42Q3
4045B46j81P79m72O09K63j156k73O28q7r72Q62m20J22l81O55m66O00j079O10j25
$$ plain form
3910 934 -48 -338 -583 171 155 115 -76 -278 909 -22 -435 -554 31 -207 474 176 95 314 1235 -139
3930 -139 -595 -1224 304 123 599 125 -666 -74 98 -916 -545 -450 -867 199 1017 573 56 -67 -600
3949 -600 153 796 -395 285 -2 -426 -819 350 -161 -672 -475 32 635 -422 -115 213 6 -105 107
3968 107 -119 382 787 87 -224 525 1451 -140 323 -184 164 382 -334 -60 1298 -323 -878 -276 -204
3987 -204 90 276 -298 -665 50 -822 263 368 -63 -224 -445 82 -112 1365 -769 135 -299 1170 317
4006 317 -1483 8 -11 -70 327 -134 -385 197 694 -874 364 41 -285 114 1600 201 602 -213 102
4025 102 535 -152 291 -461 -1536 220 182 -12 891 358 803 -206 56 797 365 435 75 -479 163 246
4045 246 65 844 372 981 1244 88 -185 443 356 -616 246 -174 -52 -433 222 -244 356 -723 -113 -238
4065b38R66j602R34O2l80K09J1l7j0O69r12M82j089M51L61o20J71K53L31N45k6
4086E31m97P34n01J06l70N47l38j035O33L37r75J471l05o91P29M75r31L70J59
4105D49k16L76j004p5l96J680m62j099J435L70j113N67r9P4r1j121J596J15m38
4124E48n01L5k80O67o81j018J806N33j165k4P94m20k32k1r1j85M20k93K54j353
4144a207J851q25j49K86o30J489p07R1J62M32j196k7q0m14J753j013K45p8K68
4163B51j005O49k98J19l10O40J68j8j48m60J801j004j256N60P16n52Q9m08R51
4182D85P24j791J507n13l69o37J461j41o72L17MP03o23p07L82K55j044J025k60
4201A06K5P29m87k19k2j248J436P9o64N12q03L8O90o74Q79q2k86K15j58K19Q31
$$ plain form
4065 -238 728 -874 60 122 -258 -49 -38 -75 -85 584 -328 154 -935 -484 -123 -743 -572 -319 12 557 531
4086 531 34 768 267 373 3 550 212 -823 -190 147 -828 643 338 -353 376 851 -80 290 449
4105 449 233 609 -395 -470 -866 814 352 -747 688 1058 -55 512 413 487 396 -725 871 986 548
4124 548 47 82 -198 469 -212 -1230 576 1109 -56 -80 714 294 62 41 -50 -235 185 -108 146 -1207
4144 -1207 644 -181 -330 -44 -674 815 108 199 361 793 -403 -430 -510 -924 829 -184 61 -17 251
4163 251 -754 -105 -403 -284 -594 46 214 196 48 -412 1389 385 -871 -311 405 -147 -58 -466 485
4182 485 1209 -582 925 412 43 -594 867 726 54 371 375 1078 455 -252 130 385 -659 366 106
4201 106 131 860 373 154 132 -1116 320 399 -265 247 -556 -518 172 -502 377 295 9 224 66 285 1116
4222A116j487J67K26N30k76n13O39j134J65M49O7m41L40O79j006P48r73Q28l53
4241b29K79r2m59N3Q11m91M37o11j65P86J05q37K43l73J72J086j223J471j247
4260b84O40l80M26L46m34q21J224M67j402O91j365K95J622j622J562j238n42J206
4278C91m11N14m42p58O67N82p38K20l44n3O46L09k38L66m1J13k73J08j139J665
4298A144n84p15J017k323J193J19j40J073q75K42L68Q58k136N45M13n41N39m99
4316c02k30J092k29o96M96n99O41q5m84J580j023k30R2p62l39R35k30j48K10J119
4336H08j321M37n24M98K48l41j52J000r78l9k95p7J425k38j99o89J426j163J46
4355b8P5Q04j859L53m40J054L69J20n86J060m50J85Q30j623m08m69J108P25p17
$$ plain form
4222 1116 -371 -204 22 552 276 -237 402 -732 -567 -118 -51 -492 -152 527 -479 269 -704 124 -229
4241 -229 50 -42 -501 -448 363 -128 309 -302 -467 319 424 -413 -170 -543 -371 715 -508 963 -284
4260 -284 356 -24 402 748 314 -507 717 1184 -218 473 -892 -597 1025 -597 965 -273 -815 391
4278 391 -20 494 52 -706 -39 543 -195 25 -319 -372 274 583 345 711 670 783 510 618 -521 1144
4298 1144 560 -155 862 -1461 -268 -149 -289 784 -91 151 519 1377 -759 -214 199 -342 197 -302
4316 -302 -532 560 331 -365 131 -468 173 88 -396 1184 161 -69 23 -739 -1078 -143 -373 -521 -311 808
4336 808 -513 -76 -600 -102 146 -195 -347 653 -325 -364 -659 -736 689 451 252 -437 989 -174 -28
4355 -28 47 851 -1008 -655 -1095 -41 328 448 -138 922 472 657 1487 -136 -544 -1013 95 820 103
4374A03J84Q51j49r32J99o18N33p76J168n44o87J039R65o32J61p66P03p99n7o10
4394f64J366n55K46o30J20j86J81N22q48Q90j015M17P81L26l65j68n97Q1o55J0
4414g43N83r0k55J246j769J338j495J123M11j74o71K93P23j152J060r45K56j35
4432c96Q28Q7m44O1o91J693p23J80J25p21J159q77o58o18M61m4J21k8Q59K3j217
4453h20Q94M0l96O39K02j311J424q48l80P33l78P30l85J249j26k130J041K28k59
4472A47L4Q79j274K55k84P32r18R61q03oO84k38j246J684n31r08R7O64k97l20
4492f88k21k29J242j017r26J970n20k44N63l0L93m92l49O85P72j191L06L91R60
4511A375j344m82J148j124K65R37j113j54L73J02Q68p37J75L80q84R02q68R19
$$ plain form
4374 103 287 1138 989 57 256 -362 171 -605 563 19 -668 371 1336 704 865 99 802 3 -54 -664
4394 -664 702 147 393 -237 -117 -303 -122 400 -448 442 -573 -156 625 951 586 418 -179 -98 -753 -743
4414 -743 -160 -250 -505 741 -1028 310 -1185 -62 349 175 -496 -203 520 -632 428 -517 -261 -396
4432 -396 432 519 75 136 -555 1138 415 595 720 -1 1158 281 -377 -995 -534 -578 -457 -485 374 397 -820
4453 -820 74 114 -282 357 559 -752 672 -176 -556 177 -201 529 144 1393 1267 -863 178 406 147
4472 147 181 1060 -214 41 -243 489 -429 532 -271 -277 407 169 -1077 607 76 -832 -735 -71 -368 -688
4492 -688 -909 -1138 104 -913 -1839 131 -389 -633 -70 -100 293 -199 -548 137 909 -282 24 415 1375
4511 1375 31 -451 697 -427 -162 775 -338 -492 -119 -17 851 114 289 669 -215 687 -181 738
4529G38n41m36m80R59j152O93n02l5n16P70Q50j42J63o60R90M33n39n45J10n74
4549d16J6K40K98M95q02M98m0l06k76j27J024n09Q44J02m7r12l6k46L44M66o25
4570a5J070j298k90O32n9O6Q6J12k60L62m27R7j54N12q14O72r08Q06k72K81J080
4591A279r55j61K58j096Q31jr7p39L53R12j24l54n75l9l13J768r55Q85k95l42
4611B40K23o72k32R04r07O29o45K93p18J170m68k01j43J07N38p5K20r25J377o50
4631F5l3M22o93n52K92j75j1Q48j72o32O36N3M55J20N57r67R0M30j512R02J103
4652A226j824j47Q22K74m62p78J491L0j44j061Q02r59J396l46p91J20O50M19o04
4671A14J33J285j710l7n22J183J50j271R80m2J90j80J29n96O47q62M10Q99j816
$$ plain form
4529 738 197 -239 -719 240 -912 -219 -721 -756 -1272 -502 348 206 369 -291 699 1132 593 48 158 -416
4549 -416 -400 -160 138 633 -169 329 289 -17 -293 -420 604 95 939 1041 994 82 46 -200 144 610 -15
4570 -15 1055 -243 -533 99 40 106 192 304 44 406 -21 76 -78 434 -380 292 -616 190 -82 199 1279
4591 1279 324 163 421 -675 156 155 58 -681 -328 584 460 106 -469 -508 -821 947 -8 877 582 240
4611 240 463 -209 -441 463 -444 185 -460 -167 -885 285 -183 -384 -527 -420 118 43 263 -662 715 65
4631 65 32 454 -239 -791 -499 -674 -685 163 -9 -641 -5 48 503 623 1180 213 303 733 -779 123 1226
4652 1226 -598 -745 77 351 -111 -889 602 632 488 -573 229 -730 666 320 -471 -351 299 718 114
4671 114 247 1532 -178 -215 -737 446 596 -675 305 263 453 273 402 -194 453 -409 1 900 -916
4690i16J191O80K15j460N02j28r00J084n75L49M90p41l88J26M79J8R46j023o54
4709g05J94n24N39K93R42p16q05J847j598K057o30j632P80N19r10P94p26Q3J231
4728A033k699J509Q82p49L85p02J303j089p21P35L21l16L81o28j25Q83j09m94
4746b00M00l00L36K77k66J589k330K28l84R61l05p03O47L2M00k91l41M57J01R2
4766D00m20J15r6j305O74M42o12K84p25J158Q5Q16J18m56j013P71P5n05o12J195
4786C89p70M50k80J052m16j5O68p42m89N09l02j68M45O74p81n62K24O36l56K7
4806A93l86l49J137k87l28m69J42P05l67k94K15M36p03P27n18j01K39p19R96j370
4826a101J149q6K63j545R00Q10j197O60M10j287J532j022J110l31j02K2M17o68
$$ plain form
4690 -916 275 955 1170 -290 212 84 -816 268 -307 42 532 -209 -597 -471 8 26 972 -51 -705
4709 -705 -511 -1035 -496 -203 739 23 -782 1065 -533 1524 894 -738 42 561 -349 445 -281 -198 1033
4728 1033 -1666 -157 725 -24 361 -341 962 -127 -848 -113 208 -108 273 -355 -480 403 294 -200
4746 -200 200 -100 236 513 247 1836 -494 -266 -650 311 6 -697 -50 -18 382 91 -250 207 308 400
4766 400 -20 95 -1 -1306 -632 -190 -802 -518 -1243 -85 0 816 934 478 -535 236 311 -194 -806 389
4786 389 -381 69 -211 841 425 410 1078 336 -153 356 54 -114 331 1005 224 -338 -114 522 166 193
4806 193 -193 -542 595 308 -20 -489 -347 358 -9 -303 -88 348 -355 372 -146 -247 -8 -727 269 -1101
4826 -1101 48 -38 225 -1320 -420 390 -807 -147 263 -1024 508 -514 596 265 163 185 602 -66
4844f6L95j094L45L82P3k33j6K73o6K75j213J222n29R28n35n30P14L11q61P35
4864E10j093k46N74Q01l38l7M12o66K05l13M1k10Q20l57J49j61O97J50j339J249
4884H48r94L57n72J90o07J174n73n66J025N44j194L2l76J252l75N80J31n89n17
4903b30O7o21R69L18Q53j401l62Q07p82J888o56j178K52n03J340j445J16J76P87
4922C95k10N91p67K74J34O5j86l35P85j27l74k66mM82N42j241J71L99n66K72l44
4943c10Q29m56k86N19K7r80J192j506R69l27K10J241r87l45R48j079O75K08o52
4962a10L40l08J350j194r41M21O40m5J25L09n11m77M2Q37o59p2j97O21K3l57O87
4983E24j006R71k97k00Q0k24r88P71L42m68n04J301l76n20R47n23L26k73O50j357
$$ plain form
4844 -66 329 -765 -420 -38 35 -198 -214 59 -7 268 -945 277 -252 676 141 -389 325 636 -225 510
4864 510 -583 -829 -255 546 208 171 583 -83 122 -191 -150 -360 460 103 252 91 788 938 -401 848
4884 848 -146 211 -361 -171 -778 396 -177 -743 282 826 -368 -336 -712 540 165 745 876 287 -230
4903 -230 -163 -784 185 503 1356 -45 -407 400 -382 1506 850 -328 -76 -579 761 -684 -568 -392 395
4922 395 185 776 9 283 417 482 296 -39 746 619 245 -21 -25 457 999 -242 -71 328 -238 34 -310
4943 -310 519 63 -223 296 323 -657 535 -971 -2 -329 -119 1122 135 -210 738 -341 334 542 -110
4962 -110 230 -78 1272 78 -863 -442 198 153 278 587 76 -401 -359 478 -181 -253 -450 171 194 -163 524
4983 524 -482 489 192 -8 72 -152 -1140 -369 -27 -495 -999 302 -74 -594 353 -170 156 -117 533 -824
5003h24R02n15Q50n43N37l98J66J027j710P18l07M67P05j105o87J178p39R30o70
5022a8j43O6L16m10J5N38q10P75n40J30L46p80J060m14k01J5P3k92J185p70n44
5043d03j70j37L94J47J890j110j476J185R7o46n4M85O3r70N44R6l19K68j32L20
5063G2Pm41L93l63J056p53l98N90r56j31J128O05j448P73k06n55P67O26j422L73
5083b83O40K92j286j73O4M27O05j76Q9K14J06j289J77J193o51J0O05l77j94m27
5103d34n5M95j1L56j55n05o52K374j685M17l08j54R90q37k68L88N8r11N47M79
5123A29L18k54o06K62m01R74o8o35J067k42l11p61J041m50K82j14K51j434J099
5142A47N70j74k5p68q01J290k62K39J36l27M09N46r28j40L8O3r26N85M76k91J150
$$ plain form
5003 -824 78 -437 413 -130 407 9 175 1202 -508 210 -97 370 1075 -30 -717 461 -278 652 -18
5022 -18 -161 -95 221 -189 -174 364 -446 329 -211 -81 265 -515 545 131 -70 -55 18 -274 911 141 -403
5043 -403 -573 -710 -316 -169 1721 611 -865 320 417 -229 -283 202 265 -705 -161 -65 -384 -116 -248 72
5063 72 79 -362 31 -332 724 -29 -427 163 -793 -924 204 809 -639 134 -72 -627 140 766 -656 -283
5083 -283 357 649 -637 -810 -746 -319 286 110 199 413 519 -770 -593 600 -51 -41 564 187 -7 -434
5103 -434 -489 6 -5 351 196 -309 -961 1413 -272 145 -163 -317 673 -164 -432 -44 14 -897 -350 129
5123 129 447 193 -413 -151 -552 422 354 -281 786 544 233 -528 513 63 345 231 482 -952 147
5142 147 717 543 518 -250 -1051 239 -23 216 352 25 434 980 52 -88 -50 13 -913 -328 148 -143 1007
5163A007j738N31J406k62p31j21J7Q59j336j196J239J109o30r83J056L01j232
5180g04Q44j200J138j50j7p63N85j42Q35o29P56Q4k68l06k5K34R5n59k30N30N90
5201F98j159K41P91q14n31J516l91n44K33J32r6r8o7N79j83M3j4j74O25l17n56
5222h6q68J22O00J105j738O11R85j586J541m51o58O75M20j245J248n34o34L26
5240a67O69l60r09j43k54M25J321r33R32q59P0K09L84o02J97m87n2M18O29l51
5260A37l78P42j572Q92J62N34j306P86L4J71m34L64l72j23k38M31L88K16N01r41
5280fL79O0r06M49O87j027j77r5N99q24O77L25pK51o79M87j003J492N36r68L22
5301E72j035P01o86N79m62k24j96J138l59l84J044q35l53n44J044P9P18r69M91
$$ plain form
5163 1007 -731 -200 1206 944 213 92 109 968 -368 -1564 -325 784 154 -829 227 528 -704
5180 -704 140 -1060 78 -72 -89 -852 -267 -409 426 -203 553 637 369 63 38 272 367 -192 -422 108 698
5201 698 -461 -220 571 -243 -774 742 351 -193 40 172 76 -22 -89 490 307 350 336 162 787 470 -86
5222 -86 -954 -832 -232 873 -865 -254 731 -855 686 235 -423 252 672 -573 675 141 -493 -167
5240 -167 502 142 -767 -910 -1164 -739 582 -351 581 -278 -208 1 385 -217 -20 -507 -559 -141 488 137
5260 137 -241 501 -1071 -179 -17 517 -789 -3 31 202 -232 132 -240 -363 -601 -170 218 434 935 -6
5280 -6 373 433 -473 -24 663 -364 -541 -636 -37 -861 -184 141 134 385 -294 193 -810 682 1218 250 572
5301 572 -463 238 -448 131 -331 -555 -751 387 28 -356 688 -147 -500 -1044 0 79 797 -172 319
5320C19r14J194p77j039J715l90j95J68J093l29o74K88q66L48N16N13K85j775
5338e20J26n0K1m74J831o46N41m0j975J144p2r14J170J161j249o04M86N69l80
5357A25P90o43j172J713l47p26k80L88j32J466j146r79J249o70N73J48K74n98
5375C3q19P93o18J015pN1P63j005Oj141J48J95P18n75K61j87p7O87j2L34r04o90
5397a031J197m88j33N12o07O01j461N17P49m9J10K90k77p69J492q84M35n84o09
5416i89M25k06Q15q34Q73k66L04R90j189J89o94M64Q34q57K85L87M97j378J11
5435b39o26J464m0l56l97J00l59J66P94o31L74K35p34O7r5J39P86j617Q54p5K58
5456F8Q61m73j509M77J546j201Q43j12j680J124l24j2J624q63J27o41Q77j026
$$ plain form
5320 319 -595 599 -178 -1217 498 108 -87 81 1174 845 171 459 -407 -59 457 970 1255 -520
5338 -520 -394 -444 -423 -897 934 288 829 789 -1186 -42 -114 -1028 142 1303 54 -550 -64 505 125
5357 125 915 272 -900 813 466 -260 -540 -152 -284 1182 36 -943 306 -364 209 357 631 33
5375 33 -786 7 -611 404 397 448 1211 206 212 -929 -781 -586 132 -443 -182 -369 -446 241 229 563 -341 -1031
5397 -1031 166 -322 -455 57 -550 51 -1410 -893 -144 -193 -83 207 -70 -839 653 -231 204 -380 -989
5416 -989 -564 -770 45 -789 84 -182 122 1112 -77 112 -582 -118 716 -141 144 531 1028 -350 -239
5435 -239 -865 599 559 203 -194 -94 -453 -287 507 -124 250 485 -249 -182 -277 -138 648 -969 -115 -190 68
5456 68 929 456 -1053 -576 970 -231 612 500 -1180 -56 -380 -392 1232 369 496 -145 732 -294
5474b94k8r5N67j142Q30L38j22N76k59j41k60q25J232o10l30O44O84j509R51j20
$$ plain form
5474 -294 -322 -417 150 -992 -162 176 54 630 371 230 -30 -855 377 -233 -563 81 765 -744 207 87
$$ [...]
8191a82
##END NTUPLES=NMR FID
##END=
