##TITLE=1H_KYU-20'+DMSO-t
 CDCl3, 108 sc, 
 13.3.2019
##JCAMPDX= 6.0         $$ Bruker NMR JCAMP-DX V2.0
##DATA TYPE= NMR FID
##DATA CLASS= NTUPLES
##ORIGIN= UXNMR, Bruker Analytische Messtechnik GmbH
##OWNER= root
$$ XWIN-NMR		Version 3.5
$$ Wed Mar 13 17:39:35 2019 Russian Standard Time (UT+4h)  she@DPX200
##.OBSERVE FREQUENCY= 200.1315
##.OBSERVE NUCLEUS= ^1H
##.DELAY= (6, 6)
##.ACQUISITION MODE= SIMULTANEOUS
##.ACQUISITION SCHEME= undefined
##.AVERAGES= 108
##.DIGITISER RES= 16
##SPECTROMETER/DATA SYSTEM= spect
##.PULSE SEQUENCE= zg30
##.SOLVENT NAME= CDCl3
##.SHIFT REFERENCE= (INTERNAL, CDCl3, 0, 15.7039)
##AUDIT TRAIL= $$ (NUMBER, WHEN, WHO, WHERE, WHAT)
$$ ##TITLE= Audit trail, XWIN-NMR		Version 3.5
$$ ##JCAMPDX= 5.01
$$ ##ORIGIN= Bruker BioSpin GmbH
$$ ##OWNER= she
$$ F:/spectra/data/she/nmr/H-F/1/audita.txt
$$ ##AUDIT TRAIL=  $$ (NUMBER, WHEN, WHO, WHERE, WHAT)
(   1,<2019-03-13 17:37:57.26 +0400>,<she>,<DPX200>,
      <created by zg, POWCHK disabled, PULCHK disabled
       configuration hash MD5:
       00 E9 B6 7A A2 85 ED C7 34 08 36 98 17 FE 4E 26
       data hash MD5: 16K
       4B B4 97 92 0D 2B 9A 75 BD 33 6E A4 4B 9F 46 EB>)
$$ ##END=
$$ 
$$ hash MD5
$$ 27 65 C6 A3 2B 9F 99 3D 3E 80 AC EE E8 EE 6E C1
##$RELAX= 
##$RELAX= 
##$RELAX= 
##$RELAX= 
##$RELAX= 
##$RELAX= 
$$ Bruker specific parameters
$$ --------------------------
##$DU= <F:/spectra>
##$EXPNO= 1
##$NAME= <H-F>
##$PROCNO= 1
##$TYPE= <nmr>
##$USER= <she>
##$AMP= (0..31)
100 100 100 100 100 100 100 100 100 100 100 100 100 100 100 100 100 100 
100 100 100 100 100 100 100 100 100 100 100 100 100 100 
##$AQSEQ= 0
##$AQ_mod= 1
##$AUNM= <au_zg>
##$AUTOPOS= <>
##$BF1= 200.13
##$BF2= 200.13
##$BF3= 200.13
##$BF4= 200.13
##$BF5= 200.13
##$BF6= 200.13
##$BF7= 200.13
##$BF8= 200.13
##$BYTORDA= 1
##$CFDGTYP= 0
##$CFRGTYP= 5
##$CHEMSTR= <none>
##$CNST= (0..31)
1 1 145 1 1 1 1 1 1 1 1 1 1 1 1 1 1 1 1 1 1 1 1 1 1 1 1 1 1 1 1 1 
##$CPDPRG= <>
##$CPDPRG1= <>
##$CPDPRG2= <>
##$CPDPRG3= <>
##$CPDPRG4= <mlev>
##$CPDPRG5= <mlev>
##$CPDPRG6= <mlev>
##$CPDPRG7= <mlev>
##$CPDPRG8= <mlev>
##$CPDPRGB= <>
##$CPDPRGT= <>
##$D= (0..31)
0 1.2 0 0 0 0 0 0 0 0 0 0.03 0 0 0 0 0 0 0 0 0 0 0 0 0 0 0 0 0 0 0 0 
##$DATE= 1552484276
##$DBL= (0..7)
120 120 120 120 120 120 120 120 
##$DBP= (0..7)
150 150 150 150 150 150 150 150 
##$DBP07= 0
##$DBPNAM0= <>
##$DBPNAM1= <>
##$DBPNAM2= <>
##$DBPNAM3= <>
##$DBPNAM4= <>
##$DBPNAM5= <>
##$DBPNAM6= <>
##$DBPNAM7= <>
##$DBPOAL= (0..7)
0.5 0.5 0.5 0.5 0.5 0.5 0.5 0.5 
##$DBPOFFS= (0..7)
0 0 0 0 0 0 0 0 
##$DE= 6
##$DECBNUC= <off>
##$DECIM= 2
##$DECNUC= <off>
##$DECSTAT= 4
##$DIGMOD= 1
##$DIGTYP= 9
##$DL= (0..7)
0 120 120 120 120 120 120 120 
##$DP= (0..7)
150 150 150 150 150 150 150 150 
##$DP07= 0
##$DPNAME0= <>
##$DPNAME1= <>
##$DPNAME2= <>
##$DPNAME3= <>
##$DPNAME4= <>
##$DPNAME5= <>
##$DPNAME6= <>
##$DPNAME7= <>
##$DPOAL= (0..7)
0.5 0.5 0.5 0.5 0.5 0.5 0.5 0.5 
##$DPOFFS= (0..7)
0 0 0 0 0 0 0 0 
##$DQDMODE= 0
##$DR= 16
##$DS= 0
##$DSLIST= <SSSSSSSSSSSSSSS>
$$ [...]
##$SUBNAM2= <"">
##$SUBNAM3= <"">
##$SUBNAM4= <"">
##$SUBNAM5= <"">
##$SUBNAM6= <"">
##$SUBNAM7= <"">
##$SUBNAM8= <"">
##$SUBNAM9= <"">
##$SW= 330.908255636489
##$SWIBOX= (0..15)
0 0 2 0 0 0 0 0 0 0 0 0 0 0 0 0 
##$SW_h= 66225.1655629139
##$TD= 16384
##$TD0= 1
##$TE= 0
##$TE2= 300
##$TE3= 300
##$TEG= 300
##$TL= (0..7)
0 120 120 120 120 120 120 120 
##$TP= (0..7)
150 150 150 150 150 150 150 150 
##$TP07= 0
##$TPNAME0= <>
##$TPNAME1= <>
##$TPNAME2= <>
##$TPNAME3= <>
##$TPNAME4= <>
##$TPNAME5= <>
##$TPNAME6= <>
##$TPNAME7= <>
##$TPOAL= (0..7)
0.5 0.5 0.5 0.5 0.5 0.5 0.5 0.5 
##$TPOFFS= (0..7)
0 0 0 0 0 0 0 0 
##$TUNHIN= 0
##$TUNHOUT= 0
##$TUNXOUT= 0
##$USERA1= <user>
##$USERA2= <user>
##$USERA3= <user>
##$USERA4= <user>
##$USERA5= <user>
##$V9= 5
##$VALIST= <valist>
##$VCLIST= <CCCCCCCCCCCCCCC>
##$VD= 0
##$VDLIST= <DDDDDDDDDDDDDDD>
##$VPLIST= <PPPPPPPPPPPPPPP>
##$VTLIST= <TTTTTTTTTTTTTTT>
##$WBST= 1024
##$WBSW= 4
##$XGAIN= (0..3)
0 0 0 0 
##$XL= 0
##$YL= 0
##$YMAX_a= 666722
##$YMIN_a= -350021
##$ZGOPTNS= <>
##$ZL1= 120
##$ZL2= 120
##$ZL3= 120
##$ZL4= 120
##$ABSF1= 10
##$ABSF2= 0
##$ABSG= 5
##$ABSL= 3
##$ALPHA= 0
##$AQORDER= 0
##$ASSFAC= 0
##$ASSFACI= 0
##$ASSFACX= 0
##$ASSWID= 0
##$AUNMP= <proc_1d>
##$AZFE= 0.1
##$AZFW= 0.1
##$BCFW= 1
##$BC_mod= 2
##$BYTORDP= 1
##$COROFFS= 0
##$CY= 11.3945322036743
##$DATMOD= 1
##$DC= 2
##$DFILT= <>
##$DTYPP= 0
##$F1P= 18.9103706918063
##$F2P= -1.10871071338519
##$FCOR= 0.5
##$FTSIZE= 0
##$FT_mod= 4
##$GAMMA= 1
##$GB= 0.15
##$INTBC= 1
##$INTSCL= 1
##$ISEN= 128
##$LB= 0.24
##$LEV0= 0
##$LPBIN= 0
##$MAXI= 10000
##$MC2= 0
##$MEAN= 0
##$ME_mod= 0
##$MI= 1.114404
##$NCOEF= 0
##$NC_proc= 0
##$NLEV= 6
##$NOISF1= 3.799351
##$NOISF2= 2.8
##$NSP= 1
##$NTH_PI= 0
##$NZP= 0
##$OFFSET= 15.70392
##$PC= 1
##$PHC0= -9169.983
##$PHC1= 25.40026
##$PH_mod= 1
##$PKNL= yes
##$PPARMOD= 0
##$PSCAL= 0
##$PSIGN= 0
##$REVERSE= no
##$SF= 200.130013532006
##$SI= 16384
##$SIGF1= 3
##$SIGF2= 2
##$SINO= 400
##$SIOLD= 16384
##$SREGLST= <1H.CDCl3>
##$SSB= 0
##$STSI= 0
##$STSR= 0
##$SW_p= 3612.71676300578
##$SYMM= 0
##$S_DEV= 0
##$TDeff= 0
##$TDoff= 0
##$TI= <>
##$TILT= no
##$TM1= 0
##$TM2= 0
##$TOPLEV= 0
##$USERP1= <user>
##$USERP2= <user>
##$USERP3= <user>
##$USERP4= <user>
##$USERP5= <user>
##$WDW= 1
##$XDIM= 8192
##$YMAX_p= 0
##$YMIN_p= 0
$$ End of Bruker specific parameters
$$ ---------------------------------
##NTUPLES= NMR FID
##VAR_NAME=  TIME,          FID/REAL,        FID/IMAG
##SYMBOL=    X,             R,               I
##VAR_TYPE=  INDEPENDENT,   DEPENDENT,       DEPENDENT
##VAR_FORM=  AFFN,          ASDF,            ASDF
##VAR_DIM=   8192,          8192,            8192
##UNITS=     SECONDS,       ARBITRARY UNITS, ARBITRARY UNITS
##FACTOR=    1.51e-05,      1,               1
##FIRST=     0,             0,               0
##LAST=      0.1236841,     0,               0
##MIN=       0,             -350021,         0
##MAX=       0.1236841,     666722,          0
$$ Real data points
##PAGE= N=1
##DATA TABLE= (X++(R..R)), XYDATA
$$ [...]
2725c49R52j169O86O4o54J01M56q1L05O18j351J252r55l90K64r73J063L13K65
2744D17o88K57P17j609O78j56J464j173%N85p92n46J041K27j082J115j154J0J460
2763G71L4r89j027O78K5M68K72N0q58K74R50r95l20J13R78j406J592q36p41R42
2783b5l08R93j344n00O72J086o66O66j393O92O29o0m67R1M33Q30j020o14P4N93
2803C62r3j34Q72o72q68J068L35j237q52J299k85R06j97n54j55kj50R55o89j97
2823b88K80L4N31j409Q08K38p38L15j221J094PK89L07j209M30JJ248m95N54j230
2843d54Q48N55p27k21o40P68r1m37J66J069j184p4N37J018m08p6p20N28j07p72
2863d22J8L29k93L87K21o5n55J55K27l51j91P02P75p23m47o92J244l36K68q9k99
$$ plain form
2725 -349 603 -566 120 184 -470 -369 87 6 311 929 -422 830 -125 -515 -251 -1224 -161 152 417
2744 417 -271 -14 703 -906 -228 -384 1080 -93 -93 492 -300 -846 195 422 -660 455 -699 -689 771
2763 771 805 -184 -1211 -533 -508 -40 232 282 -576 -302 648 -347 -667 -554 424 -982 610 -226 -967 -25
2783 -25 -333 660 -684 -1184 -512 574 -92 574 -819 -127 502 442 -25 66 499 1329 309 -305 -231 362
2803 362 269 135 1007 335 -533 535 870 -367 -1219 80 -205 701 504 -50 -205 -207 -357 598 -91 -288
2823 -288 -8 26 557 -852 -44 194 -544 -229 -1450 -356 -349 -60 247 -962 -532 -531 717 222 776 -454
2843 -454 394 949 222 1 -639 129 38 -399 -233 836 -348 -422 115 1133 725 649 -71 457 350 -422
2863 -422 -404 -75 -368 19 240 175 -380 -225 2 -349 -540 162 937 214 -233 -925 319 -17 251 162 -137
2884a37k73N33O55q26J44O86j324o2J28p26K057q91n05O54j04L26Nq7J02j205
2904h50J018j02k12O99rj13q68J45L23P23p51m63N43L17j320J274k03p47P50q4
2924G0m00J48J70j132J457j252O05N78M55o18j446Q55k51R60o44L14n6M20o43
2943d10J846j266j122Q97l09J023m53j7l39j75P86J69k96m53L3Q0M64M59l77p21
2963a81K74l44R82j117P16L99r60k23K93M88j53R7Q5l82j03K23j70l35L89J27
2983A05j021J086j40M14l45j013K78J535j085O54l83j008R12p76Q58J04L99j39
3001D35l86M22L28j124N07r18J515q79J14J86j96R71j711J388p65K61r59J520
3019G09r67L29K17PR69j869J529l83m47j25j5L8Q92k147R57R68k137J391K38M40
$$ plain form
2884 -137 -410 123 778 -48 96 782 -542 -604 -476 -1202 855 -36 -541 113 9 335 340 253 355 -850
2904 -850 168 66 -146 553 544 431 -437 -292 31 754 3 -460 83 400 -920 354 151 -596 154 70
2924 70 -330 -182 -12 -1144 313 -939 -334 244 699 81 -1365 -510 -761 199 -445 -131 -187 233 -410
2943 -410 1436 170 -952 -55 -364 659 206 189 -150 -325 461 630 334 -119 -86 -6 458 917 540 -181
2963 -181 93 -251 731 -386 330 729 -231 -454 -161 327 174 271 356 -26 -129 94 -76 -411 -22 105
2983 105 -916 170 30 444 99 -914 -636 899 -186 468 85 -923 -11 -787 71 175 574 435
3001 435 49 471 799 -325 182 -736 779 -100 14 200 4 975 -736 652 -113 148 -811 709
3019 709 -258 71 288 295 1264 -605 924 541 94 -31 -46 -8 884 -1263 -306 662 -1475 -84 154 594
3039E94Q08j387n12J009n35N66p21l6Q45q5K29p39j031P39J99l00L8K98p60M18
3059c63p0K62m93J317r60J544j018o99N55j550K679k095J060q86m3Q99P66r14
3077ij52j17L16L19O07j099M4m52p2N82p78L51P9k07P25M3k48J181j831M40Q28
3098E50j772J198k53K60m21P8J009n1p48j43O14R45j154n02Q46l63K88N39j144
3117b24J3l41J042l19r40L29q95J491J86j511J342J22o52J360j026j03o93N32
3135b87O78l57l0M76m09p24P46j55J174r37L77j215P37o76M88j96K67P51m79k38
3155im34J289o62o14K35J85J020j779O31O54p14M95k14k71n07K81J065l5m06j94
3175A6K56Q71j686Q34L39k83m91O08k7o96m55J615m69j462J466m93L44q67k77
$$ plain form
3039 594 1402 15 -497 512 -23 543 -178 -214 631 546 775 36 -995 -256 -57 -357 -319 -21 -781 -363
3059 -363 -433 -171 -664 653 -307 1237 219 -480 75 -1475 1204 -891 169 -717 -760 139 905 -9
3077 -9 -161 -278 38 357 964 -135 -91 -543 -615 -33 -811 -460 -381 -588 137 180 -68 1113 -718 -278 550
3098 550 -1222 -24 -277 -17 -438 -360 649 598 -150 -293 321 1266 112 -390 456 93 381 920 -224
3117 -224 -211 -552 490 171 -769 -440 -1335 156 342 -1169 173 295 -357 1003 -23 -126 -819 -287
3135 -287 391 34 4 480 71 -653 93 -62 1112 175 552 -663 74 -602 -114 -310 -43 708 229 -9
3155 -9 -443 846 184 -430 -195 -10 1010 -769 -138 516 -198 297 83 -188 -695 -414 651 616 210 16
3175 16 272 1143 -543 291 630 347 -144 464 437 -259 -714 901 432 -1030 436 -57 287 -580 -857
3194h57J233m86R58q84P34k92p85N39j01l06K2j191J300J270j300m76J219p46
3212a49j057K232j431O77K93L9K88q25J5k4L10J02r17R91P4m46j084P89l97L51
3232a69M5K84L4j54l75R57j236P79N8l89J065o49r68P91O24r53O29o45J35l68
3252e05L9O81o39J400j281L07Q27p99l88J769j509K85j95n41J005k84K00j360
3270i88R08K67O30j389j38J596p15m56Q89o09L90l65O51n44R2N35n3q33J01J088
3290A057p11j30q28M43N77M72M29j304M03p95L75o49J382m31j08k03N84M82j173
3309a28r64P32J163p30M26n73O33n19p96M30O08l4q46R30r39l71J385j026J098
3328D79j317J141K0m68K22q84P59J46J8N1l58M52q75O18m8J84n90K15N41m92M94
$$ plain form
3194 -857 376 -110 848 -36 698 406 -379 160 59 -247 -225 -1416 -116 1154 -146 -622 597 -149
3212 -149 -1206 1026 -405 272 565 604 892 67 82 58 368 470 -447 544 618 172 -912 -123 -520 -169
3232 -169 -124 160 194 40 -335 622 -614 165 223 -166 899 250 -718 73 697 -256 373 -272 -137 -505
3252 -505 -466 215 -424 976 -305 2 829 30 -358 1411 -98 187 -8 -549 456 172 372 -988
3270 -988 -80 187 817 -572 -710 886 171 -285 604 -5 385 20 671 127 219 754 701 -132 -31 1057
3290 1057 346 216 -612 -169 408 880 1309 5 408 -387 -12 -661 721 290 182 -21 563 1045 -128
3309 -128 -1092 -360 803 73 499 -74 559 40 -756 -326 282 248 -598 332 -607 -978 407 -619 479
3328 479 -838 303 323 -145 77 -807 -48 98 116 167 -191 261 -614 4 -44 140 -450 -235 306 -186 308
3349C08J0k38L14n58k59L58j72l35j14J491m70j83J99o5n20J123m70p16J305n81
3369D27m07N76j969J178L60l42m9k5j99J063j234J223o23J074o40r14Q03q38L71
3388a65J62K61k76L27j69j02j18m67L7J7l00m98K100r74J442j059k50L30J035
3407A333j282M9O9M0k20L71K56j75j194J193o40l4j53o22R82J66L23m72K56J17
3427C63l4l65J022j166O89Kj81n30J414j488Q82o51J212j488Q68l4q0k48j148
3446i61J007M98L93j076P96p86r4j41J346l74o84L53L63j045M49l58Q20j95J46
3465D57K01r3o70Q08o45po41P24l57o85K216j028q9J69k46m40N61R58p44o74J79
3486d6m68P98n83k22J464k46l77j63k69L20Q18m73j049J4P26M21m94j27r5K90
$$ plain form
3349 308 318 80 394 -164 -423 -65 -237 -572 -686 805 335 152 351 286 -234 889 419 -297 1008 427
3369 427 20 596 -1373 -195 165 -177 -226 -251 -450 613 -621 602 -21 1053 413 -501 302 -536 -165
3388 -165 -3 258 -18 309 140 38 -80 -547 -510 -493 -793 -1291 809 -165 1277 218 -32 298 1333
3407 1333 51 100 169 209 -11 360 616 441 -753 440 -200 -234 -387 -1009 -27 139 462 -10 246 363
3427 363 329 -36 986 -180 509 511 330 -200 1214 -274 608 -43 1169 -319 549 515 435 187 -961
3446 -961 46 544 937 -139 657 -129 -223 -364 982 608 -76 277 640 -405 44 -314 506 311 457
3465 457 658 565 -105 703 58 51 -590 134 -223 -908 1308 280 191 360 114 -326 235 1193 449 -225 -46
3486 -46 -514 284 -299 -521 943 697 320 157 -112 208 1026 553 -496 -482 244 665 171 44 -51 239
3506B39j26o41O17o41Q90n72Q94j206R58m25p9q7o14k28M17K27L87O0n66J040
3526E44m36k92m49R54j121J568q58j241J674J53o5m59j02P65KM8j041q89J867
3545F22K52j747J205j89O43m93m94j69N60m94J70m1j42M28o06J80J127m13k57
3564A42K38o62L9O97q12P0J085j491J124j15p35J87q0O67q29p25K151j367O39
3583B23JP53k73j431R37p22n91J563K59R25j436J081j497r00J781o01j18O80j169
3602e35R74j146L34L85o32l08L64Q03K40m36n9L72o21K54j7m25J11J268o78j193
3622i45J178p76L99N82M60r12K35N64j381J776o86m32n27J285r56p28P85M44k91
3641G4n74M69j16L53K41q21J758k111P35J074n97L9p03L01j12O53r78M36m38P68
$$ plain form
3506 239 113 -528 89 -552 338 -234 660 -546 412 -13 -92 -179 -793 -1021 -604 -377 10 70 -496 544
3526 544 108 -184 -633 321 -800 768 -90 -1331 343 496 431 -28 -130 635 637 685 -356 -1245 622
3545 622 874 -873 332 143 786 293 -201 -370 190 -304 -134 -175 -317 111 -495 -315 812 399 142
3564 142 380 -282 -243 454 -358 -288 797 -694 430 315 -420 -233 -313 354 -475 -1200 951 -416 223
3583 223 224 977 704 -727 210 -512 -1103 460 719 1644 208 1289 -208 -1108 673 72 -46 634 -535
3602 -535 439 -707 -373 12 -620 -928 -564 239 479 43 -16 356 -265 -11 -28 -453 -342 926 248 -945
3622 -945 233 -543 -144 438 898 -14 221 785 -596 1180 494 62 -465 820 -136 -864 -79 365 74
3641 74 -500 -31 -147 206 447 -374 1384 -727 8 1082 485 524 -179 122 10 663 -315 121 -317 451
3661D51k87J0p48J109j638J383n05L94L46j246j99R42k50k08J509j151K15m94
3679c67j18k12N61M34J84q45k07M87J04O84m10J38j657Q95L9N94J29l74l08P11
3699D62m12k76N56l63O51n10l1L0K26M29q65O93j01l37p43J880j471j41O34m86
3719a75l19p2M55p0J057j986J083q18J220M85j586Q19j83J27k60J135p08l21n80
3738f97J390j716J263k09m61J12J86J367k33j237J63J82k37M04k99j12r68R27
3756a75l63n6K29K15q80K90J258J81j367R84J85r8j478M35K42J23M07M33o44r6
3776a75j0P43j021L9J20O21K71j843J657k99p81J166p14Q3R28p70k58O35n30q8
3796b26L63P94j031K83j01N61k40j28m6j047J483n95J54L98q12K37o95M2P65n14
$$ plain form
3661 451 164 174 -574 535 -1103 280 -225 169 515 -731 -930 12 -238 -446 1063 -88 127 -367
3679 -367 -485 -697 -136 298 482 -363 -570 -83 21 705 295 433 -1224 -329 -290 304 433 59 -249 462
3699 462 50 -226 330 -33 618 108 77 107 333 762 -103 590 489 152 -591 1289 -182 -323 311 -175
3719 -175 -494 -566 -111 -181 876 -1110 -27 -845 375 860 -726 93 -90 37 -223 912 204 -117 -697
3738 -697 693 -1023 240 31 -430 -318 -132 1235 1002 -235 -72 110 -127 277 -22 -134 -1102 -175
3756 -175 -538 -594 -365 -150 -1030 -740 518 699 -668 316 501 403 -1075 -640 -398 -275 132 565 -79 -175
3776 -175 -185 558 -463 -424 -304 317 588 -1255 402 103 -678 488 -226 -143 785 15 -243 392 -138 -226
3796 -226 137 931 -100 183 82 643 403 275 229 -818 665 70 224 622 -190 47 -648 -606 159 -355
3816c55n79N95J126K71j195M5M20l15n80l89n0J246j11l45L12l92n3m49J380j075
3836d93j96J615r68L41N96p27J51k06rr1o00r1M15R24r36J009p91M27J38j037
3856e29Q8O83J46m60M7N32j696K354j084O9j43J45j172J023n53r7J131r19Q0J92
3876a63Q91k78p55J359r59M37j154K93k11P96K19O9J22j609J307o59N71r68k04
3895h96R87L91l72k21k0M25r7l07L80j408J260n97O28o09L05L47n35J634j085
3914B10m25O5L13n09l37J295r78M62l74R3K15r9Q86j75p40K9M16j32R1Q6o91L45
3936D6K06m1n77m47P51o38Q02J272j780Q89q03o48K364j443M5J45P6j82Q9m0M75
3957E61k50m51Q05j010j07J119m71m87n4M29j108R09m32N10N8L88M58n37p61n
$$ plain form
3816 -355 -934 -339 787 1058 -137 -92 328 13 -567 -956 -1006 240 129 -216 96 -296 -349 -798 582 -493
3836 -493 -689 926 -42 299 895 168 319 113 104 13 -587 -678 -263 661 -275 734 -57 370 508 -529
3856 -529 -441 242 388 -72 -25 507 -1189 1165 81 150 7 152 -1020 3 -550 -647 484 -435 -355 -163
3876 -163 728 450 -305 1054 95 532 -622 -329 -540 256 475 544 666 -943 364 -295 276 -692 -896
3895 -896 91 482 110 -111 -131 294 197 -110 270 -1138 122 -475 153 -456 -151 196 -339 1295 210
3914 210 -215 -150 163 -346 -683 612 -366 96 -278 -185 30 -69 817 642 -98 -69 347 215 306 392 -299 46
3936 46 252 211 -366 -813 -62 -700 102 1374 -406 483 -320 -968 1396 -47 -2 143 219 37 126 86 561
3957 561 311 -140 665 -345 -452 667 196 -291 -345 84 -1024 -115 -547 -37 21 409 867 330 -431 -436
3977d36q28K405l26j617R10P38k70M5j72o32M64o40P64K04o6l88M34p19J20O2
3997E2K80O7n19p45R98oM70j732J22L01R25J35r71N58M41l59p68J354M50n16N11
4018A048j7m59Q1j23q03J03J04L34J339k372L86O20j58N1J95j708L71J195M70
4037F57m60J87l40M23J59n31O56j403M92R3q92R31N90j209l37J698J25l50j080
4056e91R36j308J037R24j118o33P35q68J257j54R1o15N96j11K98K33r84J164l94
4075D95m09N59j652J804j539M12P69j543J307q85J078n29Q73n63n92k35Q59J58
4093C67L63j235R28n61j198J475k51n04P41j75N9o54N07O94J33r03M28M11Q9j045
4113c31N28K52o33O90p08l35R78m28M61q62K75N67j63o46J91j87J16k54J010Q7
$$ plain form
3977 -436 -1264 1141 815 -802 108 846 576 621 449 -183 281 -359 405 609 543 155 589 -130 -10 52
3997 52 332 399 -120 -865 133 127 597 -1135 -1013 -712 213 348 -623 -65 376 17 -751 603 1053 537 1048
4018 1048 1031 572 653 530 -273 -170 -66 268 1607 -765 -379 241 83 134 329 -1379 -1008 187 657
4037 657 197 384 44 467 626 95 751 -652 -160 -67 -959 -28 562 -647 -984 714 839 489 -591
4056 -591 345 -963 74 998 -120 -753 -18 -886 371 217 308 -307 289 178 476 709 -275 889 495
4075 495 86 645 -1007 797 -742 -330 439 -1104 203 -682 396 -133 740 177 -415 -650 209 367
4093 367 730 -505 423 -138 -1336 139 -112 -616 125 -50 9 -645 -138 556 689 -214 214 625 714 -331
4113 -331 197 449 -184 506 -202 -537 441 13 474 -388 -113 454 291 -355 -164 -351 -235 -489 521 608
4133F08r31N67Ml15l26K99K50p27L48o04R64j074K23L63L54j7k76r0N9N54j38
4154I5k43N22m90k27P24N6k2J37l62K58j840Q67J62K77J73m78m29Q81j319K039
4174G81q72L15q29P82n41L12K89M46l70r33M20L71m2p4l79r2M57M21J17r51j37
4195e09J508j262N27p10j8O72l20l95Q50R8K70j41n11J014j692R27l06J94p96
4214f00L9N95L48o46M50L01p17J2k89K13M38P09j650J99O76L10n54P15k28m65
4234a44N44r7o17K57K80J80K83L37j811N47N53m7l17r7J15m51R39n67J29N6R27
4255I99j146J687j863m86J115n36m2P84j506J224m42j25J689j225m1O02k78k72
4273A38L97j82q43O87K87L29o47q69O19j0J343j570R19Q33j237r35N09q41O49
$$ plain form
4133 608 -323 244 248 -67 -393 -94 156 -571 -223 -827 137 -937 -714 -351 3 -14 -290 -380 -321 233 95
4154 95 -148 374 -116 -343 381 437 415 552 190 448 -1392 -525 -363 -86 87 -391 -820 61 -1258 781
4174 781 -91 224 -605 177 -364 -52 237 683 313 -620 -200 171 129 55 -324 -416 41 462 579 -372 -509
4195 -509 999 -263 264 -446 -464 208 -112 -507 343 441 711 570 59 1073 -619 308 2 196 -600
4214 -600 -561 34 382 -264 186 487 -230 -218 -507 -294 144 853 -797 -598 78 388 -166 549 321 -144
4234 -144 400 303 -314 -57 223 403 686 1023 -788 -241 312 265 -52 -149 -34 -485 454 -113 16 72 999
4255 999 -147 1540 -323 -809 306 -230 -272 512 -994 230 -212 -337 1352 127 86 688 410 138
4273 138 535 353 -490 197 484 813 166 -703 -84 -94 1249 -321 598 1431 194 -741 -232 -1073 -424
4292d24K90K20j52r17R38p97J385n55L44L83l05p48L67J170j105K37l03M69J37
4311F34r86O69j98O13n37r98L48J021j815J291j088O69J636j154K96r8n53j8Q80
4330F12q54N59m50N38n02n80Q93N34j838J185J193j634N86K77p03p29M69L01L63
4349B20J04J192j760J076j038J68K69K10p75r44P37Q34k61q71J084p83O30N2p64
4368f20J182o98NJ1q24Q12n69K06K259j378q7K40l76p2k73Q34J3l3o33o92J294
4389F01j91k48j08j25l69k10J059J04o58M24N48j411J59m58J155j426J384k40
4407a0K2K95k4n72Q10p07P09j194P11j81M34k71K24m53P37j423J052k75j58j15
4427c89l40P39Q44j73j510J97J178j43P24o87K51j192K66K44M78j118K59M98o03
$$ plain form
4292 -424 -134 86 -66 -983 -45 -842 543 -12 332 715 410 -338 29 1199 94 331 28 497 634
4311 634 -352 317 119 732 195 -803 -455 566 -1249 42 -1046 -377 1259 105 401 303 -250 -268 612
4330 612 -242 317 -133 405 -97 -677 216 750 -1088 97 1290 -344 242 519 -184 -913 -444 -143 220
4349 220 324 1516 -244 832 -206 -38 231 441 -334 -1278 -541 293 32 -839 245 -538 92 144 -620
4368 -620 562 -136 -131 -120 -944 -132 -701 -495 1764 386 299 539 163 91 -182 652 665 632 -1 -693 601
4389 601 410 162 54 -71 -440 -650 409 513 -145 279 827 -584 -425 -883 272 -1154 230 -10
4407 -10 12 307 283 -289 521 -186 523 -671 40 -141 293 22 246 -207 530 -893 159 -116 -274 -389
4427 -389 -729 10 854 681 -829 -632 546 403 1127 440 691 -501 -235 9 487 -631 -372 126 -477
4446d77k30L92M02l55k42K41k90m12M34O68j197Q57O47q56l77N45K41R21j197
4465b85L29R05j097J21oj056J052J95m55j135J415j68L73p58n37J908r09M35r84
4484f57J546j945M14K92K09L53q86J153k30J169p12m34N13o06K6j91n2o76O96
4503a8R98j368q58J772n81o8n5J230n05M5q06O3l62O45q0n31M5K79m18K45L11
4524a7K82J63j263O33Q30j85p07R90n86o06M00M77j66m12N0M28O83j265j65J038
4544F02n70j64n8N65k02R0J04l04K11m4j45Q6k35L4Q14j120j35Q76j193P54J33
4565I9J58L0p25j45P25O85j029N61m23K24n13L15N4P95n18r46J60n01M02k18J832
4586A022m57l93o64J60O10L39j196p62J903p93m12N71l72O29M3l87l96N50k71
$$ plain form
4446 -477 -707 -315 87 -268 -510 -269 -559 -971 -537 131 -1066 -209 438 -418 -795 -250 -9 912 -285
4465 -285 44 949 -148 -27 -33 -1089 -37 158 -297 -1432 -17 -185 188 -570 -1107 801 -108 327 -657
4484 -657 889 -1056 -642 -350 -141 212 -674 479 249 1418 706 272 785 179 205 14 -38 -714 -18
4503 -18 980 -388 -1246 526 -55 -123 -178 1052 547 592 -214 -151 -513 132 52 -479 -434 -155 -573 -328 -17
4524 -17 265 428 -835 -202 628 443 -264 726 140 -466 -66 411 245 -167 -117 311 994 -271 -436 602
4544 602 32 -132 -190 375 173 263 367 63 274 230 85 171 -64 -30 784 -336 -471 405 -788 -34 99
4565 99 257 287 -438 -583 142 827 -202 359 -64 160 -353 -38 16 811 293 -653 -493 -994 -592 -810 1022
4586 1022 565 172 -492 -332 278 617 -579 -1341 562 -231 -643 -72 -444 185 228 -159 -555 -5 -276
4605b76J666k213J050o44J36m64O70q7J02M64n78K53K9r71R52N01m1j370J669
4624H48m42K07k20o84O92j99n67n68R35K67q54N10K23Lk7J32k43m55p1R10M36
4645H33j21l53m41L07r22J223J52p34M81n74R3K72j00j2o11o41P16O98M8j52P6
4666B38n92Q12n97J33M30J76p41K09O69j279L95O32n63l96J47M60L42o5q48j2
4686d50L38l70K74P98n54L38j71K97q78J282p34L77r49o09J128r53M83j72P70
4705B45l9k80j07j70P8N88j044P04l9K10K40l45j328K109j565Q88k54J3L58l33
4725g1m8q33J411j12j114R7K24m54Q76N89r51n34J337l14P16q06K76n49J44j7
4745a33K19J59l63K63j292J273K10J8o68J439j853M8Q42M66l90p46K23K03M82
$$ plain form
4605 -276 1390 -823 227 -417 -281 -745 -75 -162 -60 404 -174 79 108 -863 89 590 549 -821 848
4624 848 406 613 393 -291 401 202 -365 -933 2 269 -585 -75 148 151 124 256 13 -442 -513 397 833
4645 833 712 359 -82 225 -697 526 678 -56 425 -149 -56 216 116 104 -507 -1148 -432 266 314 162 238
4666 238 -354 458 -139 -6 424 600 -141 68 737 -542 -147 485 -78 -474 -327 133 475 410 -438 -450
4686 -450 -112 -482 -208 590 36 374 203 500 -378 904 170 547 -402 -1011 117 -836 -353 -525 245
4705 245 206 -74 -181 -351 -273 315 -729 -25 -64 146 386 41 -1287 822 -743 145 -109 -96 262 -71
4725 -71 -119 -952 459 347 -767 -670 -446 -900 -24 565 -386 -920 417 103 819 13 289 -260 -116 -133
4745 -133 86 245 -118 145 -1147 126 336 354 -314 1125 -728 -680 162 628 238 -508 -285 -82 400
4764D00j539K393k443J400M57L27o37r47K27M70M69j039J78k0k74N90p05P38J79
4783B24o71L15m93J421p74O55j124L72K96j053P91MN20r57O18j36K64l25j70P51
4803E28r31Q86l66j046Q00k80P70J85j709J737l09O16j681J811m24o95R3j1M22
4822C96r14k57Q78N89j432J311o32m43J072l02M2j156N03n67L48K73n69J885j522
4841d97J135K69j103K5p0j04M36J39M97q49L81o74O01R75n06m11n44Q10j718P56
4861d52J254m61L2k20P3l87L31K56o20O97k24L79n74J92L00j116Q61m8l41J521
4881A453o06j281M16N06j616R53j42m07J396j21o67K94r00J37L10O18l45L87p5
4900C10l89K23n44J069m48K48M0J37n00J5O0o4n76K32L45j98o41J776j424j007
$$ plain form
4764 400 -1139 1254 -1189 211 668 995 358 -589 -362 108 577 -462 -284 -304 -578 12 -693 45 224
4783 224 -447 -132 -625 796 22 677 -447 -75 221 -832 -41 -37 483 -474 144 8 272 -53 -223 528
4803 528 -403 483 117 -929 -129 -409 361 546 -1163 574 265 881 -800 1011 587 -108 -15 -26 396
4822 396 -518 -775 103 692 -740 571 -61 -504 568 266 308 -848 -345 -912 -564 -291 -860 1025 -497
4841 -497 638 907 -196 -171 -241 -345 91 230 727 -122 259 -415 186 1161 655 244 -300 510 -1208 -452
4861 -452 802 341 373 153 226 -161 170 426 -194 503 279 658 84 276 576 -540 321 273 -68 1453
4881 1453 847 -434 -18 488 -1128 -175 -317 -724 672 551 -116 178 -722 -585 -275 343 -2 385 310
4900 310 -79 144 -400 669 221 469 509 646 146 161 221 157 -419 -187 158 -40 -681 1095 -329 -1336
4920a336J102K70m1m91n47K077j045k64J243j563O42J091j040K47O25j059O54
4937E65j524J242j6K21r46J72J37n4K2L48L55q35J64k01J70M7J060j562L01Q65
4957E31q89K85M01l64P82k00k45m23k83M08L33l18o56R39o33O97O5j1q08Q17o81
4978b53J083j148l14O95j64M71r68J467q30J6j4N29q00J02P7J12J69k62r37O87
4998b82O98j243N01P09j474J402n15L96O09j642M2J193k21j6J298j253nj96L10
5017C11l08k6L25K23o13n03Q89l65l96O89n42O62n58P75j135P47Q26j702K84J472
5037A055p16j8L13j448M63L53O6N16n25n20M01N13q50Q22r22L70J05p21J78j96
5057g61R64o38O49l03K3l42L47o84Q09j187Q63l88L89l10J125o87j042M50k53
$$ plain form
4920 -1336 -234 36 -5 -496 -1043 1034 -11 -275 968 -595 47 1138 98 345 970 -89 565
4937 565 -959 283 267 488 -458 -286 -149 -203 -181 167 522 -313 -149 -350 -180 -133 927 -635 -334 531
4957 531 -358 -73 328 -36 746 546 301 -122 -405 3 336 18 -638 301 -332 365 430 419 -389 428 -253
4978 -253 830 -318 -632 63 -101 370 -598 869 39 55 41 570 -230 -128 -51 61 230 -32 -969 -282
4998 -282 416 -827 -326 383 -1091 311 -204 192 801 -841 -799 394 173 157 1455 202 197 1 311
5017 311 3 -23 302 525 -88 -591 298 -67 -463 226 -316 346 -212 563 -572 175 1001 -701 -417 1055
5037 1055 339 321 634 -814 -351 2 68 584 59 -461 -60 453 -397 425 -497 -127 -22 -743 -565 -761
5057 -761 203 -435 214 -89 -66 -408 -61 -745 64 -1123 -260 -648 -259 -569 556 -131 -1173 -723 -976
5076i76J158J57j18k9M61o31N80M9K30l65j097L08L43o6L85K60n14r8k12p5l25
5097e75J127r6n62M95L51j193J569j348j66J128k86m88J08n19J112l60l96k98
5115c97P88k07n35pJ015M4r13R98n60P23o82j122n4P76oM86l11K15o70R07p59
5136b71J55J50O1M62M2o74O74j001R35j421Q22L05N99l75q05K25N62p84P3R3O11
5157D38q88m05J360k0j597J871K57q27l56M49K36l70M8J16O43j282P49m41l45
5176c64O77j64m17J9K25j376J731K20M13j311O54k45j67K1L4R58l53J90k37j211
5196g03R4q5O52K02l34Q66J49j414M2J81Q09m03K59q77l49J237l39n9M76l15N80
5217F69j129J191n76J02r2K02p42L84j86o39P50k14O71j008J615o84m46O7J06
$$ plain form
5076 -976 182 339 221 192 653 22 602 651 881 516 -581 -273 70 4 389 649 135 37 -175 -250 -575
5097 -575 552 456 -106 389 740 -453 1116 -232 -398 730 444 -44 64 -455 657 297 -99 -397
5115 -397 391 184 -351 -358 657 701 -212 786 226 949 267 -855 -909 -133 -139 347 36 251 -419 488 -271
5136 -271 -116 34 95 557 599 -75 599 -402 533 -888 -66 239 838 463 -342 -117 445 -339 -266 -173 438
5157 438 -450 -855 505 485 -1112 759 1016 189 -167 282 518 148 196 312 955 -327 422 -19 -364
5176 -364 313 149 -268 -249 -24 -1400 331 551 964 -347 307 62 -105 -84 -50 908 555 745 508 -703
5196 -703 -609 -694 -42 160 -174 692 841 -573 -531 -350 459 56 315 -562 -911 326 -13 -72 404 89 669
5217 669 -460 731 155 257 165 367 -375 9 -177 -816 -66 -280 391 -617 998 314 -132 -65 41
5236D1j158O09M28O02l51l29N63J76r11QP14m72J84r60J492m90k15J87r6Q91J60
5257A073lj411J444j459m56R47M82m13j022L13j9P09n05M82qp66J626m70r4q54
5277d04Q44n03J80m54l75J150K42j116J031q78M66j096N23p4J175q05k1K39M4
5296A68O91n37N9q63j69L98N29p73Q71K47j515P14r48Q95K74Q9P08o00Q93q55
5316B76K32j316N08l35P33L22N78o5j783R0L43R5k98J404j057N29J68n56L59j59
5336F8P33m07M9j055M14M06Q9o46Q6J99k07p40M51N79N38L4k40n08L7J529j593
5357a84O74q58P66k28J1j24j1m24R86j461M46K7l93P68N45n23J168j113O39n36
5377A75o47J018j386O58n23M62j9pL12N4o85J124o07k38L07N62O34j639j50L5
$$ plain form
5236 41 -1117 -508 -80 522 171 -158 405 581 -330 -322 392 -80 104 -856 636 146 -69 118 22 913 1073
5257 1073 1070 -341 1103 -356 -812 135 617 204 -818 -505 -524 185 -320 162 154 -612 1014 544 450 -404
5277 -404 440 -63 117 -337 -712 438 680 -436 595 -283 183 -913 -390 -464 711 -94 -115 124 168
5296 168 859 322 381 -482 -651 -253 276 -497 374 621 -894 -180 -1128 -233 41 130 838 238 1131 276
5316 276 508 -808 -300 -635 98 420 998 933 -850 -760 -417 -322 -620 784 -273 256 424 -132 227 68
5336 68 801 394 443 -612 -198 208 297 -349 -263 -64 -271 -1011 -560 19 557 591 351 -157 -120 1409 -184
5357 -184 490 -368 398 170 181 57 46 -378 608 -853 -407 -380 -773 -5 540 17 1185 72 711 175
5377 175 -472 546 -840 -182 -705 -243 -262 -269 43 97 -588 536 -71 -309 -2 560 1194 -445 -595 -560
5397e60J169m24l36j39L69L14k56N5j194P64o77J073Q56j432N76k39n11M81m27
5416e38J119J27q41L92L50q67N98j413K185k689J310P43r69j83J065n20P31o37
5434c7K85l83J02K95j09K95K34m1l10j40N62m59K01n18J33l51J34M54n10M88L45
5455F70q26l92N56O96j032N15j26K64J70N24j991O67M40o0Q41j407O73k59n24
5474f01J286q29J89Q0M72o65K79J33j01L30l99L17j67o19O52j47n92R8q08J13
5494i79J362n13p2L13o36n76M94P29r8j040R64m91n37J022J3j274J955n21K89
5513D04j008J453j526N9M57J87O1P91j124J065q34m02P00j098J074p28J94L68
5531I3M74p27P67j047M38q4L46j04L67Q1q74K70n56P01r99R24j35k09N36J15O9
$$ plain form
5397 -560 609 185 -151 -290 79 393 137 192 -1002 -238 -915 158 1014 -418 158 -81 -592 -111 -538
5416 -538 581 708 -133 259 609 -258 340 -1073 1112 -1577 -267 476 -493 -676 389 -131 600 -37
5434 -37 248 -135 -33 262 153 448 682 641 331 191 753 294 495 -23 110 -241 -107 347 -163 325 670
5455 670 -156 -548 8 704 -328 187 61 325 495 1019 -972 -305 135 75 916 -491 182 -77 -601
5474 -601 685 -144 45 125 597 -68 211 344 243 573 174 491 324 -295 357 210 -382 -284 -1092 -979
5494 -979 383 -130 -202 111 -525 -1101 -607 122 24 -1016 -52 -543 -1080 -58 -45 -1319 636 115 404
5513 404 -604 849 -677 -618 -161 26 87 878 -246 819 -15 -417 283 -815 259 -469 -275 93
5531 93 567 -160 607 -440 -2 -86 260 156 523 604 -270 0 -556 145 -854 70 -65 -274 262 377 446
5552D46k84j172N68O78J69l04l3p63J451n24j71n60l1r1Q0q76J931K3r40J056
5572F53R15j594j412Q04J915j267n28J134j897K015n96O59j316J056p06m51J9
5589e97Q10N79j130J71P90p54L21j243Q35K40k27k27J170o94J170j025r9N93q47
5608a64K11r1j20J191j499Q37o51J050r54j02O24k76k23lJ08k45L85p17M43p5
5628b71R71q52L21N85j050l41L38N61J5k24P11m67N45P5r25m59P5K34O65p10K97
5649I4l74R02m42l84J260q27J45p27K27M29n57n43O9J334l00j72M15k43J9o60
5669c35Q3L63L11q54O79j009N83M10L74q22NN83j220J289m85R7p87J039l32j00
5689a28j41j38O77r77N63J58n60j11O8J158m25L64m00M78o11N37R24j442P97p82
$$ plain form
5552 446 162 -1010 -442 236 405 101 68 -695 756 232 61 -499 -530 -621 -541 -1417 514 537 -403 653
5572 653 1568 -26 -1438 -634 1281 14 -514 620 -1277 738 142 801 -515 541 -165 -616 -597
5589 -597 213 792 -338 -167 623 -131 190 -1053 -218 22 -205 -432 738 44 1214 189 90 683 -164
5608 -164 47 -44 -164 1027 -472 365 -286 764 -190 -292 332 56 -167 -170 -62 -307 78 -639 -196 -271
5628 -271 700 -152 169 754 -296 -637 -299 262 277 53 764 297 842 917 -8 -467 -392 -158 507 -203 94
5649 94 -280 622 180 -204 1056 229 374 -353 -126 303 -254 -797 -728 606 306 134 549 306 325 -335
5669 -335 -252 111 422 -432 247 -762 -179 231 605 -217 -212 371 -849 440 -45 52 -735 304 -28 -128
5689 -128 -269 -407 270 -707 -144 14 -546 -657 -589 569 144 508 108 586 -25 512 1436 -6 791 9
5709Io34j52J136r60k84J088l65P10j317K262q62p61K47p02N80K64k1r32R24N59
5729G89j81j688J580q34j63R45l75m05l50J673j251r6k32Q52Q90j030n85J958
5747A497j204j088Q78j504J705j062N79J7R4P2p1Q48j167M63j185K151j144N20
5765C99j07Q2o02n60J805j026j303K054j475N32m09J336j001o46O68m03R42o45
5783c59R70p39q88J911j085J35q21J189K9j31R48o67o23q9l7K16l55J374k41l20
5803D17q23J69R72j548J134p29J42n0O70j02m04r79P42P12N15m66M68r96L51j7
5823A78o13R80q62k25J355l96n06k65J155p56k38J462j212M65j075P99k50m07
5841d11P77r04R65q77r12J449O39p21N70l70l71o25R43j281Q71M59n67J14M87
$$ plain form
5709 9 -625 -777 359 -601 -885 203 -162 548 -769 1493 631 -130 117 -585 -5 259 238 -694 230 789
5729 789 608 -1080 500 -334 -497 448 73 -332 -682 991 -260 -356 -588 264 1154 124 -461 1497
5747 1497 293 -795 83 -1421 284 -778 -199 -182 -88 -16 -87 761 -406 57 -1128 1023 -121 399
5765 399 292 374 -228 -788 1017 -9 -1312 742 -733 -201 -610 726 -275 -921 -253 -656 286 -359
5783 -359 611 -128 -1016 895 -190 -55 -876 313 342 211 1159 492 -131 -220 -257 -41 -396 978 737 417
5803 417 -406 -237 735 -813 321 -408 -266 -316 354 252 -152 -1131 -389 323 838 372 840 -156 195 178
5823 178 -435 545 -317 -542 813 417 -89 -354 801 45 -193 1269 57 522 -553 246 -4 -411
5841 -411 366 -538 427 -450 -1362 87 726 5 575 205 -166 -791 152 -1129 -258 201 -366 -252 235
5860B35l15M3j118O01M68J85l51J033q04o38L57m4O47K3l12ll33j72P95l58Q03
5881G42o00o59J62M34j82k59J087j382P88q27Q45J047l4j551O96M14j707J587
5899F01r88R52p04K85j46J133q65L38j309J523o98m12R71j570R32M34N30o00j134
5918g27R45r12l40R20j77L91J54M39r14Q25p10M15j03J111k279J263q20M52j06
5937a73m41k1Q47m01P14n40L07r25N95O61j089J016j400K82r8O81P8n00M64r18
5957h61M64m23J003n85K46K96m36P68m1j8l73n10L05R33m72j300Q71m91L56K13
5977e5n15L34J088n25J22j426P26N1k16J155m68q7o64q4J200k28J34j288J842
5996A096r07L97Q84j593l95M00Q97j284L52M18o33L13M7R99n48N99j647J55L17
$$ plain form
5860 235 -80 -37 -1155 -554 -86 99 -252 781 -23 -661 -304 -348 299 322 10 7 -326 -498 297 -61 742
5881 742 142 -517 -355 79 -103 -362 725 -657 131 -696 149 1196 1162 -389 307 721 -986 601
5899 601 -387 565 -139 146 0 1133 268 606 -703 820 122 -290 681 -889 43 477 1007 407 -727
5918 -727 218 -694 -1034 -114 -291 100 254 693 -221 604 -106 309 206 1317 -962 301 -519 -67 -173
5937 -173 -614 -635 212 -189 525 -15 292 -633 -38 623 -466 550 -850 -568 -666 15 93 -407 57 -861
5957 -861 -397 -820 183 -402 -156 140 -296 472 431 413 40 -470 -165 768 296 -1004 -133 -624 -268 -55
5977 -55 -570 -236 852 327 449 -977 -251 -200 -416 739 271 184 -480 -564 636 408 542 -746 1096
5996 1096 189 586 1470 -123 -518 -118 779 -505 -153 265 -368 -55 -8 991 443 1042 -605 -450 -133
6015a33j04j10m5J093m12j09J5r7N72j587R22R81o15N09j481K65P42L43j440J047
6035C56j116P42K94M47k22o45l17J38P77L50j684Q15o7P62o48q6K40n57L57O72
6055F08m33l46M29O86r23n12P92j29J4k59r80M86Q47l4l75p3O09l98k60M33J53
6076C35n70J207j78j140k13L09j38P59J00r75P33K83p64J88p44Q02k54q41J148
6095D7O73j249q95R94k17J447k97o54J19j7ol6J702j953J147j841J297n34R5Q35
6115F57N69j818N12r77P97P5R5K22q2O77o93K2p21j15P30Q60L49j412L74L0P20
6136H71j15n73o00n39P28m47K57P59J85j373O78q48P81k88J15M92l8p22J089n78
6156a66o3l1N95J124j935K17m63J683j554J599j072L59n98M10n2q51P05J19P58
$$ plain form
6015 -133 -237 -347 -392 701 289 180 195 98 670 -917 5 986 371 880 -601 -336 406 749 -691 356
6035 356 -760 -18 276 723 501 -144 -461 -323 454 804 -880 -65 -132 630 -18 -104 136 -421 -64 608
6055 608 175 -171 258 944 21 -491 301 172 186 -73 -1053 -567 280 246 -129 -202 407 9 -251 182 335
6076 335 -235 972 794 -346 -559 -250 -388 371 471 -504 229 512 -252 -64 -808 -6 -260 -1101 47
6095 47 720 -529 -1424 -430 -647 800 503 -151 -32 -49 -55 -91 1611 -342 805 -1036 261 -273 -178 657
6115 657 1226 -592 -80 -1057 -260 -185 -90 132 50 727 34 56 -665 -780 -50 810 1159 -253 121 151 871
6136 871 756 183 -417 -956 -228 -675 -418 341 526 -847 -169 -1017 -236 -524 -409 83 45 -677 412 -166
6156 -166 -229 -260 335 1459 -476 -259 -722 961 -593 1006 -66 293 -305 105 53 -798 -93 26 784
6175G84O47k242J372p74j36L65J41J41k03j179R42k49m00J513r18O86j198K1J154
6194D67l76K81J27M16j030l69N13l40L79j51j098P37J331j574J040o89L8M79J23
6213C04l88L25n77Q53j415P23M4n33Q49n42qJ046j595l09J270N7l81M75P01r28
6233b9n90J103m64r56M87O07N12L25r62m68M42p14J688p02M55j218o69J473k72
6252D8P26j496R19N09m37o89L60J59p13L94K89j509J016J627j970J880j130J131
6270A114j602J752j129J97J26j192O95L92k32p13J262r07J61O15l69o7k32k21
6288c50O24q06J192O5m13k36o26O86Q76o02l28m66M91K50q51l06N31o8JK23N76
6309D63l13m52n80L74M85K57n44N54m51J516k227L63L10L51k71K76j50k52K89
$$ plain form
6175 784 1431 -811 561 -213 -349 16 157 298 95 -1084 -142 -391 -791 722 -196 490 -708 -687 467
6194 467 91 372 499 915 -115 -484 29 -311 68 -83 -1181 -444 887 -687 353 -336 -298 181 304
6213 304 -84 241 -336 517 -898 -175 -131 -664 185 -357 -365 681 -914 -1223 47 104 -277 198 899 -29
6233 -29 -619 484 20 -936 -449 158 670 995 33 -435 7 -707 981 279 734 -484 -1153 320 48
6252 48 774 -722 197 706 269 -420 -60 99 -614 -220 69 -1440 -424 1203 -767 1113 -17 1114
6270 1114 -488 1264 135 332 458 -734 -39 353 121 -592 670 -237 -76 539 170 103 -129 -350
6288 -350 274 -532 660 725 312 76 -550 136 1012 410 82 -384 107 357 -494 -800 -269 -337 -336 -113 463
6309 463 150 -302 -882 -508 -23 234 -310 244 -207 1309 -918 -555 -245 106 -165 111 -39 -291 -2
6328bl45J87q23K97L93L86p55J151l99q14M29n5J81Q63j201k19N39j13L00o90
6348f90N84n88Q39n22Q53o10m72N46K80q75M23Q94j160J203j095J62J271l11j061
6367c29O15qL01J21j37o66J569j057o33M76n55L52q0L8J62j94n88J495j95p41
6387e4m75J008M9o38j74K60m78K61K52K13p87K37P65j68n39k44K38o73R70j62
6407a39O91n03J47r36J604j733Q87L00o80P21R5j235N12L67L21l7r23O19N41j372
6427g53Q59O5l66m27R06j15r41M59N30P26m18o76R90j98k51N14j024p31J633n67
6447B15M02o61j87M97o90o03N34J270m38k171J606p46j44J118m44Q68o02l69J217
6466F72j055m70N45Q88j98q51r4J295j56j110J57R87j502N44P52n92r33L04J344
$$ plain form
6328 -2 -347 -160 -983 -686 -293 93 -662 489 90 -724 -295 -350 -169 694 -507 -726 -187 -300 0 -690
6348 -690 -106 -694 145 -377 476 -134 -606 -60 220 -655 -232 662 -498 705 -390 -228 1043 732 -329
6367 -329 286 278 579 700 563 -103 1466 409 -224 252 -303 49 -31 7 169 -25 -613 882 687 -54
6387 -54 -529 479 528 -110 -284 -24 -502 -241 11 224 -563 -326 439 271 -268 -512 -274 -947 23 -139
6407 -139 552 49 196 -740 864 -869 18 318 -362 359 454 -781 -269 98 419 382 -541 78 619 -753
6427 -753 106 171 -195 -622 284 169 -772 -313 217 943 525 -151 839 641 390 904 -120 -851 782 215
6447 215 617 -44 -231 266 -424 -1027 -493 777 339 -1832 -226 -972 -1116 2 -442 426 -176 -545 672
6466 672 -383 -853 -308 580 382 -469 -563 732 576 -534 -377 610 -892 -348 404 -188 -1121 -817 527
6485E27o13L88j56l15K49m50k63J546n09L15m00p32R38q00q2P1M2P92J14j547
6505h85J123K99Q90j380r5P30j120N57j91M00k6qn69R26j191K35o55J217k36l80
6525c59m86J056o38M98m24p60P78L78Q07J5j086p1K72n01l46P89n7N77L14j75
6545E81M08j050N75n38M68j582J646L38m47r22P04n52Q96q37M76K99p46L44l00
6564b39l10J002m23J56J562j834n6K38J009j590O27n01J18j221K290j189n05J0
6582h56J367k2N34j120o85J323q13P44n70J6K71j027N55J095n84m78Q04q8l53
6601A13m2m06J219m73n91p52J189j81j013J219l88k64R57j197n3R21n72P74p72
6620c12K10m9p0k80J61J493q79L69p66O7J22J40n61O18k96P03j55qj720J347n93
$$ plain form
6485 527 -86 302 146 -169 80 -370 -633 913 404 719 319 -413 525 -275 -357 -286 -244 548 662 -885
6505 -885 238 537 1427 47 -48 682 -438 119 -72 328 302 294 -275 651 -540 -305 -960 257 21 -359
6525 -359 -845 211 -427 71 -353 -1113 -335 43 850 865 -221 -292 -20 -521 -867 -78 -135 442 756 581
6545 581 989 -61 514 -24 444 -1138 508 846 399 -523 181 -371 525 -312 164 463 -283 61 -239
6564 -239 -549 453 30 186 1748 -86 -142 96 1105 -485 142 -359 -241 -1462 828 -361 -866 -856
6582 -856 511 489 1023 -97 -782 541 -272 472 -98 -82 189 -838 -283 812 228 -250 554 466 113
6601 113 71 -335 884 411 -180 -932 257 76 -937 282 -106 -370 587 -610 -663 258 -314 460 -312
6620 -312 -102 -151 -221 -501 -340 1153 274 643 -123 -56 66 206 -355 263 -33 670 515 507 -1213 134 -459
6641d59J503p07K5j364P43K87J13l85k79P20J98M90j927Q48M09J56n38Q6J26n20
6661d75N37P6J21o53Q46j100J712j035N8l95J19m73q1N40R60m19q62J383q23k22
6681a86J07j021J375j88m85m63M75M05J03M32n9j037M50J9K57m42j43J92k8n13
6701g50J029K45n63Ml51P08j09j195J191k31l6m47l75N81R59l87l03M37p87J85
6721a95L27K34m1N97r56M35n58P68j190N75P43Q51j630N09l53K90n04J2M01l00
6741A5j3k8j95M23m34J1m9K81K9o80Q56q23L37J60R40n39j578J322Q50q71n02
6762d88J82O02K32j131K40m14P75p34J433r40mMN29o63P48k30k72L24L87q7K58
6783G51L8k17l66l40o35J153k32L09M50j234j67l66Q45K60l0P4J23o17J204j869
$$ plain form
6641 -459 1044 337 362 -1002 -259 28 141 -244 -523 197 395 885 -1042 -194 215 371 -167 -81 45 -475
6661 -475 62 138 259 -394 452 -648 1064 29 87 -308 -189 -662 -743 -203 757 338 -524 859 36 -186
6681 -186 -79 -1100 275 87 -398 -861 -386 19 122 554 495 -542 -92 -73 184 -258 -401 -209 -237 -750
6701 -750 279 524 -39 -35 -386 322 213 -982 209 -22 -58 -505 -880 -299 660 273 -30 407 -380 -195
6721 -195 132 366 325 922 -34 401 -157 611 -579 -4 739 1590 -40 469 116 406 -98 -86 315 15
6741 15 2 -26 -221 202 -232 -221 -270 11 40 -640 216 -607 -270 -110 830 291 -1287 35 885 14 -488
6762 -488 -306 296 528 -603 -363 -777 -2 -736 697 -243 -247 -243 286 -377 371 141 -131 193 580 493 751
6783 751 789 572 206 -134 -769 384 152 461 911 -323 -490 -856 -11 249 219 293 416 -201 1003 -866
6803h66N87k61J13J47n60R58l63k25k16P98l09J14J32l20K21M5N67k20J389j570
6823A61j574K113p85q36P68P34r92J83J002l56j547J275j063L75o28Q4O29P09
6841B52j03p64j9L71R54m67j056N17J9j32R38l91J89l31J48m79O6q2J21K00j20
6862a69J0o70P73l9n71P1p87J434l39qK32j24j37L02K2N3j54n81O09l82J317j764
6884i02J312m46Q29j67L41r37P44j193M63j11K83J7l96k41N05P57j343J0M45N38
6904E08j163O94J72N35j543O55J044p11J78m55o4J141r26K71M06m71r29l61J258
6923B39K47k76l82L11K75k14k56K20Q95p04M87j160n36Q61O3p23Q67K61k52j368
6943a145J453p5L60l56j24K6J48J10M71r94K04O27k43M35r98m70j73R16m94J82
$$ plain form
6803 -866 -279 -540 -427 -280 -840 118 -245 -470 -686 112 -197 -83 49 -271 -50 -5 562 342 1731 161
6823 161 -1413 700 -85 -921 -153 581 -411 -228 774 418 -1129 146 -917 -542 -1170 -1086 -457 252
6841 252 149 -615 -634 -263 691 224 -832 -315 -296 -428 510 119 308 -23 125 -354 -288 -370 -249 -49 -169
6862 -169 -159 -829 -56 -95 -666 -595 -1382 52 -287 -295 -63 -187 -324 -22 0 53 -101 -682 -73 -455 862 -902
6884 -902 410 -36 793 626 967 30 774 -419 44 -67 216 233 -163 -404 101 858 -485 -475 -30 508
6904 508 -655 39 211 746 -797 -142 902 191 369 -86 -150 991 65 336 742 271 -658 -1019 239
6923 239 486 210 -172 139 414 200 -56 164 1059 355 842 -318 -854 7 70 -653 214 475 223 -1145
6943 -1145 308 233 593 237 113 139 287 397 868 -126 78 705 462 897 -101 -571 -744 172 -322 -140
6963a40Q34p54l48m43M84j8l94j7O35j6Nj51q97R47J95j88L80j05O70j045J178
6984H12m18o13l19m85J641m93P34m50j297M67P05q05R5L89m09J319j246R69j030
7003d34M22m18n75J237P3k26N04j13k17q57J039j86m52K7q31L84L92M95j305J217
7023A76p8O15r22N92N65o74Q00n64l55M30m67n60j75J180o01j200J019R6k38N80
7043B19q1q61J738m97j703J463R49k064J086J28j188J70L96J032l14r71M3N66
7061A11j005L49J32P63j298J387p0l06L37j060J024p18J684j120o22J07K96M60
7079D51J64r04K5R6n18m02P06J47m20R13j783K000n86Q96j703K032q32K49m92
7098C9o36m2R34n50L73J47p00P88K42l22j73J033j580J21P64p7o62J076j857R80
$$ plain form
6963 -140 694 -60 -408 -851 -367 -385 -779 -796 -161 -177 -172 -323 -1220 -273 -78 -266 114 9 679 -366 812
6984 812 394 -219 -538 -1023 618 125 859 409 -888 -421 284 -521 -426 -37 -446 873 -373 596 -434
7003 -434 -12 -430 -1005 232 305 79 583 470 253 -604 435 249 -203 -176 -1007 -623 -231 264 -1041 176
7023 176 98 713 -209 383 948 274 1074 510 155 585 118 -442 -617 563 -38 -1238 -219 -123 -361 219
7043 219 138 -723 1015 518 -1185 278 1227 -837 249 377 -811 -641 -245 787 473 -498 -455 111
7061 111 -894 -545 -413 350 -948 439 369 63 400 -660 364 -354 1330 210 -412 -305 -9 451
7079 451 615 -289 -264 -168 -686 -1088 -382 -235 -655 258 -1525 475 -111 785 -918 1114 282 531 39
7098 39 -597 -639 295 -255 118 265 -435 353 595 273 100 1133 -447 -326 438 361 -301 775 -1082 -102
7118a02Lo4J092o14n99L85N13r77j66P85j313N90m09P04M88L3j03j03l17k30K65
7139a39L39q0n03J81k43l59J741j016K83n66Q43j017N22j012J908k54j315O45
7157d2M39r5lL13n32K93l89n5N71o98N90l67K34o61P69P65j319N2n38P69L66j045
7179e83K84p12J070N39K08j555Q83m18J78J854j739m50j92O08K54r76L80N1J391
7198A075l03r43j0K65J21o97R81J12j765P81Q15p75N68l18M13m26O61r28K13l63
7218e23R82r46q4L29n0J274o3j327M22Q19n94n76p90K005q58l92J116j364L68
7237b52L59k00m03O94k11L1n33J006r2o31n6M93K19j202J29J112K95q2m97Q09
7257I88j105l77R90j028L70j42ol8m96O54J892j729l08N50o15J33N71J13j178
$$ plain form
7118 -102 -99 -163 929 315 -284 101 614 -363 -529 256 -1057 -467 -876 -172 316 349 246 143 -174 -404 -139
7139 -139 200 120 -383 -202 -445 -804 937 -79 204 -362 481 -536 -14 -1026 882 628 -687 -42
7157 -42 397 302 299 612 80 373 -16 -71 500 -198 392 25 259 -402 367 1132 -187 -135 -673 96 462 -583
7179 -583 -299 -1011 59 598 806 -749 134 -284 -106 1748 9 -441 -633 -25 229 -747 -367 -316 1075
7198 1075 772 -171 -181 84 205 -492 489 601 -1164 -383 432 -343 225 -93 320 -106 555 -373 -160 -523
7218 -523 459 -487 -571 -242 -292 982 919 -408 14 833 239 -337 -1127 878 20 -372 744 -620 -252
7237 -252 107 -93 -496 198 -13 18 -515 491 399 -232 -288 205 424 -778 -649 463 758 676 179 988
7257 988 -117 -494 496 -532 -162 -304 -310 -348 -844 -190 1702 -27 -335 215 -400 -267 304 417 -761
7276g61R47o86O49K42q97k48J06O88P33j093P6J23l65N07O13r78O8o27M11K80
7296b12p46J422r16o85K319j766N00M98q68K19K80l39l2K69K99o05N05R96j799
7315f61J519o87m78K47P3l21Q74q28N28r52K31m5J15P38r41J595n54p87J73J21
7335d0L8l97J35J62k70O95k73L27j205J218J24o38K46K32l07p0k11n62J370o48
7355g4R83j509R21m92M4J97o84M52K12j106M58J222k119J671L55p23K18o00R15
7374C41l09L96k89k82r57P51L82R25j064J86n97J353k227J358o17N94M72J83o30
7393c1J61J19m95K18J99N26j525K030n97m53J538k583N67N52j21l84J36q89J352
7412C20p12N64j71q81K46j34J84O71p41k63J376k36k9k95l62j64M95N05N72j373
$$ plain form
7276 -761 186 -500 149 391 -506 -754 -648 40 773 -320 -244 -121 -486 21 634 -344 -276 -903 -492 -212
7296 -212 -958 464 -452 -1137 1182 -584 -84 414 -454 -235 45 -294 -326 -57 242 -363 142 1138 -661
7315 -661 858 171 -307 -60 13 -308 566 -262 266 -686 -455 -500 -385 353 -588 1007 453 -334 -161 -40
7335 -40 -2 -399 -264 -102 -372 323 50 377 -828 390 514 -124 122 354 47 -23 -234 -796 574 -74
7355 -74 909 -600 321 -171 -127 70 -614 -162 50 -1056 -598 624 -1495 176 531 -192 26 -574 341
7374 341 32 428 139 -143 -1100 -349 33 958 -106 80 -517 836 -1391 -33 -650 -56 416 599 -31
7393 -31 130 249 -246 -28 171 697 -828 1202 605 152 1690 -893 -326 226 105 -279 -143 -1032 320
7412 320 -392 172 1 -880 -634 -768 -584 87 -654 -917 459 223 194 -101 -463 -627 -132 373 945 -428
7432d28l61P46O14m05k24Q29j823Q79l11J58l48J180l62m57R33j007J281q11N07
7451E90l21Q67j092r1p31P30O55j66q21P07k10p19J299j070R99n49j146J659j93
7470C97j403J440q64L03J66k13Q58K62j817J009n65k62J239j204P98l08M98l16
7488A8P67j323J25O51k86j05l0l63R94n40N57n24K08Qn90J207q46K00K48q50k95
7509g69O69m50M96l36Q15p74o80K234r08K67o18p00Q76K39O46k90K38o66j096
7528h07J335k86m84Q19k58j4J68r63J658o96k4q98k63R95r00J494r9j615r7J389
7548D54n1Q0o19p6J115l26o51Q39O16j029o79Q56q4q3K22l68j51R18o32J16n7
7569D10l41m79N21K09j138J04j59J20J26M56N68m15j558J772r88O82m56j51j47
$$ plain form
7432 -428 -789 -43 571 166 -58 771 -1052 -173 -484 -326 -674 506 144 -313 620 -387 894 83 590
7451 590 269 1136 44 -47 -778 -48 607 441 -380 327 117 -602 697 -373 626 77 -1069 590 397
7470 397 -1006 434 -430 -127 39 -174 684 946 -871 138 -427 -689 550 -654 144 -164 334 18
7488 18 785 -538 -413 238 -48 -153 -183 -546 448 -92 465 -59 149 157 -433 774 -72 128 376 -474 -769
7509 -769 -100 -550 -54 -390 425 -349 -1029 1205 297 564 -54 -754 122 361 1007 717 955 289 -807
7528 -807 528 242 -242 577 319 305 473 -490 1168 472 448 -450 -713 282 -618 876 777 -838 -935 454
7548 454 403 483 -136 -212 903 577 -74 765 1381 352 -327 529 445 362 584 216 65 983 351 467 410
7569 410 69 -410 111 320 -818 -714 -873 -753 -627 -171 397 -18 -1576 196 -792 -110 -566 -717 -864
7588h64J0P23M37j56m51K99p36O02M07J63m07kJ45l86j04j07J588k001L84O91
7608B35L55K65j212R64j219J233p57Qk34k21J410l28M81l95m38n23q24J934j310
7627e76K22O96K5n94J27J35j384J483n66M70m27M36Q66m97L21p09O98l91R85j013
7647C07m90N27K31Qo25L54Q07j678J196j233J039m33J010k40n89n39R89r15J017
7666G43j084m10P20O15j217R1k17M80O88l61N85p25J66o58J331q49j045N63N02
7685h2k51J136j821J246j95l82m13L65L45N99j81J143j951J117rq66Q8Q1k78M38
7705A29M69n84o13L22R54o77m79R36k45M83j368k99R79n86r5J45J682j161MJ32
7725A28L95p67J229r24j74N30k91j350J821p53Q82l7j199Q30m22O67k106P84R92
$$ plain form
7588 -864 -854 -131 306 150 -301 -2 -738 -136 271 434 27 25 170 -216 -320 -427 1161 -840 -456 235
7608 235 590 855 -357 607 -612 621 -136 -128 -362 -583 827 499 980 585 147 -376 -1200 734 -576
7627 -576 -354 342 367 -227 -100 35 -1349 134 -432 38 -389 47 913 416 737 28 726 335 1320 307
7647 307 -183 344 575 583 -42 312 1119 -559 637 -596 443 10 1020 780 191 -348 641 -274 743
7666 743 -341 -751 -31 584 -633 -542 -759 -279 409 48 633 -92 74 -584 747 -102 -1147 -584 -82
7685 -82 -333 803 -1018 228 33 -349 -762 -397 -52 547 366 1509 -442 675 666 -200 -112 -31 -309 129
7705 129 598 14 -599 -277 677 0 -479 457 212 695 -673 -972 7 -579 -674 -529 1153 -8 -4 128
7725 128 523 -244 985 61 -113 417 126 -1224 597 -156 726 689 -510 320 -102 565 -1541 -757 235
7744B35j27j068M37O7M45k02J3J62j51O83l06k07Lj43N44n55O40j042M18o3Q15
7765E98M47j664J348J63p51r86J057kk33j76r8r4N86j025J137K00j489R24k40
7784b98N79l71l62L83k56k83J259r51J91j83n48P56J67L07l76l09L50n64mK13
7804c00K84J05N3M69n61qr7j08o75M11R70j123N89R77j926L25m29Q05M78j153
7824i14P57l99n41O10J304p81k13O37j02m04Q6Q08l48o07M29J86j07J40j102m29
7844i90J268j426N11M51R65j47j251Q81j29J27k33K32L67n1o46K29M21j242M18
7863b45N13m65n2R84p8r59J43J09M22m12qo10L07k24L56M8R8k12J230j94r69O11
7885C93N65o40p11q14J76R32M26p01J019j13J84j152P98oj17o58R85j006L95Q36
$$ plain form
7744 235 108 -960 -523 -456 -11 -213 -200 -38 -189 494 188 -19 -16 -159 385 -170 470 -572 -154 -217 598
7765 598 1045 -619 729 892 141 -845 212 210 -23 -199 -297 -391 195 -830 307 507 -982 -58 -298
7784 -298 281 -90 -452 -69 -325 -608 651 -300 -109 -292 -840 -84 83 390 14 -295 55 -509 -513 -300
7804 -300 -16 89 142 611 50 42 -55 -163 -838 -427 543 -580 9 986 -940 -615 -1044 -239 239 -914
7824 -914 -157 -556 -1097 -487 817 36 -177 460 358 -46 40 848 500 -107 322 508 401 541 -561 -990
7844 -990 278 -1148 -637 -186 779 632 -619 262 133 260 27 259 626 575 -71 158 579 -663 -245
7863 -245 268 -197 -249 735 657 -302 -159 -50 372 -40 -48 -658 -351 -575 -219 -171 -73 -285 945 751 -218 393
7885 393 958 318 -393 -1207 -1031 -99 327 -374 645 532 716 -436 362 356 239 -419 566 -440 -45 791
7905G91r01l33J841j793J80P46q4j40n84k24M21M85J04l97j94J32J225o19m85
7924A71P82p18m30K03P39o06r00J557n04p28R9L87l9J23o55J065q52J66O04r08
7944d44k6P25J9k66l82J059l32O82j392J006j557J010m0j99R83r25K12K58j42
7963B49m27M92J38j93k95P87j478K90R42m06N54m21r88R58l08K70n18O36j056
7982g74J34J477r30L50O2L18j247J780k066J45P74j89J464j129O33j676J149r53
8000f78K90M79l87N04j20r01R99R58j063n03r0o19J215m59J21L64P43o59O51M12
8020A257r11r64J556j144O86j242Q35n6j06O47j245N89m63j78O79N43o65O12m73
8039d3M64l07O0q2k12j68J038m08J06k97k72l08N44P1m96O63k65k34k23O24n86
$$ plain form
7905 791 -110 -443 1398 -395 -215 531 447 307 -277 -501 -80 405 509 112 -82 50 1275 656 171
7924 171 953 235 -195 8 747 141 -759 798 294 -434 -335 52 13 136 -519 546 -306 -140 464 -444
7944 -444 -470 255 274 8 -374 685 353 1035 -357 649 -908 102 62 -137 846 -79 133 391 249
7963 249 -178 314 452 259 -36 751 -727 -437 505 99 653 232 -756 202 -106 164 -354 282 -774
7982 -774 -640 837 -93 257 319 637 -610 1170 -896 -751 23 -166 1298 169 802 -874 275 -678
8000 -678 -388 91 -296 208 88 -813 186 1144 81 -422 -512 -1131 84 -375 -254 110 853 194 845 1257
8020 1257 346 -618 938 -206 480 -762 73 17 -89 558 -687 -98 -561 -739 -60 483 -182 430 -43
8039 -43 421 114 174 92 -120 -288 750 342 448 151 -121 -429 115 186 -310 353 88 -146 -369 255 -331
8060c31j20N34K2o79N87j72P51m35l46m58L64P04J308j908L07m51J27M78j376
8079a094J339o25R03q33O6K37l3P68l05j09P2L22j5q71n4P57Q16j681J50Q56p04
8100c8l80K35l76K60j78P88j62J198k254Q61M87q09O70m49J41j1p73L29O74J41
8120C54j177K3J101K1J41K3j312O97j47Q34j359J249J1L09j260R2n08j196K597
8139D93%o60Q0L66k80J8L34l48M26l49m62L73p11P21mJ01p48J138N14q04L94r67
8161c75J99k99O84L94m13n93K90J430j541Q52j93L03j83J70j134R68m55n40M60
8180B4JJ22p62J103j050l12J131l67N43m25j532
8191a524
$$ plain form
8060 -331 -451 83 105 -574 13 -159 592 157 -189 -647 -283 421 1729 -179 128 -323 -196 282 -1094
8079 -1094 245 -380 523 -310 -244 -7 -40 728 423 314 386 708 693 -178 -232 525 1341 -340 -190 666 -38
8100 -38 -418 -183 -559 -299 -477 311 149 1347 -907 -46 441 -368 302 -147 -6 -17 -790 -461 213 354
8120 354 -823 -800 301 322 463 486 -826 -129 -276 558 -801 448 459 768 -492 -400 -908 -2104 493
8139 493 493 -167 -87 279 -1 17 351 3 429 80 -382 -9 -720 1 -3 98 -650 488 1002 198 592 -375
8161 -375 -176 -475 209 603 190 -403 -113 1317 -224 628 435 738 555 725 -409 559 104 -436 24
8180 24 25 147 -615 488 -562 -874 257 -110 433 8 -1524
8191 -1524
$$ Imaginary data points
##PAGE= N=2
##DATA TABLE= (X++(I..I)), XYDATA
0@OoK7l4N4p6R9j20J54j86K20k68L17l70M34n16N96o83P77q89J011j153J305j481
24g82J668j873K095k354K635k949L297l696M149m671N265n956O780p788R033j0629
40e776J2769j5803K0506k8917M9496k77543r2253M7778m1915J3364k5003Q113
52c35184j4837P889p378J1425K027J4004O994J9443J3380K2586J6733K5481K0422
65a97015K5248K4328K6662K4795K5203K3782K5121K1917K2507K1432J8036J6931
77G8947J6406J2763J1764Q530O658L851K576M74j595l683o848q201q275j0249
91A03118j0122j3425j4193j4260j4200j4279j4101j4785j3734j2225j3032j1612
103e6850j0366q897p624o117n969k620k382k25N64L372L260N352O536P295P429
$$ plain form
0 0 6 0 27 -7 47 -29 70 -50 104 -82 138 -130 187 -183 251 -265 331 -352 425 -464 547 -606 699 -782
24 -782 886 -987 1108 -1246 1389 -1560 1737 -1959 2190 -2481 2784 -3172 3608 -4180 4853 -5776
40 -5776 6993 -8810 11696 -17221 32275 -245268 -337521 -289743 -331658 -318294 -343297 -335184
52 -335184 -350021 -342132 -349510 -338085 -336058 -322054 -315060 -295617 -282237 -259651 -242918 -217437 -197015
65 -197015 -171767 -147439 -120777 -95982 -70779 -46997 -21876 41 22548 43980 62016 78947
77 78947 95353 108116 119880 128410 135068 138919 141495 141969 140374 136691 129843 121642 113367 103118
91 103118 92996 79571 65378 51118 36918 22639 8538 -6247 -19981 -32206 -45238 -56850
103 -56850 -67216 -76113 -83737 -89854 -95823 -98443 -100825 -101050 -100486 -97114 -93854 -88502 -81966 -74671 -67242
118f7242R050J0242J0058J0937J0501R603J0871J2360Q906R453Q772P748P956
131E9215M857M094M031K334J693J19q48k921k902m175o706n651q152p621r768
146B7599p713j0593r144r930j0563r276r598r306r200p585p948o787m312n433
160h9789l740j580l113p68J339J366O86M238L464M026O975O584O848P303P658
175d8503Q212Q039Q085P896P915Q237P104P564O108N041O778L915L885L261K588
190D6125Q72O71K18m85j747k725k355l473m804m312m201m203o338m710l823p043
206b333n265n496l732m239l668m544k412l789j483o78j857J76J98J61J965J495
222c5501J968L187L282K825M184L667N225L926L242L669N373L138L513L393K625
$$ plain form
118 -67242 -58192 -47950 -37892 -26955 -16454 -6851 4020 16380 25286 34739 43511 51259 59215
131 59215 64072 68166 72197 74531 76224 76343 75495 72574 69672 65497 58791 53140 44988 37367 27599
146 27599 19886 9293 149 -9781 -20344 -29620 -39218 -48524 -57724 -65309 -73257 -80044 -84356 -89789
160 -89789 -93529 -95109 -98222 -98990 -97651 -96285 -95599 -91361 -87897 -83871 -76896 -70312 -63464 -56161 -48503
175 -48503 -40291 -32252 -24167 -16271 -8356 -119 6985 14549 20657 25698 32476 36391 40276 43537 46125
190 46125 46997 47668 47886 47401 45654 42929 40574 37101 32297 27985 23784 19581 13243 8533 4710 -2333
206 -2333 -7598 -13094 -16826 -21065 -24733 -29277 -31689 -35478 -36961 -37639 -39496 -39320 -39122 -38961 -36996 -35501
222 -35501 -33533 -30346 -27064 -24239 -20055 -16388 -11163 -7237 -3995 -326 5047 8185 11698 15091 17716
237A7716L298K892J282J365J08o9j23O4j150l009j513r64m778j991l989k899n294
254I46l985l483m518k682n075k628m505k347l791l715k125j462j228r20j375K92
270d2601M57m1J892J197K483K719K636L865J514M294L041K620N021M113L762L579
286E51K929L119L722K180M487O94J946J804P65J308K69J37m13n70j796o53k088
303A8391k376j779l443k541k015k783l876k828k768k593k800j781k596j777k570
318b0135k040p10j963m3j03l96j3K018J077N65P67K641K533K032K384K373L185
335e828K644L004K226K605L680K456J882J667K726K154P12J163M12K062k60J65
351B3470k288J077j726j223q84l566j086j840k268k396k889l855j706k332l626
$$ plain form
237 17716 21014 23906 25188 26553 26661 26592 26469 26533 25383 22374 20861 19897 15119 13128 9139 6240 946
254 946 -3039 -6522 -11040 -13722 -18797 -21425 -25930 -28277 -32068 -35783 -37908 -39370 -40598 -41518 -42893 -42601
270 -42601 -42144 -42185 -40293 -39096 -36613 -33894 -31258 -27393 -25879 -21585 -18544 -15924 -10903 -6790 -3028 551
286 551 3480 6599 10321 12501 16988 17682 19628 21432 22197 23505 23774 23911 23498 22928 21132 20479 18391
303 18391 16015 14236 10793 8252 6237 3454 -422 -3250 -6018 -8611 -11411 -13192 -15788 -17565 -20135
318 -20135 -22175 -22885 -24848 -24891 -24994 -25390 -25403 -23385 -22308 -21743 -20976 -18335 -15802 -13770 -11386 -9013 -5828
335 -5828 -3184 -180 2046 4651 8331 10787 12669 14336 17062 19216 19928 21091 21503 23565 23305 23470
351 23470 21182 22259 20533 19310 18426 14860 13774 11934 9666 7270 4381 526 -1180 -3512 -7138
366g138k307j783l466l007j494j366k459j54j460j384n46O0l90P89M49J003N90
383b4063J368K760J577O84K854K071J704L439J944K674K768J307K238K861J198
398G384K442K237P21J152Q23L93O12O30j391M28K45j581m94k359l69o71k144j261
416F797j578k359j831j693j741k002r46j641j670q05j778M22j978J25o95J397
432a1976m16l99O16K21R51K196m43K541M74J595J613K219J290P32K404J521J640
449F779J631Q66J285J005P40Q55M41K43J01N38o07j452J57n68p97j087k134j372
467F624j534q80k614j187k959j469p93k267k546n59j415j534p39j503p45R1q82
484a6911K02P5q08J013Q21P21K110L4P93J698J550J454K111J182J510J987K568
$$ plain form
366 -7138 -9445 -11228 -14694 -17701 -19195 -20561 -23020 -23174 -24634 -26018 -26564 -26504 -26894 -26105 -25656 -24653 -24063
383 -24063 -22695 -19935 -18358 -17674 -14820 -12749 -11045 -7606 -5662 -2988 -220 1087 3325 6186 7384
398 7384 9826 12063 12784 13936 14759 15152 15764 16394 15003 15431 15676 14095 13601 11242 10873 10202 8058 6797
416 6797 5219 2860 1029 -664 -2405 -4407 -5353 -6994 -8664 -9469 -11247 -10825 -12803 -12678 -13373 -11976
432 -11976 -12392 -12791 -12175 -11954 -11003 -8807 -9250 -6709 -6235 -4640 -3027 -808 482 1214 3618 5139 6779
449 6779 8410 9276 10561 11566 12306 13161 13602 13845 13946 14484 13877 12425 12582 12014 11217 10130 7996 6624
467 6624 5090 4210 1596 409 -2550 -4019 -4812 -7079 -9625 -10184 -11599 -13133 -13872 -15375 -16120 -16029 -16911
484 -16911 -16709 -16634 -17442 -16429 -15608 -14887 -12777 -12743 -11950 -10252 -8702 -7248 -5137 -3955 -2445 -458 2110
501B110K095J107J746J240J282J707P12J6J938l07L18K17JO22j598j74M3j862
519A1213q92j146k411l90j214k627j452j722k35l057j297j708n92j928j226j349
535a2033m0M99l026J645j160R21N36p99J758j4J058R85J681J624N20L344r36J729
553a708K869J145K015J818J487P51J263J823L80q60J532Q25J66j27M94j596j29
570A2148j035L66j316n49k472o0j467k926p68k125j957n24j521j607j204k233
586i250j030o57o01r59n83p68M32l84O90m21J418pJ197O15J016l18L587J650l87
605d760J857J785M81K340J602J703l09K102Q99Q56P58L07R25K303q73k48R96q94
623A1830j173q87j56j306Q4j386j094q69j936j640q24n66j577j976K96k516m84
$$ plain form
501 2110 4205 5312 7058 8298 9580 11287 11999 12015 13953 13646 13964 14181 14182 14804 13206 13032 13075 11213
519 11213 10321 9175 6764 6374 5160 2533 1081 -641 -876 -3933 -5230 -6938 -7530 -9458 -10684 -12033
535 -12033 -12073 -11574 -14600 -12955 -14115 -13194 -12658 -13457 -11699 -11713 -10655 -9670 -7989 -6365 -5845 -2501 -3437 -1708
553 -1708 1161 2306 4321 6139 7626 8377 9640 11463 11843 10983 12515 13340 13506 13379 13873 12277 12148
570 12148 11113 11479 10163 9614 7142 7082 5615 2689 1921 -204 -2161 -2685 -4206 -5813 -7017 -9250
586 -9250 -10280 -10937 -11538 -12497 -13080 -13848 -13416 -13800 -13110 -13531 -12113 -12120 -10923 -10308 -9292 -9610 -6023 -4373 -4760
605 -4760 -2903 -1118 -637 1703 3305 5008 4699 6801 7700 8556 9314 9621 10546 12849 11976 11728 12724 11830
623 11830 10657 9770 9614 8308 8392 7006 5912 5043 3107 1467 643 77 -1500 -3476 -3180 -5696 -6180
640f180j636j361o65k40L89j123K99Q66j057j51J542p99J785P81J101J157P76
657d516J484k58K768k34J664K011K54J458J396N50R16J522l30R44K02L76k99r2
675I816J38P16j864o12j232R88j943k001kj527j120j033j186j214o56k082n84
692e398o60p08j585J56q05m11j40r48Q76m49J448q19P30J88R44J195j62K102O80
711c766J771j41J099J596J109J280J670k53J235R65J613o80J900o28j28J14M59
728I215J73r06L80Pj715m25j226o0j111j365Q1j735j301l48q67o79j537q20j086
747e325j274M15j132n38l27n3q15J5J647k68L20j30J129n74K176J123J99J207
765b205R55k54K385J529j89K72K27J966J088P81j07J045J39k96J84R1j070J171
$$ plain form
640 -6180 -7816 -9177 -9842 -10082 -9693 -10816 -10517 -9651 -10708 -10859 -9317 -10116 -8331 -7550 -6449 -5292 -4516
657 -4516 -3032 -3290 -522 -756 908 2919 3173 4631 6027 6577 7493 9015 8685 9629 9831 10207 9908 9816
675 9816 9954 10670 8806 8194 6962 7950 6007 4006 4004 2477 1357 324 -862 -2076 -2732 -4814 -5398
692 -5398 -6058 -6766 -8351 -8195 -9000 -9411 -9551 -10499 -9623 -10072 -8624 -9443 -8713 -8525 -7581 -6386 -6548 -4446 -3766
711 -3766 -1995 -2136 -1037 559 1668 2948 4618 4365 5600 6565 8178 7498 9398 8770 8642 8756 9215
728 9215 9388 8482 8862 8869 7154 6729 5503 5443 4332 2967 3048 1313 12 -336 -1203 -1882 -3419 -4239 -5325
747 -5325 -6599 -6184 -7316 -7854 -8181 -8234 -9049 -9034 -7387 -7655 -7335 -7465 -6336 -6910 -4734 -3611 -3412 -2205
765 -2205 -1250 -1504 881 2410 2221 2493 2720 4686 5774 6555 6448 7493 7632 7336 7520 7611 6541 7712
783G712r20P0n27m15n05j342j378R69j175j595q57m79j416J3j208k61j165r28
801e407o61j66J77n07q30j12Q48o17J058R0J2j6P97N40J060J211K74Q76K28J176
821C1j44J974M05L70N95M87J240O24n83K070K3j65q97J049n84K10l94j082J172
840F401j014K49j847l75j290j39q04r49l2p68q59j288l71k37r18O9p35N55j027
859e379k93o55R78P92j267Q61n03J034m01J980k02o62K060l31J519N07J13J095
877A246J71M41J176K99L73R03j406K137q59J87L05J59O3J06j149J046j903N28
895C823j144J73o77n60j083L4K10j212K71o41j238J051j767J03j58q44jK95o54
914d019J514j128K69n41k77K272l55o40j09R63J107L98r92J548N37L6P02L68Q63
$$ plain form
783 7712 6792 6862 6335 5920 5415 4073 2695 3664 2489 894 37 -442 -1858 -1845 -3053 -3314 -4479 -5407
801 -5407 -6068 -6234 -6057 -6564 -7394 -7506 -6658 -7275 -6217 -6127 -6115 -6131 -5334 -4794 -3734 -2523 -2249 -1373 -1145 31
821 31 -113 1861 2266 2636 3231 3718 4958 5582 4999 7069 7092 6927 6030 7079 6495 6705 6311 5229 6401
840 6401 5387 5636 3789 3414 2124 1985 1181 232 200 -568 -1427 -2715 -3086 -3323 -4241 -4172 -4907 -4352 -5379
859 -5379 -5672 -6327 -5349 -4557 -5824 -4963 -5466 -4432 -4833 -2853 -3055 -3717 -1657 -1988 -469 38 151 1246
877 1246 1417 1858 3034 3333 3706 4609 3203 5340 4481 4668 4973 5132 5195 5301 4152 5198 3295 3823
895 3823 2679 2852 2175 1615 532 566 776 -436 -165 -806 -2044 -993 -2760 -2657 -2815 -3659 -3660 -3365 -4019
914 -4019 -2505 -3633 -3364 -3905 -4182 -1910 -2265 -2905 -3014 -2051 -944 -546 -1538 10 547 583 1285 1653 2516
933B516J78j115J100R96j091N75P34r58J152l09L7o20m04k56N13q67l29l79o17
952H56L67j039l96r37Q50j05k37k25j145l36l94K86j539J163o2m57M27m21M29
971b915p32N08M05J212l68L5J315j168J303N8J077k24R91n24J791r31r1J327M68
990C537L63j241J120j429Q49L29j328P54L24k52r62L21K43n58l29L13j041r64
1008D9N80j458M64K01j540N38q21r5L75l76k52j98J4O56j74r25j27N77J741p03
1028a474jo6L56L32N95M90N1m37J457j04L88j245J338Ln46P92n16M51Q19j390
1048A293Q24j772J486J049j865M52k48L49l39N56r14m30l71JK23P56j925Q30k27
1067b72j253j33j16j2O52j84N0q12J700j114Q2n3J72L2j70P25n24n2J984j019
$$ plain form
933 2516 2694 1579 2679 3675 2584 3159 3893 2935 4087 3778 3815 3195 2791 2535 3048 2181 1852 1473 856
952 856 1223 184 -212 -1149 -299 -404 -641 -866 -2011 -2347 -2741 -2455 -3994 -2831 -2893 -3350 -2923 -3344 -2915
971 -2915 -3647 -3139 -2734 -1522 -1890 -1855 -540 -1708 -405 -347 730 506 1497 973 2764 1833 1742 3069 3537
990 3537 3900 2659 3779 2350 3199 3528 2200 2954 3278 3026 2064 2385 2628 2070 1741 2054 1013 49
1008 49 629 -829 -365 -164 -1704 -1166 -1987 -2082 -1707 -2083 -2335 -2533 -2519 -1863 -2037 -2962 -3089 -2512 -771 -1474
1028 -1474 -1475 -1541 -1185 -853 -258 232 283 -154 1303 1199 1587 342 1680 1683 1137 1929 1413 1864 2683 1293
1048 1293 2117 345 1831 2880 1015 1467 1219 1568 1229 1785 871 441 70 71 294 1050 -875 -45 -272
1067 -272 -1525 -1658 -1774 -1786 -1134 -1318 -1268 -2080 -380 -1494 -1412 -1465 -1293 -1261 -1431 -706 -1230 -1282 702 -317
1087c17P25rj82nM75L08J75P44m09K9r19J048J64o17J65k33N38O59j290N6j34
1108I71J91J116o73j488L38K07j333J49P54m76N97k92j522L20O53j461M62O37
1126h50N13n22p38N3J76N37m19M78m65J082p32O94q33P81O21p08O45r00J006l33
1146H6n40N92K65M97P27n74L40l74o48k40M96M6o94Q94p24l25J271m51r36J204
1166I12J38j184O0Q05j308Q74q32P2K00Q94k020J007O13k14j789J722o59N13j079
1185a275P10L16n8k32J82M54o65J623j258P15k45L02k84r81J749j648J009N5N9
1204E28l2j74Q69j596J292o05R0L02k41L32j488K45R04j365Q55L0o9q60n7R83
1224e7L81r27K25M18l84p6o60J129j032O40l97J047o90R08j522l94P67o62Q10
$$ plain form
1087 -317 408 399 217 212 687 995 1170 1914 1505 1534 615 1663 1827 1210 1375 1142 1680 2339 1049 1105 971
1108 971 1162 2278 1605 117 455 662 -671 -522 232 -244 353 61 -1461 -1141 -488 -1949 -1487 -850
1126 -850 -337 -859 -1597 -1544 -1368 -831 -1250 -772 -1237 -155 -887 -193 -1026 -245 376 -332 313 -587 419 86
1146 86 -454 138 403 900 1627 1053 1393 1019 371 131 627 673 -21 873 149 -176 1095 644 -292 912
1166 912 1050 -134 -74 731 -577 297 -535 -463 -263 631 -1389 -382 231 17 -1772 -50 -709 -196 -1275
1185 -1275 -565 -249 -307 -539 -357 97 -568 1055 -203 512 267 569 285 -696 1053 -595 414 469 528
1204 528 496 322 1191 -405 887 282 372 674 433 765 -723 -478 426 -939 -84 -54 -123 -983 -1040 -57
1224 -57 324 -603 -378 40 -344 -420 -1080 49 -983 -343 -740 307 -383 525 -997 -1391 -624 -1286 -476
1243d76m83R3Q35J14R25m16J51q86K62M10n28j45k14o1K98K47j134N34Q38k16
1263A48j305K537n72J57j098k73O5j98J256n15K9p41J223p76m35Q15o88P60r87
1282e98J048K6o4o27j215J336j119J069j153K30N21l90J670n55j600J605m49N3
1300b12J57L93m7L19o68o51N71j41L52R1K79j95n28K73K72N3l44N00K96l73j234
1321h37L68L2k70J571o80m42R61j022j09O6L60j054J262j054l03J121J062j570
1339e38J090r61J65N36j223P02M90r73K59n13R30O8l88K29n6O13l34r78J596p90
1359g6r85K184n4j456n27J230k166J568K52M3K0Q32m60L72j56Q5j060r64J231
1378h7m53n42O60L42K10j93r23J26O60n88R75j85o24N73K91o15j574J577k59J04
$$ plain form
1243 -476 -959 -866 -31 83 1008 592 743 -143 119 529 1 -144 -358 -419 -121 126 -1008 -474 364 148
1263 148 -1157 1380 808 965 -133 -406 -341 -539 717 202 231 -510 713 -63 -498 317 -371 389 -598
1282 -598 450 476 412 -215 -1430 -94 -1213 -144 -1297 -1067 -546 -936 734 179 -1421 184 -265 -212
1300 -212 -55 338 291 610 -58 -709 -138 -279 73 164 443 248 -280 -7 265 318 -26 474 770 397 -837
1321 -837 -469 -437 -707 864 184 -258 703 -319 -428 -362 -2 -1056 206 -848 -1151 -30 1032 -538
1339 -538 552 -409 -244 292 -931 -229 261 -712 -453 -966 -36 32 -356 -127 -183 430 96 -882 714 -76
1359 -76 -1061 1123 1069 -387 -914 316 -1850 -282 -30 13 33 865 405 777 621 706 -354 -1318 -87
1378 -87 -540 -1082 -422 -80 130 -63 -986 -860 -200 -788 187 2 -622 -49 242 -373 -1947 -370 -629 -525
1398e25L99r27J740n49l62O02r61j43K40R49R9j008n33K312j469l23M92L5Q75
1417I43j85j175M25N9p71J679r87J32k26k61n01L59m24O93Ln10K83j95K67m29
1437h21j30K52o4J64J199q70k60k98P98k01L56j41l02K26o26N27J140j601k41
1456h93J502o62m62l40J83O51M27k60j68k74L40K33j81j09n24m01R00M1j39L46
1476B10L07r36n55o1P35J03r03K8J69J048J8j577O65J046j151K29o68P34m47Q96
1496a10M85j598J116M71m78J09o59Q45K83J74q19N23N3j13m14M11p60P63J79p48
1516b87J117o78j50q7K73r22J309j186L52M47j426M22M27m16M65p63J787m02j397
1535a115J850j151n86M56m31j5Q20j20o06K6p68J736q29M95N95p91m11Q88k53
$$ plain form
1398 -525 -126 -1053 687 138 -224 378 -583 -726 -486 463 562 -446 -979 1333 -136 -459 33 68 943
1417 943 758 -417 8 67 -704 975 -12 120 -106 -367 -868 -509 -933 -240 -237 -747 -464 -659 -392 -821
1437 -821 -951 -699 -763 -599 600 -270 -530 -828 -30 -231 125 -16 -318 -92 -718 -191 949 -652 -893
1456 -893 609 -53 -515 -855 -672 -21 406 146 -22 -296 44 277 96 -13 -537 -938 -38 3 -136 210
1476 210 517 -419 -974 -1035 -300 -197 -1100 -1072 -903 145 163 -1414 -749 297 -854 -625 -1293 -559 -1006 -110
1496 -110 375 -1223 -107 364 -114 -5 -664 181 464 638 -181 342 395 282 -132 279 -481 282 461 -287
1516 -287 830 152 2 -85 188 -734 575 -611 -259 188 -1238 -816 -389 -805 -340 -1103 684 282 -1115
1535 -1115 735 -416 -1002 -546 -977 -992 -172 -292 -898 -872 -1640 96 -733 -238 357 -434 -845 43 -210
1554b10o49J230N01j500J399j061o7J270q67R59L3K33j144J72k60p88O35J70j6
1573D0n17J406J9k97p23r41L40Q90q1q24Q61l22j12r95J98l2l32N64J65N04m86
1594f75R2k60K17n78O64k66Q37j061M98Q14r0k45M52p96l05J665j337R84j181
1613e71J17J069j01L58q99M16J65p98K04j4P30m00L26k05j274M28M15l11P11l41
1633B5q70K70Q00k99kM74j224l16J6L45J11n74J108j499O9P67J609r89L96m05
1653a88l89L3k95l93J043J079r97K26M71l89l78K99L04q03O68R27j8L71j222J74
1673E23k96j26M67K90p70P32n05P22j763J054o86p12O78K90L14m51j73r49Q42
1692e19j468K93J289L58j223P57l8j076J084j432K003j609R16k36K53P91L8j38
$$ plain form
1554 -210 -859 371 872 -628 771 -290 -357 913 46 1005 1038 1271 127 299 39 -749 -114 56 40
1573 40 -477 929 948 651 -72 -1013 -673 217 136 -688 173 -149 -261 -1256 -1058 -1090 -1422 -858 -693 -189 -675
1594 -675 -583 -843 -626 -1204 -540 -806 31 -1030 -532 282 192 -53 399 -397 -702 963 -374 610 -571
1613 -571 -454 615 514 872 -27 389 554 -244 -40 -54 676 276 602 397 -877 -449 -34 -345 366 25
1633 25 -845 -575 225 -74 -76 398 -826 -1142 -1126 -781 -670 -1244 -136 -1635 -1566 -799 810 -179 217 -188
1653 -188 -577 -544 -839 -1232 -189 890 -107 119 590 201 -177 122 426 -377 291 1218 1200 1571 349 523
1673 523 227 101 568 858 88 820 315 1037 -726 328 -358 -1070 -392 -102 212 -239 -412 -1361 -519
1692 -519 -1987 -1694 -405 -47 -1270 -513 -551 -1627 -543 -1975 28 -1581 -665 -901 -648 143 181 43
1710D3n53J137l47P95j347N42N49o58j74N57k13K58K76l5m47L04J20Q1J02l93
1730E97j12k60Q43j439N72k81P37j169J65O95n27J411k224M63L70l50l87m86M82
1749i00j23M70L36m32N17n54J55K38k40Q04j246j54O89m19Q35O44J2j370N08P69
1769E39k00M1Q92j484P23J32j39J45O99o42L68k82J52M9q51P90q5N02j012P16
1789A053j207l9j201J687r11M1P34j921K393j532l63J285j108J261j691qk86N97
1807a216k5p73J246M47k49L9Q18m40L4l31P52L33j326Q65J126l14j640J69J58
1826c27J014m2O11k05r36J342r69K28l46j66K68J05j08K89r22J194j498N27p39
1845f80nN89p16J05p9M91j087K04O77m62o6n27P54L51r4p82R2J491q73j85o23
$$ plain form
1710 43 -510 627 280 1075 -272 270 819 161 -13 544 331 589 865 830 383 687 807 888 990 597
1730 597 485 225 1068 -371 201 -80 657 -512 -347 348 -179 1232 -992 -529 -159 -509 -896 -1382 -900
1749 -900 -1023 -553 -217 -649 -132 -686 -531 -293 -533 271 -975 -1129 -440 -859 -24 620 632 -738 -230 539
1769 539 339 380 1272 -212 511 643 504 649 1348 706 1074 792 944 993 142 932 847 1349 337 1053
1789 1053 -154 -193 -1394 293 -618 -577 157 -1764 629 -903 -1266 19 -1089 172 -1519 -1527 -1813 -1216
1807 -1216 -1241 -2014 -768 -321 -570 -531 287 -153 -119 -450 302 635 -691 174 1300 986 -654 -485 -327
1826 -327 687 645 1256 1051 115 1457 488 716 370 204 472 577 469 758 -164 1030 -468 59 -680
1845 -680 -685 -96 -812 -707 -786 -295 -1382 -1178 -501 -963 -1029 -1556 -802 -451 -545 -1327 -1235 256 -617 -802 -1425
1866a425J238j72m28M54Q89k18k38Q67o53j23M66o35M94k13J67K32k8k67j22L37
1886F22K96N5o32M33o79J373o99k85j085J215n34p8O40n1j010M00j28j85J23J29
1906h0j67k70M92r70M86j491O61J477q13n40Q41K26p93Q1J743j606M95j73l85
1925g86R65o36o0J535n45K17q51R51m45O84J43J78j334M05m50R12l14J77p4m35
1945B37M31o82k98P32k64N66j190L93K94q20q32J867j470M76O84M39j749N71M41
1964a74o77K12l00o9R21l34j05r81R56J09n00J425l73P02j834Q18K94M40p78J112
1984H64l54k75P05m13N86j39N57k35l51K35m91j162J011J16n6j55j166P72j275
2003a226P1Q57j86k41J71O43j207N07P52o92O36k46m01j265J068m06J226j34p59
$$ plain form
1866 -1425 -187 -359 -787 -333 556 338 100 967 314 191 657 22 516 303 470 702 674 407 285 622
1886 622 918 973 341 774 95 1468 769 484 -601 614 80 2 642 591 -419 -19 -147 -332 -209 -80
1906 -80 -247 -517 -25 -995 -509 -2000 -1339 138 -675 -1215 -374 -148 -941 -860 883 -723 -228 -401 -786
1925 -786 179 -457 -517 1018 473 690 -161 790 345 1029 1172 1350 16 421 -29 883 569 746 672 237
1945 237 668 -14 -312 420 156 722 -468 -75 219 -601 -1433 434 -1036 -560 124 563 -1186 -615 -174
1964 -174 -851 -639 -939 -1008 -87 -421 -526 -1507 -551 -442 -942 483 110 812 -1022 -204 90 530 -248 864
1984 864 510 235 940 527 1113 974 1531 1296 945 1180 689 -473 538 654 598 443 -723 49 -1226
2003 -1226 -1155 -298 -484 -725 -554 89 -1118 -611 141 -551 85 -161 -562 -1827 -759 -1165 61 -73 -832
2022h32Q75j04K11k33M28m05p0J36q87J513k35p94O30j581J312k18K40J23j86
2041g7J104n37m54J088J36m50n64P28m47n94L68L76K95p31n19o73J853r54k67
2060c19O90k41M15j595M92M66P65j146J89m42J86n98j38M47M32k44P07n63PM11
2080g9j50q78N97M22N1n74N24p7M30K08j021N04O79q63J97j51j69L93l93N47Q09
2101A006m66l22J374j445L08j65l9K7j23N11j338Q80j14M50p30m15L01j173J507
2120C4N73n69l9m42K50n6j33K12j046R80m29k86Q51m80Q63n33P44o87M1J502j437
2141h7L33p94P47k14Q56r59N59j31n78M81k79K028o58k19j423J397N7j387L93
2160A22k58N60j027L78Q02o76p84J451j105l2L40j114J143J37q73J668j285r72
$$ plain form
2022 -832 43 -61 150 -83 345 -60 -130 6 -881 632 397 -397 233 -1348 -36 -254 -14 109 -77
2041 -77 1027 490 36 1124 1260 810 246 974 527 -67 301 677 972 241 -278 -951 902 -52 -319
2060 -319 371 130 545 -1050 -558 -92 673 -473 -284 -726 -540 -1138 -1276 -829 -397 -641 66 -497 -490 -79
2080 -79 -229 -1107 -510 -88 -37 -611 -87 -164 266 474 -547 -43 636 -227 -30 -181 -350 43 -350 197 1006
2101 1006 540 218 1592 147 455 290 251 278 155 666 -672 208 94 544 -186 -601 -300 -1473 34
2120 34 607 38 -1 -443 -193 -249 -382 -170 -1216 -236 -665 -951 -100 -580 283 -250 494 -193 -152 1350 -87
2141 -87 246 -548 199 -15 841 -118 441 310 -268 213 -66 1962 1304 1085 -338 1059 1116 -271 122
2160 122 -136 424 -603 -225 577 -99 -883 568 -537 -569 -229 -1343 -200 -63 -936 732 -553 -1525
2178a525M02M20P81q97k61P89j428J223o13M64P42l71l17K81L41m39J89R1m34
2197e62L48M63q79J028m53P03n30N42q05k5J01m2M56L6m72N53L2l15N51k59l08
2218A63J64N7K03p91L70n61o02J435o13L51o12J367r06p45k3P27m62q91J155L12
2238I8K73J041k508Q06J029k75j036l71P75J016j037l35O83Jj36O53j10k42P46
2257A071k87K95j314K8M75p46O88j10r60J820j257Q00j153Q40o43J160o33k73
2275a99K99q50J206M09j143l89K008j107n9j088N21m96J252m82l22J6R6j80P37
2294B29j087R64l46L14L98j141J0P94k96M49P96j329R17m66P02K6L1l63j6j072
2314d86J739o95m57j57J242j144P01m22R8o29J204p19p2n91L19K31j62K7O87j296
$$ plain form
2178 -1525 -1123 -703 78 -819 -1080 -291 -1719 -496 -1109 -645 97 -274 -591 -310 31 -408 -219 -128 -562
2197 -562 -214 249 -630 398 -55 648 118 660 -145 -170 -69 -111 345 381 -91 462 494 179 730 471 163
2218 163 327 384 587 -204 166 -395 -997 438 -175 176 -436 931 25 -720 -743 -16 -478 -1369 -214 98
2238 98 371 1412 -1096 -290 739 464 -572 -943 -168 848 -189 -524 159 160 24 677 567 325 1071
2257 1071 784 1079 -235 -207 268 -478 210 100 -860 960 -297 503 -650 190 -453 707 74 -199
2275 -199 100 -750 456 865 -278 -667 1341 234 175 -913 -392 -888 364 -118 -440 -424 -328 -508 229
2294 229 -858 106 -240 74 472 -669 -659 135 -161 288 1084 -245 672 206 908 934 965 602 586 -486
2314 -486 1253 558 101 -56 1186 42 743 321 419 -210 994 275 203 -388 -69 162 0 27 714 -582
2334e82N13N12r00Q59j648J161L2K62k1L34j583J614j329l80O98p84R93J16K94
2353A61j169K211j165Q1m27L53O83M56j275p3J89N64k80l05k0k71L01J076O66
2372A756k704J252m45J58m28j01q6J86l16J208n16m41J285j150k59j012J000Q83
2390B70j360P68n55J570O88j560J87p04K04N16n74R77L89r82q8M18r11P70j193
2409a170J333p08l2R79k29R31n94N47o68K29N40n97K15Po25J59R47K96j201j239
2429h80J349j125M74l4L1r13J022n56J16P33o91K70q89N68N08n43M83j91j25L3
2449c60Q5l07J809n37j129J130q87J09j440O57J548n53J48J370m40k19q39M19
2467E64k57J59M52r8o14K43K66l63K10l77M99N08m13O45o92o93N13m20J17K25
$$ plain form
2334 -582 -69 443 -457 402 -1246 -85 -53 209 188 522 -1061 553 -776 -1156 -458 -1242 -249 -133 161
2353 161 -1008 1203 38 119 -308 45 728 1184 -91 -164 25 589 309 4 -16 -287 14 1090 1756
2372 1756 -948 304 -141 17 -411 -512 -598 -412 -728 480 -36 -477 808 -342 -601 -1613 -613 270
2390 270 -1090 -322 -877 693 1381 -179 8 -696 -492 24 -550 427 816 -166 -254 164 -747 23 -1170
2409 -1170 163 -545 -577 402 173 1104 510 1057 389 618 1158 561 776 783 158 317 1264 1560 359 -880
2429 -880 469 -656 -182 -216 -185 -1098 -76 -632 -516 217 -474 -204 -1093 -525 -17 -560 -77 -268 -393 -360
2449 -360 -275 -582 1227 690 -439 691 -196 -87 -1527 -870 678 125 273 1643 1203 984 145 564
2467 564 307 466 918 820 206 449 715 352 562 185 684 1192 779 1424 732 39 552 132 249 474
2487D74r17M90k32j47J17M70q65M81m5R01r36n78L01J96j14j240J872m04l31M97
2507a0J22m90L93J41Kk25r19J394l41p95J296r55N46M92o57K14K80N41m28o50
2527d9j39M63o5j22j23N76Q5j202J349k94m1n44L61q59N77j450J138N49k51l43
2547c84J52p92J475r07n61J059l43m94J331r43R9O10P4q15K34P03l61j47L97M92
2567H79j344M60p86K360j398p06M06N21O54L24q96R0p36J083p13o63J203o79O5
2586A24M30j349J129k86m47Q67k70l23R69l76o97n16M74J094j760J343m42J203
2604A167q29k59p00J076j15q19K2J481n08M7n50l07N04J36M7q34J139o57Q09l09
2624E41j126J52O60j031J142o13N21n05K68m9J43O5q52J440k23j8o14k30K35N26
$$ plain form
2487 474 -443 47 -185 -332 -215 255 -610 -129 -174 727 -209 -787 -486 -290 -404 -1644 228 -176 -507 -10
2507 -10 112 -378 15 156 158 -67 -986 408 67 -728 568 -387 159 651 -6 208 488 1029 601 -49
2527 -49 -188 275 210 88 -35 541 626 -576 773 479 438 -106 255 -604 -27 -1477 -339 210 -41 -384
2547 -384 -232 -1024 451 -456 -1017 42 -301 -795 536 -407 -308 302 376 -439 -205 498 137 -10 387 879
2567 879 -465 -5 -791 1569 171 -535 -129 392 1046 1370 474 564 -172 911 198 -465 738 59 124
2586 124 554 -795 334 48 -399 468 198 -125 844 468 -229 -745 -271 823 -937 406 -36 1167
2604 1167 338 79 -621 455 340 -479 -457 1024 516 563 13 -294 210 346 393 -441 698 41 850 541
2624 541 -585 -433 227 -804 338 -275 246 -259 9 -40 103 168 -684 756 533 515 -99 -329 -94 432
2644D32r57j58R17N09l88l16q22j3m43N93l8J631j724O44O1j44N52j110Q45l61
2664b90J553k129N44L45J7j320J686k40Q3j67M24m76p18J666J81o97q65Q57J0
2683D64L84m82j39K64k56O28j294J447o73l88O08P5k515J268Q50q4n27K39L05
2702A74j09K39n55J22q12R09k53j212R92O43q29L08j29Q23j75L03o10l37J77k64
2722e95m90O82M61O68J36o73M66p59k59o5o64N13J502r59Q91j321L15r74N97N68
2742D0K31m10L81J383j391l13N72k70M3n7q76J242j321N2J001j318M43N55n52
2761e65L3K61M51j540J357n77M51N27o19N6M4M12m34L15l48j39K70J43kN44r80
2782c40j87N46P52j71r14m72P78q58O45M47n08l90R58m51p99Q59K37j48j276J955
$$ plain form
2644 432 -525 -683 234 743 355 39 -783 -796 -1239 -646 -684 947 -777 -133 -72 -216 336 -774 71 -290
2664 -290 1263 -866 -322 23 40 -1280 406 166 249 82 506 30 -688 978 1159 462 -403 454 464
2683 464 848 366 227 491 235 863 -431 1016 343 -45 563 638 -1877 -609 241 157 -370 -131 174
2702 174 65 304 -251 -129 -941 -32 -285 -1497 -505 138 -691 -383 -512 311 136 439 -171 -508 -331 -595
2722 -595 -1085 -403 58 726 862 189 655 -104 -363 -428 -1092 -579 923 -36 855 -466 -151 -1125 -528 40
2742 40 271 -139 242 1625 234 -79 493 223 266 209 -667 575 -746 -694 307 -1011 -568 -13 -565
2761 -565 -532 -271 180 -1360 -3 -580 -129 398 -221 -165 -121 291 -143 172 -176 -315 -45 98 96 640 -340
2782 -340 -527 19 771 600 -314 -786 -8 -866 -221 226 -282 -672 286 -165 -964 -105 132 -16 -1292 663
2802F63r62m53J706j147K39J00J71j000L28m21j03k56J321n80P98m86l63J362
2820I17m69M06j482K90k9J366j190P10k15P87j192J147j048K88l48Q5L92j145
2838g30J476J17q29j12Q50p54p21N15K80K07q90R75j131J013J004p43n39n01j123
2857a636J682k59J149j051m02P73p69N39m18l8L12K5R05j494N32L27o23P45n92
2876b93k1j83N20K21o50M42m41J37L67o42j76J668n79k68l8R04o3j470Q73M4m87
2897a35O5L98m8j079Q29J344k074J49Q4R42j336R8N23P12m89M93k15M36q99P77
2917E75j07l00j1J08k9j184R80M06j264Q27J5J649j644M84j467P98R97q30K12
2936B15N8j46P43L41j346L50k00J657j523k54L28J336j653k49O6P41O46j391J87
$$ plain form
2802 663 -299 -752 954 -193 46 146 317 -683 -355 -776 -879 -1135 186 -394 404 -82 -445 917
2820 917 448 854 -628 -338 -367 999 -191 519 304 1091 -101 1046 -2 286 -62 23 415 -730
2838 -730 746 863 34 -78 772 18 -703 -188 92 299 -591 384 -747 266 1270 527 -12 -513 -1636
2857 -1636 46 -213 936 -115 -517 256 -513 26 -392 -430 -118 -93 812 -682 -150 177 -446 299 -293
2876 -293 -314 -497 23 244 -406 36 -405 -268 99 -543 -719 949 370 102 64 968 905 -565 308 352 -135
2897 -135 -70 328 280 -799 30 1374 -700 -551 -467 475 -861 -763 -240 472 -17 476 261 697 -202 575
2917 575 468 168 157 265 236 -948 32 438 -826 1 16 1665 21 505 -962 -164 833 3 215
2936 215 273 127 870 1211 -135 215 15 1672 149 -105 223 1559 -94 -343 -277 464 1110 -281 -94
2955i4l78K10J42l3O48j77q97J14L20o46O76m5j09K67l48L74L49k38J357j666
2975a74n36M09K54o7p61Q83J61p9j242J265N60J35J86r63L73m34j81j9j81J92
2995b19n15M12n6K64j5L77l21M55p4n78N77r67N14M5p83J599p44J027j012m4q78
3016i36J198l89n9R5j060J552J79j444R37o55m70J052j59j243J163L34J73R93
3034A261r38m29P9P62q39L53l32P26o87N99r57R80o8j83R4l7r62m22P33M57N0
3055B40n75P99k5l96l55m23K59J027m73p08n71K605j407p59O49j66K11m00p99
3074a267J385J21j675J460J11o35J87K5J333p21n74Q74j391J500L01m58o40j207
3092a271J909o94J61J010j171l1j46P95r30J720r40k8k29j01j70l0K16Q60o08
$$ plain form
2955 -94 -472 -262 -120 -153 495 318 -579 -465 -145 -791 -115 -160 -269 -2 -350 24 373 135 1492 -174
2975 -174 -710 -301 -47 -114 -875 8 169 90 -1152 113 673 808 994 31 404 -30 -211 -230 -411 -219
2995 -219 -734 -322 -378 -114 -129 248 -73 382 308 -270 307 -660 -146 -101 -884 715 -29 998 -14 -58 -936
3016 -936 262 -127 -186 -91 -1151 401 580 -864 73 -582 -1052 0 -159 -1402 -239 95 268 1261
3034 1261 323 -106 -27 735 -104 249 -83 643 -44 555 -402 578 510 327 421 384 -578 -1000 -267 190 240
3055 240 -335 464 439 43 -312 -735 -476 551 78 -630 -1201 1404 -3 -762 -113 -279 -68 -468 -1267
3074 -1267 118 239 -1436 24 135 -500 -313 -288 1045 324 -250 624 -767 733 1034 576 -64 -1271
3092 -1271 638 -56 105 1115 -56 -87 -233 562 -368 1352 412 384 155 54 -116 -146 70 930 322
3111C22R39j755Q36P04p79r24N03K02q78M30N77Q57j290J139m30N67o91K71j285
3130f85O45l60l08J193j64r12N50j95M07j71L57J37j03q88R04j40k06O88q64M47
3150C32Q4j22J31m77O46m79J30n12Q55L35n40r8r64Q64q75N21J235j119Q36p70
3170A3M38N44k700J968q38R7J36M3Q22J81j173L90K50rJ139j484j02J197n51p66
3190d05L69M33k58P64j287l96Q02q21P44l8j61O72Q7O47j809O14m77O28M48p65
3210b09J61O98r16n17M44J10J27o05J295r26K5R93n90j39j97j2L38J040q93j029
3230h02K110j189o48J455o53j26L09p6K80p47M96L48j415M75K0O47j21K14j985
3249a408R24L00N37n86L43K03J8k40J184j007P49k09j516J77J084j577J074J06
$$ plain form
3111 322 1261 -494 342 1046 267 -657 -154 48 -830 -400 177 1034 -256 883 453 1020 329 600 -685
3130 -685 -40 -400 -708 485 321 -591 -41 -236 171 0 357 494 391 -497 407 267 61 749 -115 332
3150 332 416 294 425 -52 594 115 245 -267 588 923 383 285 -679 185 -690 -169 1066 -53 783 13
3170 13 451 995 -1705 263 -575 -478 -342 -299 523 704 -469 -79 171 162 1301 -183 -285 912 361 -405
3190 -405 -36 397 139 903 -384 -780 22 -799 -55 -93 -254 418 505 1152 -657 -43 -520 108 556 -209
3210 -209 -48 650 -266 -783 -339 -229 -102 -707 588 -338 -313 680 90 -49 -246 -258 80 1120 227 -802
3230 -802 1308 119 -529 926 273 147 456 380 660 -87 409 757 -658 -183 -163 484 363 577 -1408
3249 -1408 -484 -184 353 -233 110 313 331 91 1275 268 1017 808 -708 -531 553 -1024 50 156
3267A56k35l71r2R43j545J066J71l2r05J331Mr70J037l60q66M03M01r72J410j642
3287a068J122m26R91j066q1m93P12J053p19Q4J418j599O84m43p14K15M39K7j207
3306a071K206j933N32K89K96P48j472L38o12J277q9j165J315j142j40N54M76N24
3324I31j113O0K04L66j60j40n49M24j083k35J078n27R79j194j2P95j2k46%M69
3344C5%l44M77k16j22k20L27o23n52P91O67K04n22M76l14j41p3j71J09P28m10
3365A06m34O41o96p43J443r5q12M28M37p98K90J53k00M59n52N24J22M03o41o08
3385e73N30n82O88m22J128j071K95o5m43M19J71o5n61M08k35m1k35k09K86O16
3405C9N89p46R51r24N77p66j18N47K12q96l75J478o56r00J327J82p02N24k78m76
$$ plain form
3267 156 -79 -450 -542 401 -1144 -78 93 61 -844 487 491 -479 558 198 -668 -265 136 -836 574 -1068
3287 -1068 54 -372 619 -447 -528 -1021 -309 744 25 109 1527 -72 612 169 -545 -330 109 136 -1071
3306 -1071 1135 -798 -266 23 319 1067 -405 -67 -679 598 509 -656 659 -483 -623 -69 407 931
3324 931 -182 -122 82 448 288 148 -401 23 -1060 -1295 -217 -744 235 -959 -971 -176 -188 -434 -434 35
3344 35 35 -309 168 -48 -170 -390 -63 -686 -1238 -447 220 424 -98 378 64 -77 -150 -321 -212 516 106
3365 106 -328 313 -383 -1126 317 222 -590 -162 275 -523 -233 -80 -280 179 -373 151 273 676 35 -573
3385 -573 -43 -625 63 -359 769 -302 -7 -72 -515 -96 75 10 -551 -143 -378 -419 -654 -863 -577 39
3405 39 628 -118 833 -91 486 -280 -398 149 361 -535 -910 568 -88 -988 339 521 -181 343 65 -411
3425d11J84J6J85l89P05O22p15j04n95K17K91j47P83j077k24J673j792O86N28
3444D36m38o60R75n82M19m19J102K0j131M35k71o60O28Q69p39L49o94J94N84m43
3464b6j86J33n1r2K43p45J556q05M1j508J497N25k77k11m91R75o59p0o56J167
3484C60p18Q62j304J130n0N42j197J46K09r7P04j311K17M10k01k74P07K37r3k51
3504B8R41j150l72L09P49j212K52J486l79o37N8K42p38k30J585r00p4p58J223
3523D23j87j42L33l00K01K33r69M41o6R4q90O17r18J203n21P54m40j51l19L84
3543b20Q05j472J287n15M15J07j059q8o29K033m07J16j35o42j73P4O71k4J62j80
3563A26K61l69k10Q47l06j64m32N28n15O10j524J088P64n49o2J38K1J20N48q11
$$ plain form
3425 -411 -227 -211 -26 -415 290 912 197 93 -502 -285 6 -141 642 -435 -659 1014 -778 -92 436
3444 436 -2 -662 313 -269 150 -269 833 853 -278 157 -114 -774 -146 723 -16 333 -361 -167 417 -26
3464 -26 -212 -79 -130 -222 21 -724 832 27 68 -1440 57 582 305 94 -397 578 -81 -151 -807 360
3484 360 -358 504 -800 330 280 822 -375 -229 -20 -117 587 -724 -507 -97 -298 -572 135 372 279 28
3504 28 969 -181 -553 -244 505 -707 -455 1031 652 15 73 315 -423 -653 932 32 -42 -800 423
3523 423 236 94 427 127 328 561 -408 33 -33 61 -829 -212 -1130 73 -448 306 -134 -285 -604 -220
3543 -220 585 -887 400 -115 300 407 -652 -740 -1369 664 257 373 238 -404 -577 -503 168 144 306 126
3563 126 387 18 -192 655 349 185 -247 281 -234 376 -1148 -60 704 155 93 231 252 372 920 109
3583A09k39M0J86K46Ol62K12m73N99m19L86p22N0K37L43m43q93O31J59K76M28
3604C57m45N02j272J096M57m74j11j54J004j005K61l70k95K92Q5O31n93O14q21
3623b41k79J488j591Q53j336J677J21j555J73J228r05L36j149O84M71m59p5P29
3641A70Q8j67j32K15R5J95o47j08P68q49N2j04P3p99J066p46J207n22P28j492
3661i09J279m3m01j014J474n91m87Q66o1J26o25L41K28j139R63J156j327P97m95
3680A38r3o67N73N36m43l91M99n54O46p4q46J227j160J138q88K12p26M97j07M4
3700d39Q36n29N69o31L52o38J743j501n81J134j311K98M43J72o01P00l14N39k50
3719ip70N73Q94j004k85P83j144J398K13q99L32J83j05p16J190j275Q96p13Q88
$$ plain form
3583 109 -130 -90 96 342 348 -14 198 -275 324 -95 291 -431 -381 -144 199 -244 -1137 -506 -347 -71 357
3604 357 -88 414 -858 238 695 221 110 -44 960 -45 216 -154 -449 -157 -72 559 -34 580 -241
3623 -241 -520 968 -623 230 -1106 571 692 -863 -690 538 -367 -31 -1180 -496 -25 -484 -559 170
3641 170 258 91 -41 174 269 464 -183 -291 477 -372 -320 -424 -351 -1150 -84 -830 377 -145 583 -909
3661 -909 370 327 -74 -1088 386 -205 -692 174 113 239 -386 -45 183 -956 7 1163 -164 633 138
3680 138 45 -622 -49 487 44 -347 152 -402 244 170 -676 551 -609 529 -359 -147 -873 -376 -483 -439
3700 -439 397 -132 437 -194 158 -480 1263 -238 -819 315 -996 -698 -255 -83 -684 16 -298 241 -9
3719 -9 -779 -206 688 -316 -601 182 -962 436 649 -250 82 265 160 -556 634 -641 255 -458 430
3738D30L76k97n3M30j459P80j64Q18j96o11O17j451M62q00J681o23J11l90J3k85
3758f11J081r17j93R09l50Pj892J959j26q00J555m09n30k1K36k85L08M87k91L65
3778D82p21L89j14l31J083O97j421j08Q44j360R69m1l25m71J089k76m49J2p72
3797h24K131j158l49J191n96k67J22q24J057m58l28k25J080K35q42j156J131J77
3815I7j72r73N09Q18j33l76L94l86p29J076N8m71N91L49M59n79l70j31j22K49
3835A58p19m5K63J24K88j155Q51K90r17M28K75J049j121O30n85J88j25K74K46
3854C97m09OL22j004M71R16q44K44o49K71Q36j036P56r7n84O91J7n59L3N48K67
3875E93j70p39J18J066j588R03R9N68j040P47j181R40n24j95l49P47K74M04j618
$$ plain form
3738 430 806 509 456 886 -573 207 43 861 665 54 671 -780 -318 -1118 563 -60 51 -339 -326 -611
3758 -611 470 -447 -640 269 -81 -74 -1966 -7 -133 -933 622 213 -317 -338 -102 -387 -79 408 117 482
3778 482 -239 150 36 -295 788 1485 64 -44 800 -560 409 368 43 -428 661 385 -64 -52 -824
3797 -824 1307 149 -200 991 395 128 250 -574 483 25 -303 -528 552 787 -55 -1211 -80 97
3815 97 -75 -1048 -539 279 146 -230 164 -222 -951 125 183 -288 303 652 1111 532 162 31 -91 158
3835 158 -561 -606 -343 -219 69 -1086 -235 55 -862 -434 -159 890 -231 399 -186 2 -123 151 397
3854 397 -12 -6 316 -688 -217 699 -145 99 -550 -279 557 -479 277 180 -404 287 304 -255 -222 326 593
3875 593 423 -316 -198 868 -720 183 282 850 -190 557 -624 316 -208 -403 -752 -5 269 673 -945
3894i45K37J86L68j362Q00J495k45l39j89l79n0L13N46r34N16k20N95j354J405
3913D44L74j80j090J00P15J5n66O07P0r09Q4n04R65lM56m52r30J386M49j439P02
3934B94lm48l32J815o63m47O9p15J143p95P5L05L62r44l84J280j418L86J044n07
3954A17o26L95L70n81M48p82J306r34L87M78M59j952J325m67N51j71m60J78p38
3973f97M88N38q77K13K84K99n34M36j192J564j41l57P41l02k54j114M37M67N81
3992E80j095M45l57P38j569J418j110J442q40Q62r2j061Q72J83m95j88J00O05
4010D38k66m05l49P42k27n55J587j098Q2m26R08k16j50R83j439J233r10M79n70
4029a59J290j389m28R11l03r49N97J064j089M24P69j502J059p87O5J059j169N82
$$ plain form
3894 -945 -708 -522 -154 -1516 -716 779 534 195 6 -373 -423 -110 436 -498 18 -202 393 -961 444
3913 444 818 638 -452 -352 363 378 -188 419 489 -420 -336 -840 125 122 578 126 -804 582 1031 -408 294
3934 294 291 -157 -489 1326 663 216 285 -430 713 -82 -7 298 660 -284 -668 612 -806 -420 624 117
3954 117 -509 -114 256 -325 123 -659 647 -287 100 578 1037 -915 410 -57 494 323 -137 41 -697
3973 -697 -209 329 -548 -335 -51 248 -286 150 -1042 522 381 24 765 463 209 -905 -468 -1 580
3992 580 -515 -70 -427 311 -1258 160 -950 492 -348 514 422 -639 233 416 -79 -267 -167 438
4010 438 172 -233 -582 160 -67 -622 965 -133 -51 -477 431 215 65 1048 -391 842 -68 411 -159
4029 -159 1131 -258 -686 225 -78 -1027 -430 634 -455 -31 738 -764 295 -492 -427 632 -537 45
4047D5q8N90N36j292N59l15j56O13J1j613J953n51K24n67R8m18k68J010l01K00
4067B70J0l09J083j805N29O79j246J411q98O0k5J73l9J053j223O72L38r73N49
4086C09j324P57J392j319M58q06J466j060k07k94J751p14o17P21o64k97K73k98
4104d73L59J46l40M21j43M73j82j017J342m79j24L52L40j874K282j729M79K6n90
4123g31L37O47K24l61K73k83L65r1n04j06J94O37j133J170n68l50J198j508J656
4142A066j127P0o98Q60J61L30J42r12K35o17O13K9L55l59n78Q59N87r76j048J490
4162D82l66L7o50k9Q62k7L01n00j73K03n73L37r54J310j063J007l60O58k2j656
4182a176R18N45q71O70j63k3q30L79Q58P13N3j340J25l42N43q71J413j087L73
$$ plain form
4047 45 -43 547 1083 -209 350 35 -121 492 503 -1110 843 292 516 -51 47 -371 -639 371 70 270
4067 270 280 -29 1054 -751 -222 457 -789 622 -276 -216 -241 -68 -107 946 -277 395 733 -240 309
4086 309 -1015 -258 1134 -185 273 -533 933 -127 -334 -628 1123 409 -208 513 -151 -448 -175 -473
4104 -473 -114 32 -308 113 -30 443 261 -756 586 107 -17 335 675 -1199 1083 -646 -167 -141 -731
4123 -731 -394 253 477 116 389 106 471 380 -124 -230 -36 601 -532 638 70 -280 918 -590 1066
4142 1066 -61 9 -689 171 332 662 804 -108 127 -490 123 152 507 148 -430 429 1016 40 -1008 482
4162 482 116 153 -497 -526 336 309 610 110 -63 140 -433 -96 -1050 260 -803 204 -156 502 480 -1176
4182 -1176 -258 287 -584 86 -77 -100 -930 -551 307 1020 1073 -267 -142 -484 59 -812 601 -486 -113
4201a13P44j288R95p45q5R03J32J528j695o15O87j88l45M90L65j811P38O45j15
4220B27K83r11L32n80Q78L02j161J92J067l52n84J16J6O20k71M0j20q59M78k17
4240e04N84k56M70k42K27n66L61o88J334J59q72j28j15k27L06Q71j510N47n23
4259g72O31o46J682p06Q38j034J132j482M70N00r11K77N46k66m05N17j361K438
4277A448q90k82n59P04j44J2M56k68J90j361M41J59N79m08j068J149p50J084l45
4296A47k80L00j63q2j08k46j002J113K01K96n69N14o82Q67r19J159o46n66J4K63
4316c89N67J6J7p66R8J188j237M53K73j65j160J163r9L22Q5r4j47p72q72J216
4336c03L43N74J93m91L54n23K7j69k11j4R32r44N3M50J65K59j137o0J353o52k14
$$ plain form
4201 -113 631 -657 338 -407 -492 411 543 2071 376 -239 448 260 -85 405 770 -1041 -303 342 227
4220 227 510 -401 -69 -649 229 531 -630 -438 629 277 -307 -191 -175 445 174 214 94 -765 -287 -504
4240 -504 80 -176 294 52 279 -287 74 -614 720 879 7 -121 -236 -463 -157 714 -796 -249 -772
4259 -772 -141 -787 895 189 1027 -7 1125 -357 113 613 -298 -21 525 259 -146 371 -990 1448
4277 1448 558 276 -283 421 277 289 745 477 667 -694 -253 -94 485 77 -991 158 -592 492 147
4296 147 -133 167 4 -78 -186 -432 -1434 -321 -120 176 -393 121 -561 306 -613 546 -100 -666 -652 -389
4316 -389 178 194 211 -555 -457 731 -506 -53 220 55 -1105 58 -41 281 366 272 125 -647 -1519 -303
4336 -303 40 614 807 316 670 147 174 5 -206 -220 712 -232 -179 271 436 695 -442 -502 851 199 -15
4357a5m96O63m60J159o52O78r46O16o1q33M65J98L08n67Q9L32M0k40j316J788
4377G50j512J163k3j030Q48L07l46j79j10o0K64q3j207l13J160M66P49j393m74
4396a023R24j05N38o08Q63m14n64J276j729N59l23k3Q20L95j617J284k11K8m84
4415d14R32m89M45j55q86J512j456o1J353l87K67j305K78O44m07m00K16o53N20
4434d46N19n63J424j046J331j957Q05q23N94k40Q42m00N53j18L41q01O4r91P88
4453a24n31P44o49Q48L36q00R0K95p87q9R63n88m43R58o98R95q74P77j498J570
4473D95o09k75J416j083K17J59l21k71L46k76M02M5r21J004m10O93l74k56J98
4492A79j160J377j471J525p36O5J44L72j467P71O9j89P20k1K73l81j30m70J857
$$ plain form
4357 -15 -511 152 -308 851 199 877 -69 547 486 -347 118 316 624 57 146 478 518 278 -1038 750
4377 750 -762 401 378 -652 196 503 157 -22 -132 -192 72 -11 -1218 -1531 -371 95 844 -549 -1023
4396 -1023 -99 -204 334 -274 589 175 -389 887 -842 -283 -606 -629 191 586 -1031 253 42 70 -414
4415 -414 518 29 474 319 -567 945 -511 -572 781 394 661 -644 -366 278 -129 -529 -313 -966 -446
4434 -446 73 -490 934 -112 1219 -738 67 -756 -162 -402 440 40 593 475 816 15 79 -912 -124
4453 -124 -655 89 -560 288 624 -176 -86 209 -578 -667 296 -292 -735 223 -475 520 -354 423 -1075 495
4473 495 -114 -389 1027 -56 161 320 -1 -272 74 -202 200 245 -676 328 -82 611 237 -19 179
4492 179 -981 396 -1075 450 -286 -221 -77 295 -1172 -401 -332 -521 199 178 451 70 -60 -530 1327
4511A327j853J12M55L85M65j496O11o8m8L32m78L05J507j224j226J032j90j06
4529a58j83q26O52j31K38l02J640j350O51j453M11R49p82J599q62N24n58N58r96
4548c79l21M63p46J436p96L43J18L15K33p01O03j228K71N38K82l07m34N64k88
4567c4l70O14N74j233O15j83P80q14N12o96L7q36M90J657j187Q65m15m2L40M11
4587A085j722K51J483p98k78M74J68o39o25J22M84m56J17m31L48l4J111k63k46
4606A51k15P33r91M16l05M06m53Q96j67j143R71j433J63Q93M41j69m45N94j17
4625B26p8M64o15m54J692k45j442M87J98k75L56m61l29Q41k98O13j084M6p13J654
4645E83N2L07n64n35R53l05K42n45K81r5K2l25j088O90J39N4J022j236K72K16
$$ plain form
4511 1327 -526 -414 41 426 891 -605 6 -62 -110 222 -256 49 1556 332 -894 138 -52 -158
4529 -158 -341 -1167 -515 -646 -408 -710 930 -420 231 -1222 -811 138 -644 955 93 617 59 617 -379
4548 -379 -700 -237 -983 453 -343 0 118 433 666 -35 568 -660 -389 149 431 124 -310 254 -34
4567 -34 -404 210 784 -449 166 -17 763 -51 461 -235 -198 -1034 -544 1113 -74 791 376 334 674 1085
4587 1085 -637 -386 1097 299 21 495 663 24 -601 -479 5 -451 -334 -765 -417 -451 660 397 151
4606 151 -64 669 -322 94 -211 195 -258 638 471 -672 299 -1134 -971 -78 363 194 -251 343 226
4625 226 148 612 -3 -457 1235 990 -452 35 233 -42 314 -147 -476 365 67 680 -404 -358 -1071 583
4645 583 635 942 378 -157 796 491 733 188 469 374 396 71 -1017 -327 -188 -134 888 -348 -76 140
4665A40n25M74q69J104M27n8K86j955J075l21Q44k01j260P16N69j097J088M32
4683H69j170P71l05j60J94p80j61R8o1N96K57q82L28J148m87J44m22q2k33L46
4703Hk32k54P27O6r09j00R69L02l80j069J335l38o1n90J81m97P48p94L88J81P09
4724C90p99k07O48n65K4J84M66J68q1j70l70R06j316L41k8L96J76p06J019j184
4744g08J54P76l03m22J293l21n27M58o70P52k00j259J082j89K65j12j008P76K74
4763A11m52j61L53K17O18j920J495mk44N09Np56m93R95p5O20q95ll35M25N34o18
4785g4J02M92n69J35M74m94L37o31O66j026J132Rj770J371n46J07P24q4K67q17
4805a95k62R48r53J06K38K01n88m16R20j06m83o72Q11m53J596j081L68m48K44
$$ plain form
4665 140 -385 89 -780 324 751 693 979 -976 99 -222 622 421 -839 -123 446 -651 437 869
4683 869 -301 470 165 5 199 -581 -742 -644 -705 -109 148 -734 -406 742 255 399 -23 -105 -338 8
4703 8 -224 -478 249 315 -594 -694 275 577 197 -872 463 125 64 -526 -345 -842 -94 -888 -500 -319 390
4724 390 -409 -616 32 -533 -509 -325 141 309 228 58 -312 594 -722 -381 -409 -13 163 -543 476 -708
4744 -708 -554 222 -81 -503 790 469 -58 400 -270 482 282 -977 105 -84 181 69 -939 -163 111
4763 111 -341 -502 -149 68 686 -1234 261 257 13 522 527 -229 -722 273 198 818 -77 -80 -415 10 544 -74
4785 -74 28 520 -49 86 560 66 403 -228 438 -588 544 553 -1217 154 -392 -285 439 355 622 -195
4805 -195 -457 491 -462 -356 -118 83 -505 -921 -1 -107 -590 -1262 -451 -904 692 -389 -21 -469 -225
4824b25O30p83J023p04J02J95m31J21J38l09L67j111O69P11m60q5k88P77n56O82
4844D63k67J3p43P3J137j294L90j67P44l26K89j166R51N03o95K19J98l79o20O47
4864c0j46J16Q21m32r53J63J155j313k74P55k0k2k42O53p05J73o10M25M10J068
4884I92l3n30j635K81J881j330K6M15K75l25M62r12J313k77j101J148q92K34k56
4903b64K49J35n42L96J71J38m61N24k081K703j019L57q14N24o56P97p28k81Q04
4922d8k76L18n65P78q6P46r67L36o71J9J176q62L06m08J29K15J36j77n89J83r64
4943a271J136J7R32j257N96r62N62J244j163L78p57N43l84N85j100J771j013P16
4961E73l90K40O8o99j20P6lK21l7k7o29M92K15j51k92L24R9K16N98r20M91j07
$$ plain form
4824 -225 405 -378 645 -59 43 238 -193 -72 66 -243 124 -987 -318 393 -67 -152 -440 337 -219 463
4844 463 196 209 -534 -461 676 -618 -228 -395 349 23 312 -854 97 600 -95 124 322 -57 -677 -30
4864 -30 -176 -60 761 329 -624 -461 694 -619 -893 -138 -158 -180 -422 231 -474 -301 -911 -486 -76 992
4884 992 959 429 -1206 -925 956 -374 -348 67 342 17 479 -433 880 603 -498 650 -242 -8 -264
4903 -264 -15 120 -422 -26 145 283 -178 346 -1735 968 -51 306 -508 16 -640 157 -571 -852 -48
4922 -48 -324 -6 -571 207 121 867 -100 236 -435 -416 760 -102 204 -204 -75 140 276 99 -490 -307 -1271
4943 -1271 -135 -118 814 -443 153 -809 -247 997 -166 212 -545 -2 -386 199 -901 870 -143 573
4961 573 183 423 491 -208 -328 -252 -255 -34 -71 -98 -727 -235 -20 -171 -463 -139 -40 176 774 -146 345 238
4983B38q5k62K60l16o54J163Kr44O33p33N4N68m71K81k37R25j344J126R07n7r67
5004H7N07j374Q36P25j134J082r34J32L49j185M54O23m93m1L22n03k37J047o63
5023d00J95O66R8J69J1m80j640J91P24P38M07k25k54r91O93K79O0lp86O44k80
5044a84M7q0M62l95J023l38k81N14n48m74J238j429J097j81R0o41NN98q57L02
5064c2M86r61J507o13k27m26n19J441j351j73Q76m65K29P12M3o56J6P55l23k42
5084G7j009LJ563j350K02J181q48L00k92n72J423J84j422K97m15M61N55k00k14
5103g6O55j191O86l53j53N13K04o67k8m9J009l53o1j061P11P53J98j030L85j23
5123c1Q2L64n60L03k50m29M82l9P53j113j061K618j174J195j434J129n73m85L87
$$ plain form
4983 238 153 -109 151 -165 -819 344 346 -598 35 -698 -644 -76 -547 -266 -503 422 -922 204 1111 1054 87
5004 87 594 -780 56 781 -353 729 -205 -73 276 -909 -455 168 -325 -366 -44 -547 -784 263 -400
5023 -400 -205 461 559 728 739 259 -1381 -1190 -466 272 679 454 200 -791 -98 181 241 238 -548 96 -184
5044 -184 -137 -217 245 -150 873 535 254 768 220 -254 984 -445 652 471 561 -80 -75 523 -334 -32
5064 -32 454 -507 1000 387 160 -266 -785 656 -695 -868 8 -457 -228 484 527 -129 -113 642 319 77
5084 77 -932 -929 634 -716 -514 667 -181 119 -173 -745 678 862 -560 -263 -678 -217 338 138 -76
5103 -76 579 -612 74 -279 -432 81 285 -382 -410 -459 550 197 136 -925 -214 539 737 -293 92 -31
5123 -31 51 415 -145 158 -92 -521 -39 -78 675 -438 -1499 1119 -55 1140 -294 835 262 -223 164
5142A64q87J068N7l36O63o29j366J339N05j432R51m68J008p32rK61k42r6m89J107
5162D37M15o77r9L49r56L86j10Q3P22K98q2j017p7M57q84J850J63n21j255O5R01
5183D48o42Q96r20q53J336J23l85R80j358J601j096j562K066p34J07J69q69Q77
5201A84l1L16o23j022J412o72M21J099j83r34J14O1p91N49r53J093K64r9M25J05
5221G35m39K59l34J08m30n33J223j046N12K83j007n34K63O20O00K23r08k61N21
5240a45P1j6l38q75J534j63l41N51j781J916m98r89R99N58Q8j090P80l12m66O74
5260A57m04O71j378O62J82N09j22q76M95R95o3j162R96O71k15j304K74K4k04j412
5280a504J996o59P08k59o05L15n08M68j78N15j03q1l49J201r21N30o53K23K06
$$ plain form
5142 164 -723 345 402 66 729 100 -1266 73 578 -854 97 -371 637 -95 -104 157 -85 -181 -670 437
5162 437 852 175 76 425 -531 -145 -255 -172 550 848 766 -251 -328 129 -755 1095 1258 737 -518 -453 448
5183 448 -194 702 -218 -1071 265 388 3 983 -375 1226 130 -1432 634 -100 7 176 -693 184
5201 184 153 469 -154 -1176 236 -436 -15 1084 901 -33 81 142 -649 -100 -1053 40 304 205 630 735
5221 735 296 555 221 329 -101 -634 589 -457 55 338 -669 -1203 -940 -320 280 503 -405 -666 -145
5240 -145 -74 -90 -428 -1303 231 68 -273 278 -1503 413 -85 -1074 -75 483 571 -519 261 -51 -517 157
5260 157 -247 424 -954 -292 -110 399 277 -599 -104 891 828 -334 662 1333 1118 -186 88 112 -92 -1504
5280 -1504 492 -167 541 282 -323 -8 -516 -48 -226 289 186 105 -244 957 36 566 -87 136 342
5299C42M44j276J148m17j486O96J0R85p86M23r95Q93j319J020m27R68J06r90l41
5318a002J08R99L52p26o84P03K67n54P93N34j116k21J104j398J780j837K79J894
5336A275j867J110j111M53K46n43N35p4l4M58j41j97p63N99J71J085j378L75l43
5355a44N65q39l61J233o4m72R06r06k21r0M53n71P66P98j090L09M32r68O30L72
5375G38r88O22K60l38Q21j357J002k65r46J81K57O43o31Q76j299Q57j631J659
5393D61n15j58P11n43K23k72J81M98J11j071N88k36k96j58M82R17k55J17J4q81
5413h2o60J026q6K64j510K90P39J27P62j524N87m23J080j689J787j006r3j27M67
5432g1K94p8Q20j166O23K3n35P1R97j644J451q20K64n36O91n38N68j3r45k55P75
$$ plain form
5299 342 786 -490 658 241 -1245 -549 -539 446 -340 83 -912 -19 -1338 -318 -745 223 329 -661 -1002
5318 -1002 -894 105 457 -269 -953 -250 17 -537 256 790 -326 -547 557 -841 939 -898 -619 1275
5336 1275 -592 518 -593 -140 106 -437 98 24 -10 448 307 110 -653 -54 117 1202 -176 199 -144
5355 -144 421 -418 -779 454 390 -82 824 -82 -303 -393 60 -511 255 1053 -37 272 704 -264 366 738
5375 738 -250 372 632 294 1115 -242 760 495 -451 -270 -13 630 -1 875 -424 433 -1198 461
5393 461 -54 -212 499 -44 179 -93 88 586 697 -374 214 -22 -318 -476 6 923 668 785 799 -82
5413 -82 -742 284 198 462 -1048 -758 -19 108 870 -654 -67 -490 590 -1099 688 -318 -411 -538 -71
5432 -71 223 145 965 -201 422 445 -90 -19 978 -666 785 -35 229 -307 384 -154 414 401 -544 -799 -24
5453b4j20l01J65nj28R2L43k4J546j811M08p32k58M68O66L75m38m25J077l6o68
5474A70j238J298P06p16l64m59N34N80j102K82O58J54m26n21J743j365J04o56
$$ plain form
5453 -24 -144 -445 -280 -285 -413 -321 22 -2 1544 -267 141 -591 -849 -381 285 660 222 -203 874 838 170
5474 170 -1068 230 936 220 -144 -603 -69 511 -591 -309 349 503 77 -444 1299 -66 38 -618
$$ [...]
8191c66
##END NTUPLES=NMR FID
##END=
