##TITLE=1H_KYU-20'+DMSO-t
 CDCl3, 108 sc, 
 13.3.2019
##JCAMPDX= 6.0         $$ Bruker NMR JCAMP-DX V2.0
##DATA TYPE= NMR FID
##DATA CLASS= NTUPLES
##ORIGIN= UXNMR, Bruker Analytische Messtechnik GmbH
##OWNER= root
$$ XWIN-NMR		Version 3.5
$$ Wed Mar 13 17:24:28 2019 Russian Standard Time (UT+4h)  she@DPX200
##.OBSERVE FREQUENCY= 200.1315
##.OBSERVE NUCLEUS= ^1H
##.DELAY= (6, 6)
##.ACQUISITION MODE= SIMULTANEOUS
##.ACQUISITION SCHEME= undefined
##.AVERAGES= 100
##.DIGITISER RES= 16
##SPECTROMETER/DATA SYSTEM= spect
##.PULSE SEQUENCE= zg30
##.SOLVENT NAME= CDCl3
##.SHIFT REFERENCE= (INTERNAL, CDCl3, 0, 15.7039)
##AUDIT TRAIL= $$ (NUMBER, WHEN, WHO, WHERE, WHAT)
$$ ##TITLE= Audit trail, XWIN-NMR		Version 3.5
$$ ##JCAMPDX= 5.01
$$ ##ORIGIN= Bruker BioSpin GmbH
$$ ##OWNER= she
$$ F:/spectra/data/she/nmr/H-F/1/audita.txt
$$ ##AUDIT TRAIL=  $$ (NUMBER, WHEN, WHO, WHERE, WHAT)
(   1,<2019-03-13 17:23:00.73 +0400>,<she>,<DPX200>,
      <created by zg, POWCHK disabled, PULCHK disabled
       configuration hash MD5:
       00 E9 B6 7A A2 85 ED C7 34 08 36 98 17 FE 4E 26
       data hash MD5: 16K
       16 34 5E 59 0A B5 DB 20 67 C1 08 B3 F5 27 17 59>)
$$ ##END=
$$ 
$$ hash MD5
$$ 0B 93 B4 B3 23 E8 EA D6 E1 B9 6F EA 1C B0 C6 01
##$RELAX= 
##$RELAX= 
##$RELAX= 
##$RELAX= 
##$RELAX= 
##$RELAX= 
$$ Bruker specific parameters
$$ --------------------------
##$DU= <F:/spectra>
##$EXPNO= 1
##$NAME= <H-F>
##$PROCNO= 1
##$TYPE= <nmr>
##$USER= <she>
##$AMP= (0..31)
100 100 100 100 100 100 100 100 100 100 100 100 100 100 100 100 100 100 
100 100 100 100 100 100 100 100 100 100 100 100 100 100 
##$AQSEQ= 0
##$AQ_mod= 1
##$AUNM= <au_zg>
##$AUTOPOS= <>
##$BF1= 200.13
##$BF2= 200.13
##$BF3= 200.13
##$BF4= 200.13
##$BF5= 200.13
##$BF6= 200.13
##$BF7= 200.13
##$BF8= 200.13
##$BYTORDA= 1
##$CFDGTYP= 0
##$CFRGTYP= 5
##$CHEMSTR= <none>
##$CNST= (0..31)
1 1 145 1 1 1 1 1 1 1 1 1 1 1 1 1 1 1 1 1 1 1 1 1 1 1 1 1 1 1 1 1 
##$CPDPRG= <>
##$CPDPRG1= <>
##$CPDPRG2= <>
##$CPDPRG3= <>
##$CPDPRG4= <mlev>
##$CPDPRG5= <mlev>
##$CPDPRG6= <mlev>
##$CPDPRG7= <mlev>
##$CPDPRG8= <mlev>
##$CPDPRGB= <>
##$CPDPRGT= <>
##$D= (0..31)
0 1.2 0 0 0 0 0 0 0 0 0 0.03 0 0 0 0 0 0 0 0 0 0 0 0 0 0 0 0 0 0 0 0 
##$DATE= 1552483380
##$DBL= (0..7)
120 120 120 120 120 120 120 120 
##$DBP= (0..7)
150 150 150 150 150 150 150 150 
##$DBP07= 0
##$DBPNAM0= <>
##$DBPNAM1= <>
##$DBPNAM2= <>
##$DBPNAM3= <>
##$DBPNAM4= <>
##$DBPNAM5= <>
##$DBPNAM6= <>
##$DBPNAM7= <>
##$DBPOAL= (0..7)
0.5 0.5 0.5 0.5 0.5 0.5 0.5 0.5 
##$DBPOFFS= (0..7)
0 0 0 0 0 0 0 0 
##$DE= 6
##$DECBNUC= <off>
##$DECIM= 2
##$DECNUC= <off>
##$DECSTAT= 4
##$DIGMOD= 1
##$DIGTYP= 9
##$DL= (0..7)
0 120 120 120 120 120 120 120 
##$DP= (0..7)
150 150 150 150 150 150 150 150 
##$DP07= 0
##$DPNAME0= <>
##$DPNAME1= <>
##$DPNAME2= <>
##$DPNAME3= <>
##$DPNAME4= <>
##$DPNAME5= <>
##$DPNAME6= <>
##$DPNAME7= <>
##$DPOAL= (0..7)
0.5 0.5 0.5 0.5 0.5 0.5 0.5 0.5 
##$DPOFFS= (0..7)
0 0 0 0 0 0 0 0 
##$DQDMODE= 0
##$DR= 16
##$DS= 0
##$DSLIST= <SSSSSSSSSSSSSSS>
$$ [...]
##$SUBNAM2= <"">
##$SUBNAM3= <"">
##$SUBNAM4= <"">
##$SUBNAM5= <"">
##$SUBNAM6= <"">
##$SUBNAM7= <"">
##$SUBNAM8= <"">
##$SUBNAM9= <"">
##$SW= 330.908255636489
##$SWIBOX= (0..15)
0 0 2 0 0 0 0 0 0 0 0 0 0 0 0 0 
##$SW_h= 66225.1655629139
##$TD= 16384
##$TD0= 1
##$TE= 0
##$TE2= 300
##$TE3= 300
##$TEG= 300
##$TL= (0..7)
0 120 120 120 120 120 120 120 
##$TP= (0..7)
150 150 150 150 150 150 150 150 
##$TP07= 0
##$TPNAME0= <>
##$TPNAME1= <>
##$TPNAME2= <>
##$TPNAME3= <>
##$TPNAME4= <>
##$TPNAME5= <>
##$TPNAME6= <>
##$TPNAME7= <>
##$TPOAL= (0..7)
0.5 0.5 0.5 0.5 0.5 0.5 0.5 0.5 
##$TPOFFS= (0..7)
0 0 0 0 0 0 0 0 
##$TUNHIN= 0
##$TUNHOUT= 0
##$TUNXOUT= 0
##$USERA1= <user>
##$USERA2= <user>
##$USERA3= <user>
##$USERA4= <user>
##$USERA5= <user>
##$V9= 5
##$VALIST= <valist>
##$VCLIST= <CCCCCCCCCCCCCCC>
##$VD= 0
##$VDLIST= <DDDDDDDDDDDDDDD>
##$VPLIST= <PPPPPPPPPPPPPPP>
##$VTLIST= <TTTTTTTTTTTTTTT>
##$WBST= 1024
##$WBSW= 4
##$XGAIN= (0..3)
0 0 0 0 
##$XL= 0
##$YL= 0
##$YMAX_a= 599972
##$YMIN_a= -311694
##$ZGOPTNS= <>
##$ZL1= 120
##$ZL2= 120
##$ZL3= 120
##$ZL4= 120
##$ABSF1= 10
##$ABSF2= 0
##$ABSG= 5
##$ABSL= 3
##$ALPHA= 0
##$AQORDER= 0
##$ASSFAC= 0
##$ASSFACI= 0
##$ASSFACX= 0
##$ASSWID= 0
##$AUNMP= <proc_1d>
##$AZFE= 0.1
##$AZFW= 0.1
##$BCFW= 1
##$BC_mod= 2
##$BYTORDP= 1
##$COROFFS= 0
##$CY= 11.3945322036743
##$DATMOD= 1
##$DC= 2
##$DFILT= <>
##$DTYPP= 0
##$F1P= 18.9103706918063
##$F2P= -1.10871071338519
##$FCOR= 0.5
##$FTSIZE= 0
##$FT_mod= 4
##$GAMMA= 1
##$GB= 0.15
##$INTBC= 1
##$INTSCL= 1
##$ISEN= 128
##$LB= 0.24
##$LEV0= 0
##$LPBIN= 0
##$MAXI= 10000
##$MC2= 0
##$MEAN= 0
##$ME_mod= 0
##$MI= 1.114404
##$NCOEF= 0
##$NC_proc= 0
##$NLEV= 6
##$NOISF1= 3.799351
##$NOISF2= 2.8
##$NSP= 1
##$NTH_PI= 0
##$NZP= 0
##$OFFSET= 15.70392
##$PC= 1
##$PHC0= -9167.512
##$PHC1= 25.40026
##$PH_mod= 1
##$PKNL= yes
##$PPARMOD= 0
##$PSCAL= 0
##$PSIGN= 0
##$REVERSE= no
##$SF= 200.130013532006
##$SI= 16384
##$SIGF1= 3
##$SIGF2= 2
##$SINO= 400
##$SIOLD= 16384
##$SREGLST= <1H.CDCl3>
##$SSB= 0
##$STSI= 0
##$STSR= 0
##$SW_p= 3612.71676300578
##$SYMM= 0
##$S_DEV= 0
##$TDeff= 0
##$TDoff= 0
##$TI= <>
##$TILT= no
##$TM1= 0
##$TM2= 0
##$TOPLEV= 0
##$USERP1= <user>
##$USERP2= <user>
##$USERP3= <user>
##$USERP4= <user>
##$USERP5= <user>
##$WDW= 1
##$XDIM= 8192
##$YMAX_p= 0
##$YMIN_p= 0
$$ End of Bruker specific parameters
$$ ---------------------------------
##NTUPLES= NMR FID
##VAR_NAME=  TIME,          FID/REAL,        FID/IMAG
##SYMBOL=    X,             R,               I
##VAR_TYPE=  INDEPENDENT,   DEPENDENT,       DEPENDENT
##VAR_FORM=  AFFN,          ASDF,            ASDF
##VAR_DIM=   8192,          8192,            8192
##UNITS=     SECONDS,       ARBITRARY UNITS, ARBITRARY UNITS
##FACTOR=    1.51e-05,      1,               1
##FIRST=     0,             0,               0
##LAST=      0.1236841,     0,               0
##MIN=       0,             -311694,         0
##MAX=       0.1236841,     599972,          0
$$ Real data points
##PAGE= N=1
##DATA TABLE= (X++(R..R)), XYDATA
0 -15 0 -23 3 -44 19 -65 49 -83 80 -114 131 -151 183 -211 241 -271 329 -366 435 -472 552 -606 701
23 701 -772 885 -973 1110 -1218 1382 -1536 1738 -1935 2191 -2467 2804 -3202 3700 -4314 5126
39 5126 -6248 7877 -10530 15524 -28386 105589 599972 391762 370379 305274 280735 230306
51 230306 203287 159245 131286 91479 65321 29965 4819 -26441 -47804 -74644 -93128 -113484
63 -113484 -126736 -143029 -151579 -160589 -166065 -168867 -168279 -166585 -160892 -154943 -144171 -133742 -119487 -106271
77 -106271 -91080 -73155 -56004 -38598 -19845 -2266 16732 34998 51751 68220 83355 97677
89 97677 109846 120220 129090 137986 143384 148376 149826 151151 150592 145796 141562 135951 127566 119609 108036
104 108036 97456 86760 74508 60636 47481 35536 21891 9083 -3711 -14768 -26173 -36760
116 -36760 -44860 -53652 -59361 -65308 -69263 -72964 -74560 -74581 -73113 -70664 -67015 -61648 -55656 -49095 -42539
131 -42539 -34304 -24283 -15284 -5657 4606 13994 23489 31834 42543 50695 59012 65969 72767 79517
145 79517 81761 86527 87699 89126 90394 89783 87223 84882 81772 77398 71198 66513 58012 52855 43777
160 43777 37893 28832 20939 13217 4009 -3330 -10175 -17608 -23786 -29939 -35349 -38484 -43428 -45567 -47931
175 -47931 -48241 -49313 -49149 -48153 -46613 -43696 -40217 -36062 -30585 -25361 -21283 -14271 -8806 -2824 4211 8461
191 8461 15571 21127 26497 32632 37913 40475 44554 49138 50370 53080 53867 54037 54363 54305 52038 51795 49035
208 49035 45650 41922 39377 34439 29377 25467 20553 15911 10292 5447 1243 -2183 -7883 -12296 -14332
223 -14332 -17344 -20291 -23259 -24663 -25973 -25874 -25698 -25277 -25071 -24167 -22900 -20615 -18684 -15304 -12314 -9479
239 -9479 -6277 -2127 1763 4551 9336 12831 15657 18469 21193 23672 24736 26909 28517 29923 30598
254 30598 30747 31437 30610 29425 27395 25665 24553 20907 18251 14901 13212 9910 5865 3134 -1897 -3819
270 -3819 -6838 -9429 -13128 -15397 -18005 -20169 -21803 -23078 -24025 -25249 -25088 -25540 -24999 -24142 -23776 -21712 -19426
287 -19426 -17235 -15408 -12422 -10327 -7496 -4983 -973 2184 5321 8453 10671 13092 15438 18170 19272
302 19272 21997 23618 25594 24769 26718 27601 26896 25313 25618 25516 22687 21494 19663 17430 14889 13054
318 13054 9840 8491 4646 974 164 -3397 -5677 -8434 -10907 -12270 -14152 -16117 -18529 -18866 -19153 -20355
334 -20355 -21806 -21670 -21295 -19842 -19761 -17906 -16096 -15760 -13931 -12151 -10172 -8139 -6074 -3403 -1335 1682
350 1682 3336 6627 8750 8752 11769 12427 15781 15253 16768 16914 17801 18242 17914 17954 17528 17005 15346 14462 12525
369 12525 11228 10593 7192 6040 4151 1929 85 -1940 -4679 -6200 -8556 -10278 -12771 -13362 -14763
384 -14763 -15041 -16505 -17739 -17868 -18389 -18349 -18655 -17631 -17461 -16397 -14948 -13894 -13768 -11370 -8938 -7175 -6167
401 -6167 -4845 -2176 -227 1903 3005 4570 6526 8708 10181 12377 12252 13138 14035 14302 14303 15101 14122
418 14122 14255 14216 13423 12168 11959 9904 8953 7829 6225 4425 2446 414 -732 -2207 -4637 -5446 -7261
435 -7261 -8909 -10329 -11567 -13354 -13570 -14669 -14302 -14139 -15454 -15192 -15198 -14968 -13359 -13992 -12821 -11282 -9553
452 -9553 -9215 -7402 -5718 -4459 -3203 -1520 -212 1040 3563 5366 6301 6763 7864 8899 9346 10097
468 10097 10316 11328 10365 10615 10475 10177 9277 8768 6872 6959 5542 5219 3249 1651 712 -1894 -3252 -4378
486 -4378 -5965 -7613 -8410 -10053 -11221 -11341 -12201 -12845 -13500 -13876 -13627 -14496 -13573 -13752 -13293 -12968 -12328 -10752
504 -10752 -10023 -8913 -7346 -6141 -4416 -2556 -1091 -661 1745 3043 5176 5911 7519 9583 8664 9755
520 9755 11436 12412 11417 13455 12311 12522 11487 11427 10268 10570 8727 6959 5804 4908 4154 2414 1332
537 1332 -1630 -2767 -5011 -6153 -7842 -8523 -9324 -10113 -11755 -12240 -13888 -13827 -15037 -14979 -14745 -15206 -15196 -14379
555 -14379 -14562 -13346 -11608 -10596 -10063 -8841 -7026 -5368 -3705 -3149 -1278 -61 2569 5049 4318 6681
571 6681 7928 7951 10618 10469 11691 10933 12090 11631 10628 11504 11177 10420 9388 8327 7860 6519 5922 3978
589 3978 2560 1813 -354 -1695 -4354 -4327 -5313 -7232 -9228 -10298 -10994 -11869 -11131 -12642 -13235 -13515 -13211 -12358
607 -12358 -12982 -12835 -12036 -11165 -9650 -9861 -8456 -6974 -5355 -3477 -3814 -1526 -970 1369 3348 3981 5702
624 5702 5125 7234 8690 8917 10103 10193 11143 10888 11728 9712 9613 10120 9544 8688 6856 6954 4231 3189 1998
643 1998 2349 4 -1945 -3159 -4321 -5818 -6792 -6930 -8185 -9057 -10925 -10619 -11825 -11653 -11631 -11621 -11838 -12904
661 -12904 -12300 -10091 -10519 -9804 -8851 -7440 -6307 -5262 -3490 -2355 -1062 -447 904 2398 4226 4789
677 4789 5660 7024 7324 7807 9119 9134 8844 9042 9156 9839 8001 8244 8396 6651 6572 5805 3749 2224 2851
696 2851 1508 35 -1259 -2808 -3129 -4838 -5732 -7396 -7322 -8911 -7996 -9524 -9630 -9884 -11702 -10350 -10651
713 -10651 -10614 -10395 -10440 -9025 -7364 -6774 -6296 -5036 -4392 -3139 -2584 -818 74 1657 2929 3664 4891 5476
731 5476 5664 6765 8078 7744 7496 8357 8282 8329 7943 7685 6683 7390 7038 6326 5443 3831 3434 1186 1821
750 1821 -843 -1590 -2498 -3852 -4616 -4773 -5418 -6766 -6704 -8162 -8350 -9436 -8637 -8503 -9302 -8148 -9337 -8891
768 -8891 -8178 -7437 -6891 -5911 -5598 -4804 -3429 -2171 -2197 -290 -446 1381 2281 2394 4982 4840 4528 5766
786 5766 5004 7620 7138 6560 7318 7549 7083 7108 6444 5625 5014 4757 3765 3033 3061 1695 145 435 -1389
805 -1389 -3381 -2294 -3249 -4575 -4987 -5781 -6383 -6902 -7285 -7451 -7237 -8105 -7304 -6316 -7987 -6888 -5513 -6505
823 -6505 -6178 -4449 -4881 -3203 -3340 -2290 -1592 -1365 -280 214 2162 2655 3715 3321 4709 3990 5378
840 5378 5866 5988 6566 5683 5674 5447 5437 5382 4446 4985 3683 3484 3233 1752 909 -101 -84 -1180 -968 -1971
860 -1971 -3128 -2759 -3598 -3781 -5036 -5500 -6039 -6086 -6241 -6001 -5620 -6881 -5706 -5816 -6535 -4808 -5460 -4535 -3860
879 -3860 -3903 -3046 -2041 -1568 -1354 -314 950 155 1789 1530 2223 3116 3748 3632 5034 4452 4015 5309
897 5309 4482 5233 4040 4946 4164 3910 4182 2984 2657 2362 1379 437 1340 726 -740 -542 -2114 -2522 -2400
916 -2400 -1975 -3280 -2642 -4236 -3630 -4153 -3813 -3477 -4435 -4561 -4697 -3689 -4163 -3031 -3021 -3554 -2946 -965 -913
935 -913 -1113 -1481 -1341 155 566 1235 919 1915 2179 2087 3023 2918 2355 2661 2878 2485 3171 3311 3247 2647 3176
956 3176 2343 2017 950 1357 1032 272 184 50 -540 -707 -1320 -1755 -2292 -2897 -3143 -3074 -2392 -3270 -2574 -2903
976 -2903 -3096 -2745 -2941 -3686 -2661 -2487 -2926 -2687 -1685 -1814 -1263 -652 -386 -1358 18 569 375 1240 2127
995 2127 2472 2210 1880 1221 3196 2256 2738 1891 2997 2259 3125 2972 2919 2872 2093 1469 1046 1470 1119 1171
1015 1171 500 93 275 -272 -949 -1222 -686 -1596 -2045 -2703 -2003 -2014 -3267 -2571 -2598 -1960 -2489 -2535 -2888 -1689
1035 -1689 -2187 -1656 -834 -1412 -97 -1740 -293 -682 422 281 609 1153 1255 941 353 1588 1474 1772
1053 1772 1553 1895 2174 2055 2264 2911 3004 1741 1902 2616 950 1074 1662 1400 957 568 206 311 462
1072 462 -505 -181 -772 -679 -1597 -1497 -1627 -2673 -1375 -1672 -1140 -1243 -2266 -1397 -922 -1027 -1689 -777 -1245
1091 -1245 -570 -924 -939 -139 -91 615 742 255 754 -718 835 1226 1490 1611 1645 1065 2000 2801 1014 1511
1111 1511 1511 1564 1254 1466 1437 1158 431 469 1343 833 -82 1070 110 -931 -787 -639 -413 -789 -159 266 -1444
1132 -1444 -1306 -1170 -1139 -1350 -1099 -822 -836 -1726 -1302 -949 -1235 -642 -406 -917 -878 -205 -400 -720 396 -475
1152 -475 434 1229 760 676 1215 1646 911 1519 1595 233 1403 1696 1461 1129 1456 1562 1400 1116 908 449
1172 449 721 148 761 -230 231 175 -385 -63 -827 -643 -248 -109 -437 -223 -1131 -1873 -965 -1849 -1390 -828
1192 -828 -12 -405 -775 -1227 -502 -1573 -288 -335 -97 -161 121 201 441 -200 273 -13 1216 -286 163 1283
1212 1283 1381 1374 1000 857 652 304 974 642 598 1422 1354 -758 855 749 426 754 724 63 337 -68 571
1233 571 312 -326 -759 121 99 -419 -437 -645 -471 -534 730 -506 -640 128 231 -926 -387 -60 -90 -645
1253 -645 639 -93 241 -202 -359 98 710 -324 -192 247 554 370 685 826 1328 694 1102 1042 259 830
1273 830 1841 209 1100 1381 928 407 1535 761 422 815 -121 -910 -289 -469 -398 -153 -136 -785 -63 -1137
1293 -1137 -312 -1241 -448 -649 -390 543 -232 350 -589 560 -281 128 398 -384 -668 1240 -297 -605 262
1312 262 905 379 1006 -71 503 1126 661 342 759 658 833 878 1 1592 89 1206 633 -504 607
1331 607 750 -714 -186 290 -227 1218 175 262 -879 326 192 -969 -814 -213 -641 -1535 -18 -1044
1349 -1044 119 -882 -724 594 -873 -1279 -724 -531 -334 85 -157 -172 -59 -581 68 -75 109 760 311
1368 311 0 1153 -74 286 -346 66 1581 1645 632 1533 866 474 -167 667 630 629 870 98 77 -289
1388 -289 -262 229 182 -214 -961 205 -1873 -206 -719 -1330 -633 -592 -16 -508 -1469 -764 -668 -792 -750 101 -410
1409 -410 240 -246 21 387 156 -379 -175 -501 -324 -230 283 627 587 628 913 278 415 545 606 573 801 1549
1431 1549 964 578 292 66 591 751 -49 313 1284 83 -226 58 315 175 -562 -723 -712 -626 -1594 -1638
1451 -1638 -1402 181 -286 -157 -1208 -506 -565 226 -54 -539 -743 -683 72 -183 -165 535 -567 1146 1116 71
1471 71 1066 1041 11 632 1127 1086 572 -216 278 1321 1054 610 1238 630 700 -148 217 -437 385 867 -470
1492 -470 -41 265 -871 10 566 305 -712 115 25 -1160 -877 -1248 -559 -760 -68 360 -377 -942 -760
1511 -760 -714 292 271 -516 -622 -982 526 -224 -498 166 467 377 -450 945 529 479 525 479 525 157 473
1532 473 484 96 -225 -28 944 -267 603 783 -53 500 326 -248 646 -140 -960 -878 1046 184 -556 -317
1552 -317 -996 -113 -364 61 -331 17 -347 -127 -199 -1107 -74 -1014 -897 -703 -154 -1197 -913 -789 -719 -1
1572 -1 969 757 -83 676 925 676 853 659 1191 352 212 110 567 1489 -213 511 718 -199 1069 297
1592 297 36 145 -192 242 -151 -514 -193 -852 -127 853 -848 -1346 -681 -389 -551 -906 -748 -1549 -1290 -1357
1612 -1357 -929 -211 -457 -229 -239 -18 219 -261 -907 690 290 184 579 381 752 1140 1592 432 1326
1631 1326 658 -1153 1329 645 741 1450 168 821 1423 238 215 -349 991 -10 969 590 493 538 -188
1650 -188 -460 -688 -164 -39 1010 -1360 -116 -350 -463 -517 -954 -1435 -1718 -817 -761 -1012 -16 408 -1125
1669 -1125 -760 605 -553 136 459 22 -335 698 807 487 628 466 -166 572 769 475 45 -460 688
1688 688 1770 -104 677 11 524 -82 438 644 534 690 121 3 171 898 -2 -660 -71 539 -484
1707 -484 -491 -408 193 -726 -1392 -291 -1146 -1357 -1186 -905 -871 -1168 -353 -419 -1518 -1070 255 -902 168 -542
1727 -542 200 317 851 -471 155 415 499 759 866 604 1005 471 1109 347 999 93 956 1826 486 1343
1747 1343 155 196 -213 -201 1187 -249 1053 -727 200 -258 -370 1426 -853 -463 -707 -434 17 -1162
1765 -1162 -438 188 -913 -591 -1413 -967 -959 -335 -508 760 392 -163 -351 -899 -375 -1169 -323 -616 738
1784 738 -561 1139 985 -582 248 -301 552 1582 325 1917 623 -39 1557 330 1547 715 876
1801 876 371 395 -646 657 -169 -413 221 535 161 -393 -613 -17 -671 -192 -792 -1578 50 -868 -1497
1820 -1497 -921 64 -942 -269 -315 -544 -571 -1088 -678 -678 -1277 -611 -65 -91 -328 -274 68 -835 350 -710 641
1841 641 1632 753 1771 1054 383 590 322 417 1542 1284 742 824 929 -742 485 -193 503 210 122 404
1861 404 -341 41 260 -30 -445 -1792 -459 -31 -48 -1127 -244 -1291 -132 457 -1723 -678 -1258 -1327
1879 -1327 -1009 -715 -491 390 -383 -1188 328 71 -305 -587 -22 -151 656 184 -404 978 50 1014 -555
1898 -555 632 1307 608 970 574 1354 261 1103 1572 556 247 1039 537 1105 -327 804 352 -118
1916 -118 -990 231 -355 590 -495 -582 -1199 -722 -1082 -517 -1563 -1096 -1132 -464 1 -1894 -80 -766 -883
1935 -883 -315 -141 -223 -24 -530 -263 137 -2 -96 479 588 1025 -211 236 -3 -234 632 666 284 406 129
1956 129 1585 805 963 -107 553 42 287 363 -2 1345 285 -96 81 -228 -734 -94 5 -603 459
1975 459 -84 -477 -337 0 -1115 -667 -1090 -1107 -1016 -1352 -644 -811 -628 74 -177 -46 -44 -146 841 387 489
1996 489 -666 498 -106 284 1086 326 -220 895 407 -336 46 166 1450 902 548 224 1228 629
2014 629 249 1294 -10 -230 595 -226 787 166 -175 610 -211 -1276 -706 -1093 214 -159 56 -343
2032 -343 -554 -828 -288 -909 -319 761 -55 -818 -1022 -856 301 -196 240 -105 -907 -822 -711 286 43 -799
2052 -799 768 184 -61 112 597 -314 764 454 875 1178 463 1501 208 1101 589 0 1259 1321 259
2071 259 -64 890 454 1182 1207 -187 -198 503 -350 743 -29 319 137 -251 287 -99 -1083 -1178 -192 -353
2091 -353 15 -126 -561 -1723 -93 -18 -213 -17 -297 17 -24 -149 181 988 -471 14 -223 -169 859 872
2111 872 747 612 1349 1185 818 823 1572 1011 718 -789 -517 11 -326 -168 -91 879 -495 -282 179 52
2131 52 612 791 353 -418 869 -537 447 -179 -697 -35 -1111 -465 -475 -939 -541 -694 -491 -982 -1050 326
2151 326 566 -35 -113 200 -455 -80 210 -277 533 234 -33 -67 -1073 -332 1001 240 -458 505 993 556
2171 556 623 -157 -329 746 -89 480 181 -635 108 201 904 564 225 571 805 365 -1026 -339 -379 243
2191 243 -982 -582 -446 -923 431 -392 -47 -827 -787 -569 108 -157 -509 -844 97 -957 -505 -491 -464 -994
2211 -994 52 209 -218 426 38 578 -351 395 355 476 226 383 1238 861 1237 815 -761 -530 -426 565
2231 565 1004 634 -307 -204 -92 -330 995 -40 -190 340 -1053 -199 97 -109 74 -879 -1110 146 -639
2250 -639 -674 -1013 -58 -113 -278 -229 -851 -39 -1199 182 42 197 -577 90 -178 -143 -402 244 -269 1216
2270 1216 1483 282 140 839 1691 426 65 795 1138 282 193 668 793 789 998 137 511 -440 -68 -402
2290 -402 671 422 102 146 59 -479 -121 -233 -257 -196 -1004 -404 -84 -1096 -594 -892 -887 -137 268 208 1228
2311 1228 -248 -116 87 -371 241 -447 325 -569 -766 151 176 -483 54 351 125 36 587 264 296 704
2331 704 -648 950 375 240 790 671 75 -40 28 -45 340 334 769 84 1075 451 -37 757 -17 -567 -296
2352 -296 -761 -392 -1589 -874 -132 339 748 -256 72 -728 -655 -52 -306 -99 264 -297 -21 -341 -608 -686
2372 -686 -99 90 208 -647 -625 422 344 -445 37 781 184 829 59 628 -207 395 349 231 471 344 410
2393 410 -551 -530 589 674 -175 19 691 -441 104 -159 -4 -76 277 127 85 27 -186 -854 317 137 586
2414 586 -511 -1319 -386 -358 -519 -488 -549 5 359 309 505 498 -152 841 397 241 -669 -480 -43 243 202 -276
2436 -276 -490 287 309 522 -176 784 538 -10 482 -759 307 -456 189 -47 221 -495 -258 1089 -224
2455 -224 -83 -35 -409 -231 -161 -725 -514 -153 448 -241 284 -48 -628 401 -431 481 649 739 -426 335
2475 335 -569 -754 -477 -52 295 256 319 79 547 765 755 26 327 1409 854 388 1116 1281 -153 585
2495 585 77 1003 286 -342 157 185 306 521 -338 47 417 -494 -518 -528 666 -200 -334 95 -5 -489 -916
2516 -916 -897 -395 -70 -476 123 -642 379 -379 -319 -456 -637 -767 -9 102 -1502 -85 433 -342 405 459
2536 459 -368 506 347 1016 630 236 -359 -390 -183 688 777 -256 377 -558 -273 -92 -913 549 -932 -289
2556 -289 77 22 104 -340 -648 278 123 -528 -212 234 -184 452 242 -159 -239 247 260 119 -508 91 -26
2577 -26 236 309 -519 -451 941 668 -370 108 -1339 -786 395 386 -461 -654 123 301 -180 1160 -542 493
2597 493 -213 182 376 -22 -188 -143 170 162 -58 310 672 739 376 -222 1274 33 540 365 -172 -727 -559
2618 -559 174 64 876 396 408 -268 86 -1308 436 357 458 1055 -703 128 -462 512 903 344 141 653
2638 653 -227 -389 453 -641 1296 443 321 272 486 364 21 -220 692 -195 222 -261 318 -901 417
2657 417 537 348 -35 -665 -298 -271 -249 -163 940 252 -1086 -340 156 -507 -577 -448 88 149 377 -939 520
2678 520 -271 -784 403 -314 -239 -523 1116 72 -4 357 267 209 375 -49 164 -502 20 1093 81 -13
2698 -13 50 -159 332 -466 -135 156 49 522 714 -460 121 13 152 437 346 326 97 -654 -802 -349 -322
2719 -322 -310 -271 -262 49 847 39 -955 439 255 -186 188 -286 -228 -352 -440 -473 -104 -140 -174 -474 -131 340 -54
2742 -54 -87 540 147 253 558 265 1442 603 -504 1061 49 715 1523 1040 710 713 386 -453 155 23
2762 23 1037 1723 297 -50 -503 127 787 70 152 -690 99 6 838 -254 536 -58 244 408 -353 743
2782 743 457 -938 -973 973 464 -12 -220 -414 346 578 -810 97 104 -178 -390 -909 -2 270 104 -677
2802 -677 -165 -156 -425 -396 544 -1423 10 331 -611 265 -410 -141 861 -306 -256 -291 484 144 -730 606
2822 606 318 718 -290 -48 212 330 -93 -436 -645 -104 -112 -45 -171 414 -589 708 -458 -832 -716 -465
2842 -465 588 116 444 -637 588 506 -284 36 555 -50 -520 492 61 -5 -247 -226 442 -11 -195 858
2862 858 95 70 -152 0 308 -44 686 -287 -83 462 -134 -897 -500 -1069 -601 583 -61 -61 54 -280 -364
2883 -364 338 120 781 -456 894 303 -224 -276 203 882 -560 -135 -532 317 261 -6 -122 -294 148 -184
2903 -184 -194 387 349 211 164 -86 -547 88 -201 -584 45 -327 287 584 -673 -1345 550 500 -1371 285
2923 285 -135 -907 -667 383 -80 -202 384 -87 -61 62 188 -1052 46 -649 -289 -313 115 -56 -23 226
2943 226 58 -209 206 -574 -498 334 -81 -60 538 -252 644 737 736 255 -35 1058 -368 33 -607 -155 792
2964 792 888 848 -279 281 202 327 175 -513 -394 137 -33 531 -776 66 -129 -498 -284 -898 -723 147
2984 147 -77 479 -225 -451 -426 238 -341 257 -593 -447 395 -894 -98 -786 39 -174 17 547 583 -275
3004 -275 -511 -918 -70 469 538 -345 272 -156 -814 -481 -29 792 92 -366 -687 -528 1127 588 -798 407
3024 407 723 -760 417 565 19 114 420 745 -608 546 -679 -459 59 -564 346 14 -475 -13 283
3043 283 340 8 648 -483 -331 34 7 -10 -372 -52 326 -874 -660 -519 -755 -1343 802 461 509 783
3063 783 -21 -759 -17 95 251 -210 -192 365 -321 -537 -268 -249 467 -806 -152 379 695 -184 162 868
3083 868 67 224 604 275 -209 -10 34 -657 -65 -90 332 226 60 -687 -14 224 -245 105 698 -1337
3103 -1337 -213 652 -952 291 148 58 447 153 438 -66 53 -56 843 2 -474 344 314 686 -309
3122 -309 341 -429 854 271 418 360 -336 -387 -19 -269 1019 234 445 -55 535 425 -367 -460 -901 220
3142 220 -228 -715 69 594 -1168 154 162 -160 -428 330 635 -262 479 250 -242 -62 -767 -706 -719 1038
3162 1038 -289 -357 257 435 153 -259 166 -430 851 14 313 551 391 858 -634 -742 -561 147 -309
3181 -309 384 -534 -950 -190 -498 -57 -121 191 -540 -885 747 29 -24 102 -128 -247 800 -627 595
3200 595 -109 641 -50 -523 -685 182 -112 1058 549 401 -254 201 535 -349 65 -768 -359 826 -52
3219 -52 -313 -737 -604 -210 -243 684 -511 51 157 -779 382 -429 -270 -343 240 139 -291 770 441 200
3239 200 126 -519 888 -999 -60 -73 -865 443 -287 589 304 -83 -25 -549 336 -578 -425 606 -441
3258 -441 -205 -67 270 405 1094 460 500 -207 258 -69 106 354 1067 3 127 -57 1087 122 822 219
3278 219 -1035 -115 -626 812 -201 -382 -271 -57 458 731 -507 -95 653 51 -361 -123 -749 -123 -981
3297 -981 -695 661 -815 -98 512 245 -35 -560 -546 -194 290 82 695 -64 444 -477 -229 83 257 -318
3317 -318 157 -152 -13 -753 -159 278 -860 715 603 1071 -642 -46 -162 -388 -381 -481 -224 256 -648 364
3337 364 429 -30 527 -447 -24 -420 -49 -202 -787 238 -146 -361 -470 -780 -830 -158 590 634 321 48 352
3358 352 707 999 -1135 -1521 263 -579 -241 -426 -182 -473 -278 -845 165 323 -92 -349 -210 441 -35
3377 -35 -151 -114 -11 -267 45 -286 -816 283 643 392 219 871 613 -805 -30 -470 335 1386 -321
3396 -321 616 249 -824 80 535 287 -403 225 188 -101 701 502 -69 -267 345 -155 430 226 -423 154
3416 154 -324 -135 -564 -497 980 704 361 -251 -521 105 -260 15 546 433 132 417 840 -287 -505 -196
3436 -196 -453 -863 1076 83 525 -499 -82 589 605 -75 133 230 -67 -81 -902 -194 718 440 509 11 -254
3457 -254 -528 76 56 -65 -337 -734 102 -583 -79 563 -498 -431 152 119 247 -1181 722 628 -554 164
3477 164 305 -1240 965 -327 710 159 318 -96 395 1082 1328 493 1 94 113 1526 -601 -1061 143
3496 143 -26 -1162 553 1453 235 -154 102 316 -76 93 243 549 -138 103 391 -407 -56 -104 310
3515 310 -813 21 -1219 462 506 -471 1143 -408 350 472 -448 383 -351 -332 -78 764 480 -819 215
3534 215 -52 389 127 223 694 132 -258 989 -615 -260 349 -741 -568 -70 83 -279 -209 144 -563 -319
3554 -319 -310 -37 1040 42 451 183 -531 164 -297 -275 -271 -314 37 871 -196 -392 130 -280 514 -145 -525
3575 -525 245 -951 -240 -664 -774 -184 329 618 432 175 -318 128 77 193 -161 122 744 176 128 -157
3595 -157 942 118 -188 385 281 -222 688 121 260 -310 -89 -688 -754 423 -385 -1215 168 -348 75
3614 75 41 1322 -432 -402 933 370 -847 726 -552 624 -731 -817 26 335 701 -560 -159 -1148
3632 -1148 1054 660 -500 292 -725 350 960 139 454 -165 789 -335 -53 187 540 -27 -576 -525
3650 -525 -294 197 227 24 590 -150 -453 517 -40 82 191 -30 340 -84 -1208 -1266 353 -248 1128 -139
3670 -139 750 456 -1318 -108 -1117 326 500 -294 759 308 -644 -460 -759 -383 -70 -310 38 -940
3688 -940 -297 226 228 112 450 -364 46 -835 27 197 -807 143 129 201 -354 -134 829 395 -271 -54 485
3709 485 207 384 -256 -191 -1134 -600 -48 281 -885 462 -281 -255 -558 480 -40 534 -613 -886 161
3728 161 75 -36 -562 -346 -430 -31 558 714 529 -281 -954 52 -1268 -351 -308 526 1009 -221 120 88
3748 88 -231 485 517 -338 683 41 -544 -24 1051 169 -484 201 -89 -721 95 964 -345 340 -157 415
3768 415 639 -995 270 -392 359 683 -24 -406 -549 -399 -1067 84 -18 -173 -722 -341 -251 -95 -103 422
3788 422 110 -75 -370 -424 708 655 -408 166 -682 242 -122 768 -364 517 413 587 -232 -650 372
3807 372 113 214 -504 -467 267 402 726 314 98 1389 -916 19 193 -309 -70 6 952 255 693 -1186
3827 -1186 -502 -20 -590 654 73 -33 -239 151 -117 -59 -106 806 -55 -871 -405 -132 -471 -826 -1545 105
3847 105 -265 476 -344 -84 -78 -463 -259 24 -357 586 619 704 -291 -508 -631 564 -272 400 -541 439 -415
3868 -415 784 -52 142 643 510 152 446 55 -619 -621 -266 -17 -43 1011 243 -678 -358 -398 305 99 374
3889 374 200 -624 173 -613 598 390 178 344 954 -430 811 -632 483 -31 -771 188 -571 188
3907 188 -401 419 394 721 276 -179 -58 -114 419 327 347 -322 -97 -214 -67 263 216 143 373 128 -361 -716
3929 -716 86 327 214 470 -49 1390 289 -37 343 410 -112 -1356 94 652 -518 -446 -292 387 162
3948 162 -286 386 663 662 488 -603 597 -139 -355 120 2 -639 297 -478 -577 -502 -102 -306 764 539
3968 539 470 40 132 -527 171 -165 -232 280 -309 524 339 243 -328 241 102 -21 -625 547 368 -618 -765
3989 -765 -495 -872 453 235 267 -507 -1118 -552 -139 24 -290 394 -353 176 -346 203 344 218 396 384
4009 384 -611 -204 18 -406 -316 -185 474 -149 817 -142 97 -614 -647 325 37 370 -194 -549 -360 -121 291
4030 291 -1055 185 -168 409 271 529 -629 -15 528 -148 -548 468 -531 -1689 370 -40 422 1434
4048 1434 70 -800 699 965 859 -344 -476 584 524 -555 198 -859 -1135 4 -224 -384 123 -382
4066 -382 -201 -98 514 -464 468 -860 281 435 247 148 646 41 38 -158 -136 -28 41 -405 -558 -473 261
4087 261 -103 237 -247 -145 619 -163 -12 -596 753 -736 -213 -44 -92 269 435 1093 431 232 155 -294
4107 -294 -1029 681 -685 -641 -254 116 -184 -207 199 -154 -189 303 359 -409 -402 -15 -506 -870 -141 -936 601
4128 601 512 227 -226 -281 -259 307 139 309 188 879 774 402 159 97 -232 -86 92 469 -519 -346 769
4149 769 -624 -75 -334 442 238 909 339 371 2 -35 -187 -119 495 36 -32 105 472 -871 398 -225
4169 -225 55 -529 500 14 832 326 296 134 -810 -458 -360 -180 -272 -34 -755 758 159 439 -335 -1070
4189 -1070 683 -69 385 1 974 401 78 457 -468 -76 562 -654 -260 696 -754 101 312 -269 700
4208 700 369 317 -908 241 -459 -198 -133 547 -730 -156 -460 813 401 -9 -538 338 903 198 -285
4227 -285 1397 391 -1079 108 594 1429 512 442 -1288 90 -1143 15 -772 114 -496 -313 -581 -459
4245 -459 170 -658 -183 -109 231 671 138 -59 36 -768 324 -1449 13 333 136 -78 -604 -184 45 -503
4265 -503 426 564 -736 -381 62 -122 -994 -243 -50 -263 -648 896 487 -302 602 461 1138 20 20 -360
4285 -360 304 -373 -655 446 -275 881 351 -568 -817 131 693 338 165 69 988 256 437 -599 947
4304 947 -745 -881 158 -1169 86 -508 192 663 284 -1070 -518 833 122 -584 346 -821 548
4321 548 185 1316 -239 434 763 209 7 -200 -18 -415 -496 -288 401 98 -441 1271 11 929 100
4340 100 370 592 394 34 -26 1224 -401 111 537 520 628 230 -35 -122 1509 -219 -739 103 -266 -589
4360 -589 775 760 345 -1208 238 569 1155 1219 -18 312 -233 -65 -395 -183 560 -297 -148 -75 684 -963
4380 -963 -313 569 -193 -463 383 -230 526 -197 793 365 346 295 -179 548 245 698 595 671 41 -933 -1031
4401 -1031 -137 -482 -689 236 289 457 792 -652 729 -1157 -106 63 4 -548 278 238 105 -132 -179 -210
4421 -210 -880 -874 -177 -274 -475 32 -408 -640 26 -187 108 122 620 -178 220 496 -141 124 -197 76 -330
4442 -330 163 -863 215 1098 210 -990 -858 196 209 -172 332 483 969 -46 573 125 -12 839 665
4461 665 811 308 -504 187 -294 245 558 -810 276 6 -900 275 -309 -414 708 -417 227 605
4479 605 -739 -677 432 -707 -104 -46 -319 -36 -692 296 -284 -675 32 587 -115 443 -1203 1007 -474
4498 -474 -237 199 324 -403 324 650 -132 175 -59 964 -623 242 -826 521 -458 -1280 416 156
4516 156 -468 -247 548 790 -64 -296 -315 206 -293 948 496 -94 -296 -509 -51 -357 108 -192 804 -55
4536 -55 -160 603 613 193 -356 -390 -264 470 -156 265 -88 -1100 290 -266 24 18 -111 -331 961 65 -476
4557 -476 -825 315 196 -206 128 253 850 -24 167 201 -97 250 -483 114 -591 399 7 95 51 -353 -547
4578 -547 662 312 -195 -62 644 -540 235 -54 -53 -826 -486 427 568 -363 -185 307 255 -62 270 251 -378
4599 -378 -99 -298 455 -96 74 424 582 312 513 293 -84 636 -587 166 928 568 641 -178 -279 -1184
4619 -1184 345 1362 -1513 800 -710 -487 -398 -200 1190 -312 -223 -371 276 378 360 -456 64 230
4637 230 57 78 286 -74 290 5 -348 240 -15 229 -1436 -194 142 284 18 176 166 1126 -780 -12
4657 -12 -1086 420 -383 238 -472 -329 0 17 364 140 -463 -288 555 -227 -234 -567 14 156 22 -90 206
4678 206 47 -176 564 -311 -177 -111 -438 -1564 -151 -272 -882 750 624 -303 370 78 -745 136 -726
4697 -726 -592 335 -7 654 376 -169 -316 -226 -1142 -182 -489 358 634 106 -73 -571 282 251 320 -493 104
4718 104 -281 -272 -364 -914 258 -31 728 -13 628 -1188 -756 10 562 480 -459 -156 -700 -271 725 444 1053
4739 1053 106 636 1 584 -339 7 439 384 -434 2 -528 -673 44 -35 267 352 -364 156 -197 -1004 336
4760 336 -906 -188 1033 462 -989 410 -692 -499 845 822 -239 1282 1515 251 349 525 -366 -138
4778 -138 -339 305 390 -319 1403 -621 330 -209 -110 -27 1371 510 161 -475 -324 585 -344 -73 -773 730
4798 730 -544 -130 -168 -285 111 218 506 634 203 -515 -575 75 -67 896 -591 -78 962 47 872 -1256
4818 -1256 119 34 -3 -564 611 -134 -47 -68 -612 1156 92 194 65 -127 251 -754 -838 -765 155 271
4838 271 -556 -411 384 -166 152 590 -605 -496 -652 -140 1216 -151 -6 -373 -405 -85 -568 198 588
4857 588 59 826 374 -652 359 -624 78 -512 -839 653 -71 844 -640 386 1116 -712 260 444
4875 444 797 -168 -337 634 529 250 187 -49 102 693 202 32 -534 -276 170 413 920 1029 52 -134
4895 -134 91 -433 -60 106 -24 295 -518 94 -18 123 -1128 791 -446 256 -475 708 269 725 -254
4914 -254 -169 662 -119 -941 85 314 -1360 1500 362 174 -829 102 -320 545 898 517 -160 -164 -436
4933 -436 -386 61 -285 199 125 254 -485 -205 -406 -466 -278 -340 -397 -8 1236 -428 420 140 -540 -84 460
4954 460 -523 -797 499 311 -185 -246 287 37 -588 428 -219 1046 101 -956 -7 492 539 -81 132
4973 132 -1135 1522 481 -384 481 479 920 -20 183 -724 -1115 -2 -142 -307 401 66 -841 -239 -1430
4992 -1430 -250 -556 -16 -657 550 304 -714 -85 -526 -198 -256 -370 -519 -898 -497 491 7 -335 -133
5011 -133 424 -115 261 -272 185 -1104 176 -316 -518 294 -2034 983 465 410 1165 -87 -120 604 219
5030 219 -464 -204 -456 -119 229 117 9 378 57 -508 -193 -132 221 1082 1029 -149 334 -1120 269 -321
5050 -321 -458 -431 -230 15 335 -26 -1180 131 116 390 796 105 74 154 -216 -164 -273 -588 -343 183 739
5071 739 1215 -753 -178 -100 -742 -701 111 -143 628 710 399 1367 -130 214 243 -433 -238 534 -528 19
5091 19 -548 409 520 614 945 -643 -564 -265 819 -453 250 161 222 292 -2 -384 -123 -228 -264 40 697
5112 697 28 396 -137 -947 1057 219 201 487 -918 1974 312 212 304 345 5 -694 174 -293 225 -173
5132 -173 -262 -482 134 379 721 282 307 914 -341 -684 -633 523 212 -275 -724 -618 67 -641 -26 130
5152 130 -218 -182 62 -389 277 156 76 -808 128 -188 -190 -384 1169 28 -500 19 373 -592 -352 -232 -127
5173 -127 -327 -356 1475 -711 137 -87 -821 -252 -1235 -528 -522 -192 -400 56 -1004 -397 -900 46 812 -883
5193 -883 164 863 571 547 -16 1026 1119 -247 400 -334 -347 -761 330 -798 -574 -986 -375 -247 -96
5212 -96 786 470 130 322 472 -813 551 -591 59 -75 178 74 -696 -964 351 -122 662 -436 -531
5231 -531 12 -31 266 -84 632 -797 -284 394 236 -35 -38 560 62 -114 149 -813 -116 64 -214 -460 -279
5252 -279 142 -204 523 -200 -263 434 380 234 -331 -535 -945 9 -147 439 757 -69 420 -293 -301 -1007 529
5273 529 -575 -54 -470 167 479 74 253 -551 -1173 -364 547 -122 791 -771 -511 899 -550 -109 -260
5292 -260 526 -98 44 266 77 709 -736 -891 -127 330 -150 395 -1109 490 -409 -113 633 -621 171
5311 171 249 -66 311 -369 -400 -606 682 -440 232 501 -154 -417 495 -664 -171 -151 -746 95 -182 340
5331 340 685 -415 128 689 -515 -707 104 247 82 574 -392 -437 -708 -377 -616 -458 650 681 254 -569
5351 -569 542 -16 -512 -184 -79 92 -395 679 134 -327 353 -238 157 -198 -273 -255 -1059 246 122 254
5371 254 -592 -616 51 -413 803 537 -256 131 412 -55 -48 -832 -503 -498 24 -272 -443 658 52 -76 -1204
5392 -1204 586 -542 181 914 -190 -158 -3 24 -60 916 10 -215 -1018 297 211 835 686 194 180 922
5412 922 -245 -57 445 23 172 -844 -939 76 -218 -24 -532 652 -530 74 -172 223 18 -143 -65
5431 -65 -366 513 167 52 -252 -491 -679 550 399 336 358 -583 104 553 215 -684 -590 5 313 -108 -384
5452 -384 188 -250 -40 -98 -163 -286 95 -785 444 -79 64 558 107 -520 29 -411 966 200 577 165
5472 165 -53 602 -213 39 192 -69 -96 -285 -646 580 691 -511 -382 57 432 962 752 -341 245
5491 245 -261 -238 -306 -284 376 -35 123 381 -624 42 791 -676 437 -1316 47 12 -34 -310 694 -147
5511 -147 575 -198 -423 312 -206 510 -429 181 357 -168 417 812 -350 250 493 153 -440 122 1525
5530 1525 902 73 -645 628 -19 -609 928 -728 -219 -453 942 -1029 459 310 570 -3 -277 -160
5548 -160 468 119 -39 299 620 614 -42 -815 -663 322 818 1026 -387 -54 72 -71 440 -30 2 144 -84
5569 -84 440 342 -318 -289 62 273 520 25 -244 -304 -643 350 781 -177 -245 -478 -389 -135 -458 527 -304 -518
5591 -518 -281 -863 213 -125 99 -83 580 -523 -563 340 89 46 -57 -391 331 600 -489 617 -1006
5610 -1006 113 -1108 155 -582 494 420 634 627 189 -412 -299 343 258 -59 421 153 -406 -511 632
5629 632 -54 169 154 787 178 131 105 -535 20 122 568 -661 -560 557 -130 -425 -511 588 56 -1140
5649 -1140 256 -61 208 -109 -1028 265 76 -65 707 -1200 202 -497 593 491 -399 1143 -368
5666 -368 -426 -282 307 -813 990 33 964 29 -190 221 203 -647 581 165 76 -300 -207 -1242 -630 -440
5686 -440 296 1 133 -507 581 -909 -90 337 -734 -456 -658 265 -21 180 -657 799 -66 417 826
5705 826 549 74 -291 -777 -904 77 446 812 398 -737 -57 595 -339 -759 1059 3 162 234 -642
5724 -642 -555 784 -165 -655 -32 -555 -89 331 300 -5 716 103 -412 -1074 -351 -844 331 42 -41 887
5744 887 -840 667 673 325 657 142 1094 473 -314 141 13 234 -836 7 -352 641 145 -329 801
5763 801 -435 -525 742 -248 -86 227 -482 264 -273 25 -623 -540 43 1147 1030 110 382 190 -249 -77
5783 -77 -3 -119 -27 683 -250 778 522 323 -933 1191 464 72 -180 115 -116 -236 24 873 1359 -533
5803 -533 -907 -148 -152 -414 914 60 -1179 -72 397 662 -646 248 592 338 -353 79 113 321 547 433
5823 433 468 6 -47 -766 36 -840 797 -389 473 172 217 512 209 -1038 564 534 -33 -223 -671 -774
5843 -774 -335 -21 -61 -690 -246 844 138 -20 -5 182 -36 30 308 208 -619 -19 -323 160 616 -198 -44
5864 -44 -554 -218 -571 -683 505 -363 4 -66 -414 1050 372 166 92 -595 285 56 256 258 -328 -256 -605
5885 -605 581 503 -11 -310 55 -432 -301 281 48 66 550 175 -908 100 147 -53 94 -326 -411 -199
5905 -199 215 -257 756 -739 -82 723 -1079 -135 -323 80 -343 -1661 -1818 -122 -704 -697 -531 -493 850
5924 850 -388 -77 -397 -244 -563 602 -46 -200 45 14 -191 606 -398 -688 -75 210 1577 282 503
5943 503 -182 474 1147 1217 -104 -22 -557 88 150 505 40 -889 300 330 354 201 -143 -90 752 -1606 179
5964 179 283 121 541 -868 147 548 430 1118 -755 678 1154 384 413 101 -123 -424 -709 583 -136
5983 -136 355 -789 -893 134 86 -364 -286 816 587 44 20 -370 140 -146 287 -12 631 -575 -366 442
6003 442 -373 -512 -460 616 82 183 411 -387 -65 -262 -62 -106 564 -111 -766 49 30 -102 -701 -310 -335
6024 -335 -323 391 33 337 -831 -794 -173 432 852 -472 -64 -182 -571 562 538 288 -271 202 -297 187
6044 187 -286 -204 -203 910 -895 406 380 564 -941 -50 1400 -781 -301 -676 -39 -114 477 244 901 170
6064 170 -471 -92 638 -579 211 569 -594 -829 -742 308 192 799 309 -384 100 -675 85 160 -117 18
6084 18 414 -925 639 -911 -890 148 673 -456 21 676 256 593 418 -452 -116 -814 -841 -147 627
6103 627 -323 -126 -995 -288 51 601 1221 17 739 -156 1058 -156 331 -182 -406 -706 792 -748
6121 -748 78 1213 117 957 299 -488 344 628 167 -118 -787 -82 -58 736 908 -181 -215 14 747 278
6141 278 256 589 -313 369 -490 -240 -810 -660 740 725 198 834 -161 -186 -203 435 56 420 -730 688
6161 688 1226 702 795 73 190 -655 -941 -16 418 1027 -415 1348 -1035 -485 164 -624 -379 -51 -320
6180 -320 638 -593 -75 143 382 357 -43 259 457 -48 346 -45 346 807 79 -1055 -91 462 -668
6199 -668 -524 -73 -142 -920 189 321 -170 -639 313 -220 -180 -639 -570 -324 -1011 -208 440 -67 -354 -355 926
6220 926 1377 557 -242 -369 -453 135 -59 450 844 207 56 232 136 382 -449 170 -14 981 -440 -638
6240 -638 -154 772 513 -584 962 -122 361 182 -715 -134 -903 534 -827 -593 1060 492 215 -689
6258 -689 -442 972 -588 -395 642 454 102 -288 -449 -171 -389 -46 -109 -235 -637 333 694 -108 225
6277 225 32 -798 -401 -912 40 412 317 -302 -167 167 271 -222 462 909 -229 -932 -1445 -624 106 -611
6297 -611 -402 -936 -305 -408 -91 582 -539 -494 -431 -167 -376 -51 449 -451 24 510 -504 -384 401 -1794
6317 -1794 422 -65 453 -363 -116 536 115 -100 -439 271 131 22 715 -217 68 -772 -769 -523 30 844
6337 844 -11 78 -315 -491 62 816 -38 -3 201 -860 177 766 -391 -355 -411 37 -423 -98 663 -258
6357 -258 -346 -591 732 410 -548 706 324 -12 -742 143 195 215 -142 -259 126 -238 263 191 1206 703
6377 703 221 215 -98 766 682 -981 -131 217 -369 346 -357 -129 979 -168 843 -331 886 -831 402
6396 402 346 -148 -69 -1254 -604 -296 -193 1093 -518 30 102 460 -327 -640 -321 135 316 -808 -1301 -224
6416 -224 -495 287 181 47 308 214 192 295 273 -1016 739 350 -842 -429 -33 529 9 -306 163 -136
6436 -136 -93 -500 911 180 517 -100 210 16 4 -288 -504 179 -1190 12 -447 -10 -248 164 -134 248
6456 248 -411 -493 -452 374 81 -334 -85 407 -761 419 87 891 -805 -187 -2 383 -483 264 737 187
6476 187 112 -1049 794 -409 1418 -339 1114 688 -845 62 249 319 844 204 -310 -625 844 -472
6494 -472 -657 -429 671 -630 126 512 481 -141 -409 315 287 118 -638 570 -764 32 -1368 -811 418
6513 418 -107 -156 -688 -126 -249 -86 103 -144 414 -146 673 968 -124 192 235 711 310 537 -490 971
6533 971 -456 467 -243 558 477 218 523 -185 170 253 34 -467 -398 -307 392 114 400 18 591 -249 -565
6554 -565 -664 9 -177 -25 361 -1039 -636 -158 -12 510 286 263 106 206 -1105 39 -1292 -75 123
6573 123 1104 -209 -460 -532 542 360 -651 119 175 -333 -750 521 48 -204 1208 108 -637 -103 156
6592 156 -831 -413 89 -116 992 451 -52 -1117 -584 -353 -643 -301 -710 434 -420 -498 479 -685 118
6611 118 173 -706 -264 -1 396 -158 713 -56 -527 857 772 -576 -176 -336 292 565 429 38 -955 -395
6631 -395 80 -675 41 -2 6 -382 181 324 -131 -248 189 -800 393 256 224 170 -466 -386 -631 103 -463 -194
6653 -194 -123 586 -926 -456 -175 581 -255 136 324 -5 657 42 675 193 173 222 -473 -294 -456 392 -466
6674 -466 -852 318 -16 -187 65 1243 777 169 -224 428 144 -134 -404 81 357 -126 362 -580 641
6693 641 368 -88 -619 298 408 37 -482 -657 -25 190 793 -20 399 -613 -538 320 -647 -362 -364 460 -132
6714 -132 778 -337 582 466 -258 -127 -544 2 -169 35 282 169 14 81 519 -449 417 -329 580 95
6734 95 193 585 -18 908 -269 -363 189 -260 -728 135 -675 185 -690 -114 -241 342 -333 487 -83 -476 880
6755 880 366 248 274 631 147 -178 974 -615 89 834 775 842 494 597 255 -371 -866 -663 669 102
6775 102 122 0 -89 131 -171 -232 -249 158 386 -223 -563 -343 -452 -80 -845 493 -257 -34 428 -512 325
6796 325 13 -559 -416 375 571 1251 649 -362 435 244 -155 -1365 -879 388 -7 -413 -613 -223 215
6815 215 -1414 -579 212 231 -590 519 -35 -410 20 -248 560 -446 -874 -968 773 8 332 -36 47 63
6835 63 -114 48 -1215 422 286 -740 128 49 32 -829 72 266 254 -508 530 166 -680 -518 -229 -477
6855 -477 128 -311 -161 -955 356 210 -198 -183 60 -204 197 -300 303 358 -162 -411 -428 64 -404 -616 -134
6876 -134 867 -886 421 -285 242 -523 -105 -520 152 -383 -597 -702 -121 -709 362 -485 217 -491 -424
6895 -424 108 843 -177 759 604 578 -887 -208 224 249 -618 -1015 -464 -727 166 -1364 225 -774 131
6914 131 125 -302 -328 -371 -1087 303 -931 -582 -185 569 602 -467 -229 250 291 458 -1376 -538 161 -24 617
6935 617 521 -699 41 -755 632 34 627 -238 657 342 289 -1017 433 -979 -212 -49 515 -314 116
6954 116 -337 -128 -548 49 668 -469 112 -133 327 -901 -602 172 -291 500 684 133 -1128 -677 -245
6973 -245 -596 457 541 36 -283 -532 -52 -567 -422 -9 -390 -75 -104 -690 1145 297 -282 159 -221 -190
6993 -190 567 169 55 683 -552 105 -843 280 269 -230 -363 123 911 10 -56 154 654 -198 256 871
7013 871 -418 18 -303 802 516 -534 -524 169 -337 -342 -526 -153 -278 501 -180 -65 -497 -366 -357 -140 1057
7034 1057 52 -32 212 -163 -268 97 -460 -1321 -327 -583 42 -515 -504 214 -782 -228 -214 369 -560 21
7054 21 716 -215 39 391 -1500 664 -86 -311 -195 887 -578 721 -463 205 -1160 -468 344 -293
7072 -293 -586 -95 180 366 98 349 -235 321 -250 912 1051 -407 -60 505 63 -377 504 488 251 330
7092 330 -431 -113 791 836 -609 2 89 -932 432 209 586 1198 -344 -139 -86 -341 677 470 545 -1375
7112 -1375 295 1038 -797 325 -428 193 -1149 -547 460 -57 -364 1195 -105 -334 -273 330 -64 -122
7130 -122 184 -596 639 195 675 -219 -374 -264 428 -841 922 1121 238 -807 -864 905 62 -24 19
7149 19 -3 -407 478 -289 782 227 758 -285 610 -387 373 1300 -2 -87 -424 -498 -49 -457 -224 -527
7169 -527 -385 173 -361 937 -543 -70 285 -51 864 -482 -216 586 159 734 160 87 -79 918 -891
7188 -891 345 347 -900 -61 376 -196 -448 25 -1068 344 -162 872 -684 -135 320 494 -197 -87 -428
7207 -428 -420 163 518 -170 -427 -1329 -72 650 233 131 -237 -295 281 -274 -448 728 474 -479 -408 -422 126
7228 126 544 217 501 -151 119 267 210 764 165 355 222 -519 -350 -263 -96 -795 -544 309 -182 305 648
7249 648 -36 -62 -454 -789 540 -18 -991 -672 255 -529 331 204 573 -886 239 564 -256 714 -425
7268 -425 -300 717 421 98 392 370 529 -124 498 234 -292 -37 79 -610 1071 -235 378 -348 370
7287 370 126 -1184 713 232 480 -52 -647 -863 -510 -1347 -67 -26 -434 179 753 1358 -190 463 -211
7306 -211 -634 -566 384 1123 621 1502 -611 353 952 631 -84 -271 1487 1102 732 -632 -3 92 -674 -260
7326 -260 481 -457 38 300 -348 -105 318 -740 -60 -215 72 455 1037 -307 -327 -399 -264 303 -802 -1168
7346 -1168 428 548 -68 397 680 12 -169 490 641 -208 414 804 396 102 743 584 -176 -169 -28 17
7366 17 -837 169 993 49 -23 -6 129 511 454 262 -190 -521 -816 396 -778 -530 199 -489 -28 644
7386 644 -475 78 -533 419 -436 -404 -550 -97 -438 -411 -866 -361 -235 -286 413 148 21 396 108 286 1145
7407 1145 -620 -725 -54 542 -172 402 -9 235 854 -1306 -866 674 1536 -725 747 236 -617 247
7425 247 -325 -1071 1017 -1053 -101 1005 286 -370 -258 -593 -167 -15 281 622 -418 0 -773 -202 -710
7444 -710 -220 -52 628 142 -82 -231 -552 -228 320 -260 -320 986 837 -69 -125 -521 -172 -312 -15 1409
7464 1409 124 -72 114 1 -454 -436 -821 -1081 65 638 306 -242 -318 -116 -803 -81 -17 -553 50 -54
7484 -54 -55 -490 -194 492 -16 -4 726 -145 -444 561 538 15 -1007 975 -524 -346 -115 144 -307 252
7504 252 114 8 571 -279 -756 73 240 -251 718 21 88 -579 -737 317 340 230 -699 283 -679 -390
7524 -390 698 -195 -323 -522 -255 -277 -1211 282 523 -792 -268 1039 -241 -304 -2 129 71 83 402 279
7544 279 540 -462 -101 774 382 19 -1181 121 717 -812 -819 -563 -371 372 959 -114 -1614 344
7562 344 -908 -285 259 -945 213 799 -373 148 -696 312 615 615 -16 28 -858 -610 656 -499 -672
7581 -672 -340 -790 -301 -1297 -1267 -1001 -222 608 -23 -169 -212 -347 213 -176 -10 34 3 -958 -281 -740 -1269
7602 -1269 -724 864 -274 -212 -114 93 -900 94 -145 -230 0 393 -389 318 -180 69 -1097 55 88 683
7622 683 -545 303 225 -140 -223 -528 332 -81 -363 103 837 -36 202 -142 489 309 -1231 291 774 -117
7642 -117 -18 -6 215 76 844 257 -631 462 1659 638 -672 -1248 199 -197 195 -644 -201 -70 155
7661 155 -373 -223 -535 -18 380 -1507 70 -217 -498 -507 282 -247 -830 -152 380 240 -25 -8 -512 325
7681 325 -257 389 -159 643 -9 -32 62 -659 -856 376 675 -358 93 299 -209 18 -1101 -430 1380
7700 1380 -73 457 724 -352 519 -542 732 404 7 660 108 485 343 -470 539 -102 253 -257
7718 -257 -15 -150 263 195 -651 -414 295 393 1303 43 -367 -84 555 -282 -130 -430 724 -720 306
7737 306 411 -730 -104 1024 220 303 -77 374 501 -358 -797 -415 147 -45 -452 -137 32 -1111 -305
7756 -305 218 -412 467 289 283 896 25 301 -403 155 -203 366 834 -212 321 -341 -297 1448 1011 1141
7776 1141 491 199 644 -1483 659 -749 209 -226 230 140 -218 92 -186 -272 -1132 574 31 739 721
7795 721 710 -13 718 -504 248 -324 -625 -391 -400 205 -326 864 -354 37 912 -164 353 -311 34 776
7815 776 116 -498 -136 307 319 -220 1181 244 -387 230 -437 -439 167 -134 -436 -922 -635 -536 212 360 -1047
7836 -1047 3 -337 35 1117 -77 263 55 -694 -86 741 -229 633 482 271 438 -621 1138 580
7854 580 -1042 -837 401 -268 -910 479 -1673 -967 184 -318 -173 -526 -695 -354 311 242 63 402 162
7873 162 135 -1088 443 -224 -450 276 1516 -81 309 450 -1502 602 761 167 -557 -457 -781 -516
7891 -516 1503 -42 635 232 -139 323 -165 59 -740 -661 323 -538 182 -302 -65 404 626 -29 214 -98
7911 -98 433 -66 683 -290 -654 -639 -271 561 63 161 307 -443 173 -151 -56 -114 155 -123 -781 -168 585 -57
7933 -57 -113 -236 -321 -415 -998 -244 -473 148 354 -721 -459 769 -683 -179 -199 -331 -488 442 286 297 -122
7954 -122 -484 -950 -105 162 -388 920 -646 -985 927 -35 -411 450 419 -578 -476 22 -194 400 162
7973 162 -428 -524 -721 -247 -4 636 -717 222 377 405 641 -400 -73 -153 132 -617 -397 215 -850 -524
7993 -524 -418 290 222 151 -771 -210 771 398 170 1347 349 63 -92 -177 132 -245 -525 406 247 317 443
8014 443 206 509 -698 -761 -323 671 -551 314 808 -951 -398 1043 -979 132 409 -728 384 575
8032 575 -359 676 153 -154 185 -692 -976 -389 599 -867 -1228 704 52 -726 543 -320 317 363 -325
8051 -325 -78 -18 -9 -138 215 513 453 -440 -241 1068 -668 -40 -120 -801 -531 624 -650 -101 13 51 301
8072 301 -16 84 -366 -402 64 449 -224 451 -1162 -104 437 -960 389 -520 85 -16 192 400 -1027
8091 -1027 331 -80 368 1075 -602 -107 239 332 278 346 -496 -282 49 -1100 -631 127 -224 447 65 668
8111 668 -578 295 266 -256 -339 -159 -91 176 640 -742 118 201 -261 -1160 434 963 274 -27 409 -851
8131 -851 -695 652 44 424 518 362 530 254 -296 -23 183 -816 -723 233 299 -409 -333 1011 -648 582
8151 582 -37 586 110 361 -519 -905 -202 532 -144 -583 -115 -158 -180 -18 1209 823 -679 -256 75 -648
8171 -648 -4 -700 274 -821 -145 -303 38 443 -667 664 -246 -456 908 196 -954 836 -50 1230
8189 1230 184 -213
8191b13
$$ Imaginary data points
##PAGE= N=2
##DATA TABLE= (X++(I..I)), XYDATA
0 0 0 0 14 0 37 -16 59 -37 93 -66 124 -113 159 -159 216 -220 284 -300 367 -401 466 -518 596 -666
24 -666 746 -844 943 -1065 1181 -1335 1485 -1676 1862 -2113 2373 -2706 3069 -3562 4135 -4922
40 -4922 5945 -7485 9897 -14441 25863 -231482 -306306 -263624 -298863 -286979 -307523 -299701
52 -299701 -311694 -303427 -307724 -295836 -293463 -278688 -271359 -251080 -237981 -216605 -199302 -175275 -155391
65 -155391 -130766 -108363 -83180 -60924 -35923 -14551 9445 28099 48202 66569 83794 97422
77 97422 109554 120727 128355 134865 138952 140465 141536 138546 133472 126917 119537 110636 99953 87024
91 87024 73814 59021 44558 30029 14736 -646 -14920 -30352 -44997 -57796 -68887 -81596
103 -81596 -91802 -100096 -107239 -112915 -116754 -120378 -120025 -119727 -117919 -115036 -109284 -104313 -98208 -89481 -79498
118 -79498 -70817 -59618 -49056 -36983 -25561 -16078 -3784 6907 16711 26346 35249 43121 50814
131 50814 56563 61966 64936 67044 69824 69728 69238 66441 63649 59880 55105 48404 41701 35063 27583 18693
147 18693 9594 788 -8993 -16782 -24598 -33959 -41353 -48695 -55403 -61945 -67672 -71901 -74826 -77973 -79774
162 -79774 -80243 -79577 -78543 -77250 -75189 -70653 -66714 -61414 -55934 -50455 -43194 -35608 -29665 -22090 -15385
177 -15385 -6309 -396 6429 12672 18081 22959 28487 32819 35894 39303 40742 42702 43914 42370 42718
192 42718 40794 38981 36633 32577 28665 24002 19589 14588 9538 3387 -1271 -6557 -11932 -17756 -22332
207 -22332 -27792 -32023 -34694 -40175 -41142 -43193 -45548 -46747 -46663 -46792 -47780 -46773 -44859 -43054 -40730 -37506
223 -37506 -34171 -31234 -27044 -23030 -19152 -13948 -10766 -7016 -2675 652 5866 7821 11171 14403 16567
238 16567 18537 19205 21496 20426 21290 20790 19887 18062 16137 14800 12686 10136 6901 3964 617 -1302
254 -1302 -5116 -9523 -12445 -15585 -18869 -21157 -24181 -26063 -27298 -29756 -31652 -32243 -33138 -33019 -33017 -32090 -30746
271 -30746 -29751 -27913 -25325 -24787 -21763 -18895 -16069 -12525 -9249 -6140 -2203 57 4259 5949 8771
286 8771 11763 14178 17297 17778 19435 21402 21420 21960 21817 21868 21222 21432 19674 17613 17088 14271 11582 9275
304 9275 6329 3738 1313 -1506 -5342 -7204 -9582 -13077 -14772 -17517 -20382 -22248 -23900 -26172 -25708
319 -25708 -26194 -26928 -27443 -27824 -26103 -25844 -24715 -23471 -20810 -19198 -18245 -15476 -12800 -11246 -9063 -6656
335 -6656 -3905 -1245 1789 4221 5555 8425 10061 11386 12604 14992 15382 16275 16310 16716 17078 15863 15766
352 15766 14744 13757 11384 10629 9372 6651 5453 3820 280 -407 -2527 -5371 -8210 -9537 -11120 -12321
368 -12321 -14965 -16090 -16931 -17687 -18525 -20661 -19051 -19406 -20212 -19425 -19924 -18023 -17669 -16223 -14300 -12847 -10292
385 -10292 -9050 -7411 -5062 -3000 -1244 1203 2983 4845 5963 8051 9553 10317 13405 12121 14174
400 14174 14318 15530 16099 15646 15635 15731 14417 14255 13539 11485 9084 8378 6890 4753 3210 739 -187 -970
418 -970 -4687 -4959 -6468 -8155 -10016 -11567 -12400 -13464 -13158 -14874 -15855 -15947 -15297 -15941 -14276 -14335 -14353 -13230
436 -13230 -11377 -10941 -9579 -7852 -7234 -5614 -2953 -1757 -874 1347 3396 4402 5776 6694 7771 9042
452 9042 9314 11090 10970 11484 13212 11905 12145 11823 10534 10653 9162 8363 7861 6890 5341 3664 2547
469 2547 1905 -73 -1072 -2705 -3853 -5849 -8266 -9810 -9103 -10409 -12338 -11637 -11542 -13029 -12577 -12437 -12855
486 -12855 -11686 -11747 -10699 -10977 -8840 -8527 -7425 -5626 -3409 -1391 -150 1365 3252 3463 4716 6355
502 6355 7651 9522 10001 11013 11940 10947 11970 12700 13156 13347 12494 12151 12380 10737 10106 8998 6915 6528
520 6528 5585 3692 1927 246 -858 -1146 -4275 -5816 -6921 -8052 -9281 -10446 -12314 -12396 -12060 -13657
536 -13657 -14290 -13434 -13186 -13131 -13030 -12039 -12209 -10566 -8713 -7942 -6911 -6143 -3918 -2451 -1096 -124 1293 2891
554 2891 3984 5616 8844 8646 9511 12049 11996 12840 12352 12925 13539 13098 13310 13013 11784 12044 10171 10186 8959
573 8959 7337 6340 5166 3330 2280 468 -1490 -1258 -4019 -5723 -6895 -7991 -9006 -10191 -10409 -11602
589 -11602 -11179 -12292 -12753 -12306 -12997 -12822 -11622 -10894 -9292 -9541 -7498 -6095 -6092 -4065 -2606 -514 1202
606 1202 1995 3139 4705 5478 6813 7981 8987 10365 11563 11829 12827 12234 12043 12892 11848 12667 10716
623 10716 10291 9140 7928 7497 5554 5125 3592 2202 -247 -880 -1713 -3607 -4254 -5321 -7044 -8199
639 -8199 -8964 -10982 -10276 -10213 -11967 -11865 -10735 -11235 -10357 -9883 -9203 -8933 -7745 -6395 -6536 -3696 -4452 -1521
657 -1521 -1776 599 3267 2132 3616 5439 7053 7851 8146 9173 9916 9805 9735 11044 11390 10619 10288 10379
675 10379 10696 9583 9299 7525 7014 5349 4967 2212 2532 -60 -1474 -1502 -2799 -3721 -4793 -5715 -7467
692 -7467 -8431 -8973 -9372 -9319 -10077 -8649 -9897 -10259 -8800 -8658 -8875 -8068 -6791 -6356 -4808 -4213 -3374 -2145
710 -2145 -1167 984 2604 3439 3751 4921 6314 5707 7378 8438 9116 9393 9473 9343 9440 10330 9481 10440 8935
729 8935 8381 7236 7277 5874 4864 3664 2536 1303 818 369 -2282 -2968 -3249 -5134 -5558 -6232 -6107 -6687
747 -6687 -8782 -7137 -9629 -8266 -8263 -8474 -7842 -7551 -7539 -6392 -6608 -5273 -5574 -2791 -1882 -1955 -656 819
765 819 1813 2306 4263 4332 4911 5511 5974 6647 7651 7655 7896 9155 8551 7368 6704 8275 7146 5950 5545
784 5545 5544 4339 3526 2743 2440 855 457 -511 -390 -1876 -2215 -3889 -4723 -4195 -4699 -7186 -6502 -6086 -7768
803 -7768 -7671 -7446 -6395 -6605 -5877 -6428 -5345 -4777 -4098 -3329 -2970 -2005 -845 340 -116 1241 2493 3408
821 3408 4085 4730 4812 4556 6819 7109 6411 6321 6554 7606 7213 6277 6860 5633 5889 5238 5021 4133 3888 1402
841 1402 1837 1151 1645 -240 -827 -2132 -1566 -2867 -4108 -4501 -5206 -5383 -7296 -6037 -6464 -6053 -6349 -6331
859 -6331 -5670 -5954 -5459 -5157 -4555 -3596 -3303 -2012 -2106 -1106 -1415 1039 -276 1543 2542 1695 3615 3286
877 3286 3122 4671 5174 4676 4912 6434 6805 5193 5251 5542 5180 5342 4753 5261 3499 3542 2521 2108 1128
896 1128 1604 113 209 -652 -1082 -1817 -3010 -1739 -2018 -2649 -4402 -3368 -3978 -4670 -4813 -5122 -3259 -3036
914 -3036 -3781 -3103 -3912 -3396 -2666 -2314 -218 -2031 -625 -135 -143 892 2063 1685 1250 2899 3299 3214 3470
933 3470 3116 3761 3975 3170 3903 4180 3596 4908 3405 2995 1829 2347 2464 2005 1398 970 759 382 295
952 295 -832 -1126 -1907 -2000 -2269 -2134 -2189 -3029 -2827 -2863 -3074 -2383 -3214 -2587 -2479 -2678 -1569 -1609 -2176 -841 -1301
973 -1301 -1046 -754 622 178 1212 1453 1642 1995 1385 1519 2209 2302 2802 3122 3542 2502 2571 3215 2311 2833
993 2833 3038 2077 1844 2088 1738 229 1003 1599 998 1428 -145 -1393 -96 -1193 -1020 -1594 -2257 -2443
1011 -2443 -2499 -1328 -1582 -2716 -2290 -3306 -2952 -1636 -3174 -1821 -1562 -1960 -1414 -1967 336 -893 -875 -396
1029 -396 135 595 -647 -936 750 1116 1781 2092 1469 1236 1525 1888 2136 1877 2360 2819 2179 2913 1690
1048 1690 1695 1706 2289 2002 656 1271 674 476 51 -470 -1 -526 -169 -91 -1953 -1970 -1743 -1014 -435 -1149 -2184
1069 -2184 -1544 -1230 -1674 -1202 -1244 -1160 -1504 -772 -934 -1158 -766 -998 -1313 135 454 -659 -525 963 986 838
1089 838 1981 966 1438 1598 1078 1285 1973 1238 3103 1143 1269 1529 1784 1271 1015 1750 721 950
1107 950 394 689 979 -90 584 -496 -925 -601 -1336 -1253 -1190 -683 -533 -1349 -2239 -731 -1439 -1532 -975 -1677
1127 -1677 -1289 -1324 -2257 -716 -2024 -1419 -1638 -631 520 -698 -187 -1012 138 286 805 -22 784 624
1145 624 300 807 1618 1377 1462 1206 1659 870 1478 1378 1411 232 512 1170 311 634 1601 661 741 453 78
1166 78 158 -649 -952 -546 -1038 -1159 -54 -725 -850 -620 -1280 -774 -1072 -1342 -866 -939 -1422 -484 454 -1156
1186 -1156 -370 -630 357 -881 -447 685 29 593 1087 65 1203 1527 155 818 86 72 1155 -140
1204 -140 284 384 724 869 289 574 -153 70 -117 -720 789 183 -238 82 -571 -148 -270 -285 -934 -794
1224 -794 -401 -114 85 -995 -570 -1190 -1326 -739 -845 -1237 -687 -569 -839 -335 487 419 -91 -773 -970 -1029
1244 -1029 92 -238 28 15 439 521 933 -44 103 642 1170 682 -119 288 927 158 199 243 1235 -268
1264 -268 -480 -15 156 1252 258 -396 -68 545 -29 -133 -76 -1048 -695 -398 -231 -441 -167 -50 -1410 -810
1284 -810 -1152 -568 -753 -1280 -674 -1047 -611 -529 -967 -366 9 27 52 414 -57 -504 99 199 771 573 244
1305 244 1447 4 800 1135 344 1255 299 1040 733 689 321 -857 -290 -217 1297 341 -754 347 418
1324 418 -571 -730 -1018 -1124 317 -942 -745 -780 122 -539 -1869 -1039 -334 -1026 -677 -717 -751 -303 -1234 8
1344 8 -223 171 -274 121 -889 717 -3 340 218 -191 279 644 393 -41 1946 807 109 1187 -393
1363 -393 229 1826 572 70 1155 671 517 464 -351 -230 -221 -618 -85 262 -64 -574 -363 -469 -602 -83
1383 -83 -585 -642 -1066 144 -692 -1120 -35 -277 -1425 -1074 -1641 245 -187 -1068 -448 -517 -111 -804 -738 69
1403 69 -545 -648 -727 631 732 784 739 917 459 607 1021 665 -499 644 566 265 799 794 214 300 630 -228
1425 -228 -433 -526 566 -1284 -185 -198 -498 15 -215 -834 -974 -758 -359 -643 -411 -923 -18 -119 -1216
1444 -1216 -922 -705 -604 -424 -724 -535 526 -1408 -120 169 -1068 -409 -233 -401 503 662 305 735
1462 735 618 47 260 979 -144 1146 -612 -279 123 -61 381 -449 1160 -787 -110 43 1239 -443
1480 -443 -763 -904 -640 -244 -1036 -765 -940 -436 0 186 -677 395 -837 -1290 -816 -998 -575 -625 548
1499 548 -818 -215 -675 -842 77 -925 -580 -587 -978 -634 163 45 328 -282 368 306 326 425 85 -373 -718
1520 -718 -117 1603 646 1025 944 -15 1171 630 280 -642 381 107 492 9 -656 -1140 -656 222 -1022
1539 -1022 -9 -507 -1124 -1136 -650 -203 -1568 -1498 -2020 -1591 -1305 -312 142 -243 -1076 -194 -1213 -349 -138
1558 -138 24 -79 288 -668 37 -657 -658 71 445 581 528 1214 272 1415 855 826 759 -108 326 682 550
1579 550 584 -161 397 -183 -105 -197 8 -425 -904 363 -12 -390 -1606 -951 -1379 -1489 -718 -1254 -417 -1082
1599 -1082 -580 -1237 -176 -813 266 -920 -466 152 -276 502 -499 -270 341 541 604 -760 -54 479
1617 479 -223 983 918 573 428 853 1039 1204 260 808 -430 660 1041 742 27 558 -198 -932 -175
1636 -175 83 89 114 -649 564 385 -603 -946 -971 -803 -1186 -1528 -1404 -662 -215 -1002 -932 -144 -200 -1028 -1099 294
1658 294 -664 346 24 -915 -560 732 -489 -119 335 260 -76 758 874 315 723 184 706 649 1214 64
1678 64 -128 820 454 432 556 597 591 321 142 -590 -227 -266 -231 -179 -726 -737 -134 -1004 -929 -525 -1502 -349 -210
1701 -210 -552 -367 -1184 -1403 -1478 -336 -1316 225 -523 -674 358 -122 -181 200 -201 -244 -257 -750 19 678
1721 678 11 1019 792 1028 703 433 997 759 1401 313 1707 999 -188 -720 195 994 406 144 835
1740 835 -323 -265 -264 292 73 312 -618 -729 -1286 -409 -514 -1507 -992 -791 -293 -1173 -1169 -579 -499 -249 -12 -1407
1762 -1407 -1286 -222 -983 496 94 -250 361 103 1525 894 1316 202 253 268 952 109 1007 276 548
1781 548 655 1219 531 232 1083 667 18 77 674 334 -380 -1238 -406 135 93 294 -431 -742 -411 -890 -485
1802 -485 -713 -489 -990 -1339 -729 -696 -590 -573 -818 -1163 -91 -242 -615 -705 -684 -671 -63 -246 -26 571 -28
1823 -28 41 100 -145 -120 301 1268 473 -443 1496 175 361 207 406 869 146 352 508 1126 351 157 -109
1844 -109 -71 981 51 -121 541 973 -1460 -1301 -23 -118 -236 -714 -1249 -149 -1415 -1797 -548 -960 -617
1863 -617 -1017 224 -485 -1074 -97 -1079 -730 202 -25 -548 -337 -1085 -382 796 -381 340 643 789 1698
1882 1698 702 -278 191 1082 218 1933 625 -253 688 877 534 1053 952 532 -214 -117 34 12 584 -946
1902 -946 -422 420 298 -146 -569 223 -180 2 -1017 573 -515 -1117 -500 -759 -614 -735 -676 74 -520
1921 -520 -387 -775 -955 132 -504 -184 628 -493 235 534 591 -476 119 741 376 79 894 1443 793
1940 793 10 284 611 192 1067 770 634 470 819 1114 -154 361 901 455 -426 -208 -577 -66 -263 -86
1960 -86 -641 -418 -1514 -595 -603 -302 -299 -211 -766 -945 -837 -331 -1480 -748 -858 -413 -167 771 370 -447 326
1981 326 124 -730 691 1047 -605 760 558 863 482 259 1077 130 920 264 723 149 94 348 177
2000 177 828 -321 1156 678 528 215 256 370 83 -1117 -286 348 -1144 -510 -598 -244 -1074 230 -509
2019 -509 -753 -769 -278 -183 -977 -520 -729 -141 -627 -1347 -442 -79 -474 101 650 -499 -392 -347 -133 -19 -500
2040 -500 27 -559 35 -504 695 498 907 273 -200 528 273 -23 195 531 -9 -141 365 -297 -517 104
2060 104 92 -190 229 605 -292 -97 -838 -224 -228 -201 988 -184 30 -284 -207 -43 -314 -721 -420 -688 -964
2081 -964 -820 -382 -272 -372 -202 186 707 -851 -622 321 62 447 432 -136 1156 287 141 500 531 1477
2101 1477 114 474 234 -881 195 -157 241 -766 231 86 -1 1040 807 -40 48 515 -1179 142
2119 142 -214 -1058 -372 -269 -321 -600 62 -500 -346 -535 -282 -338 -919 -678 76 76 -416 -423 -965 997 -1139
2140 -1139 673 -488 297 248 -86 734 993 671 218 -49 -281 1007 -307 877 848 1110 1128 1080 800
2159 800 314 598 556 548 980 52 429 980 512 -147 -519 98 249 -49 398 -262 -538 -623 782 -237 -620
2180 -620 -830 -1687 -468 -714 -372 700 -674 -243 -1025 457 -647 -1401 -636 -503 -56 -610 -507 1216
2198 1216 230 113 -20 343 1085 723 278 994 103 -304 273 -262 176 -129 399 752 334 790 266 235
2218 235 181 -1050 963 1060 245 85 619 156 892 -666 465 -328 -849 -1383 -310 290 -657 -1235 -375
2237 -375 6 -792 -66 -472 -638 -114 -254 -73 -430 65 106 -784 -894 248 -266 198 1042 474 750 -303
2257 -303 -50 -278 289 145 923 1123 422 -89 838 894 833 -12 599 599 940 703 265 145 13 -523 -319
2278 -319 128 3 -144 -780 -1263 490 -545 -608 -807 -416 -772 -765 -379 -622 1090 -998 -1 274 -95 149
2298 149 -283 -504 -603 441 -215 -671 -492 -47 95 -97 -64 -462 -108 595 -366 792 -87 1134 569 341
2318 341 253 247 288 -293 606 -154 108 29 677 -9 504 -337 236 116 23 351 -774 -208 501 31 92 -257
2340 -257 -302 -144 -269 -627 -1330 410 14 -262 -559 -368 -636 -436 -1050 229 -784 425 -664 -1035 635
2359 635 227 315 284 -1095 420 -285 -468 -620 410 1319 578 283 375 262 309 -241 1145 717 310 401
2379 401 327 -110 35 -208 -499 1267 -980 -728 -568 436 -454 -115 -507 -1213 -307 -95 23 397 -1066
2398 -1066 -75 -1048 -864 -769 230 -320 -563 -324 82 -59 -400 -264 -908 99 632 395 -606 610 316
2417 316 121 -533 261 1827 785 348 574 293 237 -233 222 214 -524 -442 -401 653 -24 1053 -419 -158
2437 -158 -256 210 -380 -328 235 -1305 155 387 -1086 -732 -479 -670 -383 -555 12 433 436 -133 521 -240
2457 -240 -333 -505 -935 -284 -435 -515 49 -289 -604 691 207 368 -4 -525 257 253 78 -52 488 223 646
2478 646 727 -334 -117 370 1390 421 363 742 364 231 -338 -1107 41 464 578 31 613 223 170 -247
2498 -247 -652 -55 143 614 -281 -203 -1103 800 -324 -595 -707 -161 -342 64 -173 -588 734 -923 117
2517 117 -75 672 647 -263 243 -553 -251 814 -3 1603 -5 168 -1119 -544 580 417 -44 -499 580
2536 580 40 370 366 189 61 -227 -590 488 -371 -92 -796 -578 -396 41 -378 -553 -865 -697 -155 -629
2556 -629 372 -34 543 -1094 746 219 -865 240 95 -124 539 -9 837 93 -37 -148 -350 -593
2574 -593 661 189 -81 934 358 -167 572 -194 289 -39 12 -463 305 1184 686 -22 1069 147 -18
2593 -18 -246 -711 -142 560 -1458 -423 603 48 997 -766 201 535 -441 -1211 -122 513 -21 -28 -336
2612 -336 136 -676 -682 -246 -315 660 258 -150 -219 595 409 757 359 1018 183 97 958 812 174 758 -218 877
2634 877 -754 1087 69 -499 85 705 -128 267 1408 45 936 180 -532 984 170 101 201 755
2652 755 -149 115 -361 128 -208 -914 -315 -431 536 -728 -532 -698 -25 878 -425 -573 -542 242 -733 -49
2672 -49 -551 -751 142 -395 106 -1014 -1030 137 -628 -213 -365 -360 48 -375 -210 322 -241 93 338 384 673
2693 673 734 454 1059 -189 354 181 559 874 887 -112 -314 -438 -418 3 921 -1317 -106 90 217 -303
2713 -303 364 -627 -540 355 -89 -176 -373 363 -814 144 -123 -697 -453 -566 258 -1111 -102 -367 524 -261
2733 -261 -796 -659 -1466 -33 223 -223 -287 -967 -41 1016 -361 -182 52 -340 -549 394 -157 -40 209
2752 209 -1062 -458 258 906 387 283 71 -247 329 666 -1285 -468 -173 -740 655 -473 107 474 470
2771 470 -158 -917 -165 -998 -280 163 -347 -145 -213 -132 -272 549 904 148 466 -65 -218 -87 -539 380 602
2792 602 797 37 442 223 -135 541 345 854 -310 -520 -413 -789 -874 -464 1308 -175 343 740 777 -58
2812 -58 -559 -96 -101 -252 -603 114 225 -529 -52 -8 448 -249 -45 85 -740 525 -24 346 -68 -395 795
2833 795 148 -21 -104 22 -292 1089 -215 970 214 -81 848 337 298 494 -156 -172 457 602 -342 -245
2853 -245 79 549 15 -257 162 333 277 -405 120 -500 847 -195 175 -800 549 -469 241 -388 -641
2872 -641 229 -69 -292 -489 -62 -260 -1237 -37 -245 -131 -306 -185 -1719 -161 -690 -914 28 351 756
2891 756 -74 -507 -26 1188 218 504 728 -270 442 -447 -527 43 946 978 -965 -797 240 729 -480
2910 -480 236 -65 -95 139 -64 -423 -497 1071 151 1266 -793 621 -843 93 535 -465 70 -74 -831
2929 -831 664 629 -689 340 -554 -177 359 577 96 412 592 -18 1106 -177 -221 309 -422 -147 -626
2948 -626 356 606 -237 257 -41 660 800 617 -516 -826 184 438 177 286 -897 -31 -135 -424 172
2967 172 -1073 395 -574 201 1057 235 481 -261 73 505 129 305 -614 -926 137 -226 589 423 -388
2986 -388 -60 619 836 -176 653 658 -284 91 204 964 400 -170 -373 -109 909 814 796 -312 -180 -906
3006 -906 597 55 329 -69 -153 -146 1222 2 -803 -135 61 98 293 -166 100 -84 551 721 -435 -601
3026 -601 -1187 -165 -196 -144 -346 976 664 -162 1013 323 -110 -93 -828 72 203 234 486 -907 219 88
3046 88 101 295 749 -18 32 591 300 403 -169 15 1009 226 382 496 619 -227 191 309 148 277 507
3067 507 -384 -244 -127 409 -751 384 191 672 692 -477 439 -473 -174 -22 118 -128 235 -894 -841
3086 -841 417 -466 660 -548 -219 -761 67 252 -179 -230 -762 641 77 103 -958 855 522 -103 -195
3105 -195 -247 353 -143 -848 957 22 341 -189 303 -80 -510 452 300 -12 -409 1124 591 -1054 -451
3124 -451 1075 383 -343 -347 -91 -232 -538 -411 -734 -850 -162 105 15 -271 -661 956 445 -533 -605 676
3144 676 162 -170 -88 396 -84 -24 205 -845 -49 418 291 497 968 -175 380 -187 511 249 -395 176
3164 176 -99 -677 -653 -391 -508 -119 -765 -228 -433 548 -222 -468 -955 451 338 -867 -267 -417 -165 77
3184 77 -509 307 -106 613 -252 901 281 -48 264 -99 121 708 400 -239 -75 153 520 -205 -723 65
3204 65 -137 655 -212 528 -211 -194 138 456 10 -548 330 -382 17 214 -713 306 180 -211 -250 -596 164
3225 164 1839 188 131 -673 108 -883 -362 435 -489 -990 644 -1299 410 118 -133 -59 -756 -657 -479
3244 -479 -341 686 823 453 320 -528 1141 953 -583 -141 -253 463 -263 -196 -731 1266 -545 521
3262 521 158 -810 164 313 177 -168 766 -906 187 -820 179 -175 1001 -433 81 -47 112 -489
3280 -489 -971 533 -709 -550 540 -311 77 245 557 -65 -528 101 367 601 -326 1117 -349 518
3298 518 36 591 -112 -69 523 -767 -278 -514 -228 -49 -38 253 528 382 -337 1089 504 173 -1527 633
3318 633 464 -145 -203 -32 132 154 -421 -477 -384 488 802 -244 99 539 1296 467 138 -736 -117 -37 352
3339 352 282 -294 -847 59 -1320 -107 265 -246 -10 -1220 -627 191 385 32 -185 107 460 342 -908
3358 -908 -34 835 -175 461 147 60 776 -137 -397 461 1375 796 -373 -1255 316 89 -255 -384 -499
3377 -499 430 214 516 -693 52 -846 -61 -191 -38 -372 -177 -402 -119 56 768 -490 -616 -182 -142 269
3397 269 44 -805 -1051 35 25 -117 828 -955 297 445 -750 538 314 370 117 -36 401 -892 -415
3416 -415 398 -521 175 441 -515 -63 197 80 596 -203 -84 -319 399 -245 464 -110 -228 555 342 -298
3436 -298 -373 -275 -944 -431 -919 360 441 -208 -650 -791 -639 -527 -972 -333 37 -107 -694 -187 462 -379 360
3457 360 -100 -150 -299 -876 456 405 -512 -197 -372 -123 655 56 -59 430 716 761 -29 418 241 350 748
3478 748 336 453 -121 280 -437 -722 191 307 144 -13 -222 -926 256 144 378 -247 -144 -104 118 256
3498 256 -776 -690 391 -59 588 -368 -270 685 688 -10 -317 601 401 -291 -262 -276 -27 263 43 506 -129
3519 -129 -322 -194 -373 595 -221 184 -868 560 517 -282 106 -449 737 216 290 131 594 950 305 -281
3539 -281 -172 -115 827 891 -187 352 -478 -982 337 -396 233 -76 216 210 -279 -268 -313 106 448 1312 391
3560 391 -917 -826 9 -142 -187 -318 -149 47 -885 266 462 -698 -60 44 300 -842 109 553 709
3579 709 421 390 20 517 -834 1290 103 -16 -530 -1098 -243 -581 75 246 304 -120 -190 779 -621 326
3599 326 371 109 -214 -34 570 476 202 -596 -1140 -578 176 185 61 -620 -475 -435 -165 -590 742 -67 -922
3620 -922 -64 92 118 -928 -947 -68 359 616 558 -388 -266 495 -172 -921 452 522 -341 203 498 532 16
3641 16 -824 -208 -529 -1589 36 469 -126 -80 -435 -86 -64 288 854 -372 157 611 -373 -726 -190 -1191
3661 -1191 439 -452 323 -271 -458 -118 56 -734 -280 -362 -488 -198 145 110 -1392 238 339 -59 209
3680 209 -309 -1029 38 272 -895 -256 472 57 1905 -561 -142 179 349 598 -422 -506 3 198 308
3699 308 33 -228 -643 401 537 -908 -524 605 -1337 -845 537 235 315 -643 178 387 -152 -589 552
3718 552 616 336 -79 -262 412 574 641 52 98 349 -105 -698 118 -827 -351 -119 -422 -621 145 -401 887
3739 887 301 184 668 -284 -31 173 -245 -218 -24 -565 17 363 -199 -573 -103 195 -486 -564 405 -113 -314
3760 -314 -540 -771 -573 -526 -307 -536 168 434 -263 -534 301 365 -1593 -466 -583 -516 -327 41 -390 -588
3780 -588 -440 -160 961 -87 -1093 565 -358 -742 -34 129 -5 -136 -81 -640 344 -397 -50 684 111
3799 111 149 -164 581 -345 446 941 94 618 -96 112 -576 -921 575 379 868 -100 368 895 8 238
3819 238 -473 -502 -313 10 -326 -314 -44 1009 216 277 -508 -326 681 58 -145 299 344 -562 9 298 -55
3840 -55 -179 140 -322 446 613 255 -28 -595 838 396 27 32 -197 188 126 -160 -578 -696 -552 613 -863
3861 -863 -695 241 375 334 -11 717 108 1015 511 451 -166 119 -530 160 -182 123 -927 53 -328 -679
3881 -679 -383 600 420 -79 142 -288 -777 -404 -82 -269 475 806 36 -905 -223 441 920 -1321 673
3900 673 -1123 -155 -27 701 385 -116 211 -173 -277 -302 -9 355 -546 -304 -661 -873 -622 155 227 -1060
3920 -1060 119 -597 -659 -393 105 -56 333 -352 -513 645 -137 -285 -377 625 873 236 317 -302 334 316
3940 316 377 -12 -976 -210 850 268 201 235 274 1233 -4 429 297 791 -62 17 1326 167 -1085 1003
3960 1003 646 -695 -573 -48 -332 -238 436 998 32 103 -505 -710 -324 -512 62 -38 343 -573 657 66
3980 66 -882 836 289 -42 -1002 -752 -267 735 -242 -135 -630 240 -2 -1211 -1052 -366 786 103 -219
3999 -219 1116 -240 823 -118 -454 -104 -54 -680 107 -104 -595 -273 137 235 -232 801 -23 1205 -595
4018 -595 55 389 -442 90 414 -502 209 -810 206 88 -756 -69 362 818 -882 -128 -216 1015 518
4037 518 451 130 -334 -320 89 -256 -936 926 -657 -231 -771 -786 78 905 602 -169 -632 -47 -116 848 -65
4058 -65 -34 694 165 493 82 -103 819 674 -309 902 -131 -108 -456 617 8 -502 -305 244 34 -464
4078 -464 104 -456 398 -1705 566 -307 -639 214 471 -461 436 579 925 1396 223 274 -141 86 -65
4097 -65 -669 -275 126 -77 337 552 320 416 -760 -477 304 402 162 -26 310 115 -40 -197 -944 -786 -284
4118 -284 327 -1 -241 -780 455 -199 -21 -523 -248 -234 35 -60 -964 554 -256 68 -886 -229 -40 -718
4138 -718 -50 596 -124 183 681 373 657 -497 457 196 730 -519 309 -191 326 -118 -572 -378 -219
4157 -219 216 578 327 221 171 595 -152 104 434 -235 -745 -140 384 139 -40 -960 -630 -156 117 -1291
4177 -1291 102 -39 599 -831 581 522 -269 -247 -37 326 -384 -435 -278 -728 359 -12 43 768 -950
4196 -950 -205 -27 324 -291 -489 461 -338 318 40 772 -519 260 326 212 -303 -98 977 -186 1562
4215 1562 71 1000 -232 -64 517 -319 -19 22 380 -136 -613 -360 96 -111 -80 -6 -650 954 -143
4234 -143 486 -998 480 -349 1315 531 151 -378 168 137 -207 58 -27 721 -345 539 358 -909 858
4253 858 821 566 305 -131 409 132 615 -8 -95 -1042 902 354 246 53 428 182 -484 523 -326 -158
4273 -158 593 -471 423 -45 263 -2 -370 -799 15 46 385 -121 -357 67 -1205 299 -71 -253 -689
4292 -689 -67 -591 294 173 143 -1122 55 286 1152 439 -65 526 -1123 17 -1069 806 -1352 1133
4310 1133 -688 245 -740 113 -5 -163 18 -472 -331 11 -52 -126 420 384 -308 306 406 528 583 -90 -246
4331 -246 418 -1179 154 86 683 241 -747 751 152 1318 35 472 -899 427 -5 376 -108 -844
4349 -844 455 -61 199 565 -1471 221 -269 61 -1069 -716 -8 751 449 830 179 -105 -148 325 -438
4368 -438 -475 202 -148 -373 -236 539 252 99 -711 316 -1045 122 194 221 -375 464 426 481 -319 -244 41
4389 41 140 -470 34 -62 491 539 -56 -342 -7 -1419 -492 175 -1175 343 -72 272 -609 -858 -127 -424
4409 -424 331 227 -351 -682 76 775 309 254 -214 -138 -607 10 -172 -81 355 -228 -145 -78 -579 387 -894
4430 -894 574 340 232 488 1198 -302 48 574 -755 -110 198 -500 269 286 674 616 783 -15 -1176
4449 -1176 215 1126 -530 -1100 487 1138 -492 -240 297 238 271 -457 208 353 823 59 11 -387 654
4468 654 -302 -224 -346 -310 326 -596 1089 377 -804 -798 457 -133 155 352 -480 1099 124 14 757 1096
4488 1096 -8 -122 -1324 264 152 -1114 833 117 339 800 110 -129 -795 -417 -454 -717 185 1182
4506 1182 -911 -21 -177 -269 368 -721 171 -83 -450 795 -719 56 83 957 -657 -639 227 -693 351
4525 351 -288 -841 -127 -263 597 -45 -520 574 -698 -162 -144 620 336 11 -196 57 -787 340 -62
4544 -62 -16 -142 246 440 127 472 132 111 357 169 237 -126 -1077 39 75 313 239 -530 -129 -220 -716 -437
4566 -437 180 -63 -680 165 -821 66 552 -518 -1187 -5 12 364 479 326 -590 15 -65 334 191 -183
4586 -183 560 123 372 337 622 770 -316 174 863 -88 205 -410 135 16 45 -524 45 -56 567 79
4606 79 -746 -341 -88 -218 79 652 -229 639 280 -799 -831 1083 581 204 40 243 -794 -400 -17 -626
4626 -626 115 -571 896 822 95 290 -755 411 -581 -290 21 292 708 195 -485 -198 123 506 1552
4645 1552 -231 287 -400 730 -490 120 -560 172 -218 212 918 -247 -213 253 484 252 -185 -467 216
4664 216 252 -324 -68 650 170 584 918 -96 -1284 -8 291 355 -390 -32 -388 -251 -190 -245 49 190
4684 190 757 -167 -777 88 -242 541 -1177 376 823 465 74 -68 481 -101 242 -33 737 32 -916
4703 -916 -617 532 -136 -340 435 -153 293 -214 -111 -758 -658 -138 710 373 -257 -957 -1137 313 -252
4722 -252 -709 -678 -189 -476 849 -350 -470 -335 -145 223 -552 282 77 -324 -219 -245 349 4 109 303
4742 303 -154 -358 33 41 -335 -733 -405 -74 311 -223 -265 244 527 -226 -796 368 -551 -1045 -258 95 1314
4763 1314 102 -806 427 -639 -11 -388 -28 324 -23 -13 -47 78 -374 32 -986 -467 -481 -669 -233
4782 -233 493 1136 416 -386 -147 -593 -189 114 920 702 -33 733 336 -473 154 -71 109 166 71 -253 -817
4803 -817 37 -307 767 996 502 -270 -34 264 960 550 -1058 -356 -1127 -353 -209 77 59 -446 -27 37
4823 37 -583 201 346 -64 -665 345 109 279 -1378 59 830 254 -640 333 -795 1062 -829 65
4841 65 67 -149 57 -169 683 -235 -274 38 -436 139 339 65 -1196 -62 -376 -687 698 309 -130 327
4861 327 445 577 -48 -320 1115 118 -35 -300 -257 896 32 -1007 -246 -55 302 -904 -608 288 91
4880 91 -857 81 -146 -780 196 -1319 325 -395 280 47 -265 990 860 -452 666 -292 -244 479 265
4899 265 -1454 158 -295 -1059 452 -230 385 13 -474 40 373 346 -576 980 435 999 967 891 15 701
4919 701 714 949 78 -579 -101 193 678 20 277 -380 -129 189 -669 198 203 366 -245 -130 116 -384 -505
4940 -505 354 -273 -76 222 750 -734 1096 -505 425 -95 -345 -740 141 357 -257 -160 -645 35 -233
4959 -233 653 92 275 419 -907 -434 -105 163 395 -152 -494 -74 -24 623 137 -752 19 743 170 -157
4979 -157 -68 436 684 -1165 134 264 198 -707 220 225 -281 -22 -18 -667 795 -487 -1316 -565 376 -230 390
5000 390 106 345 -243 -645 -81 -761 599 -31 -393 -757 -385 674 -114 302 774 493 -694 -112 -685
5019 -685 463 -402 508 -724 -856 60 -332 -136 777 -63 -944 697 847 -222 -574 7 391 -319 343
5038 343 -153 -808 -525 -372 -986 633 -676 -344 29 14 245 59 -394 -127 989 -311 571 373 409
5057 409 505 254 88 244 167 -579 -130 -255 240 219 391 -160 -229 -376 58 41 268 379 -328 -1189 191
5078 191 485 172 -345 -598 75 76 -459 -359 60 -1089 -454 -68 -234 -544 -510 1099 220 29 370 18
5098 18 636 -405 -48 -180 495 -498 149 -514 -839 -180 -775 504 -743 -1409 111 85 307 -319 -740
5117 -740 99 359 212 -120 173 621 517 -175 97 -1120 483 215 -369 -538 134 463 -29 697 157
5136 157 -566 261 -50 -801 -86 809 652 204 -214 -913 53 -287 127 19 -75 3 -409 211 793 650 -317
5157 -317 197 208 -380 22 70 -200 590 376 -387 193 -380 256 -144 261 -8 -761 168 -240 698 -205 -419
5178 -419 472 -124 -1407 -504 151 -95 -561 -539 335 459 -64 205 502 -693 730 789 649 609 -606 128
5198 128 -183 -752 -587 371 21 -487 418 -20 -752 90 925 -1070 -116 -209 -764 939 -346 237 -882
5217 -882 -5 149 -71 112 324 304 -99 453 790 61 -148 336 19 655 478 413 -577 -374 837 -117
5237 -117 -514 -342 250 -25 -283 862 -56 -616 -243 -265 369 307 411 166 -1235 85 661 -359 446
5256 446 456 -457 837 -555 361 488 -526 -1156 540 622 -34 651 355 537 -696 -717 -134 666 -588
5275 -588 -583 127 -618 -1094 -820 -611 -257 -220 916 439 319 -163 -421 -53 -876 -104 168 -179 -141 152 -650
5296 -650 -675 -278 -132 -344 -388 -698 350 -675 -670 464 -313 1015 -1215 677 -98 703 375 -867 877
5315 877 320 -565 -324 -213 -305 -408 -408 26 -816 772 -74 459 -280 -821 -660 209 -28 587 49 -403 -938
5336 -938 586 1044 44 -589 -595 465 -38 -266 267 -188 259 150 -637 526 -643 1575 692 -407
5354 -407 -321 -741 273 319 878 -182 -236 -673 -251 -89 164 407 -144 418 -186 -211 -53 -392 151 -549 558
5375 558 415 190 123 -251 -731 -449 -333 -141 -407 -345 219 1355 135 633 -107 291 598 311 248 -1501
5395 -1501 83 879 392 536 270 161 -807 524 -561 -17 -449 340 -349 -590 520 -533 731 331
5413 331 -632 -342 437 194 -417 634 -294 530 -429 308 -547 1047 219 -627 -642 -1336 -1221 456 688
5432 688 -34 -303 -249 1609 -922 -444 -584 -634 -71 446 642 500 -740 -407 150 140 238 -618 -391 77
5452 77 352 562 301 -772 119 705 125 35 126 -457 -347 -495 -728 737 -198 651 4 539 150 -299
5472 -299 499 124 243 -714 -1141 -232 469 350 229 144 353 -277 40 291 326 287 947 -95 -452 -24 -590
5493 -590 -449 -419 646 -564 100 -383 -599 -603 498 903 228 182 198 -682 -244 318 -1000 109 74 954
5513 954 289 621 1264 796 490 91 719 -149 -504 368 143 1005 943 592 -819 -7 -282 73 150 379
5533 379 -47 -306 263 155 -882 -411 -81 157 -47 17 -736 4 101 -362 -202 -382 105 215 250 199 269
5554 269 720 -126 -297 483 341 103 90 -369 765 -33 -100 940 607 1009 81 288 549 625 -880 -278
5574 -278 -108 554 -532 475 -94 468 860 -215 551 157 -902 334 -269 -275 708 -438 497 -925
5592 -925 524 133 87 290 -285 -209 877 -131 -59 -390 393 -750 193 935 447 133 -48 -202 -133 133
5612 133 -141 278 -88 483 622 1158 -210 86 -427 -722 -1623 313 -48 602 -165 602 -189 -676 -431
5631 -431 -885 -6 -269 629 -745 186 414 117 -759 -99 -195 357 306 -581 -477 -1153 -335 709 617 -337
5651 -337 509 471 253 938 742 -228 572 -144 -773 128 -103 11 -107 1021 -12 665 309 -280 -563 -1165
5671 -1165 -177 -264 237 -45 -45 -634 284 735 -34 490 84 -390 -401 607 1022 445 -615 437 -208 -95
5691 -95 329 793 63 -81 494 -789 466 -331 1043 -114 -2 367 -486 635 254 156 -361 -92 -469
5710 -469 -475 769 -461 129 -988 -273 429 552 338 153 88 -563 445 72 -1172 801 -156 851 -761
5729 -761 -678 386 52 -217 -322 -139 738 420 80 -115 -1205 -86 -476 696 -93 125 -396 -262 95
5748 95 -770 12 365 16 274 -59 -279 -300 87 684 406 114 -10 327 204 149 329 937 476 156 218
5769 218 916 -48 678 539 -205 -474 287 161 511 654 -189 -236 -451 -885 343 280 -371 -55 -100 -983 -46
5790 -46 -408 408 -270 584 -586 197 911 -167 362 723 77 -223 294 546 -287 62 133 -258 478 -234
5810 -234 93 248 -273 -786 -1117 -670 -815 -796 -304 -248 -699 -561 851 675 -209 -68 872 65 116 68 324
5831 324 392 408 220 358 124 417 -63 304 64 -263 338 1629 977 513 16 10 358 384 598 -757 -946
5852 -946 -346 656 439 -269 949 945 -1266 630 -430 583 -535 452 62 856 221 -423 98 142 -294
5871 -294 1121 -1211 23 -690 -22 530 653 84 383 -347 -1211 -731 584 1276 506 333 133 453 155
5890 155 131 571 222 107 907 -292 592 70 1096 -706 -309 155 -388 456 662 -6 40 88 -466 609
5910 609 -608 425 529 1177 -254 598 534 -35 268 -423 155 685 -396 -782 -38 725 538 -421 511
5929 511 -643 -419 -1199 -380 77 953 354 -662 173 -68 -319 358 551 -545 -443 -940 -657 -757 852
5948 852 30 442 451 21 942 -177 -631 265 -42 129 776 -88 956 541 653 220 1126 243 624 558
5968 558 721 479 -297 395 -355 -498 329 909 281 160 -643 241 1114 475 -111 411 -656 99 456 468
5988 468 -171 186 140 198 932 -245 648 623 -618 5 -39 -416 208 -970 367 -612 -20 854 -1063 -206
6008 -206 -468 -534 146 546 -282 -808 -303 -441 -409 -168 -50 444 345 942 454 684 385 -568 -339 333 181
6029 181 -863 656 131 118 110 -327 -315 654 213 822 -242 -580 411 -1320 -260 820 -515 441 896
6048 896 1061 -431 1651 -205 -400 -742 143 -528 -510 -338 95 -668 594 475 -1056 -385 -216 285 490
6067 490 701 -507 764 569 270 -364 -169 -1085 90 13 348 464 -8 366 215 -215 30 203 192 31
6087 31 879 -383 377 667 1328 738 -221 -171 -257 -499 -7 -1142 -329 1088 -46 154 60 -1024 -659 280
6107 280 209 77 -141 23 -349 -1269 -716 924 32 596 561 -1311 -575 -439 664 -186 -45 433 878 -596
6127 -596 -75 193 378 431 974 -90 302 -185 -113 -1215 -901 -852 35 -20 410 16 -52 -939 432 -313 -95
6148 -95 -525 227 -686 -1072 652 232 61 60 -251 20 236 -590 -371 6 174 807 439 -133 -227 -313 258
6169 258 -961 -329 -798 1118 -154 -412 1283 348 198 -62 581 -167 158 827 519 -547 72 392
6187 392 172 -118 86 -310 268 -510 -171 -538 685 -348 -356 598 -640 592 -238 -259 408 -95 -330 -155
6207 -155 574 121 -758 -333 -279 -354 851 112 -184 -411 -79 524 164 -506 -120 -180 707 -33 -460 74 210
6228 210 210 -285 530 1004 29 -261 -322 827 -994 208 738 -380 618 -404 58 391 -182 162 -344
6247 -344 -332 180 96 -546 -118 194 441 677 -270 93 -1758 -120 420 -776 303 320 -526 -396 -202 -256
6267 -256 -724 -97 1122 323 169 -207 181 92 334 81 -429 333 167 -266 -559 -36 -1240 -318 538 -1227
6287 -1227 290 397 -518 240 489 41 -303 -251 -268 708 -621 651 -831 526 353 541 -37 -146 -714
6306 -714 1088 -4 368 -170 -909 -65 -475 -542 173 -946 -410 644 -535 -427 -509 -278 -340 510 332
6325 332 -318 179 194 793 364 -42 190 -1 30 -215 -92 -73 -433 321 -257 83 575 -393 -55 1016 508
6346 508 -397 -129 -633 247 -260 -321 -505 456 -1391 -345 173 -109 702 -255 -1345 671 -9 109 -262
6365 -262 -1224 -641 -370 93 191 768 96 77 -49 -458 -980 242 328 -549 458 -161 -306 -9 507 651
6385 651 213 344 975 -715 194 695 -459 -1282 -412 3 -418 -151 -922 330 1089 -666 16 -989
6403 -989 94 1097 576 -46 466 47 248 681 -105 1251 -512 -335 214 69 307 -759 255 639
6421 639 1379 588 -68 130 392 342 1484 145 365 -498 681 -583 -293 -163 -354 367 -778 318
6439 318 -331 868 -196 500 382 678 433 -64 -28 96 -337 718 454 98 -738 -399 -164 412 928
6458 928 -4 -49 -682 -44 588 -78 256 -117 -180 -1015 37 144 -607 8 148 377 -857 -228 -229 -326 507
6479 507 -962 -151 502 69 -399 425 -902 -1223 332 75 675 258 889 40 404 922 451 -1052 444
6498 444 -286 134 -949 79 166 -133 51 675 323 -152 130 37 -163 -182 302 -14 248 -37 -38 377 -907
6519 -907 757 98 -63 -403 248 719 700 -201 -178 305 -576 758 171 -78 -549 192 677 -82 -151 303
6539 303 688 255 71 1126 -718 850 608 79 567 -266 926 -374 -17 334 -63 -228 1075 537
6557 537 -117 -219 1184 -72 -796 89 -856 -687 -937 -466 220 210 -625 -32 380 268 25 376 -48 180
6577 180 -531 128 36 -35 193 -21 96 -308 132 -692 -401 202 441 579 116 -61 -29 372 -463 -539 331
6598 331 764 -471 -195 581 -352 -374 46 317 -131 -498 1195 290 -237 261 -158 -784 53 269 127 355
6618 355 -867 -525 -1284 466 384 54 -37 -476 47 661 174 -256 -350 558 5 -250 228 -1039 249 420
6638 420 -519 -168 -330 -110 63 621 155 -24 -976 -396 -906 673 -545 -889 370 353 515 -196 306
6657 306 313 641 240 -14 -216 -400 1230 289 459 97 -488 -442 238 -96 -290 -189 -331 287 -161 -147 236
6678 236 59 237 53 -29 -78 29 -94 529 -35 590 876 15 402 -574 672 616 799 -1068 15 -1189
6698 -1189 933 -1134 -159 430 -510 -265 -368 737 -710 705 26 310 -118 -939 145 613 357 463
6716 463 -187 -427 593 -361 -183 111 287 472 437 -249 -192 210 129 345 283 363 619 -9 -341 213 254 -132
6738 -132 -459 -209 1041 -238 863 764 194 412 -16 300 -109 813 1111 426 564 -174 -911 366 -913
6757 -913 -804 321 -269 -452 113 326 215 257 130 253 -4 719 -76 116 170 152 126 -113 -1284 337
6777 337 716 399 -693 -686 825 575 -368 45 152 -746 -526 -453 747 274 -345 -875 116 613 28 -599
6797 -599 -272 170 498 -540 729 170 384 -405 375 -185 -87 401 693 501 48 93 -101 -326 249 -115
6817 -115 -63 -177 287 -310 -429 243 417 -76 -959 -172 -307 -486 933 -264 -950 -555 277 851 95 -472
6837 -472 588 1334 868 -202 414 -359 -175 -169 407 548 423 60 534 -130 -731 198 -813 -406 984
6856 984 240 439 -329 -58 -464 253 -400 -433 594 -416 84 57 280 267 81 8 -424 -86 401 -154 -529
6877 -529 -39 -142 29 119 -140 -407 788 300 682 5 427 480 306 -678 584 -847 709 277 -183
6896 -183 -320 -456 1151 -549 324 -180 520 -190 -309 29 686 298 -377 1021 -701 294 69 -177 754
6915 754 348 715 573 -1016 806 -881 -346 775 -720 431 303 -191 -123 512 660 351 -689 915
6933 915 -534 202 -118 369 -1111 335 -121 809 96 -96 247 -444 138 -577 4 -486 27 -584 -542
6952 -542 1112 119 -1160 481 476 73 189 -242 254 -121 -1027 10 -177 -902 625 -186 -48 167 1628
6971 1628 -219 1337 -643 -406 94 353 -41 221 91 492 -47 -99 441 -211 192 -188 -210 -362 -923
6990 -923 253 -474 217 473 -1011 -418 -1261 26 -493 109 946 -329 -189 -1185 -489 1248 -651 313
7008 313 -350 385 769 200 -305 718 518 -273 -118 605 887 -267 466 -477 76 -58 -63 -206 -218 698
7028 698 1157 -618 -347 -547 -698 -219 242 461 887 105 -1349 871 1088 328 -718 -12 -609 871
7046 871 -418 363 365 224 425 -364 132 -294 -230 337 -176 -173 -283 -865 1052 697 -433 112 -746 -88 142
7067 142 -695 310 436 -80 -164 -43 -1098 826 92 -514 1077 -1539 -221 764 -137 -421 -803 -167
7085 -167 403 -346 317 -937 194 344 -555 21 861 -483 720 -694 -202 196 3 -650 808 -911
7103 -911 239 563 -43 862 -450 71 634 669 422 460 557 475 620 415 118 -302 -1255 457 89 -190
7123 -190 65 404 -185 -36 -242 23 639 -146 146 1025 -422 118 -392 -380 644 -249 7 1176 860
7142 860 -716 344 586 -445 288 -311 -377 272 620 -38 -336 -1 -489 -440 -637 121 341 586 504 -717
7162 -717 360 966 -467 307 -702 201 324 -410 87 536 343 -255 -49 -454 -135 97 35 259 -97
7181 -97 -834 -30 328 -208 414 -370 80 53 559 250 257 269 -149 -1230 257 -513 -134 308 -468 296 -519
7202 -519 236 -225 -54 227 -180 -155 -733 -66 59 -68 259 -318 -1067 191 201 475 -221 -216 -322 232 69
7223 69 693 -361 422 558 75 -230 -397 -523 444 774 -103 -771 118 356 497 119 -797 -376 -451 -58
7243 -58 973 222 -18 -359 39 287 155 -123 749 -8 -153 226 -254 -6 -117 -582 107 -87 -493 532
7263 532 121 326 592 526 457 580 -407 -395 193 26 145 38 -295 1067 713 -117 -212 -542 -484 -1051 775
7284 775 -642 838 -33 -58 602 -1128 -533 429 -30 -417 499 1041 -520 -221 24 -320 -257 -220 193 -919
7304 -919 -591 -142 -228 -650 -674 573 -330 -199 25 -961 455 -416 -362 -32 -552 -188 -510 -405 693 89
7324 89 -949 185 736 -1003 321 172 -400 -343 -122 -1429 8 -105 -751 -393 221 -957 -682 950
7342 950 -76 626 -362 526 81 729 288 481 -35 -335 -283 431 512 92 568 197 272 -235 -294 -1378 -96
7363 -96 -54 8 -505 -114 -7 -82 896 205 -164 655 -960 135 -580 -1029 419 -39 490 56 -35 -229 -540
7384 -540 -678 437 -654 -373 17 590 594 -605 -82 -1044 228 -304 -102 218 -93 166 -336 -822 589
7403 589 348 -556 -266 473 -358 -208 -126 -499 709 -345 -69 -213 139 -765 370 132 208 65 1331
7422 1331 143 344 -577 551 491 129 224 -653 -491 -216 569 969 -324 -712 -3 -112 -713 -1010 -466
7441 -466 -146 200 -637 796 -210 573 80 390 228 -265 -798 11 -785 564 -199 -385 227 122 -110
7460 -110 258 938 451 369 130 480 679 493 235 44 120 317 -894 -1125 973 339 636 609 -1192 154
7480 154 -934 -503 -319 -507 -362 -2 384 -703 -792 -1342 410 -144 34 359 421 76 310 -328 357 139
7500 139 -357 -653 474 -457 3 380 -586 827 -433 1053 -539 -308 681 -316 -766 861 604 -410
7518 -410 -369 -180 -836 -426 855 330 -244 -245 241 189 668 -690 -412 -128 -869 -202 -177 28 319 -287 -401
7539 -401 -60 -574 270 -137 -79 569 -692 413 4 291 -449 -442 0 753 1019 163 543 219 659 -298
7559 -298 100 264 390 -182 -688 -252 187 -581 53 -604 -642 -19 -704 -526 -65 140 -558 -416 -550 359
7579 359 -383 -637 271 -601 -281 1028 793 397 783 450 -243 400 11 351 749 -438 179 -227 34
7598 34 366 455 -66 1001 -624 228 -624 -521 -19 134 217 -68 -526 32 -479 653 -565 -235 163 592
7618 592 204 310 -185 29 -370 332 379 -84 727 -356 870 -702 -182 849 80 -702 27 630 400
7637 400 -278 1434 69 99 -562 -795 23 -219 -334 -569 319 -113 418 -605 -560 111 -233 170 -871
7656 -871 418 -203 -441 217 434 155 -610 729 37 261 -129 -927 623 -634 -332 -562 -372 705
7674 705 -185 -199 -104 -309 -11 839 -91 564 -203 -195 -162 345 -3 4 -253 -213 480 -1291 -33 -141 -433 208
7696 208 -452 20 -121 860 -83 -706 -290 397 -839 -343 -964 161 -698 476 917 -1002 -546 -51 491
7715 491 498 1018 -352 -395 -174 230 423 1036 555 629 -503 10 254 -188 162 87 -335 9 53 755 -774
7736 -774 645 -871 404 1311 402 -100 214 413 139 -374 -95 -714 -532 200 -25 251 16 426 887
7755 887 -322 124 88 887 430 -33 102 -46 -387 6 351 206 614 216 328 -14 280 694 -293 356
7775 356 523 135 1305 4 279 653 798 287 265 -51 157 1167 8 -168 -52 1168 298 242 -342
7794 -342 48 285 887 302 469 -653 217 23 958 381 -63 78 -1146 539 491 1080 -452 -604 -378
7813 -378 253 91 604 -76 91 519 206 -1411 455 -935 260 -122 230 -95 -88 -169 -232 100 -471 1233
7833 1233 -219 -499 337 577 47 102 333 -233 97 108 -296 941 -283 48 -246 -29 623 -925 330
7852 330 142 -1001 72 444 282 171 14 -55 376 -264 522 643 -652 730 -47 267 -59 -83 306
7871 306 -382 -39 -254 -21 397 523 -191 -1193 -220 363 -634 -321 682 1045 -186 74 -282 58 307
7890 307 -667 -435 -11 459 -869 44 -674 307 280 637 -655 462 -518 189 750 -264 -302 -1091 1328
7909 1328 922 2 -535 239 272 -250 264 172 947 -581 -266 -320 -1005 -305 1087 -122 310 391 222 460
7929 460 -259 744 63 -673 -16 594 14 -332 -395 -1052 408 -385 -1000 24 241 -1529 326 -300 956
7948 956 619 -144 289 -194 481 -136 558 277 659 570 105 125 -336 -766 277 683 -472 -1056 -88 37
7968 37 1324 9 145 -698 -134 -837 -335 233 428 -256 -353 793 129 663 -934 906 108 -683 116
7987 116 -343 -10 354 32 -230 -469 -893 -71 621 159 275 -164 237 737 -98 291 -328 -20 416 -264
8007 -264 -116 -164 143 -123 330 126 -351 275 222 -408 460 -205 -671 377 -519 -386 -1078 523 -880 -71
8027 -71 -341 140 170 -736 -885 179 65 100 1055 -1000 -195 495 120 262 -723 -897 -961 223 -376 466
8047 466 -923 230 95 1524 138 -817 615 124 525 34 -1051 -20 -25 1200 150 418 786 256
8065 256 193 -46 303 106 227 -424 -132 525 597 166 -174 -45 339 831 123 -40 739 -780 0 1125
8085 1125 -728 -451 363 167 -53 -720 725 633 -380 297 525 -637 253 1165 87 172 -712 94 310
8104 310 692 91 569 736 -465 -504 -838 681 -559 -817 -26 -821 235 624 -1169 -813 317 399 -1107
8123 -1107 540 -508 -369 -819 1047 -2 517 164 1118 -132 140 656 -118 -248 -736 -270 291 -154
8141 -154 29 198 501 423 -1171 332 302 79 -694 24 -376 -850 -482 425 -105 378 -421 -335 -295 872
8161 872 -474 52 -409 -159 -699 310 96 -807 632 112 60 10 349 -305 182 776 -167 271 -319 195
8181 195 1006 -778 -41 175 -1069 -51 -859 -375 -201 7
8191G
##END NTUPLES=NMR FID
##END=
