##TITLE=1H_KYU-20'+DMSO-t
 CDCl3, 108 sc, 
 13.3.2019
##JCAMPDX= 6.0         $$ Bruker NMR JCAMP-DX V2.0
##DATA TYPE= NMR FID
##DATA CLASS= NTUPLES
##ORIGIN= UXNMR, Bruker Analytische Messtechnik GmbH
##OWNER= root
$$ XWIN-NMR		Version 3.5
$$ Wed Mar 13 17:22:12 2019 Russian Standard Time (UT+4h)  she@DPX200
##.OBSERVE FREQUENCY= 200.1315
##.OBSERVE NUCLEUS= ^1H
##.DELAY= (6, 6)
##.ACQUISITION MODE= SIMULTANEOUS
##.ACQUISITION SCHEME= undefined
##.AVERAGES= 108
##.DIGITISER RES= 16
##SPECTROMETER/DATA SYSTEM= spect
##.PULSE SEQUENCE= zg30
##.SOLVENT NAME= CDCl3
##.SHIFT REFERENCE= (INTERNAL, CDCl3, 0, 15.7039)
##AUDIT TRAIL= $$ (NUMBER, WHEN, WHO, WHERE, WHAT)
$$ ##TITLE= Audit trail, XWIN-NMR		Version 3.5
$$ ##JCAMPDX= 5.01
$$ ##ORIGIN= Bruker BioSpin GmbH
$$ ##OWNER= she
$$ F:/spectra/data/she/nmr/H-F/1/audita.txt
$$ ##AUDIT TRAIL=  $$ (NUMBER, WHEN, WHO, WHERE, WHAT)
(   1,<2019-03-13 17:20:40.71 +0400>,<she>,<DPX200>,
      <acquisition in progress>)
(   2,<2019-03-13 17:22:12.84 +0400>,<she>,<DPX200>,
      <data hash MD5: 16K
       9E 17 2C B6 A0 CE 15 E5 5B 33 57 4D 4C 65 3B 9C>)
$$ ##END=
$$ 
$$ hash MD5
$$ D8 AC 8D 2A E4 33 FD 65 0F C2 A3 12 12 2D 54 A6
##$RELAX= 
##$RELAX= 
##$RELAX= 
##$RELAX= 
##$RELAX= 
##$RELAX= 
$$ Bruker specific parameters
$$ --------------------------
##$DU= <F:/spectra>
##$EXPNO= 1
##$NAME= <H-F>
##$PROCNO= 1
##$TYPE= <nmr>
##$USER= <she>
##$AMP= (0..31)
100 100 100 100 100 100 100 100 100 100 100 100 100 100 100 100 100 100 
100 100 100 100 100 100 100 100 100 100 100 100 100 100 
##$AQSEQ= 0
##$AQ_mod= 1
##$AUNM= <au_zg>
##$AUTOPOS= <>
##$BF1= 200.13
##$BF2= 200.13
##$BF3= 200.13
##$BF4= 200.13
##$BF5= 200.13
##$BF6= 200.13
##$BF7= 200.13
##$BF8= 200.13
##$BYTORDA= 1
##$CFDGTYP= 0
##$CFRGTYP= 5
##$CHEMSTR= <none>
##$CNST= (0..31)
1 1 145 1 1 1 1 1 1 1 1 1 1 1 1 1 1 1 1 1 1 1 1 1 1 1 1 1 1 1 1 1 
##$CPDPRG= <>
##$CPDPRG1= <>
##$CPDPRG2= <>
##$CPDPRG3= <>
##$CPDPRG4= <mlev>
##$CPDPRG5= <mlev>
##$CPDPRG6= <mlev>
##$CPDPRG7= <mlev>
##$CPDPRG8= <mlev>
##$CPDPRGB= <>
##$CPDPRGT= <>
##$D= (0..31)
0 1.2 0 0 0 0 0 0 0 0 0 0.03 0 0 0 0 0 0 0 0 0 0 0 0 0 0 0 0 0 0 0 0 
##$DATE= 1552482718
##$DBL= (0..7)
120 120 120 120 120 120 120 120 
##$DBP= (0..7)
150 150 150 150 150 150 150 150 
##$DBP07= 0
##$DBPNAM0= <>
##$DBPNAM1= <>
##$DBPNAM2= <>
##$DBPNAM3= <>
##$DBPNAM4= <>
##$DBPNAM5= <>
##$DBPNAM6= <>
##$DBPNAM7= <>
##$DBPOAL= (0..7)
0.5 0.5 0.5 0.5 0.5 0.5 0.5 0.5 
##$DBPOFFS= (0..7)
0 0 0 0 0 0 0 0 
##$DE= 6
##$DECBNUC= <off>
##$DECIM= 2
##$DECNUC= <off>
##$DECSTAT= 4
##$DIGMOD= 1
##$DIGTYP= 9
##$DL= (0..7)
0 120 120 120 120 120 120 120 
##$DP= (0..7)
150 150 150 150 150 150 150 150 
##$DP07= 0
##$DPNAME0= <>
##$DPNAME1= <>
##$DPNAME2= <>
##$DPNAME3= <>
##$DPNAME4= <>
##$DPNAME5= <>
##$DPNAME6= <>
##$DPNAME7= <>
##$DPOAL= (0..7)
0.5 0.5 0.5 0.5 0.5 0.5 0.5 0.5 
##$DPOFFS= (0..7)
0 0 0 0 0 0 0 0 
##$DQDMODE= 0
##$DR= 16
##$DS= 0
##$DSLIST= <SSSSSSSSSSSSSSS>
##$DSPFIRM= 0
##$DSPFVS= 10
##$DTYPA= 0
##$EXP= <>
$$ [...]
##$SUBNAM2= <"">
##$SUBNAM3= <"">
##$SUBNAM4= <"">
##$SUBNAM5= <"">
##$SUBNAM6= <"">
##$SUBNAM7= <"">
##$SUBNAM8= <"">
##$SUBNAM9= <"">
##$SW= 330.908255636489
##$SWIBOX= (0..15)
0 0 2 0 0 0 0 0 0 0 0 0 0 0 0 0 
##$SW_h= 66225.1655629139
##$TD= 16384
##$TD0= 1
##$TE= 0
##$TE2= 300
##$TE3= 300
##$TEG= 300
##$TL= (0..7)
0 120 120 120 120 120 120 120 
##$TP= (0..7)
150 150 150 150 150 150 150 150 
##$TP07= 0
##$TPNAME0= <>
##$TPNAME1= <>
##$TPNAME2= <>
##$TPNAME3= <>
##$TPNAME4= <>
##$TPNAME5= <>
##$TPNAME6= <>
##$TPNAME7= <>
##$TPOAL= (0..7)
0.5 0.5 0.5 0.5 0.5 0.5 0.5 0.5 
##$TPOFFS= (0..7)
0 0 0 0 0 0 0 0 
##$TUNHIN= 0
##$TUNHOUT= 0
##$TUNXOUT= 0
##$USERA1= <user>
##$USERA2= <user>
##$USERA3= <user>
##$USERA4= <user>
##$USERA5= <user>
##$V9= 5
##$VALIST= <valist>
##$VCLIST= <CCCCCCCCCCCCCCC>
##$VD= 0
##$VDLIST= <DDDDDDDDDDDDDDD>
##$VPLIST= <PPPPPPPPPPPPPPP>
##$VTLIST= <TTTTTTTTTTTTTTT>
##$WBST= 1024
##$WBSW= 4
##$XGAIN= (0..3)
0 0 0 0 
##$XL= 0
##$YL= 0
##$YMAX_a= 647827
##$YMIN_a= -318711
##$ZGOPTNS= <>
##$ZL1= 120
##$ZL2= 120
##$ZL3= 120
##$ZL4= 120
##$ABSF1= 10
##$ABSF2= 0
##$ABSG= 5
##$ABSL= 3
##$ALPHA= 0
##$AQORDER= 0
##$ASSFAC= 0
##$ASSFACI= 0
##$ASSFACX= 0
##$ASSWID= 0
##$AUNMP= <proc_1d>
##$AZFE= 0.1
##$AZFW= 0.1
##$BCFW= 1
##$BC_mod= 2
##$BYTORDP= 1
##$COROFFS= 0
##$CY= 11.3945322036743
##$DATMOD= 1
##$DC= 2
##$DFILT= <>
##$DTYPP= 0
##$F1P= 18.9103706918063
##$F2P= -1.10871071338519
##$FCOR= 0.5
##$FTSIZE= 0
##$FT_mod= 4
##$GAMMA= 1
##$GB= 0.15
##$INTBC= 1
##$INTSCL= 1
##$ISEN= 128
##$LB= 0.24
##$LEV0= 0
##$LPBIN= 0
##$MAXI= 10000
##$MC2= 0
##$MEAN= 0
##$ME_mod= 0
##$MI= 1.114404
##$NCOEF= 0
##$NC_proc= 0
##$NLEV= 6
##$NOISF1= 3.799351
##$NOISF2= 2.8
##$NSP= 1
##$NTH_PI= 0
##$NZP= 0
##$OFFSET= 15.70392
##$PC= 1
##$PHC0= -9160.607
##$PHC1= 25.40026
##$PH_mod= 1
##$PKNL= yes
##$PPARMOD= 0
##$PSCAL= 0
##$PSIGN= 0
##$REVERSE= no
##$SF= 200.130013532006
##$SI= 16384
##$SIGF1= 3
##$SIGF2= 2
##$SINO= 400
##$SIOLD= 16384
##$SREGLST= <1H.CDCl3>
##$SSB= 0
##$STSI= 0
##$STSR= 0
##$SW_p= 3612.71676300578
##$SYMM= 0
##$S_DEV= 0
##$TDeff= 0
##$TDoff= 0
##$TI= <>
##$TILT= no
##$TM1= 0
##$TM2= 0
##$TOPLEV= 0
##$USERP1= <user>
##$USERP2= <user>
##$USERP3= <user>
##$USERP4= <user>
##$USERP5= <user>
##$WDW= 1
##$XDIM= 8192
##$YMAX_p= 0
##$YMIN_p= 0
$$ End of Bruker specific parameters
$$ ---------------------------------
##NTUPLES= NMR FID
##VAR_NAME=  TIME,          FID/REAL,        FID/IMAG
##SYMBOL=    X,             R,               I
##VAR_TYPE=  INDEPENDENT,   DEPENDENT,       DEPENDENT
##VAR_FORM=  AFFN,          ASDF,            ASDF
##VAR_DIM=   8192,          8192,            8192
##UNITS=     SECONDS,       ARBITRARY UNITS, ARBITRARY UNITS
##FACTOR=    1.51e-05,      1,               1
##FIRST=     0,             0,               0
##LAST=      0.1236841,     0,               0
##MIN=       0,             -318711,         0
##MAX=       0.1236841,     647827,          0
$$ Real data points
##PAGE= N=1
##DATA TABLE= (X++(R..R)), XYDATA
0 -8 -3 -15 -1 -36 6 -49 33 -64 55 -76 84 -100 114 -139 169 -173 210 -229 279 -303 360 -379 451 -488 567
25 567 -616 706 -782 887 -982 1119 -1237 1412 -1578 1813 -2072 2412 -2824 3392 -4172 5347
41 5347 -7303 11173 -21674 90213 647827 462036 418240 361861 327121 282165 247988 207374
53 207374 174710 136418 104886 69488 40667 8802 -17480 -44189 -67985 -89409 -108925 -128721
65 -128721 -140112 -153273 -161268 -168731 -172449 -174808 -172436 -169045 -161962 -155283 -144659 -133044 -121418 -105682
79 -105682 -90633 -75663 -58033 -40649 -22540 -5373 11575 28300 45014 59554 74005 86992
91 86992 98407 107604 116082 124485 128893 133920 134866 136540 135071 132499 128350 123451 115705 106415 99483
106 99483 88622 78308 66797 56453 44051 32328 21337 10821 -276 -10820 -19737 -29074
118 -29074 -35753 -42528 -47997 -52739 -55984 -57657 -58253 -57748 -55599 -54015 -49167 -43932 -38219 -32155 -24916
133 -24916 -15819 -7095 2456 10312 20169 29246 38421 47186 55240 63705 72489 78288 84670 89378 94231
148 94231 96279 99112 100793 100380 100688 97612 95662 92173 87365 83154 76969 69460 63871 55888 48681
163 48681 39050 32008 23013 14725 7568 -1063 -7634 -13191 -20209 -25687 -31330 -34283 -39828 -41948 -44496
178 -44496 -46405 -45816 -47396 -45155 -42840 -40466 -38754 -33814 -29348 -26347 -21336 -16093 -10576 -5156 -620
193 -620 5215 10701 16102 19627 25622 28298 31770 36092 37224 39346 41517 42488 42931 41578 40843 40189
209 40189 38974 35561 32334 29600 25807 22443 19229 15542 9254 6411 1719 -1936 -6106 -9339 -13388
224 -13388 -15697 -19005 -21018 -23345 -24911 -26151 -25435 -24644 -25036 -24412 -22747 -19948 -19186 -14828 -13244 -9543
240 -9543 -6167 -3017 1358 4534 9415 13749 15781 20656 23641 26534 30349 30745 34996 36915 36649 38585
256 38585 40034 39622 39558 38924 38634 35977 34305 31637 29246 26988 22973 19616 15489 12995 9223 5501
272 5501 3257 -1253 -3986 -7481 -10759 -13320 -15932 -17961 -19816 -21049 -22583 -23043 -23510 -23444 -23810 -22693
288 -22693 -22399 -20613 -19316 -17583 -14734 -12506 -9319 -7570 -5741 -2498 20 1770 5510 8128 10088
303 10088 12068 14307 15917 18009 19259 18821 19611 20065 19200 19607 18520 17953 16734 15449 13764 11830
319 11830 10234 8080 5257 2729 1060 -2558 -5148 -6192 -9640 -12019 -13720 -15322 -16351 -17224 -19603
334 -19603 -20623 -20947 -20345 -21034 -20505 -20298 -19483 -19027 -18505 -16730 -15002 -12915 -10229 -8108 -6508 -3669 -1271
351 -1271 967 2806 5265 8150 10757 12032 13879 14724 16227 16842 18578 19030 20697 19836 19393 18875 19939
368 19939 18584 17192 16099 15296 14514 12157 10054 8906 6039 4646 2293 549 -1363 -4203 -5948
383 -5948 -7387 -8962 -11057 -11542 -12587 -13148 -15248 -15346 -15185 -15628 -14796 -15995 -14370 -14059 -13435 -13142 -12094 -9866
401 -9866 -9692 -7271 -5431 -4698 -1728 -2075 -79 440 2375 5269 4484 6387 7269 8265 8469 9669 10797
418 10797 9290 9496 9177 9202 8361 7545 7181 6284 5911 4175 1651 1421 764 -2252 -2569 -4759 -4566 -7228
436 -7228 -8504 -9344 -10308 -10317 -10965 -12185 -12309 -12627 -13074 -12834 -12662 -12771 -12171 -11733 -11008 -9730 -9025 -8289 -7220
455 -7220 -5649 -4303 -2716 -2391 -277 1611 2279 3172 6712 5015 7210 7643 7889 8652 10074 9540 10414
472 10414 10629 9751 9580 8951 8442 8909 6898 5694 5258 4657 3253 2287 455 62 -391 -3583 -3658 -5660
490 -5660 -5431 -6123 -7740 -8894 -8621 -9666 -8788 -9401 -9500 -9367 -9714 -9473 -9180 -9264 -7594 -7249 -6474 -4974 -4324
509 -4324 -4361 -3005 -2271 -1176 1567 1119 952 2777 4187 4635 5177 5597 5904 5982 6924 6910 7256 7393 7487 6204
529 6204 6353 5575 5448 3966 2642 2825 897 268 -834 -985 -2484 -4154 -4601 -5070 -6254 -7527 -7402
546 -7402 -7943 -8959 -8403 -8828 -9395 -9295 -9279 -8685 -8272 -8432 -8936 -7911 -6446 -5839 -5510 -4554 -4625 -2817 -1440
565 -1440 -652 1192 326 2486 3103 3603 4901 4870 5825 6797 7245 6713 8079 8031 7772 7577 6084 6901 5871
584 5871 5326 6472 5057 4093 1923 1855 2072 -314 -774 -2062 -2472 -2647 -4310 -4472 -4517 -5362 -6813 -6963
602 -6963 -7425 -7773 -7442 -7650 -8266 -7838 -7155 -6762 -5774 -5257 -6103 -4075 -4626 -3365 -1920 -1034 -962 -404 508
621 508 1436 2783 3099 4568 4128 4325 5270 4692 5203 6410 4920 5401 5826 5408 5308 4939 3308 4066 2929
640 2929 2115 1812 1700 455 -950 -1441 -1595 -1850 -3141 -2704 -4101 -5459 -5159 -6196 -6963 -6497 -6281 -6541
658 -6541 -6692 -6788 -6296 -4795 -4854 -5172 -4609 -3712 -3004 -2559 -2412 -1825 -655 6 930 1454 1474 2433 2881 2682
678 2682 4335 4809 5045 4859 5562 4896 4539 4833 4988 4265 4272 4006 4027 3143 2795 2569 1895 1223 168 -171
698 -171 -1147 -2084 -1807 -2804 -3362 -3233 -4216 -4677 -4777 -5087 -5434 -5739 -4839 -5065 -4561 -5811 -4896 -4595 -4277 -1735
718 -1735 -2358 -3060 -2191 -1381 -1038 -822 80 346 1016 1626 2734 2895 3968 3297 4031 3682 3603 3081 4213
737 4213 3893 4112 4834 3166 4293 3333 2769 2228 1937 1718 2736 1342 634 459 -534 -1063 -1469 -2287 -2159
756 -2159 -2133 -3247 -3756 -3971 -3847 -3729 -3271 -5084 -4323 -4127 -3557 -3516 -4171 -2019 -2202 -2183 -997 -585 -573 -1799
776 -1799 289 1034 1036 1273 1454 1322 2696 3095 2809 3253 3760 2583 3492 2934 3011 2878 3214 2938 2804 1019
796 1019 1116 1215 984 258 -165 292 121 168 -679 -1835 -1482 -2316 -2592 -2668 -2857 -2323 -2920 -3186 -3029 -3835 -3358
817 -3358 -2769 -3372 -3169 -2629 -2557 -1381 -1924 -1045 -798 -713 -315 1459 1109 1114 1090 1679 2670 1224 2671 2816
837 2816 3207 2695 3309 2844 3483 2681 2574 2488 1108 2716 2675 1342 932 1466 1639 1583 370 426 -224 -390
857 -390 -1439 -1372 -1586 -1673 -792 -1749 -2686 -1762 -3271 -1954 -2386 -2395 -1845 -1300 -2098 -1765 -2214 -2038 -2689 -741
877 -741 -589 -996 -74 -469 116 668 -284 1708 1714 1281 1510 1355 2156 1976 2110 2742 3376 1680 2117 2246
897 2246 1790 1601 1361 1025 1370 740 736 1349 119 -489 -113 -225 161 -204 -1337 -366 -1961 -1832 -2326 -1724
917 -1724 -1169 -1205 -1381 -1712 -1381 -1548 -2102 -1641 -957 -658 -644 -466 -1001 -720 -137 257 987 483 224 510 464
938 464 1257 1104 1071 874 1755 1515 2592 890 555 1412 1636 1386 1697 1033 1259 1375 -136 -225 1701 -467
958 -467 -907 -58 -647 -603 -110 567 -717 -433 -866 -1604 -582 -1757 -442 -1456 -1043 -39 -1749 -356
976 -356 192 82 -221 96 292 86 -499 890 -812 665 871 590 516 402 -277 876 1963 1344 539
995 539 614 580 254 1741 1465 1411 605 882 -102 847 46 1137 301 -243 -791 363 -1064 125 92 359
1015 359 -283 -902 -938 -1160 -1095 -947 -1713 -555 -401 -822 -216 -713 6 -37 -482 682 332 2 1094 -708
1035 -708 622 -67 1341 -16 1060 -9 1411 1524 -203 1269 1392 743 265 356 1137 1248 -152
1052 -152 1208 -491 -341 424 491 -256 40 634 -1060 870 671 -571 -1598 -153 -251 -631 -27 426
1070 426 -1408 -1294 -250 -1428 -1312 -669 -1076 -279 -511 -1082 451 -81 3 -294 611 -173 392 950 651
1089 651 79 866 907 949 1427 -223 187 -455 4 375 1491 1282 960 841 -367 -212 1114 436 -586
1108 -586 352 87 -1 -328 -447 -811 -202 -292 -1205 -726 225 -242 -419 329 21 316 -26 -874 -552 -741 62
1129 62 -204 554 -48 -754 -642 157 -528 766 547 679 1176 -345 491 -314 952 1724 279 199 441
1148 441 502 306 782 46 275 -273 -96 -150 692 674 -795 -192 -657 512 -546 -643 -410 -564 -645 -1094 -391
1169 -391 -351 958 -442 -432 304 -596 -669 45 -1034 -1000 948 -515 705 889 992 1092 778 938 1020 302
1189 302 454 997 -91 923 323 122 891 628 526 -300 668 658 292 -176 856 -415 878 691 -203
1208 -203 517 -1636 -71 218 106 979 -922 -49 -502 -1739 1017 -868 -249 -1211 194 -814 -830 71
1226 71 408 -345 -499 -700 332 -656 -293 -613 -708 -806 203 -325 -628 51 -406 -469 615 1022 -169 549
1246 549 -177 -854 951 763 -337 278 1556 853 312 374 -185 329 -441 680 -333 675 -665 1127
1264 1127 -1022 40 610 334 -308 218 -783 586 -270 224 -264 -1038 -588 485 392 -1274 -269 -1611
1282 -1611 -78 -632 -994 -1080 -695 -289 -254 1565 131 -765 1 -119 701 -244 -588 799 -260 997
1300 997 131 837 -859 385 304 501 -245 169 254 322 -737 -847 914 444 581 -524 373 -445 1101
1319 1101 502 -37 -481 51 340 -674 -412 433 -1068 -1058 -643 -466 -1444 -1698 -716 -1324 -879 579 -146
1338 -146 -405 -625 -1018 18 -785 324 -212 -287 159 362 107 -749 332 374 -829 -984 -5 382 293 -7
1358 -7 545 263 -377 853 519 561 244 245 486 -282 -493 65 -67 767 449 690 16 -258 -923 350 -442
1379 -442 -1275 -397 157 -677 -113 -408 313 591 89 -184 -188 -1141 896 555 -141 -271 43 -48 707 1137 -118
1400 -118 180 -828 775 -565 631 240 339 206 309 450 368 175 235 -472 960 785 316 156 -1
1419 -1 -588 -946 -476 -718 -942 -1044 -316 289 -354 -173 -476 -51 -864 -502 -1156 370 -1263 -1300 335 -370
1439 -370 -1012 -666 -509 147 589 -673 89 98 -682 -348 1106 410 459 169 250 2 -91 223 192 440 -129
1460 -129 -68 -1130 284 75 -394 205 1 459 571 689 170 -607 560 799 -144 -55 723 511 -459 -559
1480 -559 -71 -173 -174 -2011 144 -719 -516 -733 -1107 66 -753 -257 162 155 -845 -558 -30 91 -789 -513
1500 -513 -22 -409 53 1377 -185 -770 -400 -36 -12 41 469 838 623 -49 713 716 -597 741 330 -114
1520 -114 31 380 143 -223 591 -517 -421 -404 -877 -517 -277 1043 -827 -1514 -56 -697 -1125 -1044 -847 17
1540 17 -1048 -125 -1182 -79 161 -791 -598 -84 -327 -161 -812 -119 -98 -771 593 -375 306 -218 520
1559 520 358 178 -53 425 15 742 -296 -354 345 10 -148 464 -317 192 627 -108 344 -774 -146 -339
1579 -339 644 -425 -854 331 -456 -765 -274 -1337 -301 -277 -107 440 -89 -159 -728 -958 383 -146 -718
1598 -718 -1230 -733 458 543 -172 118 -558 -200 510 249 23 420 445 -612 -114 969 -156 640 705 458
1618 458 497 974 121 222 36 -77 489 1437 739 -378 753 -993 -511 -419 459 57 -67 -417 -566 -1274
1638 -1274 -1530 -1224 145 -295 -786 -878 -1477 76 -749 -698 -784 -1663 -428 -867 139 -778 -371 -56 -639
1657 -639 -781 531 222 -571 370 -40 -6 516 610 -488 188 -178 -568 735 965 688 648 264 -726 281
1677 281 -707 -7 972 -154 -278 -233 881 -510 99 -733 -531 -950 812 299 -146 151 -172 -646 1058
1696 1058 -544 -322 -1134 -83 342 -171 -767 -320 -91 -990 -213 -787 -413 -782 285 -327 -20 -287 1142
1715 1142 -70 -152 960 640 -258 442 802 -128 485 512 -23 73 -277 -87 487 329 18 506 14 162
1735 162 24 -120 -38 -621 -344 -235 -943 -25 -492 196 474 -696 571 -1325 -113 464 -996 -738 -1123
1754 -1123 -305 -398 868 -417 395 237 874 -112 540 -276 -169 1384 836 -45 -716 -163 -293 -250 -77
1773 -77 -236 156 553 631 826 223 172 707 -55 -28 -45 -276 188 185 -342 -25 -565 568 716 705 -314 -1036
1795 -1036 -881 55 -1092 -582 -102 1007 -323 -336 178 -1743 -1792 -562 37 208 -777 -228 113 -184 -352
1814 -352 -863 776 117 -300 562 -85 1397 57 -149 764 109 -124 27 1113 1371 -134 -237 467
1832 467 452 -541 624 14 -295 -317 344 -858 -108 -1114 -475 -829 236 277 -1061 609 -780 547
1850 547 -796 -1430 -249 -238 172 -287 -409 -589 -224 -397 -436 -655 -329 -976 -37 342 -809 -148 161 106
1870 106 944 102 19 -210 -263 245 1029 -364 268 712 837 713 -275 731 865 333 876 556 325 -23
1890 -23 555 157 -595 76 73 -632 -1064 -137 -708 -45 -700 -988 132 -1294 67 -1466 -291 -462 -1254
1909 -1254 -695 -1466 -281 -629 -249 -61 280 -196 -471 317 459 -583 175 -193 -7 -525 -727 366 -391
1928 -391 -284 1337 551 483 143 -239 804 -264 219 -288 864 90 608 288 1119 934 -582 715
1946 715 457 652 -295 -228 320 -1681 -1077 510 -924 786 -129 -901 -469 -606 -420 -531 194 -195 -348
1965 -348 242 -1371 -839 -664 -894 -459 -586 -602 9 -382 459 140 -57 -114 288 743 867 667 -220 706
1985 706 -1157 1067 312 233 980 968 -363 435 47 24 704 201 -709 -706 -200 -728 -277 -757 -54 -861 562
2006 562 -35 159 117 525 782 75 -613 -1026 -470 -395 281 -298 -278 461 -1196 -482 -995 -514 433 910 137
2027 137 427 304 -202 -287 386 105 1103 948 953 60 -102 -221 1196 95 -192 -159 -18 309 542 932 167
2048 167 170 -355 28 -591 287 -531 -457 309 -2089 -417 -467 -1163 -1026 -45 857 -124 -268 -805 -1 -139 -153
2069 -153 689 429 -745 -25 240 -245 -52 -232 -264 49 532 151 164 -388 -480 -249 253 253 404 -851 545
2090 545 448 -870 -987 345 -345 1129 -998 -492 -303 636 761 -830 631 -112 -352 333 -149 -92 -527
2109 -527 217 -225 -85 -855 -415 -394 -392 711 -259 1154 -485 81 -289 -421 -344 -1066 187 -95 -85 -175 406
2130 406 68 -209 133 -448 -188 984 275 129 -2 247 -73 207 -197 -138 213 390 -440 486 -1114 -127
2150 -127 442 -66 -609 792 -538 807 -427 -692 232 298 -481 -56 -202 -95 -632 -548 157 -856 -777
2169 -777 -328 -535 118 -839 -688 -93 -1160 255 6 -307 71 392 460 -367 507 -46 -190 1205 -662
2188 -662 -529 169 174 -670 284 -156 234 461 791 -208 655 636 702 631 107 262 -518 -1010 -523 -389 13 86
2210 86 -542 -85 -589 772 -272 713 -987 -268 -403 -772 -178 262 -700 362 261 -574 -4 510 27
2229 27 234 -148 -107 -292 -812 225 -836 -563 -75 220 834 967 272 -733 -222 -854 -113 545 669 -667
2249 -667 -93 997 8 252 -160 586 21 3 -83 -713 -471 15 -294 279 270 -73 608 -38 311 533 485
2270 485 447 -442 -464 366 -346 -587 14 882 -62 -434 1151 -143 -282 -700 -434 -248 239 -96 -388 29
2290 29 -474 -722 498 -651 -76 622 375 352 -166 195 496 526 -1167 -118 260 -531 161 537 48 -154
2310 -154 1102 414 37 -186 -90 -72 848 565 -385 461 -511 133 495 -404 -832 -310 404 490 -617 -579 -565
2331 -565 -860 -583 230 -560 -766 271 -249 591 -962 -760 -221 376 -140 112 -1072 575 29 327 914
2350 914 -180 299 -277 323 836 480 -594 332 -437 698 482 1391 -1010 -277 945 347 1281 -220
2368 -220 -978 -15 1166 230 739 55 -312 -195 456 -523 -385 -572 -205 445 -100 395 815 -129 -317 949
2388 949 -1078 50 499 -354 100 -338 -242 -1076 512 -532 134 338 -350 470 600 -735 -23 417 -1107
2407 -1107 72 223 688 937 -219 164 704 128 -52 -519 -326 302 377 327 115 -291 -283 553 -461 214
2427 214 460 60 -476 -715 -934 -254 -68 958 -1101 -707 -280 -366 1010 -259 191 -1223 1283 109
2445 109 -142 420 -439 -668 790 -77 -354 -311 -468 -742 509 -439 -578 177 573 -286 1066 -1002 -489
2464 -489 -837 280 1003 -144 220 137 -163 137 -859 -258 160 421 651 -384 23 450 -160 598 1056
2483 1056 295 -217 -82 303 -202 207 -263 1211 215 424 -466 443 -57 -133 175 10 -14 126 692 586
2503 586 787 325 -530 -749 -788 21 -442 -505 -48 -269 158 -97 -968 26 -220 -383 594 -610 98 -163
2523 -163 -419 343 199 277 369 -719 -588 100 180 211 382 -690 -44 -118 -119 106 31 -20 389 213 -199 -313
2545 -313 -1167 -337 261 -580 606 -125 -510 137 -1194 1321 288 -267 -458 32 -283 -190 -431 393 -731
2564 -731 -142 -205 491 -731 751 602 -500 712 1976 246 -575 -419 -650 930 -59 -307 -463 210
2582 210 288 -281 -399 859 132 386 173 -989 87 -340 -2001 699 -69 343 -966 -625 336 -491
2600 -491 -142 -35 205 821 -392 -384 252 364 -97 -434 84 324 77 -514 482 508 -630 -131 -247 51
2620 51 -381 499 -242 -879 -29 395 842 -219 -858 -92 -130 423 -417 -373 -262 224 -299 -939 -363 148 -335
2641 -335 962 607 331 23 -296 -617 -236 832 -9 -179 -1361 29 255 1452 1178 -631 281 879
2659 879 405 -328 296 -40 772 545 -46 692 121 158 63 274 -208 516 -75 429 419 -548 300 135 -448
2680 -448 -690 -448 -972 81 144 222 -276 24 -397 -38 -238 328 110 -3 346 -557 -945 -514 -187 -94 -16
2701 -16 -560 -151 -218 -1278 -822 -558 234 -121 -486 99 28 573 260 36 35 -194 465 193 -877 229 -100
2722 -100 -187 574 329 522 58 -679 -209 316 -10 652 1089 570 -729 1313 485 640 -458 -804 464
2741 464 -1199 -670 188 -477 18 -457 737 -1352 -370 1111 597 -528 -548 1060 511 -563 196 -1322
2759 -1322 -992 -37 679 41 -1125 841 16 -631 367 -128 -968 568 236 238 -1026 -100 -1167 -395 -362
2778 -362 -155 -56 422 -328 -805 -22 -470 -459 209 694 -217 -438 144 -1256 -190 389 63 1274 -411
2797 -411 416 769 -248 -17 -11 -179 342 66 533 -43 -380 56 184 -638 182 -274 1150 -559 77 120
2817 120 -85 -432 411 -341 43 264 114 -345 -301 -905 193 799 406 -303 -580 -8 164 567 -806 -971
2837 -971 -1314 -507 -171 159 -386 -780 580 -202 91 73 19 196 463 1422 329 -852 -256 -74 -167 271
2857 271 -903 286 686 663 216 -61 -340 -967 253 -46 257 144 668 337 -490 697 -506 -45 581
2876 581 382 -1129 -56 -223 36 623 -123 930 -558 -467 -666 -124 -837 91 328 -319 -273 -855 457
2895 457 -853 -26 -793 -577 -188 657 -767 -198 24 -429 52 -409 -393 645 492 -264 266 -111 81
2914 81 567 -538 -102 343 -334 -110 827 -413 -222 -181 -277 40 2 -491 -131 87 -205 -418 -117 337 -695
2935 -695 305 27 160 26 269 -709 24 148 -215 -196 -412 329 77 -713 -194 437 1098 -304 306 -426
2955 -426 -821 401 526 92 -315 332 -376 81 454 -32 -76 -54 -133 179 414 -103 -420 -146 -1018 -201 -2
2976 -2 -503 -80 -176 -1044 -150 -529 863 14 1421 -1180 259 -19 -46 1045 166 -987 486 366 76
2995 76 155 -102 434 -111 136 -429 34 -492 81 -226 174 -503 31 -369 -863 -174 240 693 71 585 278
3016 278 87 -793 501 -317 63 152 -695 916 297 44 121 179 -405 105 -363 617 -399 -996 407 25
3036 25 -237 -573 269 -897 236 824 233 331 -300 -561 407 -280 -423 -371 1272 345 -294 21 437 -418
3056 -418 107 -523 -440 129 245 26 250 -25 -692 -99 169 -47 725 684 504 511 287 276 -285 499 -142 587
3078 587 -309 764 312 668 -532 -434 -733 -303 -124 921 -456 501 875 -140 -499 43 1055 1119 -1307
3097 -1307 152 939 -241 -352 -80 1 273 235 548 -120 623 -396 326 -397 398 -62 -507 -834 -297
3116 -297 1012 57 271 11 16 127 -78 439 591 -805 -464 -367 155 -674 556 556 -215 626 -200 282 -534
3137 -534 -459 53 -629 1126 735 361 -72 360 -4 -417 -144 101 41 575 478 -462 846 1646 934 323
3157 323 632 -626 -463 -1008 -52 599 417 181 -521 25 78 861 119 -282 800 -567 -457 93 -218
3176 -218 373 512 252 -304 1000 -511 615 -3 -742 730 111 311 -573 168 -436 -255 -31 600 -26
3195 -26 531 49 -234 264 331 506 -1009 299 -96 -561 -658 36 129 -75 -154 -406 -133 -337 874 586 190
3216 190 -357 -687 -128 371 -198 122 1118 623 701 643 -1099 109 -258 243 -103 -649 -53 -369 -77 -638
3236 -638 283 28 194 113 320 985 21 166 -112 -913 -211 -431 -77 897 -634 -39 -555 -166 510 -430
3256 -430 263 -31 -194 67 -155 60 362 375 429 499 -163 -583 -308 -266 -541 -364 906 354 186 -806 216
3277 216 16 14 -328 567 -430 485 9 798 428 856 -121 470 413 -195 591 738 816 -358 24 -412 1138
3298 1138 -73 587 691 391 -439 -285 671 -287 -463 -710 -556 -457 266 -386 -569 72 -581 -691 65 -394
3318 -394 -137 78 224 220 852 382 -458 474 142 206 -329 -458 428 -82 -658 -341 -118 -509 498 406 -332
3339 -332 -224 963 -383 -632 220 -778 340 -85 -141 361 -814 397 12 -641 -225 -69 1113 432
3357 432 688 -197 -1150 -40 -47 278 1194 -344 -573 90 830 -704 -921 537 -963 38 -325 -552 -422
3376 -422 586 -864 188 -276 -418 -1219 251 422 -787 -46 -1071 -202 5 -283 -317 304 63 -874
3394 -874 303 -478 1691 -514 282 -60 -1287 -211 1130 -273 -887 985 -818 434 -448 -527 -512
3411 -512 -394 22 7 -342 702 253 1404 331 -174 184 -131 -120 333 667 211 -212 -140 -935 460 220
3431 220 -743 -60 -807 334 343 -249 -180 -788 -1285 -209 -285 -3 -833 -98 -1 -566 -562 84 -206 84 -551 1213
3453 1213 311 161 -70 1362 -406 -1323 232 -73 390 9 -604 -172 728 1731 -151 -307 -307 -615 624
3472 624 -78 754 -480 567 -1058 827 347 -105 222 -49 391 -77 -584 -342 785 323 -712 -361
3490 -361 -330 444 661 281 703 -16 86 -737 -1211 -1285 -246 -639 -997 -273 -96 630 -149 -143 -385 523 -2
3511 -2 12 1 -118 84 -793 -41 -623 75 86 -438 760 -60 -336 -44 101 785 -322 -27 -763 -74 1556
3532 1556 150 122 -610 312 -81 -273 57 -93 1063 510 -1089 40 94 -743 139 788 -307 424 -416
3551 -416 -337 -285 -154 316 17 -611 273 -1436 577 -298 110 313 -555 -27 -442 -36 -280 206 246 -269
3571 -269 650 -528 941 419 -7 44 -228 303 -25 32 -363 562 -648 -900 143 -329 -289 -32 276 -626
3591 -626 -854 -571 -372 241 -359 543 -216 -449 -20 -96 -451 808 21 -51 322 121 164 -99 -41 -89 270
3612 270 -485 879 -387 79 -434 632 336 -303 -152 548 -40 446 -389 161 188 11 831 -207 636
3631 636 -127 -48 506 490 43 342 -20 -1624 199 657 -137 349 125 149 309 83 461 -16 -49 250 -562
3652 -562 -219 12 -683 -322 126 233 -283 741 -679 846 259 -440 -1381 -124 -409 -727 456 -455
3670 -455 -371 -420 1152 -300 287 384 -684 -59 -38 -772 269 -140 -419 -480 -300 318 -932 -119 -150 -1009
3690 -1009 661 -272 315 586 -325 -489 -982 -1017 737 326 -559 870 -259 -583 -242 -302 142 -732 1541
3709 1541 -447 745 212 671 376 42 -742 1019 -545 260 547 519 417 -578 1274 216 -712 243
3727 243 -360 202 -99 555 -804 -330 -924 98 822 -166 435 64 857 101 -408 173 -290 280 -485
3746 -485 308 563 -330 261 -323 -322 -926 801 675 180 396 50 223 194 675 -246 -783 589 503 -397 -333
3767 -333 -1046 823 189 304 -75 -656 -591 115 -251 263 188 1009 901 -1391 255 -181 -676 -34 295 -725
3787 -725 -223 35 -404 -606 -998 347 -1203 -1391 -732 746 -32 243 -284 235 343 -106 -293 -472 20
3806 20 478 -656 -749 -253 483 4 -535 449 -1259 797 -38 -34 -376 900 834 633 512 950 538 -278
3826 -278 -298 199 402 -55 24 -408 -908 -75 164 -724 212 449 28 575 -758 170 -832 544 -321 1002
3846 1002 86 -119 337 88 87 -465 517 433 187 -799 -499 -592 -1099 -1405 431 118 -558 286 23 569 -83
3867 -83 -558 277 -61 446 -186 -232 -550 -14 -709 -755 -774 -257 -852 -745 -211 -450 -837 -496 -721 81 -28
3888 -28 939 257 55 -544 463 946 532 261 287 -7 167 73 -51 590 1108 614 376 141 -16 1112
3908 1112 1024 -754 -526 672 686 -1 574 517 -1504 -60 442 466 1 -801 612 -144 -81 620 760 -1012
3928 -1012 47 -91 156 646 -1260 -420 -260 -66 309 -308 95 -615 290 864 -96 133 -502 -1070 497
3947 497 1212 155 -84 -564 -596 -745 -525 304 594 -630 -60 -101 30 902 650 -112 -315 -251 -193 -97 488
3968 488 1476 991 480 1497 -48 223 -486 141 393 127 80 -626 105 -407 247 76 -12 -19 423 700 121
3989 121 107 -54 -100 -18 -122 869 -162 -899 -168 94 -397 415 -588 -714 323 -515 -93 -334 142 -611
4009 -611 238 -507 47 -223 -681 -221 -9 -655 -264 192 -404 -26 -575 -980 711 19 -164 -34 261 426
4029 426 -150 758 -934 -699 185 -678 394 639 78 -62 -506 -565 519 272 380 -46 -607 1431 -118
4048 -118 252 -128 -334 238 153 -487 335 6 -798 -470 286 333 -323 71 226 -155 477 -860 -339 126
4068 126 -347 -46 -393 989 54 -104 240 532 -189 -484 214 -110 -331 105 -225 340 302 722 612 346
4088 346 650 -228 145 -254 -135 -24 172 -293 -428 278 -548 318 1590 -238 183 -409 269 -325 -207
4107 -207 53 -569 -314 959 308 -780 -1029 773 -1321 174 572 246 316 904 108 396 -613 45
4125 45 -658 104 -33 -368 818 -155 64 430 467 563 492 -433 65 -294 628 -93 -493 11 -883 290 -571
4146 -571 -187 1397 180 -155 293 -118 595 -7 -457 -493 -821 -496 55 103 -573 -211 427 -310 586 -433
4166 -433 -966 -379 490 -412 -13 -606 -161 337 -490 610 -307 -351 -146 -98 495 -19 -152 736 -875 -196
4186 -196 415 402 -521 -531 -73 -983 -429 -620 -825 -328 -358 -20 384 168 -618 -604 845 -506 693 277
4206 277 863 -35 59 -664 127 -546 -832 1 -719 158 977 -159 -213 443 -83 858 525 28 232 -587
4226 -587 633 421 -125 10 949 577 918 215 -343 667 -745 -65 625 863 -205 99 786 687 -186
4245 -186 845 20 2 -326 -302 -330 -156 41 -669 163 31 -340 325 -48 811 -318 -1145 -249 -836 -331
4265 -331 -350 368 -230 250 -93 2 -283 180 -942 -772 105 252 -2028 -103 141 73 605 365 726 -907
4285 -907 485 152 326 -115 -108 831 480 -613 606 758 248 -565 279 1006 -193 -242 -810 -63 1536
4304 1536 114 155 561 -837 220 312 79 94 297 -521 -332 -80 520 -326 765 860 -357 -712 -13
4323 -13 431 -249 151 128 -26 -108 150 541 -99 749 -306 -498 154 -281 -334 309 138 397 -160 -393 1504
4344 1504 528 -96 -65 656 107 357 847 -670 196 -193 -352 95 -54 -447 -511 -707 -456 251 58 -462
4364 -462 649 -127 -417 -173 -1167 -812 -358 -258 1037 -264 -101 320 61 -96 249 -112 -457 357 -599
4383 -599 -102 51 228 389 895 273 -401 -27 270 -88 85 123 -710 -450 -972 109 585 90 464 677
4403 677 -387 1201 -347 779 142 223 -719 430 20 -312 361 -468 -397 -429 339 -860 281 1050 -768
4422 -768 -424 219 -458 77 264 -406 -222 107 258 311 -297 248 -142 -638 -638 272 -191 -199 804 32 706
4443 706 606 611 380 66 -393 -209 250 24 -587 -3 -401 -41 812 -253 -144 315 -63 259 370 372 536
4464 536 342 -480 452 26 -246 392 114 -87 -184 668 -152 -163 -342 212 158 889 -367 -528 959 657
4484 657 1147 315 355 834 801 789 519 -284 -276 -191 -920 -523 415 338 -530 22 572 -676 607 -326 -209 77
4506 77 -414 16 -85 453 254 -5 -69 516 647 -213 -401 263 145 -342 -410 770 253 1168 42 7 522
4527 522 -179 1158 1064 602 5 -329 64 -618 148 -851 -465 -383 361 440 248 -215 -405 -904 414 -1011
4547 -1011 -648 -110 -411 785 415 537 -469 427 -208 797 -963 -163 -703 -820 110 -1022 -291 79
4565 79 -885 358 -274 -289 480 574 -365 114 1194 -497 146 -301 -738 293 561 219 -145 -587 -456 616
4585 616 -369 685 -30 1100 66 -77 380 -385 296 -688 314 367 253 4 -19 1105 -400 219 -692
4604 -692 722 349 -153 270 -97 -175 736 -359 -259 -229 20 603 1121 -323 495 -352 221 805 -71 -492
4624 -492 -340 -70 141 11 -618 -282 215 -380 217 377 -499 -430 -66 278 -19 -95 -191 354 -365 -913 -637
4645 -637 -108 -476 -229 278 -537 468 -207 293 262 -520 -72 200 618 683 58 -1009 -19 769 -4 904
4665 904 460 -168 -141 -169 -677 916 -311 262 -326 -203 29 562 1068 -332 551 -1278 497 78 -772
4684 -772 372 -2 -103 404 487 230 610 268 -713 -308 -88 735 -871 -305 318 469 706 -378 201
4703 201 517 -933 -603 -254 136 197 -711 -381 639 -251 -452 -52 -544 692 -707 -310 -159 -517 -447
4722 -447 218 -188 -246 -25 -486 349 -599 -228 612 20 1463 -281 -144 657 512 359 -889 895 -334
4741 -334 451 -614 -116 -147 -555 1262 95 551 371 220 343 27 -216 790 -124 547 -1028 -150 325
4760 325 103 -340 -1269 240 307 -249 -31 -876 810 -478 587 822 660 -561 10 -512 78 965 -939
4779 -939 -1386 385 383 -103 -1092 -110 170 93 -608 65 141 -493 300 -919 586 271 125 917 160 32
4799 32 137 -1442 1006 467 -229 -145 262 -403 512 -442 -810 -1044 181 -286 -834 327 -473 -389 59 68
4819 68 267 31 -773 297 -569 0 199 -263 -245 -355 -361 -48 246 -521 -276 -166 141 -981 -931 -219 465
4840 465 -424 1084 -370 308 -187 -292 356 405 1031 -464 -115 471 671 413 -177 -270 -809 -1236 429
4859 429 268 348 -526 -633 -920 -310 -316 -669 320 59 1 427 -70 713 40 861 736 -132 -388 329 -791
4880 -791 -287 379 -9 784 -929 -105 308 -87 -269 470 -230 30 109 -685 231 4 160 243 -607 -1464
4900 -1464 164 -87 106 9 245 175 454 -419 545 -559 -340 286 -1069 793 -82 379 -314 607 -137
4919 -137 -55 -441 -55 374 -226 568 -223 -57 251 138 -502 -226 -507 -285 -465 -465 -83 -319 -178 743 -562
4940 -562 -339 506 29 26 -119 529 -191 266 -376 -754 63 -602 -293 411 271 -419 182 226 1079 -620 -439
4961 -439 -232 -65 -367 51 380 -855 686 603 60 780 321 676 -183 -308 -658 437 -459 -502 42 841
4981 841 63 225 403 -646 -324 -108 -266 -445 -763 32 510 227 703 -661 -353 -663 -159 -2 270
5000 270 176 536 -887 10 -750 -324 293 -207 935 300 606 496 -91 -707 675 -614 -956 150 331
5019 331 166 -55 -593 340 1061 94 -305 -783 316 196 272 -1202 120 -346 -153 -617 -815 -321 -896
5038 -896 887 1402 285 -395 -97 530 -65 -1095 481 384 231 316 -42 862 728 31 997 -163 583
5057 583 -30 -397 268 21 -257 -20 1030 573 323 -916 323 13 190 -640 -329 -514 338 -390 -206
5076 -206 633 -378 -624 -368 -846 -161 107 111 -565 78 130 703 -83 165 199 965 -30 -197 567 -411 428
5097 428 267 -1226 -68 596 -881 117 -276 454 -267 -324 382 145 -599 273 -32 780 -918 -181 -44
5116 -44 -831 -263 238 -1239 284 292 -576 2 -266 -79 -18 139 -331 -208 -583 253 -657 -116 508 -360 1078
5137 1078 -1132 4 -53 -579 -425 27 887 -1584 -583 240 -472 276 487 580 -311 -164 795 804 132 835
5157 835 -793 234 74 609 948 1143 396 457 1345 583 -122 -261 740 497 -366 251 -15 21 948 610
5177 610 1276 -131 574 87 -1543 -996 -646 -429 193 355 -835 -247 -538 545 73 197 -602 414
5195 414 -553 -688 0 -516 -515 212 161 -107 23 85 370 246 -161 -686 -109 1233 -1018 -387 -599 3 240
5216 240 -114 254 -176 584 301 36 196 -50 477 -430 710 -906 -522 27 800 -383 100 213 -547
5235 -547 235 -354 24 -475 -564 0 729 2 -219 319 -268 841 585 -137 750 -98 -213 -103 111 616
5255 616 349 367 -611 670 -213 392 67 42 -57 -274 6 -906 -1118 789 -417 -210 -372 624 -24 521
5275 521 130 -257 471 541 -358 775 -602 -966 -706 1162 477 405 -41 201 472 830 1044 -474 -771
5294 -771 -211 -164 379 277 45 -151 451 319 1480 177 517 -329 -273 229 -289 -889 215 -953 -911 335
5314 335 -266 415 -1009 150 355 -37 295 -130 -326 130 -164 -471 -54 457 -1222 692 -288 51 0
5333 0 538 -579 177 769 -110 -510 -102 138 676 607 -687 -724 651 -1084 -433 -768 22 710 664 -247
5353 -247 -216 -476 600 922 -113 -901 -89 1157 300 -651 -612 -56 767 1354 365 473 -199 -514 584
5372 584 456 379 -62 565 -292 -495 -214 -184 636 608 -719 -7 607 861 285 -169 262 -244 675 -260 -1004
5393 -1004 -199 45 672 686 -644 -220 256 -255 114 644 -491 476 -135 646 24 103 -17 -78 -645 -60
5413 -60 -456 305 352 -770 87 212 -114 -1394 1088 -58 -83 -944 -597 202 251 -255 -124 -77 -508 745
5433 745 92 305 117 127 222 -749 -454 -225 -358 -756 -66 -390 -618 -37 223 -625 -95 586 269 1562
5453 1562 -577 626 434 -711 667 -121 -535 391 -756 1 -153 -506 -896 605 187 479 -264 -455
5471 -455 69 -273 179 -415 333 1296 -1098 -459 -272 -518 158 637 -239 -36 -153 -451 789 -357 254
5490 254 473 355 -480 6 -290 -952 -384 0 139 -179 -662 -416 1381 -497 -661 458 -44 -25 408
5509 408 309 484 101 -746 360 615 101 382 -796 -407 -303 -921 -1420 179 -166 611 -749 93 -1413
5528 -1413 -1062 -282 407 -273 1003 -421 -618 -517 -79 -170 -408 52 587 116 230 503 -472 -936 510
5547 510 759 668 -402 -120 -358 -450 -6 -35 -675 215 943 -365 -55 -1493 -78 271 635 32 -228 385
5567 385 246 872 -270 439 434 -312 731 -635 -322 -443 438 122 667 35 496 144 358 647 -69 -320
5587 -320 155 -9 269 517 -159 147 43 -327 -313 -451 439 491 -344 279 -31 -440 -245 -654 -127 304 -668
5608 -668 439 -968 -1041 -736 -872 534 233 575 45 483 -791 -625 -361 213 734 470 449 -215 638
5627 638 854 62 634 -578 -74 259 178 -78 -737 87 230 644 912 -281 -401 110 24 391 -484 -100
5647 -100 -270 76 69 696 927 155 -401 -376 914 -618 -677 250 -1131 648 1231 352 -255 450 572 851
5667 851 -562 -603 -353 -591 55 -392 -541 -68 -111 722 387 -165 -649 -291 -420 -397 1162 4 -203 234
5687 234 148 -1868 11 5 -897 -948 -331 -61 779 -231 177 420 403 -99 450 -343 101 233 -1124 398
5707 398 -11 -373 269 1011 -335 598 -70 470 74 331 691 624 -333 992 524 -268 456 -312 -131 -115
5727 -115 -298 568 -204 279 906 -1416 28 -531 14 -305 -324 -238 -709 490 61 -269 300 -380 -589 -1094
5747 -1094 316 759 -454 -323 -8 -414 -765 131 -710 112 -1373 -199 -113 -425 -574 -246 -231 62 -1162
5766 -1162 490 61 -140 192 -57 742 -1155 31 -335 218 416 -394 351 110 785 -229 179 659
5784 659 468 479 41 273 -908 638 -53 489 -33 -565 435 -542 -542 350 276 -7 264 93 -405 468
5804 468 128 -470 -325 -281 -150 -1269 403 457 365 5 -908 1013 -533 -374 -648 135 -28 26 -430 -286
5824 -286 862 414 -265 -142 1139 -73 719 -206 332 191 186 -120 269 99 454 -412 -507 393 104 -871
5844 -871 -30 -286 -478 117 -747 -1043 -776 633 -338 359 1554 -234 -187 167 -783 739 -191 -603 -181
5863 -181 102 58 -684 -135 191 425 883 411 -305 1108 318 -171 68 -970 -196 483 -579 -737 -256
5882 -256 91 -435 262 54 92 297 160 -93 49 -329 -569 413 -246 155 48 656 846 -63 -317 97
5902 97 -997 88 -334 -866 457 275 46 812 -620 -613 -507 486 486 838 246 886 -239 430 34 353
5922 353 -516 -14 447 686 -522 182 172 -1015 -17 624 -306 75 553 287 449 56 -133 696 -684
5941 -684 -542 321 464 374 291 108 757 -396 -294 196 -98 -533 58 831 -169 -380 -549 -514 442 -12
5961 -12 -127 -1 31 -759 333 -728 -1128 255 -355 363 926 74 -781 421 -244 144 204 -492 -35 603
5981 603 -48 646 -25 -11 354 237 -778 578 273 741 612 -1196 467 -104 323 -753 -513 667
5999 667 194 391 -357 17 1016 663 -568 -890 -404 -1098 267 477 -60 -79 242 -82 -959 554 -153
6018 -153 -182 103 -1063 118 -698 -771 33 197 -137 -851 429 -830 514 269 350 -706 20 761 -648
6037 -648 22 212 -873 -212 924 -486 366 -187 958 -880 1348 429 -379 202 -465 -73 -684 -174
6055 -174 503 -708 -362 427 40 -568 -1291 -159 -569 144 1164 -1104 391 -695 -584 -502 -589 765
6073 765 265 -11 -105 -560 339 89 -487 -1022 240 162 -50 148 -449 -245 -206 445 153 -406 -454 157 443
6094 443 179 -1019 -218 -924 381 -8 281 209 -217 -212 -462 -583 -472 -995 -136 497 -935 -215 -320 364
6114 364 980 -880 926 -530 593 -881 919 -334 124 378 -198 521 511 198 673 -654 -1230 240
6132 240 784 -258 184 315 798 -465 86 52 285 701 -640 -579 -807 -398 -13 246 10 -183 -234 -204
6152 -204 -695 185 273 155 461 327 -71 -438 -326 326 -186 -657 -202 -250 198 -558 287 -68 -746 335
6172 335 -149 -219 65 504 -277 -355 400 -307 -1604 189 -479 -658 -382 -13 213 235 353 -550 413 838
6192 838 814 -357 -182 -127 358 2 34 262 338 -416 -333 -321 -144 -140 -29 -443 178 -51 -484 746 -794 549
6214 549 371 513 177 -218 -263 -193 169 -755 566 -232 71 468 -275 -330 525 153 -1153 -164 82 -23
6234 -23 917 -189 226 163 143 -723 -511 -411 -835 -639 -285 710 -132 687 284 276 -47 350 -359 687 -447
6255 -447 709 1084 84 -45 277 320 124 60 23 171 -360 408 -348 361 549 381 -370 -15 -16 -78 -157 596
6277 596 -333 -291 -67 -481 192 22 -404 142 -120 619 -14 55 -504 -465 219 -229 -642 1281 -102 -214
6297 -214 25 -290 -420 -1016 -154 545 185 27 -244 -875 109 -301 -200 364 -419 -127 -688 -149 310 -17
6317 -17 -456 174 -192 -560 -557 56 -109 134 227 -236 231 56 -31 -238 17 -162 -831 491 215 250 808 -309
6339 -309 -201 123 -248 22 -247 -850 823 17 -787 13 -599 526 469 1171 572 488 653 108 -802 396
6359 396 451 -312 834 -378 -266 314 -672 125 127 68 187 669 -195 -45 -399 -417 -1141 -1245 -327 597 405
6380 405 -577 146 1483 -938 -490 -612 -756 228 -613 411 -106 89 636 72 -840 338 462 -10 364
6399 364 -119 337 425 627 1419 -900 130 202 -671 255 512 -96 -747 208 763 1241 492 -318 -902 428
6419 428 -137 742 461 -682 29 -44 197 414 235 -527 583 -711 403 469 -392 73 315 -216 -615
6438 -615 691 529 -487 432 -636 -478 -178 251 215 312 516 320 903 -232 -260 96 43 279 327 45
6458 45 525 79 293 -608 807 -769 248 50 878 -430 -87 -428 339 724 -197 -320 542 -130 213
6477 213 -64 1132 395 668 402 561 916 -474 392 1269 958 -51 976 564 -522 -136 543 115
6495 115 384 -530 114 132 -635 11 -290 135 999 -179 -1529 147 -192 -618 585 107 416 -194 98
6514 98 823 -79 464 119 102 -211 -124 185 -104 181 -1223 348 -52 26 145 -471 -658 -336 -737 -784 19
6535 19 256 -240 229 549 -272 172 -884 720 112 423 737 1223 1757 -113 -588 -794 658 1672 405
6554 405 -296 323 -37 483 -287 1504 -757 -183 -30 5 -358 -465 -644 153 190 -62 -261 560 709 626
6574 626 -233 -297 -252 -10 33 -434 -418 194 841 -604 274 -657 -436 -413 -267 -757 213 169 320 -291 138 331
6596 331 -180 105 1014 -517 -423 816 125 207 -751 171 -174 -987 -16 -102 -9 -55 497 732 347 31 -735
6617 -735 547 249 -637 252 -282 -423 8 -308 54 -452 -306 -584 107 622 -304 865 -704 771 -267
6636 -267 94 -122 500 688 -186 -435 832 -370 381 349 -137 -298 -552 824 -551 -841 -970 -756 -335
6655 -335 7 237 -1097 886 -80 1260 134 123 627 4 -438 -161 158 -1049 -86 -38 -705 -579 154
6674 154 -546 -579 -10 282 446 -366 833 -8 -145 313 -846 -527 211 808 -1042 426 -658 495
6692 495 -877 91 -67 -440 -466 231 49 -1031 554 -197 321 -543 278 -581 741 183 72 5 -102
6711 -102 -279 -406 858 611 -757 -571 -394 210 -171 -285 -13 -969 -155 52 -1177 32 970 192 328
6730 328 -75 -280 65 -577 557 769 679 -293 692 475 -737 318 42 1269 196 198 -313 980 313
6749 313 333 -153 363 -646 -414 -236 -424 528 -362 -818 171 -103 696 92 1106 -883 49 -508 218
6768 218 21 -961 82 -685 776 -390 247 -144 -980 717 -425 12 -675 258 -207 399 -295 239
6786 239 21 -696 -670 268 -110 128 -385 377 -551 -777 494 -243 -187 41 -695 -622 -135 -501 -85 -893 -19
6807 -19 692 88 -13 -672 137 -491 311 656 341 -424 17 252 396 -344 602 -94 -279 85 -15 552
6827 552 946 -228 -655 700 -891 331 -129 -156 73 657 570 108 236 397 381 193 -1019 -192 -122 -535
6847 -535 -34 515 298 -660 -268 -120 221 -1014 177 -101 398 -850 -99 1 -1009 121 209 153 -161
6866 -161 -119 -642 -411 -95 -327 206 143 -612 -197 -292 997 -638 434 -813 -395 132 582 -1100 -166
6885 -166 -503 118 -210 -43 426 45 -676 345 1118 671 788 -31 -769 765 698 1248 -431 636 -398
6904 -398 -446 -94 -847 358 48 -29 -35 291 -697 428 -105 783 -648 -697 186 81 -859 235 -126 -314
6924 -314 723 -321 272 1311 753 29 139 -409 -542 752 -200 753 217 104 709 -84 -195 -497 -836
6943 -836 587 -421 -640 -121 919 -81 187 -283 -142 -335 255 -105 221 -970 603 -883 413
6960 413 130 -1027 114 -401 265 517 638 -431 -412 -510 -274 540 8 -224 610 -906 -597 203 489
6979 489 -638 152 -518 1195 -40 -441 337 -443 -221 226 -285 -371 62 663 -679 -434 -406 -297 118
6998 118 818 -1327 -69 -150 -140 -992 -48 256 -76 -686 208 226 -432 884 -408 -225 -96 -753 -24 642
7018 642 -192 748 757 -131 -27 -463 -63 131 -459 -1415 -271 123 9 254 291 -33 507 74 -307 -376 109
7039 109 496 113 150 -446 426 -423 119 209 -75 -114 807 644 -147 -582 919 41 179 731 -433 -311
7059 -311 -503 -451 865 -589 1009 -315 -348 355 -20 70 303 -760 -387 -159 -736 321 640 -468 160
7078 160 564 790 -578 410 -1111 -1145 553 -424 -412 452 -291 -186 -47 -757 13 -1003 -116 539 -330
7097 -330 540 1351 507 719 -426 -470 -446 231 711 -37 -250 389 174 -307 -129 471 -67 -555 815 -1030
7117 -1030 264 -98 493 -574 -705 746 -587 152 -326 51 205 -371 561 -1154 -113 -31 -1032 1039
7135 1039 -1356 45 821 -1232 173 -380 -786 -479 -277 -771 235 471 -292 266 -240 -221 -301 691 -720
7154 -720 -478 -213 60 -14 -221 69 847 306 632 -528 -429 463 211 -399 629 987 894 558 -995 140
7174 140 320 -809 324 657 672 50 -310 -385 397 -191 274 141 -487 908 -101 -743 308 -16 297
7193 297 118 -48 725 297 425 386 -86 -244 253 -541 668 -207 463 -350 887 -128 -26 -541 702
7212 702 -617 -357 -256 -825 -23 -58 -501 -11 694 -311 969 -147 770 -70 -558 -466 -27 -412 -117
7231 -117 -44 137 1244 -569 211 306 115 149 -46 -236 748 773 -869 -536 276 -694 253 595 94 -371
7251 -371 410 -155 -402 -97 -145 304 -353 -86 702 1144 -11 -550 -225 288 1067 353 -726 -858 327
7270 327 354 503 803 -45 212 -794 -118 -356 464 316 198 -859 -573 -182 -691 896 680 -102 -447
7289 -447 337 159 -83 209 -155 -418 880 -109 315 251 370 -86 851 310 330 -301 -825 -58 985 -37
7309 -37 -254 52 -95 414 1179 763 358 -360 495 660 -1355 449 -351 -1573 -280 -315 757 152 -694
7328 -694 -199 -67 -385 414 232 -861 -568 948 -383 -190 -692 -380 -611 -367 -111 201 -256 452 683
7347 683 932 219 -339 462 328 577 -211 742 443 139 579 -141 -478 -477 713 -276 263 -394 324 -272
7367 -272 375 -140 893 -347 322 121 -144 505 1374 -311 198 583 787 -377 1278 -532 246 -385
7385 -385 3 -667 143 590 36 -326 -600 -407 -628 514 -661 693 131 -99 800 -452 -593 -920 -596
7404 -596 110 14 -340 612 46 -104 -405 -683 139 -243 -117 -751 -306 52 -388 -37 382 -686 71 -13
7424 -13 -450 -597 -72 699 -884 573 -632 -351 92 -97 428 -189 -115 721 439 -364 -440 334 656 -6
7444 -6 272 505 -1048 -252 -562 -865 -551 -128 1110 667 202 -904 188 -888 -821 82 246 -155 -261
7463 -261 1277 -349 792 -172 922 57 -590 466 -35 -447 999 75 220 567 -189 -242 288 491
7481 491 244 -745 -656 140 -660 -325 -312 987 -166 504 -216 -646 -237 -668 -715 -287 262 407 -519 530
7501 530 247 75 -223 -643 212 -240 292 -61 -611 -927 -91 826 -526 31 -519 453 494 -253 32 294
7521 294 -982 -31 940 813 676 -914 1071 84 196 634 404 12 323 64 841 312 -371 -617 414
7540 414 39 -441 108 -831 -222 278 218 164 215 -245 164 -990 -179 -431 -123 -197 -803 903 -142 567
7560 567 -624 -1224 -369 -352 182 -569 649 -610 554 -195 306 523 302 -347 436 -602 -886 635
7578 635 599 97 266 -477 77 200 -413 -421 321 398 857 785 -118 -212 104 339 -617 815 -18 236 -993
7599 -993 -95 841 760 204 -520 -316 514 653 818 -844 430 921 608 -496 1142 -417 -393 514 -178
7618 -178 -1250 13 -786 381 236 -10 37 -271 -539 388 847 792 -116 405 627 697 105 0 148 -176
7638 -176 -495 307 -816 25 336 -526 3 -604 -280 349 657 -461 241 415 80 642 -169 24 274
7657 274 -657 526 338 -68 108 -875 -61 -356 359 551 -451 -872 -71 1116 735 739 130 74 892 -313
7677 -313 -124 -271 -619 468 -366 207 402 14 343 -146 229 447 285 98 664 688 80 269 -1057 1196
7697 1196 927 -378 -176 -178 749 281 92 176 319 -154 -463 -779 44 -238 -603 1215 -227 -928 -7 -75
7717 -75 278 -60 667 -277 812 254 -801 -868 470 38 56 -383 810 976 356 104 765 -667 -795
7736 -795 233 544 640 -130 -1192 93 -355 -113 39 -107 33 611 342 19 989 -369 -129 -306 -675
7755 -675 131 -222 351 477 497 -351 288 -1168 12 -311 49 -1118 -177 1006 -492 131 -424 382 -764
7774 -764 564 149 -87 877 646 613 811 902 293 156 135 -872 -562 118 56 328 -256 986 569 987
7794 987 385 302 -42 619 -414 815 -769 -138 260 -263 -1103 -523 -639 344 935 -899 780 379 -382
7813 -382 850 -282 641 -505 -327 -134 -634 -923 -100 102 -773 351 -22 -792 -1114 425 -375 770
7831 770 -446 471 709 519 1134 -496 -207 -1584 -117 -165 -265 -212 825 -325 -366 344 92 -515 -194
7850 -194 -237 284 -1163 686 -199 -292 -432 -999 523 -339 -54 235 -706 174 -186 507 374 500 359 -270
7870 -270 810 383 793 -224 -246 -432 237 -29 410 281 809 456 -156 379 426 -134 -249 -664 289 403
7890 403 -318 235 -97 -137 -44 65 523 1198 -377 -273 682 110 -150 1038 299 -454 -53 123 312 46
7910 46 -518 -292 357 -632 372 -706 -516 -144 705 -321 527 276 347 431 -311 -77 -583 498 700 -187
7930 -187 215 -343 -865 1028 325 29 143 -135 -24 118 335 702 106 -279 -33 -309 660 -89 -409 -75
7950 -75 459 -188 -143 503 798 371 81 501 148 125 94 301 -438 -84 -308 258 153 -854 -289 940 321
7971 321 486 -195 439 -1444 534 633 330 342 225 -279 -652 -973 84 558 333 0 461 161 -1151
7990 -1151 -44 431 -834 322 -300 617 -684 292 -289 164 526 766 401 563 -464 211 1130 685
8008 685 48 -568 117 314 710 -1139 767 224 -515 89 258 -119 548 -36 -52 -1210 264 -118 -606
8027 -606 -203 115 226 914 105 88 -1054 387 -114 -761 906 443 567 -1285 112 -124 -46 52 -148
8046 -148 -65 -84 449 757 -1097 -497 -681 285 -730 15 -467 -407 -769 931 -8 -63 429 287 -84 -200
8066 -200 66 324 1416 1311 11 353 624 233 925 -105 906 572 1432 -314 142 416 363 649 -797
8085 -797 -263 762 377 580 -386 497 772 179 -486 290 -263 453 133 -961 610 1234 603 401 763
8104 763 215 1517 -391 -796 1060 -244 183 -685 214 338 -355 418 -526 -297 -43 506 686 -81 -191
8123 -191 -999 -534 802 -420 -2 -1005 -40 -659 -520 -158 360 131 -351 -232 -881 -253 392 -645 252
8142 252 51 -522 -485 -947 -258 -602 -8 156 37 495 -316 1361 -198 -129 12 -598 525 169 -45 -408
8162 -408 -524 351 629 0 -69 -94 791 -744 632 73 553 386 -731 1131 281 -641 -690 -728 -1376 -120
8182 -120 297 -932 993 809 839 192 791 1942 1192
8191 1192
$$ Imaginary data points
##PAGE= N=2
##DATA TABLE= (X++(I..I)), XYDATA
0 -4 17 -5 49 -30 77 -64 122 -109 177 -172 240 -251 331 -351 443 -487 587 -648 766 -850 977
21 977 -1104 1254 -1406 1590 -1781 1998 -2243 2503 -2807 3138 -3533 3959 -4467 5039 -5745
36 -5745 6554 -7604 8883 -10606 12982 -16579 22613 -35439 87144 -100462 -301355 -224835
48 -224835 -291199 -265196 -303677 -291133 -316683 -303496 -318711 -305468 -311871 -296055 -295779 -275293 -268393
61 -268393 -245961 -232552 -209244 -191183 -164069 -145842 -119665 -97819 -72270 -51335 -27299 -5509
73 -5509 17420 35697 56202 72481 88253 102515 113615 122891 131218 136363 140642 142135 141265 138961
87 138961 134218 128800 121938 113069 101625 90318 78528 65401 51894 39296 24918 10585 -2762
100 -2762 -15178 -27720 -40252 -50090 -60574 -69327 -76211 -82584 -87292 -90971 -93587 -94439 -93727 -90777 -88500
115 -88500 -83136 -78126 -71633 -62607 -54883 -45808 -36871 -25173 -17675 -6532 3537 13372 22915 31616
129 31616 40177 48432 55893 61145 65973 69153 73150 75290 76526 76024 74163 72706 68129 63839 58178
144 58178 52534 45808 38954 30569 21553 13159 4238 -4442 -13802 -22205 -29895 -39190 -45839 -53200 -58759
159 -58759 -64082 -69081 -72803 -76725 -77937 -80874 -81200 -80330 -78913 -76867 -74225 -70696 -64849 -61377 -55911
174 -55911 -49510 -41961 -36660 -29661 -23925 -16113 -9242 -3559 3476 8274 14801 19078 24365 28222 30981
189 30981 33973 35633 36687 37898 37342 37913 35190 34966 31463 28621 25912 22655 19022 14487 9435 4757
205 4757 253 -4715 -8402 -13864 -17434 -20000 -24073 -26951 -28408 -31199 -32474 -33899 -34286 -34923 -34746 -33007
221 -33007 -31501 -29232 -26178 -24139 -21694 -17334 -13479 -10646 -7063 -2172 1436 5902 10006 13138 17962
236 17962 20028 22439 25169 28573 29711 30734 30838 31503 32706 31677 30869 29256 26409 24601 21937 20086
252 20086 16442 13383 9760 6344 2267 -2539 -5388 -9150 -13844 -16677 -20154 -22707 -26259 -27871 -30651
267 -30651 -33076 -33226 -34689 -34094 -34890 -33748 -32624 -32361 -31107 -30993 -27225 -24255 -22019 -20555 -16942 -14075
283 -14075 -9753 -8554 -3973 -1626 1728 4618 7176 9927 13028 13280 16189 17355 17270 18493 19220 18576
299 18576 19218 17742 16579 15757 14253 11971 10644 9079 5961 3936 1743 -1896 -3454 -5490 -8465
314 -8465 -11093 -13070 -14357 -16247 -17464 -19314 -19722 -20998 -20902 -22326 -21976 -22453 -21400 -20091 -19984 -17026 -15928
331 -15928 -14393 -12643 -9948 -7186 -6026 -2875 649 2582 5133 7750 9643 10687 13015 14237 16562
346 16562 18431 20175 20427 19581 21298 21362 19851 18912 18665 18409 16935 15607 13353 12167 10196 7981 6335
363 6335 2769 1710 87 -2615 -4839 -5697 -8636 -10483 -12320 -14489 -15402 -15833 -17769 -16981 -18245 -18450
379 -18450 -18951 -18315 -17867 -17124 -17634 -15206 -12524 -13350 -10840 -10226 -7800 -6550 -4285 -3205 -1391 619 1482
396 1482 4056 4562 6185 7590 8375 10514 10936 11183 11011 11436 11422 10611 10866 9907 10210 9212 7520 7545 4966
415 4966 4603 3454 1888 1093 -1540 -2023 -3934 -5248 -6176 -7453 -8260 -8820 -10256 -11080 -12112 -11605 -10564
432 -10564 -11106 -11063 -11427 -10680 -10137 -7918 -8402 -8145 -5151 -4041 -3915 -1433 -939 985 3149 3339 4523 5504
450 5504 6262 8038 8592 9780 10456 10899 10870 11264 11547 11415 11942 10816 10417 9109 9414 8181 6916 6201
468 6201 4659 2953 2409 2070 -497 -2176 -1711 -3902 -5317 -6218 -6408 -7205 -7944 -8698 -9689 -10249 -9910 -10560
486 -10560 -9892 -9987 -9333 -8432 -9493 -7808 -7516 -7063 -6015 -4882 -3352 -2467 -1636 596 1063 2414 3361 3656
504 3656 5335 6402 7323 6809 9328 7328 8145 8721 8808 9058 8587 7153 6627 7384 6494 5055 4297 4727
522 4727 3456 1217 403 -748 -1643 -2096 -2927 -3421 -5703 -5893 -6865 -7965 -6926 -8211 -8128 -7903 -7832 -7941
540 -7941 -7746 -7999 -7179 -7240 -5953 -5138 -4311 -3680 -2640 -1949 -52 -48 257 1832 3273 4575 3822 6090 6590
559 6590 6760 7496 8324 9034 7361 8252 8584 8820 8996 7996 8706 7218 6818 5703 5467 4554 4013 2355
577 2355 2149 1495 -757 -903 -1873 -3340 -3868 -4384 -4252 -5471 -6771 -6512 -6225 -7565 -6838 -7223 -7221 -7188 -6591
596 -6591 -5327 -5955 -4671 -4562 -4418 -3359 -1014 -2300 -753 563 862 844 1865 3109 3669 5048 6121
613 6121 6236 6568 6290 7104 6358 6961 6356 6948 7589 4865 6534 4877 4421 3978 2032 3036 2020 1832
631 1832 -521 -940 -1076 -2676 -2295 -4262 -4008 -4843 -4766 -4405 -6532 -5447 -5402 -5518 -5290 -5438 -5556 -5283 -4488
650 -4488 -3341 -4284 -3253 -2660 -1792 -560 -571 249 -17 2169 1789 2438 3913 3625 4317 5453 4549 5356
668 5356 6555 6616 5301 5835 6289 6804 5572 4750 4256 4987 3383 2895 2698 2055 1744 22 -781 -723 -1404
687 -1404 -2669 -2506 -4556 -4214 -4271 -3840 -4748 -5359 -5319 -5470 -5194 -5033 -4868 -5138 -4021 -3854 -3876 -2349 -2533 -2352
707 -2352 -1615 -1540 -421 1212 1692 1083 1180 3111 3205 2855 3776 3028 4701 4364 5088 4831 4252 5245 4928 4810
727 4810 5096 4635 4806 3007 2742 2690 2430 1177 1070 843 -363 -460 -976 -1945 -2693 -2640 -3320 -2657 -3978 -4563
747 -4563 -3642 -4836 -3626 -3646 -4113 -3842 -3570 -3494 -3692 -3038 -2400 -2177 -2155 -787 -1001 -631 354 830 1532 1688
767 1688 3277 4018 2204 3018 3554 3054 3615 3502 4365 4539 3169 3908 4192 2456 2922 3366 2764 2167 1272
786 1272 1683 531 205 56 -405 -282 -1025 -2680 -1652 -2422 -2070 -2479 -2604 -3105 -2670 -3725 -3862 -3821 -3620
805 -3620 -2648 -2774 -2433 -1726 -854 -1956 -724 -489 279 -775 -766 796 1020 1438 1909 1747 1576 2908 3294
824 3294 2645 2075 3345 2537 2746 3540 3567 3062 2967 3019 1662 2466 2136 1628 866 630 301 283 288 608 -1182
845 -1182 -1128 -1725 -2241 -1881 -1775 -1803 -2453 -1516 -2205 -1413 -2605 -2868 -1925 -2678 -1949 -2105 -967 -1980 -1114 -526
865 -526 -1121 -248 153 1262 -266 1673 445 1064 1016 1542 1277 2061 2286 1517 2086 2504 2307 1323 2208
884 2208 1999 1567 1614 2288 1000 1378 -177 398 -351 324 143 -505 -409 -1292 -1169 -1373 -1511 -1999 -1531 -2459
904 -2459 -2084 -2110 -2163 -1143 -2336 -1701 -1311 -1009 -739 -863 -90 -786 -460 -423 510 177 589 460 392 752 1494
925 1494 1688 614 1578 2026 910 1181 1802 604 1076 1713 1881 710 -346 1457 1304 1130 665 449
943 449 70 -467 267 -486 529 -1062 -559 -990 -569 -1260 -783 -1434 -995 -1162 -1725 -1684 -3188 70 -905
962 -905 -1506 -476 -823 -929 -897 124 -236 84 460 96 -434 289 332 51 582 1463 1415 1535 393 1455
982 1455 1095 295 292 1433 716 441 870 972 467 546 236 0 264 -142 301 -732 -1155 199 -120 -187
1002 -187 -888 -810 -546 -1406 -715 -486 -500 -714 -170 -285 -725 -714 -500 -569 -417 49 215 721 594 -133 582
1023 582 28 -456 1012 382 670 426 153 1240 574 1487 499 1282 951 -964 885 581 174 3 -446
1042 -446 656 429 -160 -581 409 -964 -618 -527 -93 -676 -829 -398 -822 -926 303 -1091 -904 -638 -581
1061 -581 -1531 -663 -917 -603 -1022 -537 161 -645 -811 -527 239 12 1315 143 1074 727 -365 424 495
1080 495 403 -320 1108 905 441 55 397 102 -867 490 869 62 -179 -485 90 -1234 725 -390 201
1099 201 -279 -36 -902 -916 -130 -1108 290 -1233 -102 -56 -374 -143 -93 -1474 -1128 -601 -95 402 -548 -36
1119 -36 -213 -506 -233 445 264 267 153 122 -73 701 -462 318 -344 1119 763 711 57 362 74 376 156
1140 156 703 429 99 -637 298 171 -45 415 -54 -992 70 121 -816 -1468 155 -654 -538 -208 -588 -36
1160 -36 -284 131 -999 -1176 -1024 -1212 -659 -391 -198 83 -1146 -348 158 293 -153 -129 -1071 -405 471 996
1180 996 544 78 -673 151 714 -694 -44 195 -323 737 505 -276 -34 -819 -345 -1378 -233 17 449
1199 449 163 -187 -414 -425 -47 -655 -684 522 -1118 -102 -275 -663 -670 -759 -938 -172 199 149 -405 -817 -1367
1220 -1367 296 -757 -403 332 -743 -131 -613 163 447 999 59 542 -200 -185 476 149 -48 -529 -412
1239 -412 733 -338 -87 1038 484 -170 15 220 -266 621 426 -1305 -977 -591 -574 -520 -523 328 -92 -454
1259 -454 -1176 -522 -254 -520 -437 418 -614 64 -653 -452 -213 -94 -510 -142 -11 -1673 -154 1196 -69
1278 -69 -658 -425 757 -648 402 358 855 -136 -865 454 1021 21 532 889 -108 714 251 -41 584
1297 584 -134 -68 -186 -837 501 -331 -70 26 477 229 -722 -108 -908 -938 -588 -1582 115 -616 -252 -731
1317 -731 185 -933 -552 -443 -229 -755 256 773 147 -434 260 545 354 70 1008 499 488 -312 165 736
1337 736 -33 1026 575 865 -514 784 -147 674 106 26 414 1288 1181 953 53 -626 341 -288 873
1356 873 -351 398 456 -222 -569 -1465 344 -571 -1474 -823 -771 -229 -545 -861 -112 150 -480 -678 -58 -615
1376 -615 -386 -540 552 -591 -490 -205 -66 246 148 -187 -15 -74 168 753 676 654 502 114 1066 297 519
1397 519 610 -627 169 942 -728 -391 1122 633 686 72 566 1596 424 1328 137 168 -158 -604 537
1416 537 -855 -629 -205 -266 -329 -90 -356 -52 -559 -651 917 -342 -1781 -715 -403 -832 555 -951 -655
1435 -655 614 304 -173 257 -123 450 38 535 -651 237 -45 -73 -180 -335 185 -235 -51 515 530 719
1455 719 -413 -398 1147 -758 -360 572 1203 -306 82 -86 561 -376 227 -105 70 -683 -578 -1087 210
1474 210 588 -1000 -39 -282 -488 405 -144 -100 -102 464 274 1343 -243 130 303 -120 760 199 664 -699
1494 -699 425 539 541 439 -379 55 1291 547 -16 302 1001 -93 -40 -50 397 714 -724 520 678 -218
1514 -218 -330 -103 428 133 -633 90 -231 -1572 635 -335 1107 -60 -241 -239 -840 -1161 -594 334 -559
1533 -559 -739 238 54 -762 -210 527 -51 -520 193 -276 -200 -518 462 681 -536 234 2540 1005 801
1552 801 108 -113 295 1214 206 304 391 -294 340 467 749 411 -375 239 -105 -466 -237 194 -8 -147
1572 -147 -879 -73 8 -36 406 -636 -578 -932 -1196 -530 625 -1110 -684 -19 -400 -559 -337 132 -181 -80
1592 -80 417 556 243 -582 610 473 477 508 408 565 -256 201 373 27 52 88 752 139 971 1130 -626
1613 -626 644 -612 614 -382 413 -806 -341 1097 408 -69 13 -993 -354 495 -86 -623 -1236 -434
1631 -434 -356 -307 -800 -605 424 330 -1333 57 -88 -193 -337 -175 -472 -473 -285 410 -129 -54 -205 241 1302
1652 1302 1138 -227 583 -163 -352 -495 180 1285 103 -221 744 381 381 519 37 297 941 -64 -475
1671 -475 -718 307 74 110 -85 -402 -256 137 -580 -500 29 -565 134 -1153 263 -654 -146 -163 175 101
1691 101 -129 169 -608 -385 858 343 -524 144 1085 200 578 1188 702 296 536 881 253 285 275 1073
1711 1073 -90 10 -387 253 -3 343 -295 827 85 760 215 -174 -132 -550 -880 58 -1380 -163 -996
1730 -996 -392 -1058 471 -125 354 -1044 -801 -134 -659 -1257 -297 -490 -361 -1199 -1483 226 -955 -35 218
1749 218 -181 641 339 -78 382 -39 -268 -287 605 1408 663 1106 488 249 316 441 569 65 1069 541
1769 541 329 79 758 760 -134 -206 -267 -499 -719 127 -165 -738 -753 -34 -977 -182 -913 -686 -953 -290 -422 682
1791 682 -558 35 217 -739 499 58 -546 -561 -713 -510 -254 748 282 -431 249 215 647 424 715 443
1811 443 333 907 126 126 162 528 -18 518 798 -293 1134 -486 902 102 -517 -176 46 -216 -1131 -98
1831 -98 -1171 -647 440 60 -1103 -15 -122 -117 -541 -315 -180 269 -700 123 561 -284 -311 -206 56 908
1851 908 -227 378 -861 -1051 -19 228 -76 -273 -581 942 -398 453 280 994 436 -173 413 563
1869 563 498 -575 551 228 569 696 485 135 -251 239 162 -1016 -197 906 528 3 716 1 -503
1888 -503 -117 103 -96 408 -131 -564 968 73 24 -550 -598 715 375 772 408 -94 167 -642 797 -161
1908 -161 707 197 159 562 -179 419 950 1554 -52 -11 119 409 19 751 -38 253 498 -124 -553 -101
1928 -101 -882 -1047 -449 609 -259 -256 -203 -1408 -94 499 187 -405 215 -716 49 736 562 -65 643 -707
1948 -707 -614 172 -684 -253 -283 685 75 -68 3 70 6 -279 263 131 574 -316 649 143 -281 140 551 -256
1970 -256 943 -141 -186 830 -745 -82 -393 -402 333 993 -166 613 -109 784 787 -291 565 -569 -37
1989 -37 -88 131 252 -813 -528 -295 -1162 26 -289 -313 -601 519 -1111 1 -226 -630 -527 -318 -498
2008 -498 733 -579 613 479 600 301 712 893 406 -481 -31 -1005 486 -29 -345 559 -134 489 -23
2027 -23 457 -493 82 304 306 289 1469 328 -738 -596 790 24 -723 177 -785 -428 -1013 -234 -83 -898
2047 -898 47 478 -153 -888 -652 427 -812 -753 497 610 -93 256 -161 100 -72 706 -1128 39 309
2066 309 -408 -434 84 -669 -541 -578 -263 359 -39 -224 -6 353 956 -197 156 404 -132 67 -699 160
2086 160 -518 36 336 126 454 201 -803 122 843 -1175 156 8 -765 -332 824 -303 -536 -372
2104 -372 -432 704 -694 450 453 -286 145 -240 -1263 743 115 -754 -152 791 1394 -250 321 -204 -121
2123 -121 397 1595 109 -1394 -878 63 343 219 -208 -187 1004 136 -521 457 949 474 -315 -599 325
2142 325 94 203 701 -592 182 -387 -97 -1605 -739 493 -178 -294 -376 -274 -576 261 -112 -237 382
2161 382 529 -811 339 703 351 -269 -1161 214 -390 621 138 -931 673 575 509 -470 406 641 835
2180 835 -196 140 1376 840 342 205 489 -84 897 462 -64 -148 260 -25 -899 588 -169 284 -1220
2199 -1220 -395 88 300 -438 -536 747 -730 72 -23 44 17 -210 249 494 -628 -279 -31 -543 -264 -146
2219 -146 -1079 -283 827 210 351 -782 -53 -51 548 -339 -628 176 575 241 379 -431 575 608 361 465
2239 465 640 1274 -762 409 454 57 472 -177 504 500 1335 96 -253 118 -889 -296 466 -158 -786 -57
2259 -57 83 -293 -254 562 -794 -248 -73 -526 -377 788 -210 -125 454 -709 259 -59 -105 -679 -693 -92 409
2280 409 476 100 460 773 1102 593 823 -169 -75 616 56 -508 -124 361 954 746 712 12 196 -478 -528
2301 -528 -1257 744 54 295 188 -151 47 -293 -73 252 -244 339 -589 -346 469 519 433 361 -52 636 -829
2322 -829 -682 -255 -536 487 164 204 -420 240 -862 334 -399 -231 306 -127 666 -337 -245 -1241 -432
2341 -432 5 -342 202 -403 266 -322 -155 272 135 147 -31 29 842 338 -317 -611 -511 -181 -900 298
2361 298 -103 594 -175 707 261 -1146 12 -17 -680 -142 -53 -931 262 -195 -279 -561 -71 -256 -50 761
2381 761 -140 641 361 678 -285 -179 -495 516 -244 -555 451 -157 420 128 -74 -407 565 35 214
2400 214 459 171 292 -185 -574 -15 -550 843 119 -769 422 -668 -596 -187 -51 -579 -402 222 -59
2419 -59 161 -419 -276 1355 -465 381 -417 -509 -506 -202 -359 290 -726 266 462 115 -806 398 663 -499
2439 -499 101 1145 -414 -33 391 -89 280 272 110 -677 1083 138 -248 59 32 -149 121 -60 -229 339
2459 339 867 84 -419 361 225 248 339 651 609 315 -656 -224 -222 269 -576 -1488 -130 -420 -237 -375 -218
2480 -218 -370 1039 -975 448 176 138 -71 -274 21 464 -103 -160 -395 -499 -1189 64 -307 -797 -436
2499 -436 55 -306 791 -643 102 -32 276 -516 -43 -127 -56 691 125 1030 -972 385 276 64 720
2518 720 -248 459 272 -1327 -50 -521 196 44 22 153 267 984 198 -330 458 -396 -179 -103 -950 -233
2538 -233 -786 810 -585 -261 -1255 358 -528 -273 242 896 1661 -151 -4 -12 37 255 -726 -301 222 832
2558 832 -51 -1427 63 -698 -326 850 238 -539 51 87 -788 -930 -469 543 -122 770 -98 607 107
2577 107 1226 683 -39 -1072 387 -944 288 194 734 492 274 16 11 -354 501 625 956 176 324
2596 324 192 -380 1180 55 17 602 206 742 -685 571 27 64 192 668 20 391 431 713 419 -271
2616 -271 298 167 -159 150 -213 -954 -905 -605 380 -1040 -323 -143 -716 396 -1153 75 -46 -268 -478
2635 -478 -440 352 -30 730 5 -274 -255 555 119 -851 531 -974 -263 802 261 674 1253 -950 -780
2654 -780 1652 -48 -121 216 -314 -650 255 579 476 165 -733 576 -240 -158 -178 -459 -5 868 -63 578
2674 578 651 -24 20 353 12 352 -26 275 39 -269 -654 -346 -220 -44 -38 -378 998 -400 -919 -253 -297
2695 -297 -694 -503 214 626 263 -881 -364 271 -796 -520 -913 -94 673 -512 1337 428 -419 442 210
2714 210 -627 -1255 429 -283 481 -396 -316 463 351 -400 -205 86 214 717 -258 493 -244 314 261 -265
2734 -265 -590 -453 -223 109 628 35 16 -348 96 -396 -541 573 325 -1085 593 -54 -375 679 -150
2753 -150 -68 462 -297 -311 -688 -414 295 442 78 -3 916 -504 -420 -323 -600 82 1106 699 165 86 -889
2774 -889 -652 1175 -614 455 749 932 -926 347 -503 -645 697 1160 -99 -454 -2116 154 398
2791 398 960 733 31 -128 89 -387 -242 -222 -153 205 -813 -360 -252 -52 122 -312 75 -86 766 -1
2811 -1 -1188 -524 115 -259 726 -598 -954 530 -390 722 -373 401 171 824 -265 853 -8 -58 -70
2830 -70 -126 -5 -1084 -106 -672 297 784 222 65 -409 163 914 -1068 -1011 -272 197 -404 -596 -812 466
2850 466 -232 91 300 152 657 1124 -532 -316 -134 1306 -542 -112 778 -51 -1750 399 863 475
2868 475 -13 361 494 108 -503 -161 635 412 -444 -482 -596 86 -658 -2315 -599 -336 -1167 -991 199
2887 199 57 -745 1597 184 -679 512 112 208 -125 -257 560 89 -510 -228 41 -734 943 699 -585
2906 -585 -816 188 -44 -67 -753 -439 583 -93 747 70 73 432 -169 248 -133 128 627 114 435 1240
2926 1240 -352 575 -228 1330 -423 -584 570 -216 541 379 -583 -396 121 246 1357 777 -244 49
2944 49 95 426 295 -336 166 585 -314 -516 -775 -402 -416 -1242 854 950 -330 525 -29 31 -295 -273 144
2965 144 -413 1120 99 -295 -440 459 1006 903 -366 1525 -464 -25 160 271 1054 -196 -799 -100
2983 -100 -787 235 1178 -159 60 351 3 94 588 860 -46 -757 576 500 -610 321 -90 687 153
3002 153 -572 392 180 356 240 236 -149 123 -1151 -1084 319 497 767 449 686 -96 -743 109 -650 -346
3022 -346 375 98 -6 -161 193 235 586 43 464 854 646 247 603 -244 -602 245 418 -515 883 -725
3042 -725 -145 350 667 -292 -846 -16 300 -53 -16 -616 35 -530 587 191 -1283 -237 577 -26 -553
3061 -553 801 -426 565 -231 -885 366 1167 -208 -256 180 -281 636 -185 -60 -124 -573 -272 -42 -595
3080 -595 76 408 -18 34 -763 -79 -1477 27 137 286 343 -312 316 -541 630 638 93 461 -131 -447
3100 -447 514 529 -285 739 517 406 647 -243 -274 251 -236 -414 814 -411 478 -555 -55 564 -696
3119 -696 16 563 922 1074 195 -113 -274 -381 -528 -1316 -150 -738 251 -240 142 266 208 370 512 -132
3139 -132 -220 42 -186 362 -538 277 -10 -407 -372 -454 -131 -356 -672 -339 6 698 -263 -64 171 1214 -1161
3160 -1161 -1559 -552 -81 -627 -83 683 339 532 531 175 134 25 -144 -298 123 426 42 480 161 552
3180 552 -961 39 -713 49 -219 528 492 -102 574 -49 672 478 -511 -880 -1023 309 750 -602 545
3199 545 -167 -169 -573 -86 -537 1150 665 -574 625 327 -303 719 -142 -544 -260 -151 154 -289 758
3218 758 332 1254 -634 -134 -131 -59 -244 -247 -510 555 -186 -424 -30 -469 -274 369 302 937 430 706 522
3239 522 -954 1399 -80 100 -866 -106 -307 302 1214 -44 904 -171 -549 910 1007 652 241 -881
3257 -881 -13 -489 57 699 -725 -262 -261 -808 -278 222 677 82 707 196 295 -534 657 -308 103 -775
3277 -775 -101 23 389 1444 711 475 97 -621 523 -138 499 -154 -568 550 197 -93 -254 129 -18
3296 -18 -1075 -119 122 -36 62 601 444 -749 -201 -854 -1074 706 -413 -536 -592 113 -767 -306 842
3315 842 -308 317 11 -537 -195 57 -847 51 365 18 915 -1000 387 113 622 -334 101 -245 -100
3334 -100 437 1008 -757 8 -868 539 564 97 -354 241 -727 -313 681 -9 666 108 45 258 392 122
3354 122 837 537 259 347 -457 280 1740 73 -612 153 98 95 -999 262 569 316 -34 303 525 448
3374 448 -201 315 -907 -18 479 20 -191 750 235 339 704 -627 18 -340 -242 294 270 -657 -703 -646 -174
3395 -174 -541 178 129 142 849 779 51 753 -15 -34 335 -188 -101 -584 379 -153 -414 1219 -269 -327 581
3416 581 10 162 -895 -237 -166 206 -217 250 -612 310 -498 131 745 331 -734 -419 217 -82 712 -230
3436 -230 -262 505 492 -246 -822 577 366 687 897 -234 -192 454 199 849 -484 -329 -665 221 -245 -111
3456 -111 334 -160 -225 117 -554 -733 142 -84 -700 640 -158 336 163 326 796 1145 -439 552 -543
3475 -543 -424 18 76 919 -213 -237 -1116 55 -294 739 1076 635 -298 -159 -223 21 -502 1008 1357 1943
3495 1943 -519 -377 309 -183 -769 114 250 -254 526 142 -172 -434 -250 740 249 671 -860 365 162
3514 162 -53 357 -89 45 553 322 923 822 -216 -286 92 570 -101 171 -85 -224 -751 217 127 546
3534 546 -415 -1112 -260 -176 -882 623 568 -685 336 61 -628 289 -665 463 -494 -305 74 -387 994
3553 994 -802 298 -20 76 516 214 -104 -86 508 -30 395 -472 222 -803 -118 150 -1057 262 -634
3572 -634 -169 106 -29 -824 374 45 800 484 368 834 403 -251 58 569 -148 400 -621 262 -273
3591 -273 -315 195 -272 -562 -21 398 674 256 -217 -224 370 -958 -106 352 286 -750 -1183 -485 767 896
3611 896 -207 223 44 -601 818 213 -128 236 684 -33 -52 603 -372 475 371 -344 10 -339 -506 -82
3631 -82 -475 -416 244 556 -136 1597 943 688 -250 -790 -90 -452 280 771 140 -672 -196 -599 -580 -546 685
3652 685 788 134 -87 -149 -497 -126 228 789 -105 440 -1147 196 -164 -157 766 -182 987 -1050 -668 -174
3672 -174 -736 -475 -258 -151 278 -85 -907 409 -668 789 186 -190 308 -380 -306 292 688 20 -78 160
3692 160 155 -635 -339 25 135 449 52 -26 -671 449 -212 -705 490 -130 70 1153 854 -528 -1151 719
3712 719 -414 -16 155 36 -386 215 192 -239 -534 -325 -238 -53 -292 427 99 -17 605 48 -77 -4 823
3733 823 -232 69 115 739 103 -166 -209 -412 -364 -34 -218 -725 -690 983 -410 492 -115 -131 -427 -670 742
3754 742 -3 -940 179 -160 75 -243 995 329 156 898 892 86 -436 -665 -659 500 -624 883 -33 -725
3774 -725 662 204 -835 447 1393 -1092 -37 467 -78 285 1152 408 168 -663 -452 111 30 756 -363
3793 -363 -45 890 203 -402 19 505 -598 662 -127 -61 924 -319 -50 -333 -674 -192 -186 214 226 178 51
3814 51 605 497 382 -498 -48 -106 578 -279 537 351 -63 -610 121 -61 -575 -545 66 185 336 636 459
3835 459 -772 297 -591 285 -271 -703 885 -214 901 -77 -214 889 566 -791 -403 175 -44 450
3853 450 -177 -213 48 742 -309 499 464 -201 -796 38 128 343 5 -31 699 447 -190 304 -329 -928 699
3874 699 47 -456 -1371 -225 652 257 -979 1119 5 516 -278 -116 -466 -138 -956 7 300 -44 246
3893 246 -105 -645 344 459 -449 -114 -455 154 -164 -983 -10 -769 781 -44 855 472 298 1146 149 -394
3913 -394 179 538 477 39 -812 404 -399 -902 127 407 -157 828 -332 476 672 387 277 137 -30
3932 -30 279 -340 103 469 -180 -557 169 241 -1360 -181 -78 625 267 -105 451 -237 392 -494 132 548
3952 548 -737 -742 615 173 361 736 15 774 -117 -591 722 -359 206 309 -260 -194 -194 249 -35 283
3972 283 -553 16 162 36 -480 487 850 -249 417 184 407 -449 -44 721 -341 -118 74 -482 94
3991 94 -512 395 349 -423 265 -297 31 -279 136 265 37 -305 205 -310 -117 -206 -369 -283 -103 -1022 -62
4012 -62 -81 -577 998 190 500 -276 405 315 1322 970 756 -524 -283 -438 -780 789 -548 103 -151
4031 -151 -33 -354 635 -289 435 -238 -599 824 859 -417 618 393 -588 -255 -781 354 -229 -632 337
4050 337 946 241 781 -554 728 383 -702 807 182 132 152 -991 -489 -160 158 -999 173 -947
4068 -947 265 -267 -222 -26 -129 -351 454 149 826 -542 -623 305 -463 -139 -168 -725 -1163 493 279 -364
4088 -364 800 95 -416 963 -16 360 425 1076 -311 -445 -370 974 402 -116 -1124 520 -472 480 -236
4107 -236 -737 305 -852 -116 690 -260 -1472 231 -662 -55 206 1161 913 139 205 45 731 141 -16
4126 -16 221 516 -289 4 -192 160 484 57 -40 945 -129 687 678 -559 139 -5 -59 1094 -740 -197
4146 -197 -227 207 -294 -835 -998 293 212 592 -314 -364 212 201 657 246 -157 -830 -142 330 634 -913 -19
4167 -19 -86 52 396 -1303 82 254 187 -372 -36 -263 -946 -526 -226 -109 -143 -553 678 576 764 583
4187 583 224 84 -62 82 -393 -573 220 78 -312 -95 -1198 -238 288 386 -224 -39 757 -182 -13 693
4207 693 -338 417 -325 -9 455 -596 402 -674 233 -992 17 -446 -122 -613 1129 -18 -728 769
4225 769 -43 -519 -311 291 -444 -111 591 500 281 -46 208 178 -375 -518 -294 142 321 -286 -343 -60 697
4246 697 -175 -101 870 -270 -82 591 679 -74 297 439 366 -827 -929 -683 0 -739 352 136 388 -409
4266 -409 867 469 -230 508 318 -118 -99 532 133 -126 215 420 386 1176 262 1283 318 -642 1291 74
4286 74 311 981 899 630 -556 -1182 -373 -208 -537 695 -228 -15 568 -270 157 -922 -490 19 -35 -420
4306 -420 -274 -468 549 -728 39 -180 -569 -1286 -416 215 -320 266 137 -375 -542 -63 -638 -195 167
4325 167 -223 396 -946 -500 267 -175 2 275 478 -367 -389 -515 -286 -482 334 -259 -729 671 136 -689
4345 -689 182 228 -631 -39 949 -664 -775 42 578 22 616 -799 24 -1547 431 -631 559 478 -252
4364 -252 -144 -304 -27 -605 -1694 -1080 -797 -391 -611 579 -493 -532 704 -652 -287 -481 373 730 -249
4383 -249 29 -414 285 -146 703 108 828 -866 721 261 -3 4 -248 339 748 24 542 -419 -147 409
4403 409 -652 -128 -7 808 360 673 -456 481 714 -108 171 681 -410 -193 -26 -79 -275 152 387
4422 387 342 -1282 -1500 145 1356 -233 106 -1446 245 -527 630 -7 -349 328 53 533 478 194
4440 194 238 -58 686 825 562 -589 176 -289 359 -845 1054 -559 -15 -398 -81 -236 -770 1399 -376
4459 -376 -5 -1020 883 -239 -92 -241 -831 -240 -34 -400 -269 830 -497 -125 151 295 1299 116
4477 116 -247 168 23 -655 -333 633 284 -474 -202 265 -202 -435 -140 -904 795 357 500 540 -384 -415
4497 -415 580 422 549 -306 -799 311 -726 856 -1171 -905 731 417 -652 -329 -316 -272 -516 714
4515 714 231 174 -284 -445 -169 -714 -153 357 987 186 689 -673 178 -239 -425 273 -504 94 -1441 1084
4535 1084 -172 42 -162 267 -35 614 451 467 -484 466 -291 715 481 -705 100 557 -353 505 91
4554 91 517 179 50 1156 -512 678 -478 258 834 678 265 -304 -226 885 -76 -350 13 150 365
4573 365 -25 264 -490 38 -218 -23 532 -361 1190 235 -507 -1262 -270 -131 -635 -148 1245 -771 -33
4592 -33 460 921 151 -26 310 -114 96 135 -453 566 131 447 804 -261 -452 408 -71 -791 86 -131
4612 -131 -175 119 407 600 844 -212 163 199 175 -110 -684 -124 -29 -529 48 858 447 1394 -464 783
4632 783 116 117 334 452 -471 -315 739 877 28 129 221 324 -337 966 302 -824 134 697 464 218
4652 218 -1448 214 -198 -554 -412 374 1014 270 175 404 700 392 -68 -658 -149 -54 258 1202 380 -472
4672 -472 114 -81 51 -422 815 264 350 36 -553 -499 -40 14 -343 -15 1420 -506 -452 187 1106 239
4692 239 -454 354 -13 -219 -402 -34 -112 915 662 -244 -135 201 -312 -1208 -65 -247 -123 230 832 94
4712 94 -29 152 474 292 609 -706 536 871 403 -1186 74 -391 -488 -746 -488 -309 673 647 311 310
4732 310 867 -427 283 436 -496 427 -394 260 -188 -560 381 -357 243 -113 182 -644 -695 750 1115 239
4752 239 -218 -800 232 564 141 703 121 -293 -542 585 -469 -165 85 312 209 443 503 -50 -348
4771 -348 140 99 9 822 860 -473 311 -254 -121 437 -587 535 -970 -115 -336 730 -702 -127 -417
4790 -417 -1009 227 167 -306 -947 442 -324 556 -760 335 -438 -27 444 -846 -80 -62 685 230 -479
4809 -479 491 -763 -355 -351 405 -847 52 469 -349 -116 -516 285 -17 377 112 -301 394 -385 1452 -16
4829 -16 -364 -470 -470 855 -7 -39 -166 635 277 406 -552 -437 956 -517 -114 1297 616 -227 69 296
4849 296 -520 -359 121 330 -738 739 80 -882 152 -486 -382 -215 1107 -8 -84 -247 -921 586
4867 586 290 861 -1062 244 -32 611 -92 -453 110 473 -99 -955 5 413 -150 443 391 868 216 86
4887 86 305 613 -54 36 -63 -213 -544 -17 -287 -110 250 -197 -596 458 -92 -163 60 435 559 167 -645
4908 -645 -1031 -213 435 -1131 -636 -148 443 550 1033 311 -241 -274 -117 -178 106 668 -621 376 -532 -88
4928 -88 -555 -715 -83 -346 -1071 -404 487 -513 -669 -345 879 793 376 -412 94 -153 -482 -680 -594 -472
4948 -472 -309 515 17 -105 -308 435 21 -519 314 583 716 410 763 -1142 -752 185 221 -98 -257 -484
4968 -484 -431 386 -64 -514 -117 352 29 -107 -776 524 76 -1239 592 445 -611 -554 669 -810 -82
4987 -82 -478 -414 -154 -342 420 204 30 -1138 744 534 23 478 -415 -72 -121 425 -921 -279 -6 333
5007 333 -379 -465 -615 -80 -260 410 816 385 -703 -419 260 -260 106 568 -403 -3 -1320 -438 239 189
5027 189 -403 -86 -1081 241 -906 630 286 385 -433 134 -278 -373 -183 89 -186 1102 412 122 657
5046 657 31 159 570 620 136 512 317 749 -814 707 -480 -385 -706 15 41 -2227 817 19 -880
5065 -880 -171 -856 -637 1157 383 270 67 -335 73 -686 -115 -198 -526 250 -681 -436 1016 357 186 574
5085 574 848 -123 -137 -128 333 369 -189 -1025 742 782 132 186 -528 -482 91 -872 -107 375 -466 173 447 -102
5107 -102 -204 238 -90 -896 189 -37 -19 -35 -227 445 718 -1083 -272 348 436 433 -32 60 -1289 -1108 153
5128 153 -350 195 784 -1175 734 -99 602 -452 -56 -355 219 43 299 26 781 702 1199 -107 63
5147 63 -686 -1231 -26 -317 244 -394 114 -331 -334 -256 -376 -521 -56 -710 -761 842 -266 774 16 -133
5167 -133 172 314 77 215 346 -564 -104 -678 903 177 666 441 -161 274 -225 138 1383 60 236
5186 236 569 462 203 32 91 -304 655 -583 148 66 664 -229 -482 188 -101 53 -210 570 161 217 -1075
5207 -1075 -275 527 587 178 307 257 -319 -563 -525 -480 15 -336 -12 -439 340 229 -817 584 665 415 -62
5228 -62 288 -793 556 191 468 -62 452 -503 280 128 512 221 29 -228 -714 -662 521 40 -131 -171
5248 -171 -578 536 195 556 -709 -272 -221 -446 -15 69 -1137 -284 540 -1055 -897 1341 209 214 554
5267 554 -447 -193 -462 -405 -1349 -152 251 -524 -1106 -617 -853 -510 960 462 848 147 -74 -295 754
5286 754 790 -413 -135 -746 -950 841 -531 -393 -787 300 638 19 218 37 233 488 852 -116 640
5305 640 59 290 -350 714 435 -282 357 211 1061 -64 -616 837 484 -418 336 189 -357 347 179
5324 179 239 -149 736 359 -700 -96 -298 74 -279 -174 -467 113 203 157 -1182 233 378 27 264 86
5344 86 -57 -856 119 -135 -1106 187 -784 886 -258 404 -1616 -296 887 38 -183 497 -245 -433
5362 -433 -548 439 177 -228 765 -784 292 -1141 -723 1050 -56 -110 -208 -692 1186 1262 320 -365 -131
5381 -131 -250 -330 -21 -324 -157 399 -86 177 9 -585 53 631 9 -24 -120 -44 1136 714 -9 -324 134
5402 134 -1187 -182 21 -469 -17 717 1426 -178 191 -515 -510 -696 -461 76 -280 213 -264 -1047 114
5421 114 -290 -629 22 263 357 -216 -121 503 109 354 -376 1099 -222 -193 -11 -247 -80 -195 -234 948
5441 948 124 190 400 82 1283 333 1266 2 -560 362 377 -1467 -88 -373 239 -415 1077 -195 35
5460 35 -156 229 -718 907 -838 651 399 -275 -213 -850 -992 -1468 -651 -365 973 -85 -443 -201 536
5479 536 -310 -967 -162 223 188 -353 918 -419 -344 -1000 234 816 105 638 35 -1100 396 504 -577
5498 -577 -55 -217 204 -777 591 116 -30 33 870 -56 282 106 238 337 146 203 -156 -233 935 461 309
5519 309 776 1185 459 156 -696 -736 133 -355 -19 -40 131 -361 666 4 -336 -135 -1388 286 -516 285
5539 285 216 891 1040 -51 -217 1113 811 314 -812 298 -366 614 -186 65 1083 -757 64 -104
5557 -104 -144 -510 -374 -777 80 561 419 -1570 -884 248 -883 218 -189 -724 824 87 122 463 -153
5576 -153 -351 398 1061 -102 25 732 -43 -616 157 -77 -280 -442 733 -203 1467 -49 -569 -277 -298
5595 -298 -381 826 61 -143 577 -10 -953 435 93 -479 702 329 -463 359 1145 703 -933 117 -950
5614 -950 18 402 -1109 130 112 -78 -67 -184 -370 237 -203 610 -26 -1259 769 412 -434 -9 -175
5633 -175 -733 -621 -1202 42 497 -717 -638 524 -478 422 617 -83 -227 -222 660 1236 831 -160 286 276
5653 276 378 -381 556 755 956 -859 -992 -659 545 707 103 -461 336 473 480 296 -760 154 770 -320
5673 -320 -1072 333 -342 -119 -201 265 -344 546 -1203 14 14 317 -83 -155 760 -42 -42 168 -973 -183 -543
5694 -543 -682 -175 748 53 -696 -298 232 -423 220 349 512 120 358 1163 -183 186 90 -328 195 -235
5714 -235 981 -404 -1343 -301 474 160 422 715 947 833 -403 -623 300 -808 -218 343 1684 1302
5732 1302 -140 -194 -171 409 -975 784 -66 -34 -26 -663 334 -69 679 -120 -600 546 230 -322 -1085 -38
5752 -38 -145 -324 974 89 -81 -501 743 -648 81 -513 -109 -492 -639 -888 -958 -143 -654 -404 -278 -283
5772 -283 72 90 -841 -164 -160 -280 187 -123 -569 -303 864 -205 496 -446 285 -90 159 202 -878 67
5792 67 -16 -446 89 595 -146 224 -322 160 438 -439 1684 -617 554 -223 793 625 -299 -125 731
5811 731 -985 -250 166 950 501 180 1016 -308 852 -729 410 564 -664 257 -214 -791 -882 561
5829 561 518 -207 -1148 85 96 -276 -1002 -912 -618 -412 46 -158 390 521 -76 -584 -468 -569 1010 405
5849 405 -639 -233 -561 350 296 192 311 179 306 4 -438 -438 7 -148 386 228 8 939 -10 -216 -396
5870 -396 -419 137 46 128 -217 414 826 404 -1084 540 -396 118 -181 461 -998 733 -155 -79 202 -223
5890 -223 -41 -884 -893 -539 358 61 -112 -938 -235 -135 -631 918 -856 439 -165 624 209 -244 -299 -1028
5910 -1028 162 -420 232 1207 -94 340 -642 -407 -152 487 231 207 -716 204 -595 131 818 347 -76
5929 -76 -335 560 0 607 -214 430 -145 309 -497 341 -1327 -19 1159 103 706 80 -455 476 -360
5948 -360 336 -447 38 201 -126 -364 105 112 -761 688 84 -251 329 -416 258 388 -1310 -587 246 -431
5968 -431 -666 -208 839 99 523 -340 71 -30 -222 80 110 261 -188 70 439 -28 577 -205 433 1074
5988 1074 -241 307 109 -501 -74 570 -443 -803 428 -148 -289 373 159 -246 569 506 158 86 -451
6007 -451 -487 -260 -78 617 -124 1135 -219 -516 523 -172 83 40 -301 28 687 -32 136 524 -333 874
6027 874 704 -835 -89 177 108 806 -946 64 -549 433 167 -1009 -822 -760 145 -111 701 100 643
6046 643 -201 -974 29 -550 711 333 -382 -629 678 -633 326 701 -519 1201 32 -505 -113 18
6064 18 -865 657 -310 675 -258 480 -429 89 -630 558 1047 -759 -188 -168 -58 1533 569 -320 57
6083 57 72 436 -732 -903 -558 389 144 595 -1006 690 177 1289 -257 20 608 -164 702 223 530
6102 530 57 -275 939 606 -233 508 66 -358 -147 -129 19 -139 194 -207 -14 -139 1000 -264 104
6121 104 -5 508 -177 6 -181 801 -1005 607 -1118 -171 467 -1037 323 301 43 -510 172 234 198
6140 198 562 -115 38 478 -407 -171 54 584 -1059 661 284 215 -438 452 186 70 -636 -46 -318 -700
6160 -700 1345 703 295 -532 -450 945 -543 -220 248 -380 452 -1 -230 -881 -397 53 -1060 1031 5
6179 5 58 -619 -262 678 543 -224 55 317 187 114 -80 221 -167 -337 -1096 -815 -352 -539 400 -485 102
6200 102 72 -96 -807 46 335 -107 374 277 -421 57 316 285 -270 297 -896 -614 120 -202 60 73 -435
6221 -435 301 732 -662 407 -144 -146 594 638 353 -846 -49 -181 -579 340 602 -152 429 -755 608
6240 608 584 -302 177 228 549 -422 455 -307 393 -439 -224 669 -712 485 525 -846 -1053 -503 -694 -1429
6260 -1429 -1195 352 -434 -612 168 -89 -618 -1287 64 699 1008 -286 257 -201 -217 24 180 1385 -889
6279 -889 -453 -244 -830 332 767 661 136 1395 -54 -460 477 354 -522 89 -126 -461 -502 -941 -141
6298 -141 31 238 -243 197 -772 -1234 749 -265 -771 205 343 366 -544 -727 386 44 -700 -292 241
6317 241 -94 354 -267 563 -89 -683 176 -106 -870 544 816 230 -628 87 -319 266 -332 77 113 -693
6337 -693 153 -196 -428 -258 688 -85 -71 -470 -779 -77 33 951 440 238 394 37 205 -272 329 790
6357 790 1219 319 -446 85 803 319 -463 136 -105 -59 -587 217 -418 65 876 -1016 -70 269 195 -650
6377 -650 270 -734 -891 -795 -334 425 -523 498 1061 1026 -451 661 808 609 354 333 -196 4 470 -130
6397 -130 217 -39 490 -199 602 -15 -1 798 -691 -275 102 -183 41 -202 -542 -615 -514 -575 -251 -111 297
6418 297 1 -303 441 776 482 349 269 -594 -172 -1008 -907 -203 -984 237 -322 -554 769 281 -884
6437 -884 523 77 211 6 -90 452 -332 -1119 -329 -154 391 -153 553 -384 -312 -8 -634 68 -668 -805
6457 -805 -312 75 60 536 462 30 -1470 -549 -208 632 206 -73 1013 -569 -675 -86 -835 -575 -105 37
6477 37 111 283 137 271 109 555 -1144 364 -149 -265 -104 -855 204 299 438 -355 -253 38 208 -657
6497 -657 331 260 1447 -608 -25 -221 -510 826 -128 -216 -504 -211 -548 1065 159 -171 -419 -401 -820 878
6517 878 115 -528 -423 -414 -1191 -976 18 648 586 10 422 -781 -525 -42 325 -143 649 -551 27 688
6537 688 -289 724 497 984 490 -453 173 -789 -338 -957 134 -24 87 38 638 96 -555 -979 751
6556 751 452 -491 -152 928 523 -583 190 -24 3 147 374 208 -359 -451 -165 66 263 325 -80 -236
6576 -236 36 -423 -464 367 -759 551 408 56 396 671 1345 1221 331 410 -975 861 256 120 92 -599
6596 -599 -407 -189 -267 674 -373 272 96 224 -149 843 1060 433 -949 762 651 -108 527 -763 -1061
6615 -1061 -215 -1187 -45 -116 -108 -220 -60 268 291 -367 -912 68 -361 406 -620 -336 685 -901 -1114 605
6635 605 501 -275 175 -579 411 -1165 -496 -149 -987 -1046 -169 878 -703 -211 594 150 264 30 37 -556
6655 -556 -469 -415 708 717 169 98 -15 -72 1022 299 -303 45 45 228 524 -128 444 651 379 451 213 179 242
6678 242 777 -530 -436 -561 -999 -351 -347 297 -465 -462 -1070 111 242 -65 205 -64 -214 -321 567 -314 307
6699 307 -1250 111 484 136 -148 27 -683 -604 602 210 256 -227 210 447 1415 483 719 736 -164 -695
6719 -695 479 -95 -80 -723 171 -83 599 -241 714 125 578 -161 -899 789 -67 955 217 -153 -466
6738 -466 -411 152 -54 203 884 390 -109 112 -532 -320 -720 -343 441 -82 62 21 -771 1042 -620 -1045
6758 -1045 432 259 -334 -427 -208 1044 -349 -463 -638 -205 397 -267 376 -416 759 -576 396 268
6776 268 -149 1006 -304 -809 197 254 150 227 751 163 647 280 105 -1183 -61 -837 -112 89 -294
6795 -294 1261 986 394 -426 387 1147 -340 -764 -895 -405 160 361 -17 -667 615 -734 -378 580 -152
6814 -152 206 -1079 -437 331 -510 220 228 193 -501 -931 211 874 -471 -512 245 -480 134 448 281 43
6834 43 -231 -234 112 -472 790 379 -112 -315 1120 571 -99 -804 -253 251 -1441 -134 842 -661 -58
6853 -58 591 -332 -77 1447 -74 288 301 -553 198 1263 77 862 -6 -627 235 -507 24 -126 137
6872 137 -413 -610 817 743 51 -688 -249 332 -637 17 454 -758 -569 1040 -612 -701 -399 279 -752
6891 -752 -389 -764 -202 -1266 -169 -525 -58 535 475 152 -22 171 -125 516 -748 361 373 908 -65
6910 -65 584 279 -424 635 111 212 275 -490 -664 -267 1144 -808 383 -208 201 675 -276 -281 260 135
6930 135 -619 136 316 -471 -282 511 -158 -285 119 398 -292 -141 -738 648 -497 752 866 159 -112
6949 -112 124 -532 -394 -616 -19 444 210 694 217 -35 -240 275 755 569 35 786 795 356 -433 -749 487
6970 487 677 314 -197 189 -457 992 1274 94 36 960 420 -727 257 -493 225 732 1092 70 172
6989 172 1020 -634 21 324 545 545 -636 -228 -242 456 -399 -626 16 -15 1084 335 -196 -836 39 746
7009 746 393 -336 -1264 410 -308 326 61 390 530 -724 -30 360 -404 -39 -603 -160 436 150 652
7028 652 -343 -391 -11 -667 -4 49 -252 -480 -684 -4 1037 570 -50 -531 -1005 -451 -470 -413 321 -17 533
7049 533 966 498 -263 109 -322 262 -15 -125 379 346 214 -282 250 290 115 611 464 -721 -989 1065
7069 1065 642 -720 420 111 -54 1004 -225 -831 513 87 -385 708 -872 320 -728 -35 -587
7086 -587 -631 -246 -257 696 -231 128 644 1113 -759 -201 32 -670 470 -545 -629 -155 82 225 -198 708
7106 708 -302 -369 -706 263 -33 1155 117 785 700 115 -28 -142 820 429 625 256 -251 -19 -12 13 -114
7127 -114 -749 -877 676 -209 372 -415 119 -295 -264 -116 -615 210 123 -545 811 129 -559 -1357 90 43
7147 43 570 -272 211 232 220 104 -22 61 -31 1 -152 857 376 377 -1122 -140 344 -221 481 -365 336 131
7169 131 -455 611 -310 -199 464 -393 -30 493 864 822 -548 -848 -737 280 -57 529 -749 278 -442
7188 -442 828 609 210 -726 472 917 -539 -348 -431 291 875 -534 -549 811 365 -783 564 461
7206 461 695 532 -11 -539 695 -187 -295 205 -1407 -390 183 26 53 -95 419 -60 -35 196 73 563
7226 563 -331 -313 -107 -746 -373 -484 -356 -511 775 -335 -146 1173 -307 167 -368 293 522 -140 557
7245 557 336 -408 -885 -157 514 -471 432 726 -164 757 -354 726 -593 -733 54 -443 457 249 -433
7264 -433 -204 -76 44 -234 -346 668 46 766 132 492 -112 -447 -565 -641 -260 1222 129 -500 -802
7283 -802 776 991 416 484 -583 199 343 -606 50 619 274 -336 70 -841 455 156 -382 231 -123
7302 -123 -11 486 -200 103 -531 -480 -419 -226 650 1096 -427 -399 499 -19 52 829 -514 63 654 234 607
7323 607 -1324 288 -481 402 -94 -332 1489 -80 605 -130 -151 384 -40 -510 -163 -408 259 -377 289
7342 289 527 637 -740 355 -907 -563 550 477 -116 -54 -112 370 -400 858 298 -329 186 -60 19 1246
7362 1246 891 616 378 68 -899 -1100 59 273 -76 -322 131 1158 -241 603 574 -1247 440 149
7380 149 -592 -557 1057 155 -1121 -394 660 -629 -37 -60 241 500 -127 -1213 -422 -286 141 1097 171
7399 171 434 -152 778 -50 871 506 480 599 -88 694 -174 -109 -981 784 546 -732 -16 -861 -831 -5
7419 -5 -558 -838 -403 -678 -681 -79 -386 -12 -673 -872 -459 466 504 706 499 401 -313 -385 241 217 -524 159 -181
7442 -181 -576 -658 685 -356 690 -112 -180 -214 766 569 -20 142 489 -605 -452 110 142 968 532 421
7462 421 -2 467 470 542 469 349 -34 -227 -600 -339 -870 -152 668 688 306 421 29 -1362 983 393 453
7483 453 -450 -511 -245 868 -1157 -217 -272 543 222 -935 -22 289 -292 473 -713 -675 -565 873 728
7502 728 -228 6 -396 -653 392 810 -175 -539 -798 575 -110 203 631 104 566 -90 -4 -116 270 -109
7522 -109 106 103 -676 -454 198 230 246 -116 1256 354 299 371 -205 -220 259 -536 544 368 331 172 -721 -15
7544 -15 206 34 -261 -46 439 -95 482 -64 625 352 -104 -32 -156 549 194 -581 -121 -124 850 495 51
7565 51 178 -181 96 753 740 148 -91 148 -139 190 -405 936 398 -99 370 -350 299 -698 852 -228
7585 -228 -399 -442 1048 -101 1416 548 -639 -210 159 -166 686 241 919 -740 -325 370 -801 -368
7603 -368 -290 311 -216 -759 66 274 -500 974 -443 651 62 711 -57 -1059 102 -123 1187 -943
7621 -943 -102 42 44 -680 -408 -739 482 136 -470 786 375 -20 -7 450 335 271 395 5 185 -454 251
7642 251 -293 -680 -329 -293 452 569 1438 -909 -164 168 62 -539 71 -408 -197 -615 -465 -731 637 166
7662 166 408 502 10 249 648 103 -475 854 408 1085 -100 330 -451 958 475 233 978 -622 -140
7681 -140 147 302 -999 -242 721 655 322 424 -159 616 -797 -90 294 1249 275 213 19 -102 -388 -144
7701 -144 -1084 270 139 -115 654 25 340 -262 482 -748 471 -453 -656 -749 -770 338 297 -1051 -294
7720 -294 101 116 -211 503 -817 -1248 -936 -1208 -1049 617 -515 77 -225 223 481 -274 1294 190 507
7739 507 -233 -641 401 875 213 -542 58 121 311 -399 93 -355 -250 409 -8 1398 177 495 510 -731
7759 -731 644 85 -345 -22 116 -277 184 335 -374 -531 -263 98 18 -803 -509 534 -377 31 1110
7778 1110 281 -505 40 83 238 -813 250 -178 -513 440 -278 548 936 -77 -610 192 -474 -982 -489
7797 -489 182 74 -187 -356 -91 -26 485 43 -1021 441 -106 -374 -66 953 -89 -14 109 1069 163
7816 163 -400 -445 595 173 -40 8 -280 145 -180 644 388 249 485 -730 -335 -606 770 -437 -432 -261
7836 -261 437 -639 986 177 361 388 278 602 -705 -290 -237 291 115 249 -446 550 -194 -95 -120 498
7856 498 -24 -1067 -645 -604 192 343 581 701 -42 -382 553 263 231 -748 766 -51 416 -188 -1039 556
7876 556 123 568 -65 -39 399 -892 185 -136 303 199 317 175 675 -500 -2 618 -1251 180 -586
7895 -586 -113 307 340 857 868 503 -294 -896 -278 157 813 -163 482 -339 60 650 -325 461 14 -123 -552
7916 -552 39 994 544 513 494 143 553 1159 637 592 312 -178 -78 230 -78 4 -305 818 -431 -681 463
7937 463 -898 293 280 51 444 39 729 412 54 -114 459 196 66 -658 -159 -58 1359 -743 1058
7956 1058 -173 -218 -579 460 461 252 -352 -1253 597 -631 240 859 341 -84 -426 -215 85 976 727
7975 727 15 -854 -563 -305 -291 801 480 607 -194 -1236 323 579 144 -177 153 359 -180 -302 212
7994 212 -522 -337 638 -36 11 211 85 314 247 -472 206 -474 -90 89 998 80 -255 85 623 349 540
8015 540 558 451 178 620 278 560 679 261 428 107 418 898 217 -318 47 793 -86 230 92 -534
8035 -534 -39 26 1076 97 -206 888 -303 668 -255 -90 18 881 61 -337 -588 -599 -119 582 -1329
8054 -1329 -229 -328 604 820 -5 -535 110 257 85 196 -1144 -572 -307 169 -843 898 310 -323 -542
8073 -542 364 418 -486 531 -360 764 -110 -394 -411 57 527 213 580 -209 -287 -445 -493 348 217 -630 865
8094 865 613 68 -333 1288 -456 466 -7 119 -365 -1226 -740 -1230 -207 597 560 -674 -572 27 216
8113 216 59 -363 260 -554 -97 -165 -593 865 71 260 966 -1209 -1350 681 -94 -359 -121 -846 -196
8132 -196 -248 -201 541 659 -421 349 986 -313 345 -411 196 -174 -235 -36 -390 -490 -493 -148 162 -693 176
8153 176 565 222 -19 -400 495 -180 -658 -450 -598 -218 -335 -113 -613 -752 790 -444 -322 1053 -515
8172 -515 -745 83 -29 494 134 312 947 586 -677 140 -1159 329 166 -255 450 -614 -36 -232 1013
8191 1013
##END NTUPLES=NMR FID
##END=
