##TITLE=1H_KYU-20'+DMSO+t
 CDCl3, 108 sc, 
 13.3.2019
##JCAMPDX= 6.0         $$ Bruker NMR JCAMP-DX V2.0
##DATA TYPE= NMR FID
##DATA CLASS= NTUPLES
##ORIGIN= UXNMR, Bruker Analytische Messtechnik GmbH
##OWNER= root
$$ XWIN-NMR		Version 3.5
$$ Wed Mar 13 17:47:44 2019 Russian Standard Time (UT+4h)  she@DPX200
##.OBSERVE FREQUENCY= 200.1315
##.OBSERVE NUCLEUS= ^1H
##.DELAY= (6, 6)
##.ACQUISITION MODE= SIMULTANEOUS
##.ACQUISITION SCHEME= undefined
##.AVERAGES= 108
##.DIGITISER RES= 16
##SPECTROMETER/DATA SYSTEM= spect
##.PULSE SEQUENCE= zg30
##.SOLVENT NAME= CDCl3
##.SHIFT REFERENCE= (INTERNAL, CDCl3, 0, 15.7039)
##AUDIT TRAIL= $$ (NUMBER, WHEN, WHO, WHERE, WHAT)
$$ ##TITLE= Audit trail, XWIN-NMR		Version 3.5
$$ ##JCAMPDX= 5.01
$$ ##ORIGIN= Bruker BioSpin GmbH
$$ ##OWNER= she
$$ F:/spectra/data/she/nmr/H-F/1/audita.txt
$$ ##AUDIT TRAIL=  $$ (NUMBER, WHEN, WHO, WHERE, WHAT)
(   1,<2019-03-13 17:45:49.00 +0400>,<she>,<DPX200>,
      <created by zg, POWCHK disabled, PULCHK disabled
       configuration hash MD5:
       00 E9 B6 7A A2 85 ED C7 34 08 36 98 17 FE 4E 26
       data hash MD5: 16K
       B7 DF D5 51 53 67 F4 EF 1B DB 0D 25 1A 6B 48 4C>)
$$ ##END=
$$ 
$$ hash MD5
$$ 0A B4 94 3F 11 14 40 78 06 25 66 18 B1 E6 E6 80
##$RELAX= 
##$RELAX= 
##$RELAX= 
##$RELAX= 
##$RELAX= 
##$RELAX= 
$$ Bruker specific parameters
$$ --------------------------
##$DU= <F:/spectra>
##$EXPNO= 1
##$NAME= <H-F>
##$PROCNO= 1
##$TYPE= <nmr>
##$USER= <she>
##$AMP= (0..31)
100 100 100 100 100 100 100 100 100 100 100 100 100 100 100 100 100 100 
100 100 100 100 100 100 100 100 100 100 100 100 100 100 
##$AQSEQ= 0
##$AQ_mod= 1
##$AUNM= <au_zg>
##$AUTOPOS= <>
##$BF1= 200.13
##$BF2= 200.13
##$BF3= 200.13
##$BF4= 200.13
##$BF5= 200.13
##$BF6= 200.13
##$BF7= 200.13
##$BF8= 200.13
##$BYTORDA= 1
##$CFDGTYP= 0
##$CFRGTYP= 5
##$CHEMSTR= <none>
##$CNST= (0..31)
1 1 145 1 1 1 1 1 1 1 1 1 1 1 1 1 1 1 1 1 1 1 1 1 1 1 1 1 1 1 1 1 
##$CPDPRG= <>
##$CPDPRG1= <>
##$CPDPRG2= <>
##$CPDPRG3= <>
##$CPDPRG4= <mlev>
##$CPDPRG5= <mlev>
##$CPDPRG6= <mlev>
##$CPDPRG7= <mlev>
##$CPDPRG8= <mlev>
##$CPDPRGB= <>
##$CPDPRGT= <>
##$D= (0..31)
0 1.2 0 0 0 0 0 0 0 0 0 0.03 0 0 0 0 0 0 0 0 0 0 0 0 0 0 0 0 0 0 0 0 
##$DATE= 1552484748
##$DBL= (0..7)
120 120 120 120 120 120 120 120 
##$DBP= (0..7)
150 150 150 150 150 150 150 150 
##$DBP07= 0
##$DBPNAM0= <>
##$DBPNAM1= <>
##$DBPNAM2= <>
##$DBPNAM3= <>
##$DBPNAM4= <>
##$DBPNAM5= <>
##$DBPNAM6= <>
##$DBPNAM7= <>
##$DBPOAL= (0..7)
0.5 0.5 0.5 0.5 0.5 0.5 0.5 0.5 
##$DBPOFFS= (0..7)
0 0 0 0 0 0 0 0 
##$DE= 6
##$DECBNUC= <off>
##$DECIM= 2
##$DECNUC= <off>
##$DECSTAT= 4
##$DIGMOD= 1
##$DIGTYP= 9
##$DL= (0..7)
0 120 120 120 120 120 120 120 
##$DP= (0..7)
150 150 150 150 150 150 150 150 
##$DP07= 0
##$DPNAME0= <>
##$DPNAME1= <>
##$DPNAME2= <>
##$DPNAME3= <>
##$DPNAME4= <>
##$DPNAME5= <>
##$DPNAME6= <>
##$DPNAME7= <>
##$DPOAL= (0..7)
0.5 0.5 0.5 0.5 0.5 0.5 0.5 0.5 
##$DPOFFS= (0..7)
0 0 0 0 0 0 0 0 
##$DQDMODE= 0
##$DR= 16
##$DS= 0
##$DSLIST= <SSSSSSSSSSSSSSS>
$$ [...]
##$SUBNAM2= <"">
##$SUBNAM3= <"">
##$SUBNAM4= <"">
##$SUBNAM5= <"">
##$SUBNAM6= <"">
##$SUBNAM7= <"">
##$SUBNAM8= <"">
##$SUBNAM9= <"">
##$SW= 330.908255636489
##$SWIBOX= (0..15)
0 0 2 0 0 0 0 0 0 0 0 0 0 0 0 0 
##$SW_h= 66225.1655629139
##$TD= 16384
##$TD0= 1
##$TE= 0
##$TE2= 300
##$TE3= 300
##$TEG= 300
##$TL= (0..7)
0 120 120 120 120 120 120 120 
##$TP= (0..7)
150 150 150 150 150 150 150 150 
##$TP07= 0
##$TPNAME0= <>
##$TPNAME1= <>
##$TPNAME2= <>
##$TPNAME3= <>
##$TPNAME4= <>
##$TPNAME5= <>
##$TPNAME6= <>
##$TPNAME7= <>
##$TPOAL= (0..7)
0.5 0.5 0.5 0.5 0.5 0.5 0.5 0.5 
##$TPOFFS= (0..7)
0 0 0 0 0 0 0 0 
##$TUNHIN= 0
##$TUNHOUT= 0
##$TUNXOUT= 0
##$USERA1= <user>
##$USERA2= <user>
##$USERA3= <user>
##$USERA4= <user>
##$USERA5= <user>
##$V9= 5
##$VALIST= <valist>
##$VCLIST= <CCCCCCCCCCCCCCC>
##$VD= 0
##$VDLIST= <DDDDDDDDDDDDDDD>
##$VPLIST= <PPPPPPPPPPPPPPP>
##$VTLIST= <TTTTTTTTTTTTTTT>
##$WBST= 1024
##$WBSW= 4
##$XGAIN= (0..3)
0 0 0 0 
##$XL= 0
##$YL= 0
##$YMAX_a= 542908
##$YMIN_a= -320812
##$ZGOPTNS= <>
##$ZL1= 120
##$ZL2= 120
##$ZL3= 120
##$ZL4= 120
##$ABSF1= 10
##$ABSF2= 0
##$ABSG= 5
##$ABSL= 3
##$ALPHA= 0
##$AQORDER= 0
##$ASSFAC= 0
##$ASSFACI= 0
##$ASSFACX= 0
##$ASSWID= 0
##$AUNMP= <proc_1d>
##$AZFE= 0.1
##$AZFW= 0.1
##$BCFW= 1
##$BC_mod= 2
##$BYTORDP= 1
##$COROFFS= 0
##$CY= 11.3945322036743
##$DATMOD= 1
##$DC= 2
##$DFILT= <>
##$DTYPP= 0
##$F1P= 18.9103706918063
##$F2P= -1.10871071338519
##$FCOR= 0.5
##$FTSIZE= 0
##$FT_mod= 4
##$GAMMA= 1
##$GB= 0.15
##$INTBC= 1
##$INTSCL= 1
##$ISEN= 128
##$LB= 0.24
##$LEV0= 0
##$LPBIN= 0
##$MAXI= 10000
##$MC2= 0
##$MEAN= 0
##$ME_mod= 0
##$MI= 1.114404
##$NCOEF= 0
##$NC_proc= 0
##$NLEV= 6
##$NOISF1= 3.799351
##$NOISF2= 2.8
##$NSP= 1
##$NTH_PI= 0
##$NZP= 0
##$OFFSET= 15.70392
##$PC= 1
##$PHC0= -9152.546
##$PHC1= -16.39974
##$PH_mod= 1
##$PKNL= yes
##$PPARMOD= 0
##$PSCAL= 0
##$PSIGN= 0
##$REVERSE= no
##$SF= 200.130013532006
##$SI= 16384
##$SIGF1= 3
##$SIGF2= 2
##$SINO= 400
##$SIOLD= 16384
##$SREGLST= <1H.CDCl3>
##$SSB= 0
##$STSI= 0
##$STSR= 0
##$SW_p= 3612.71676300578
##$SYMM= 0
##$S_DEV= 0
##$TDeff= 0
##$TDoff= 0
##$TI= <>
##$TILT= no
##$TM1= 0
##$TM2= 0
##$TOPLEV= 0
##$USERP1= <user>
##$USERP2= <user>
##$USERP3= <user>
##$USERP4= <user>
##$USERP5= <user>
##$WDW= 1
##$XDIM= 8192
##$YMAX_p= 0
##$YMIN_p= 0
$$ End of Bruker specific parameters
$$ ---------------------------------
##NTUPLES= NMR FID
##VAR_NAME=  TIME,          FID/REAL,        FID/IMAG
##SYMBOL=    X,             R,               I
##VAR_TYPE=  INDEPENDENT,   DEPENDENT,       DEPENDENT
##VAR_FORM=  AFFN,          ASDF,            ASDF
##VAR_DIM=   8192,          8192,            8192
##UNITS=     SECONDS,       ARBITRARY UNITS, ARBITRARY UNITS
##FACTOR=    1.51e-05,      1,               1
##FIRST=     0,             0,               0
##LAST=      0.1236841,     0,               0
##MIN=       0,             -320812,         0
##MAX=       0.1236841,     542908,          0
$$ Real data points
##PAGE= N=1
##DATA TABLE= (X++(R..R)), XYDATA
0 -5 0 -16 2 -36 27 -65 60 -93 99 -123 149 -173 210 -228 280 -313 373 -407 491 -530 625 -685 797
23 797 -876 1005 -1107 1265 -1392 1584 -1749 1970 -2206 2487 -2806 3191 -3639 4196 -4893 5802
39 5802 -7036 8835 -11730 17089 -30556 108310 542908 317727 309257 244119 227170 178468
51 178468 157238 114926 91740 53898 28566 -3413 -25645 -54786 -76526 -100255 -116517 -134806
63 -134806 -146777 -160529 -167005 -174428 -175973 -180306 -176110 -172769 -165358 -157797 -145314 -133470 -119358 -103628
77 -103628 -87041 -68352 -49755 -30885 -11256 7792 25974 44378 62735 79780 95853 109888
89 109888 123521 135507 145350 151834 159204 162374 165628 166324 165424 162346 157463 150878 141961 132771 122775
104 122775 112641 99085 86298 73205 60664 45023 32232 17275 5489 -8325 -18860 -29199
116 -29199 -40892 -47747 -56793 -64174 -68000 -71745 -74998 -74801 -74435 -73874 -71041 -66115 -61720 -55493 -48593
131 -48593 -40239 -33152 -22914 -13267 -4833 5624 13833 23613 32623 42860 50191 58222 64124 70429
145 70429 75582 80127 83039 84837 87288 86621 86430 83588 81571 76961 71999 67922 62574 56290 48247
160 48247 41774 33391 26759 19637 11532 4175 -2901 -10215 -15680 -21450 -26484 -31359 -35511 -37960 -41169
175 -41169 -41597 -42820 -42507 -42804 -40724 -38770 -35341 -31196 -27386 -23492 -17613 -14445 -7471 -945 4377 10362
191 10362 14808 21205 26066 31374 35449 40009 43799 48061 49816 51912 53515 54184 55234 54615 53895 51975
207 51975 51038 47711 44871 41779 37292 33466 28849 24667 20802 16194 9695 6579 1793 -2326 -6365
222 -6365 -9953 -13014 -15092 -19011 -19808 -22337 -23470 -24323 -24824 -24396 -24053 -22142 -21091 -20220 -18174 -15190 -11636
239 -11636 -8247 -5825 -2926 522 3995 6873 10016 13438 17164 19556 21587 24468 26122 28266 29334
254 29334 30018 31068 30824 30085 29293 29099 28686 26234 25633 23010 20767 18579 16378 12951 9446 7429 4247
271 4247 1455 229 -4127 -5915 -8399 -9395 -12232 -13131 -14844 -15984 -16879 -17260 -17536 -17457 -16111 -15390 -15385 -13727
289 -13727 -11702 -9621 -8358 -7406 -3578 -1552 1526 1915 4418 7312 9416 12053 14704 15700 17428 19207
305 19207 19743 21467 21462 22804 22646 23326 22469 24030 22186 20626 19439 18799 17943 16408 13592 12420 9220
322 9220 9077 6918 4637 2172 -1090 -1113 -3984 -5725 -7134 -8264 -10875 -11988 -11986 -12745 -14513 -14444 -14225 -14343
340 -14343 -14195 -14537 -13465 -11719 -11498 -10597 -9169 -7565 -7106 -5016 -4230 -2983 -283 659 2269 5551 7081
357 7081 7281 9110 10232 11176 13672 12684 13855 15066 14627 15134 15557 14657 14489 13964 13267 12857 12935 11007
375 11007 10694 8945 7719 6865 4806 4271 3354 892 174 -1649 -2564 -4123 -4829 -5586 -7351 -7200 -8040
392 -8040 -9211 -9244 -10074 -9509 -9267 -9470 -8966 -7592 -8071 -8597 -7240 -6424 -5304 -5196 -3557 -2943 -2071 -400
410 -400 432 233 2807 3647 5459 4807 6310 6409 6618 7692 8818 7729 8478 8260 8155 8424 8475 8050 7476
429 7476 6249 6627 5681 5275 4143 2881 2557 1187 150 -137 292 -1675 -2937 -4612 -3772 -5268 -4182
446 -4182 -5852 -6087 -7163 -6881 -7454 -7587 -6856 -6548 -6547 -6930 -5678 -5572 -3977 -4146 -4543 -3016 -2385 -1923 775
465 775 31 1058 2316 2285 3510 3024 4451 6467 5189 5845 6359 6496 7340 6470 6381 6945 7239 5603 6583
484 6583 6185 5576 5030 2770 2742 2583 1080 -25 -401 -1065 -2018 -2912 -2982 -5045 -4618 -6174 -5933 -6164 -6967
503 -6967 -7240 -7046 -7389 -8228 -6390 -7202 -6900 -5747 -5677 -5611 -5375 -5559 -3122 -2910 -1936 -1404 -738 714 1028
522 1028 1976 3355 4343 4355 4472 5481 6825 7105 6836 7853 7111 7065 7552 6519 6671 7869 6459 5994
540 5994 6153 4345 3384 2885 1259 1488 913 -229 -728 -2409 -2331 -3085 -5593 -4755 -6153 -6081 -7935 -8360
558 -8360 -7736 -9202 -8224 -9285 -9216 -7525 -8560 -7494 -7645 -7520 -6519 -5457 -5051 -3740 -3246 -2495 -1241
575 -1241 -340 399 1947 1475 2346 4287 4860 5598 5519 6931 7124 7563 7875 8194 8232 6978 6920 8131 7023
594 7023 5656 6281 5893 2922 4023 3698 2398 2325 1332 -802 -1411 -1354 -1951 -3315 -4032 -5180 -4741 -5376
612 -5376 -6328 -6849 -7365 -6757 -7547 -6901 -8038 -8057 -8587 -6876 -5916 -5776 -5589 -3463 -4306 -2970 -2150 -1516 -548
631 -548 -744 427 1215 2651 2628 4168 4434 4178 4968 5982 6026 5449 6281 6129 6157 5668 5886 5683 5191 4751
651 4751 5335 4488 2737 2122 2127 814 557 291 -348 -333 -1702 -2062 -3067 -3440 -4571 -5322 -5187 -6189 -5470
670 -5470 -5143 -5970 -5493 -5148 -5881 -5353 -4637 -5288 -4443 -3710 -3677 -2425 -921 -1383 -720 -716 632 1400 1388 2504
690 2504 2591 3737 4324 4148 4552 4091 3945 5024 4719 5362 5090 4384 5299 4409 4890 4162 4047 2916 1780
709 1780 2845 1875 759 726 0 -69 -505 -735 -2513 -2859 -2096 -3099 -3923 -3875 -3541 -4297 -4979 -4832 -4288 -4343
729 -4343 -4229 -4477 -3746 -4074 -2770 -2845 -1674 -2173 -1080 -753 -1908 -800 -682 1269 1754 1690 2311 3081 3503
748 3503 2833 3730 3667 2984 3856 3426 4420 4738 4542 3645 5039 2834 2472 4017 2372 2195 1457 240 698
767 698 951 -766 -355 -1396 -2085 -1563 -3380 -1966 -1768 -2949 -2764 -3058 -3128 -4330 -4652 -2856 -3444 -3264
785 -3264 -2876 -2911 -2960 -3918 -2343 -910 -950 -1358 -931 431 -291 679 2272 2383 1816 2512 3349 3349 3200 2996
805 2996 4148 4529 4067 4440 4153 4287 3241 4677 3413 3908 3929 1600 2444 1818 1641 1186 1057 -495
823 -495 -334 -4 -1158 -1297 -1127 -1395 -1805 -2143 -2726 -2895 -2800 -3947 -3412 -4470 -3416 -3200 -3649 -3550 -3540 -4053
843 -4053 -2361 -2403 -1978 -605 -1456 -1568 -797 295 -247 760 535 1146 874 2312 3065 2084 1312 3494
861 3494 3333 3508 3426 3079 2909 3500 3785 3819 3330 3386 3302 3253 2764 1756 947 1776 1766 1003 345 -470 -860 522
883 522 -467 -1206 -1387 -1523 -1619 -2535 -2363 -3300 -2719 -2261 -2060 -2099 -2298 -2123 -2720 -2660 -2275 -1767 -2202 -2000 -2255
904 -2255 -988 -276 -769 -45 -362 295 826 433 363 2031 791 998 2425 1638 1901 2365 1779 2557 2294
923 2294 2208 2500 2737 1869 1716 2090 2819 1997 781 446 994 602 647 465 -138 -336 -763 -803 -673 -1617 -668
944 -668 -2094 -2232 -2268 -2119 -1171 -2032 -1357 -2439 -2761 -1880 -548 -1594 -807 -1022 -1278 -684 -1203 -804 -242
963 -242 -94 -538 -387 723 494 640 1779 1293 1813 2829 922 1451 1575 -303 2814 1671 2817 1845
981 1845 1399 1363 1192 1675 1366 66 553 1082 380 391 846 -958 -836 -593 -127 103 -1080 -1060 -1416 -628
1001 -628 -1167 -1394 -1443 -1061 -1657 -1260 -1448 -1368 -1842 -1661 -1456 -332 -1099 -902 -559 -936 21 -761 -201 -18
1021 -18 376 1242 1276 833 1153 109 1173 980 806 1437 2488 1116 1287 328 609 1255 475 1416 1297
1040 1297 -155 1295 665 -420 319 277 859 -253 126 178 -438 -539 -610 -271 -839 -774 -1448 -1681 -917 -1404
1060 -1404 -851 -1318 -1913 -1990 -367 -411 -928 -1041 -1909 -1382 -1229 -1186 -385 292 -806 251 561 834 -106 786
1080 786 1215 39 -303 1415 1249 1822 371 113 546 640 1923 1497 227 -588 827 88 211 345
1098 345 440 1122 696 -52 146 -326 -697 -479 -701 -1227 -843 -1042 -1237 -1068 -674 -662 -1949 -1158 -1050 -2155
1118 -2155 -875 -1269 -674 -1584 -1016 -462 -658 -586 -202 -487 -8 -350 302 -64 255 422 94 424 656 699
1138 699 31 542 667 526 921 1067 -74 1058 953 832 988 1062 1237 1241 750 987 44 -55 48 21 514
1159 514 118 152 -305 -302 -412 -913 -1371 -1299 -196 -1141 -527 -153 -1275 -766 -324 -771 -1362 -1103 -767 -1015 -1053
1180 -1053 -1019 -451 -685 -1390 -1438 74 -952 -788 27 345 -228 -2 770 965 4 531 619 623 677 1004 645
1201 645 -119 838 318 833 1447 690 1076 986 1009 104 251 538 900 826 -399 -123 -232 -86 -555 667
1221 667 -655 557 -139 -320 -298 -1327 -1381 -705 -805 -547 -783 -194 -701 -840 -607 -1430 -463 -787 -922 295
1241 295 165 -557 -644 -747 364 213 -368 -492 -74 -33 -325 377 809 6 -245 -765 203 399 479 954 314
1262 314 698 128 329 224 120 779 320 1413 -457 -349 -330 -807 -403 378 -66 -76 -25 -370 -695 79
1282 79 132 -369 -209 -404 11 -419 6 35 220 -119 52 66 -51 -985 -273 -975 210 -302 382 234 -711
1303 -711 -203 -293 -4 -21 -272 79 246 291 364 648 554 195 -70 1175 1212 181 -268 -309 172 225 -93 -405
1325 -405 167 876 -636 -1155 76 -329 -53 178 -1548 247 -720 411 45 -134 -208 135 162 -584 -1214
1344 -1214 -1076 -62 -930 -375 -136 -412 396 315 -1617 -190 73 -144 415 838 113 122 52 423 -184 -596
1364 -596 435 808 101 83 -483 309 413 -271 788 123 -175 -516 -54 547 1305 -332 343 299 -9 180
1384 180 -345 -884 443 -60 -699 627 407 581 -556 -500 -138 -596 241 143 -1542 -242 -1734 -452
1402 -452 -499 -549 -514 -471 -523 -393 620 552 -534 -400 -644 79 514 -916 439 -645 424 -747 -579 162
1422 162 581 1228 89 1234 844 257 -852 125 666 244 117 489 -743 157 100 582 527 -113 -31 -637
1442 -637 -195 1048 8 178 -38 -767 -470 -430 591 494 -152 -1 -396 -526 -1204 -391 -500 -117 -399 -575
1462 -575 591 -945 -361 -681 -404 1112 100 1230 73 -121 1165 -1570 -421 443 -899 -564 -71
1479 -71 -53 217 1374 -688 39 167 317 -215 358 1066 -299 234 760 130 6 1715 594 -857 -1304
1498 -1304 -160 -489 -771 -289 67 -169 696 -340 494 -817 633 44 -1154 -1246 -45 233 -499 -132
1516 -132 111 -1245 -120 -923 -535 -366 20 -552 427 -628 -337 191 -1052 -451 116 1006 190 470 -173
1535 -173 727 854 -254 -171 595 -142 -467 -154 537 1165 439 602 501 126 74 -426 209 -316 668 -92
1555 -92 -92 419 -562 -635 173 -369 901 156 -120 555 455 -144 -406 -976 156 -447 -424 -300 -1331 -327
1575 -327 283 -437 -459 -805 -1112 -678 -654 -221 -615 -809 64 85 -736 506 1214 -390 -277 527 1075 292
1595 292 1016 314 -511 34 598 396 -30 -668 192 -226 8 -584 -821 -877 1315 503 630 162 -540 -51
1615 -51 31 1145 423 -936 456 279 -1004 259 2 -204 183 -1131 351 -1101 -579 106 -218 -755
1633 -755 21 -264 1046 -1304 -241 -180 436 322 848 -33 176 988 -278 -289 321 1413 -575 -78 -490
1652 -490 654 -19 39 -306 -194 -530 826 33 -233 433 57 -205 -80 -609 -349 -105 23 582 1257 -551
1672 -551 89 15 669 -548 1079 -95 -538 -8 -539 609 471 808 -262 551 -672 -162 -138 -60 -90
1691 -90 499 172 634 -132 494 -94 21 247 -132 328 414 435 -636 1241 167 987 416 34 913 376
1711 376 -840 -215 635 1086 967 219 24 -78 155 -678 -838 -153 225 703 425 702 -163 -619 -448 633
1731 633 -878 251 185 342 99 -496 -644 -331 42 -275 345 -107 307 -766 -161 -199 -928 22 -1336
1750 -1336 -762 -392 654 377 295 78 458 114 -941 29 -609 227 502 -332 809 394 -268 731 237
1769 237 39 180 459 -388 137 390 137 716 1328 -990 -307 -274 -128 -864 813 -827 -453 336 90
1788 90 895 338 404 -812 -635 228 -1222 -24 -269 -531 -251 571 -483 -626 -1091 -439 -281 -953 77
1807 77 363 -1102 -858 -214 -1116 -16 51 226 -45 -395 917 -512 433 -232 37 -582 101 -3 -327
1826 -327 582 433 -1188 1514 -533 212 -75 -1070 795 -885 303 407 -111 -174 -166 -707 110 955 537
1845 537 -255 146 -640 -187 -194 -688 1015 11 -822 484 -246 422 -388 506 -864 365 454 -198 -325
1864 -325 201 180 -318 868 -1261 -599 114 60 477 590 787 397 588 725 300 -397 -68 33 219 -741
1884 -741 177 -749 -127 -498 -224 43 171 1177 103 258 -690 -226 131 -189 -841 -160 -222 -367 -509 -48
1904 -48 13 -18 -299 -348 -529 -561 985 -10 127 -343 134 169 701 -511 253 41 257 -357 873 -77 238
1925 238 156 286 169 132 600 20 279 -1200 -785 320 -49 -174 -196 -478 391 468 483 -594 576 910
1945 910 120 -276 91 584 -1433 392 -509 -687 -200 -219 -91 626 -601 -114 -251 208 -693 -215 -42
1964 -42 785 -349 305 -54 -585 -436 -310 -308 404 360 -200 -842 268 397 -355 679 -687 -756 434 1001
1984 1001 -353 598 34 -984 730 446 347 505 240 453 -396 143 581 -296 -321 -623 -308 728 212
2003 212 118 422 -390 -586 41 -211 -139 -391 -588 -526 48 -295 -27 -435 1246 -107 -20 325 249 -641 -459
2024 -459 -127 -355 191 -601 221 113 -145 -1206 -830 -299 -743 -118 168 39 -151 1233 247 252 -1278 513
2044 513 -404 -191 -534 -14 899 137 972 761 319 85 -283 -391 -481 -203 -150 46 289 -506 1246 697
2064 697 -191 -514 160 126 -148 -37 -621 48 -129 64 -425 -260 -575 555 -168 -276 -42 171 -791 -962
2084 -962 -174 32 554 843 949 199 472 -121 -1688 -633 -393 -582 -640 368 172 512 578 212 519 353
2104 353 82 222 328 62 575 555 23 572 501 -784 212 216 165 30 831 -384 -83 1104 656 -56 -265
2125 -265 523 -1320 1094 -352 -644 -1158 748 150 -1044 -546 525 174 -549 240 406 451 407 537 422
2144 422 -2 833 184 -342 382 -258 523 -481 -875 -3 146 -449 -7 1100 390 -152 1250 173 50
2163 50 79 7 -314 285 602 -331 -186 670 819 1260 86 -680 759 -209 -1288 269 -390 -49 95 -141
2183 -141 -95 -952 -128 -707 70 68 -64 -467 35 911 -174 -203 362 -345 709 994 471 -542 -110 850
2203 850 -497 1095 238 408 270 402 -489 -261 314 -229 -200 -124 563 188 -845 -325 -983 -601 -324 -51
2223 -51 364 -178 647 -59 679 -486 -450 277 -300 127 -1371 -161 -248 -17 52 -453 -37 301 -94 97
2243 97 197 -437 174 -1128 -800 62 -1788 -441 75 259 952 -450 -956 598 -1104 833 -269 -93
2261 -93 -91 998 306 -867 -491 -3 -487 309 634 1091 1188 -160 874 -84 83 -457 457 833 341 -606
2281 -606 -500 371 750 57 389 197 -514 462 271 -275 372 179 -623 4 495 -226 -2 -866 486 -101
2301 -101 -292 38 -298 119 844 -133 -597 294 484 -389 680 160 -374 -405 406 961 -95 479 166 604
2321 604 -374 571 -178 -86 298 -795 469 42 -172 983 191 -57 328 180 329 717 364 277 665 -53
2341 -53 -170 229 -29 89 522 -543 -270 -626 -193 -1520 -196 -451 -448 -520 -27 -597 63 -316 200 -182
2361 -182 285 -104 -1266 485 -110 -695 449 70 -501 -717 -321 236 524 846 -229 37 -116 -323 124
2380 124 1042 192 380 63 801 110 -82 331 -482 454 508 242 324 -507 277 544 -595 -445 1048 -475
2400 -475 455 -355 120 -889 -288 418 -174 1132 368 343 684 444 732 -246 383 -139 -1119 -199 287 534
2420 534 -99 405 107 450 -695 -278 -1069 -45 -289 -37 954 -218 238 -1 48 525 -19 -358 -20
2439 -20 -95 -184 472 264 -368 711 1080 -103 461 -222 -343 -337 -1072 -74 -546 50 143 -298 1050 395 -697
2460 -697 350 88 968 -15 76 -795 -358 908 -613 -275 -166 -216 132 226 -487 465 150 -101 -722 -213
2480 -213 -383 280 470 1140 -661 -1457 614 -622 -198 -1637 -856 -82 179 0 557 -579 -178 -773
2498 -773 -285 -1125 -282 -155 46 -939 193 264 -68 261 630 256 536 -520 193 419 39 15 -131 -60
2518 -60 858 83 149 -172 1158 -519 331 825 560 -9 -275 168 -201 16 455 471 106 -502 -63 -104 622
2539 622 216 -683 -49 803 -439 248 404 -556 528 61 -236 267 -520 -420 15 -344 -248 -399 304 227
2559 227 974 -232 -115 611 -440 -1068 477 -2 515 24 -320 -357 -11 65 -40 -360 -177 273 -942
2578 -942 -286 297 554 -854 -629 -764 453 407 -73 -642 103 1011 -120 246 712 1119 1082 436 51 262
2598 262 -538 -582 350 753 -510 -42 -632 116 649 -202 522 -677 -391 -621 808 669 348 364 405 -954
2618 -954 -494 276 -168 89 -22 -240 36 -694 -294 -206 8 290 -518 -1495 -530 -253 -9 -461 128 -433
2638 -433 269 -577 640 -173 144 -320 -290 -774 252 -258 -672 -249 -10 -1147 977 61 -709 999 -607
2657 -607 -348 -1448 617 665 232 700 -1299 -319 -229 22 174 228 -18 -205 493 200 -724 -479 -207 -417
2677 -417 -122 -209 -30 -323 -131 -99 1765 -655 -464 345 -529 141 -245 -897 -98 -453 660 -185 262 -523
2697 -523 -428 -105 -564 -54 -820 -139 450 15 496 208 105 -502 -34 -538 -58 -480 -565 257 106 -660 877
2718 877 140 435 108 579 -1143 -502 -437 690 13 -87 1042 107 498 -487 1333 -76 977 -477
2736 -477 510 1404 -698 756 472 807 125 -294 667 -177 90 741 -503 135 -506 -546 301 704 -261
2755 -261 -662 -453 891 172 148 453 -795 -432 1143 -986 -600 25 941 -234 -645 401 336 622 -578
2774 -578 -1066 111 -107 119 -902 -294 -154 -818 437 -176 -140 -185 527 -102 -385 252 -213 204 560 209
2794 209 232 -2177 80 -285 454 -896 -17 338 -1251 327 -115 494 -826 44 707 -8 36 1318
2812 1318 291 227 563 -396 -230 347 522 439 -248 578 176 210 367 713 -213 -246 -185 -371 339 144 371
2833 371 -596 -503 -682 -50 -295 1024 911 -495 -286 816 -106 506 101 -419 -696 -431 553 -470 -61
2852 -61 -297 -616 -423 292 -112 -286 96 56 262 -827 676 -242 -708 1119 37 612 -129 1118 727
2871 727 41 151 -291 -636 402 749 753 244 93 104 203 -107 350 416 207 293 -205 907 518 236 26
2892 26 -826 -598 -262 266 393 671 3 -163 138 865 1013 -289 125 -994 443 -409 345 182 -321
2911 -321 387 482 76 546 -477 -54 -289 -124 -1284 -128 851 -372 -242 -269 -393 -595 579 -379 50
2930 50 815 -131 -77 269 443 -1030 -252 -981 -316 380 688 -808 4 274 441 -285 -105 539 -1141 -10
2950 -10 68 -931 -836 -270 -333 -43 -143 -37 246 -142 695 -473 316 751 -1184 70 -822 -627 -99 -334
2970 -334 801 -148 -342 159 -108 151 -491 1005 684 330 607 -947 -711 -75 -394 -456 662 6 134
2989 134 -259 -344 93 132 -13 710 -508 -988 -636 -777 -724 939 587 -831 -289 151 368 -844 -358 -123
3009 -123 -278 918 -157 -848 978 452 344 -255 -20 124 -127 -625 -328 -63 482 -171 -682 254 316
3028 316 73 102 512 629 -17 -374 305 -415 879 -13 -298 -751 22 311 772 -75 -246 439 161 84
3048 84 615 317 -147 674 -146 -566 -38 -687 -1221 -838 -610 -433 553 -147 -387 104 305 -674 1255 -78
3068 -78 362 -314 61 -558 -380 -87 -353 684 -73 -17 -574 104 746 -169 399 277 252 378 975 -746
3088 -746 860 263 313 -476 -837 -475 4 -591 720 929 -500 1045 -177 1411 479 -507 6 279
3106 279 842 495 -374 -821 -573 -341 -489 -238 -41 27 -542 -659 24 -589 -808 -463 -857 -123 313 297 229
3127 229 -797 -739 -183 -653 577 1010 -122 -340 166 486 347 -166 -784 508 -75 116 20 -880 8
3146 8 433 -283 -562 -219 -629 -136 200 -425 311 408 -800 279 810 -689 -323 653 -259 160 -1128 -249
3166 -249 -189 954 -318 28 1135 -601 536 73 -1021 -657 -226 806 937 -228 274 903 225 -466
3184 -466 950 -595 492 456 361 -42 177 635 -517 130 350 658 -63 268 194 -211 -7 -711 218 -1048
3204 -1048 282 95 554 734 1055 245 -261 -1173 -748 -97 -169 887 304 709 -401 709 392 272 695
3223 695 -513 651 769 194 -488 -635 40 -507 -132 252 1234 410 -178 -5 717 -34 -1100 -359 -28
3242 -28 -647 -504 201 -197 447 -343 -202 -155 -386 102 -548 -121 270 20 878 795 -183 513 -208 566 776
3263 776 134 -159 -406 -1148 -344 269 -709 66 290 -966 -437 -368 319 327 52 802 -200 -87 -2050 -593
3283 -593 -29 -572 970 -312 -192 63 -1201 855 622 687 -706 321 23 -611 592 -691 746
3300 746 -348 1013 387 -234 -327 703 56 11 1147 1101 25 102 315 -434 -92 -79 -220 48 370 1233
3320 1233 441 -719 -486 -849 -717 -1 -140 337 713 -111 -961 -251 -130 -303 -3 -330 132 360 135
3339 135 -530 55 -282 -175 83 -340 85 411 316 -528 471 -707 -964 -11 652 46 -133 271 1044 324
3359 324 405 1179 44 -32 110 -335 -353 235 -199 -240 472 -1066 149 448 423 205 247 821 346 -470 175
3380 175 867 587 363 -324 -25 937 289 107 -66 207 332 331 12 407 1038 -186 604 809 123 -264
3400 -264 115 -41 -322 -574 258 43 -234 -7 -46 135 75 58 -202 -588 -116 279 -376 67 -586 610 184
3421 184 404 -233 -225 332 554 126 611 639 100 235 237 743 -879 385 -223 1488 -89 961 -761 261
3441 261 -288 521 659 840 635 -4 -532 474 -48 525 424 695 170 -126 -556 -407 1005 872 -648
3460 -648 -761 -923 -164 -832 419 -608 438 -384 793 -385 955 485 -342 -255 384 -496 -843 -116
3478 -116 185 -417 -266 -508 -284 -121 391 -513 -697 419 -189 208 -40 212 -749 254 -105 91 -167
3497 -167 170 -99 -373 781 -683 -380 442 512 417 -628 230 218 1301 442 913 710 269 373 168 541
3517 541 145 -376 -401 -20 -89 859 -1388 690 80 589 316 -430 96 -80 299 -107 443 534 429 319
3537 319 1066 202 321 -1293 112 36 647 699 1070 820 -372 699 488 147 169 -213 -120 -60 -383 342
3557 342 -187 273 260 132 -447 -119 193 547 -121 1187 -551 12 167 -721 357 -180 508 426 -1069
3576 -1069 471 -447 -136 283 1485 -888 -516 206 -53 261 -321 49 504 1109 1134 695 -104 -1245 597
3595 597 895 -464 434 -1379 -1464 247 -1285 -450 348 221 400 157 -269 -243 753 185 -328 366 324 -85
3615 -85 -235 -452 1305 -502 1296 226 -851 -366 1229 -342 604 -339 -948 -52 -664 -205 958 -788
3633 -788 114 -318 -133 -150 -35 -581 415 1292 186 215 614 511 -843 624 -175 -503 37 -641 -388 585
3653 585 188 -96 -294 -354 -744 -699 69 348 -96 -383 -295 -447 846 541 -260 163 -511 -172 -347 -495 1592
3674 1592 175 1006 -374 -14 -694 -194 520 -57 251 -267 -963 340 -53 -445 -323 -49 -775 -752 -366
3693 -366 -33 -966 -356 73 -187 -678 -1 984 -233 594 112 542 237 307 -340 280 -1263 -642 631
3712 631 -233 -448 439 -177 -153 242 291 216 350 113 501 -62 159 133 160 315 -456 -599 -327 678 -281
3733 -281 649 -186 384 304 -419 471 457 640 -784 -354 584 -907 -159 618 269 -88 -384 -899 21 0
3753 0 12 157 -322 69 -440 -100 -404 -832 -383 -981 -228 -970 488 -249 -948 493 -74 105 360 -36
3773 -36 259 -323 55 -54 -338 25 -470 445 -77 241 186 -504 -316 -212 -396 -202 370 547 145 647 -666
3794 -666 -203 624 461 750 65 64 26 -41 -312 -627 -160 828 -101 -314 103 757 -122 -296 261 -815 -296
3815 -296 206 661 134 1227 1158 -137 393 -533 -417 331 -211 290 269 -734 259 -851 0 268 1231
3834 1231 155 -1357 343 445 37 -620 -659 211 1233 209 -281 -447 526 -115 -654 5 -808 79
3852 79 602 888 339 -173 421 -7 -457 347 70 -216 -693 -213 -1460 -84 -408 186 485 432 -852 343
3872 343 255 -77 -383 142 -163 188 -176 -247 -166 27 662 -735 166 175 306 -504 -144 -120 -606 243 -3 983
3894 983 833 -956 663 -348 709 -1120 -402 -287 538 -256 320 55 -886 -206 -620 597 -522 158
3912 158 -299 -389 914 187 428 801 -119 -360 -543 -738 761 53 -33 136 -900 -517 -102 -580 403 -96
3932 -96 -14 -13 846 -1109 533 1605 431 -1025 -558 618 -57 541 149 -526 206 30 -424 1582 -500
3951 -500 -441 -291 289 -570 -232 540 -661 -410 12 355 -476 40 -503 -421 -1059 1209 -454 207 -652 -191
3971 -191 149 -925 -588 -425 652 409 -757 421 273 -695 -129 -750 -443 -416 23 -1125 20 944
3989 944 -129 993 888 -339 3 -87 633 1391 -165 -376 303 -198 174 -837 642 1060 218 -257
4007 -257 -54 -432 307 309 -431 451 -90 -30 -193 61 -245 411 -174 -968 -639 -104 605 -846 -549 -215 253
4028 253 946 -233 -1078 152 557 261 -594 -61 215 15 442 165 539 -371 -507 -36 -1268 87 430
4047 430 -483 -112 -567 455 515 -192 343 -153 -677 -386 -562 713 324 1353 40 -326 -993 -750 -741 329
4067 329 253 748 235 -696 -552 -376 -265 -1084 856 401 -607 -226 -8 1363 -268 -648 155 -209 1009
4086 1009 -811 -987 -917 -149 -339 -444 -128 258 -517 -528 95 -245 698 -505 602 266 972 -675 591
4105 591 421 -222 38 -70 -388 -731 498 -925 405 -816 -579 -963 -654 -80 86 230 -166 -1224
4123 -1224 -338 677 426 -70 -501 144 -68 409 27 673 -591 190 -360 -122 560 -606 311 14 526
4142 526 -277 342 -316 -61 222 1215 -179 -535 266 -42 224 -459 728 -212 356 408 230 -135 -64 -174
4162 -174 -883 946 -492 311 189 -685 -302 -615 -548 152 -94 -152 659 250 -922 -129 279 361 751 580
4182 580 -240 383 330 -32 635 -75 -816 250 -166 73 -416 -1864 80 852 782 774 -284 -574 -499 0
4202 0 795 -670 457 280 621 -597 404 189 79 646 180 -54 184 -220 357 -489 226 315 -507 559
4222 559 -190 408 -316 -57 44 -24 -154 607 622 -556 -380 -197 236 761 167 78 -230 349 -593 294 613
4243 613 -394 936 442 -597 160 602 693 -256 -277 -1276 -527 208 580 -882 -535 -519 179 -712 -461 381
4263 381 -342 -482 161 -517 -259 679 173 -482 -314 -185 87 334 -66 896 144 254 -658 270 90 861
4283 861 328 16 568 -66 215 -40 -388 -62 348 -824 -111 267 -231 -52 -2 150 69 415 -32 145
4303 145 -318 -307 -9 -1201 -546 -144 -92 581 -999 -54 115 -136 328 -411 162 45 1123 -598 -66
4322 -66 88 455 61 -33 67 632 -993 433 -82 -7 106 383 -46 -772 -103 -126 432 261 -93 115 1084
4343 1084 1132 186 -250 388 -170 254 666 -87 1203 612 -62 627 -380 -694 639 -1015 305 483
4361 483 408 -544 -222 81 324 261 -259 -553 267 204 913 -253 -428 -39 -672 419 85 -325 -372 -72 -227
4382 -227 -407 -783 -10 -109 -723 258 -583 86 -188 384 -363 67 -21 390 968 77 348 830 120 674 -214
4403 -214 -1136 -94 451 126 -258 13 -122 165 957 -1 699 72 -552 177 -534 218 -226 692 -466
4422 -466 -804 439 -1202 -461 -569 -205 -631 484 215 -811 769 -716 -483 -310 233 29 228 5
4440 5 1037 1161 -319 -219 -1321 -413 -204 -151 12 -358 375 -284 -676 -611 -651 -177 -918 -174 876 -621
4460 -621 842 397 -230 165 -1079 -835 371 28 -428 -170 210 -309 1322 -1024 -1016 253 -640 -309 453
4479 453 -343 189 561 -481 -45 -1345 -1218 366 208 1 -386 770 -28 -350 925 -844 -6 831
4497 831 885 468 -876 291 -178 -411 572 250 740 629 98 801 218 201 40 630 415 672 -396 814
4517 814 96 134 -266 643 99 957 338 199 720 -557 118 598 776 57 -47 -238 -605 301 -441 902
4537 902 -43 -591 -306 424 -37 -674 826 92 693 878 245 870 530 431 770 -1208 -364 133 767 146
4557 146 194 -225 653 -508 41 -405 -81 601 -660 881 439 -605 -376 67 521 -350 1168 -676
4575 -676 747 440 589 562 275 -371 126 36 654 1050 303 -736 -289 -132 -206 63 -104 45 668 -57
4595 -57 119 345 976 1392 242 -42 -321 -864 -467 -387 -728 -1031 -329 788 -558 -270 712 382 -150 -371
4615 -371 193 -351 622 239 7 661 3 401 -744 121 -119 134 36 560 513 -245 69 85 1461 139
4635 139 -937 -974 40 175 -114 80 733 -411 560 522 -393 285 -979 -1018 -100 -793 1 -4 -257 -440
4655 -440 -11 127 -1335 -555 -87 1150 -1060 -364 646 -1213 -634 -11 487 -483 -597 285 -284 -16
4673 -16 704 113 445 331 634 -402 365 -255 -180 -948 1026 -695 -711 -239 -75 199 -892 525 74
4692 74 756 551 -210 9 848 631 100 713 98 -392 538 -578 376 522 -519 649 536 -177 198
4711 198 840 -424 535 334 265 -35 590 42 -156 382 306 -808 344 -78 -388 888 6 -184 -1086
4730 -1086 -392 832 -170 -4 -514 112 53 -423 471 964 -616 774 -916 905 -19 647 956 -20
4748 -20 1493 211 -1173 -674 87 433 -331 -483 120 355 -432 -656 691 12 -350 342 694 357 67
4767 67 -538 -1 -808 412 386 -633 582 58 -46 344 -334 187 183 -896 -18 999 -273 352 1287
4786 1287 -1105 109 521 -672 676 -600 174 -113 -1528 280 -988 -1204 1139 -562 37 201
4802 201 12 740 334 872 -739 352 -416 248 -729 -389 -167 348 -804 -75 673 961 -237 -6 429
4821 429 255 261 -662 379 -762 -138 -679 1230 -98 124 8 -654 17 749 -299 630 971 -711 -1564
4840 -1564 106 -482 378 133 -989 -196 -548 445 215 -989 6 520 392 189 -18 136 -89 321 -235
4859 -235 -217 193 -220 1219 219 271 -44 -1339 -1040 77 -75 -226 -258 537 482 -421 1483 295 320 -308
4879 -308 -600 -578 -467 166 -1037 929 -114 -316 -486 -571 -645 593 -294 254 1610 772 292 91 490
4898 490 491 -567 515 -785 -289 -251 65 449 90 -723 1174 -194 546 399 -736 -167 408 594 -496
4917 -496 -603 -3 1212 219 -203 18 1127 -142 -930 447 -85 553 -32 42 323 -278 -7 -3 -250 -614
4937 -614 -694 761 606 930 126 44 -374 -483 247 822 524 512 902 -118 -812 140 -18 397 -274 -766
4957 -766 -88 320 -983 764 -194 -293 696 -700 331 307 -348 -186 264 651 -245 63 -642 -91 958
4976 958 -248 -316 978 -276 -247 504 -516 -1306 -1139 -11 -32 -618 12 32 886 -1041 -336 -529 664
4995 664 -87 346 -645 19 -168 476 -673 64 505 140 -221 157 531 372 767 -925 725 642 -15
5014 -15 357 -704 -300 -1011 -425 912 1119 -733 -59 -480 -1210 -405 519 -323 25 -166 272 -1020 -234
5033 -234 312 723 750 224 -373 502 968 -472 131 415 168 1087 -715 -765 -48 -977 747 43 -49 -317
5053 -317 -237 63 -330 262 709 -270 86 -82 41 -577 -329 -73 -506 272 177 420 521 438 -467 -39 -231
5074 -231 -499 -335 255 324 -63 -867 -303 449 462 -523 272 -342 -354 1067 -538 94 1450 547 -253 -199
5094 -199 -375 -200 52 -898 -299 292 -173 135 725 -519 -485 285 905 857 -418 866 -227 -496 205
5113 205 697 -726 -959 689 -709 405 449 -502 -347 -815 -189 -1109 735 517 -160 342 -1415 216
5131 216 -397 -876 -375 669 303 30 -497 225 -15 -353 -591 -1173 19 -417 -18 -521 -243 247 56
5150 56 -414 -365 -223 962 -797 -472 -509 -447 -772 -52 501 612 1482 1312 482 -170 -667 -428 -852 542
5170 542 -855 1161 426 -78 84 -956 634 317 -123 258 -247 -423 95 -21 92 1370 501 121
5188 121 -165 -182 -300 -7 459 -26 -59 -262 96 6 -261 256 -175 -534 648 667 462 -708 396 528
5208 528 9 74 383 685 -29 881 -958 -120 193 349 431 -1105 -274 -190 -319 -568 -978 -95 -328 489
5228 489 338 -125 312 1141 -140 -317 31 -169 -818 199 38 304 423 -254 248 1059 223 58 -92
5247 -92 420 195 364 -1013 414 667 -224 543 189 -407 1045 603 656 -302 202 177 -85 -415 611 1161
5267 1161 255 836 47 -17 616 673 -293 -452 527 1062 -181 194 -571 -152 380 319 -1011 41 -290 48
5287 48 122 97 -218 517 -742 501 -243 -92 -149 -337 -289 167 -741 -643 849 213 167 -338 128 85 -613 182
5309 182 -73 236 14 -232 573 227 249 627 521 282 12 -249 -544 -403 700 -514 -296 -477 -116 -727
5329 -727 406 -975 -286 -2 540 211 318 -56 -451 317 -678 -280 88 -679 -946 -171 369 -42 -832
5348 -832 -303 269 360 18 403 248 -150 -893 456 15 -176 -283 -348 708 -54 359 274 -153 -1287 -119
5368 -119 411 -317 -568 71 16 -471 432 507 -945 429 398 685 -182 849 742 -513 434 -362 -440 -289
5388 -289 387 -124 939 -948 250 -377 -947 -78 -1384 251 -432 252 -312 173 -310 506 -190 -825
5406 -825 -315 676 -681 603 -23 -585 1118 -23 349 -1109 -602 -206 665 -832 543 -131 -879 -788
5424 -788 -101 58 -315 -760 -173 -580 -420 -855 214 -414 -433 331 577 608 -1477 243 -221 888 1002
5443 1002 289 -60 -227 -174 565 -348 275 -455 -145 576 1108 -142 13 -852 -388 -208 354 -14 -264 749
5463 749 793 85 -639 -685 456 -9 -776 -335 -88 543 -700 381 -43 -141 -44 407 199 185 122 -866 366
5484 366 175 -205 -221 -35 -267 -490 -547 -477 -45 3 -388 -651 -168 -172 579 -358 -655 400 904 4 -17 328
5506 328 510 -254 -1093 1144 130 -1069 -233 -466 -655 259 -289 343 -44 -774 91 -115 -75 -290 104
5525 104 -456 -284 218 317 -614 -843 -227 -312 370 -109 355 61 16 378 -146 -4 -546 -385 -563 1057 -1020
5546 -1020 181 -170 -220 -341 -757 -196 -30 -1267 -65 -82 -735 -641 186 163 -568 -209 179 -52 1017 726
5566 726 368 1132 -864 -84 -12 -410 -25 -973 535 -54 96 -250 -508 -662 -751 -585 -661 -263 1020 -1041
5586 -1041 90 -899 161 -81 -68 146 291 149 153 970 164 923 224 43 -634 -1010 -1085 -27 -145 57
5606 57 -178 -655 -281 -328 719 309 980 946 -14 449 29 -189 329 -34 -65 -502 928 325 379 506 -432
5627 -432 471 631 -183 -488 419 -1641 -290 -429 1377 759 432 101 171 -358 352 -1189 207 -44 -47
5646 -47 6 -644 500 52 238 -422 688 -355 -551 -100 -1434 -138 679 1318 340 -491 299 601 777
5665 777 476 -91 -262 -552 -96 -118 213 786 964 244 180 123 439 -615 -868 -140 -453 640 -110 -527
5685 -527 -736 87 287 362 -58 99 -618 308 1503 676 972 -491 -867 487 1048 326 -646 -1608 180
5704 180 -13 -224 -579 134 114 382 -364 -477 -430 191 -753 -229 437 -707 -836 668 -255 650 220 146
5724 146 -307 -366 262 205 -1387 -202 6 764 55 542 810 196 -344 -238 18 -238 -451 -134 177 -375
5744 -375 228 750 791 1065 -520 -422 933 -1148 -203 345 111 -136 -833 971 -247 -236 -290 216 78 396
5764 396 -452 -338 -335 -168 614 215 324 -706 181 1049 -411 -399 376 408 117 -25 218 -376 -677 -112 -121
5785 -121 -245 405 -136 628 267 292 -261 -170 -224 -766 -440 46 441 -603 -70 -1074 58 -1069 642
5804 642 -463 -143 370 145 726 -94 444 657 -558 298 -402 -343 -997 -765 -582 466 382 -576 158 78
5824 78 131 214 -206 -412 16 741 1240 -456 409 -599 465 -91 -68 94 -381 597 -531 844 622 1579
5844 1579 57 -1126 -99 -472 -495 360 -365 -526 -582 -264 649 292 288 449 105 -916 -676 -406 600
5863 600 -398 32 -742 -948 752 514 248 -1633 -122 435 1291 -293 -152 -268 163 440 433 378 -16 255
5883 255 71 710 356 464 -800 383 339 -206 -169 -262 -422 582 -309 -721 507 -199 -176 4 388 -305
5903 -305 685 96 -85 435 117 -10 -221 -71 -528 -14 -585 46 619 512 -994 136 -199 309 205
5922 205 104 215 48 -74 -322 221 125 -554 702 210 621 1308 244 -290 -580 4 -412 -371 -192 551
5942 551 131 28 289 -638 481 -778 -781 -157 436 -604 -178 337 571 -318 -350 66 1099 167 180 946
5962 946 344 793 198 -647 327 415 178 -486 -402 -655 801 -684 -166 -487 -295 -42 220 -29 -718 140
5982 140 829 482 -427 -1157 286 1071 -615 -397 1535 910 -99 965 64 -607 -428 -1289 -347 260
6000 260 -102 -533 -480 -385 -386 201 -246 -506 141 1058 414 -48 -48 -18 205 -503 1027 493 641 288 156 578
6022 578 262 -232 1 356 909 419 -321 882 177 474 210 99 485 -339 -257 -413 -108 193 11 81
6042 81 -598 425 -121 172 -169 698 67 -201 -235 -72 912 -48 172 -880 -213 -565 -155 -592 -1051 -494
6062 -494 32 323 -56 -940 1030 102 -310 22 -83 358 1041 -245 -889 -259 -779 1457 34 417 76
6081 76 406 -84 186 -264 185 -47 268 5 445 604 809 301 -326 206 -19 190 -58 -204 -556 -656
6101 -656 195 190 334 148 -351 -530 -118 776 -188 476 350 566 150 440 -706 -990 573 -401 -212 120
6121 120 624 1192 -856 57 80 522 610 339 558 -80 698 -345 -413 -165 -704 -68 424 -233 -133 603
6141 603 503 647 1068 77 -270 -92 9 -113 473 -113 616 15 868 1 926 -988 -385 183 -213 -204
6161 -204 -580 -395 -190 -468 -665 -34 59 55 440 -655 4 159 -403 130 -666 -150 -106 -910 880 -185
6181 -185 -240 169 -197 -579 -564 255 -137 1064 143 -1103 -357 -449 -465 -408 -136 -24 -171 199 -538 319 406
6202 406 -489 -44 -107 -305 -33 74 1099 643 -449 165 -527 824 -80 458 -665 -590 -826 524 -283
6221 -283 -496 -251 -480 186 22 711 -779 1075 210 -334 -258 727 648 126 569 -108 -387 -413 -20 694
6241 694 -1036 423 -203 -1349 -271 1017 16 -2 553 389 719 690 389 -77 -368 138 -168 134 700
6260 700 930 -240 628 -549 -503 573 -34 -170 372 134 337 -793 -244 565 -1226 551 -608 -165
6278 -165 -692 -1529 1310 -197 -1039 482 -724 55 686 453 626 -410 -958 -30 -608 658 743 604
6296 604 1034 -96 -159 -410 108 -961 -205 -59 -218 -65 -135 -812 487 437 788 -393 591 940 -118
6315 -118 181 -62 472 -608 -867 -538 539 961 -642 354 113 -468 589 -1384 -267 -867 3 -324
6333 -324 -534 437 -157 560 -228 359 -631 654 -23 180 -69 761 -296 665 -530 8 127 864 416
6352 416 -714 -891 -641 153 -279 738 -274 -616 596 -303 -102 669 262 105 -567 -429 1073 -487
6370 -487 -720 -292 -108 508 1237 291 -768 319 156 252 -118 -825 406 -438 1190 344 -382 -490 -530
6389 -530 139 -21 -236 20 -495 -154 450 -6 -651 274 262 -995 40 -392 123 -103 -253 149 551 -534
6409 -534 171 419 -420 978 457 120 815 -101 911 518 -972 -418 -329 603 -234 -1046 -373 776 -686
6428 -686 -263 75 -1236 19 -1217 464 -803 398 212 641 -199 -249 207 539 375 458 244 1007 860
6447 860 -721 -31 -344 811 332 -80 1292 -264 349 -626 -236 -202 -204 -597 -779 339 210 160 -610 -970
6467 -970 -573 110 364 1258 -697 545 -125 -518 -231 76 -403 828 -154 -391 1070 -133 186 -518
6485 -518 -123 -731 533 377 -784 429 -730 -677 414 -327 270 83 -525 -1094 -231 1 -34 -577 -430
6504 -430 -450 -452 46 1454 1142 484 -577 247 558 -324 216 98 528 324 1276 -575 -625 -1958 -196 596
6524 596 1108 472 -815 84 -1182 62 -111 675 -980 120 -511 50 -653 17 -941 -391 -402 61 48
6543 48 -297 -606 -583 -261 378 624 170 -874 -331 450 -170 625 409 -242 -877 -596 -189 -379 601 -490
6563 -490 56 -235 25 307 -695 707 203 -250 45 -419 186 -250 -115 -195 37 177 390 -78 328 105
6583 105 194 -80 576 1299 74 -631 90 304 60 -720 475 -425 65 -356 584 -909 282 1695 -844
6602 -844 80 629 -336 939 -516 -16 221 19 -391 -429 31 -571 174 -110 61 223 -490 369 -302 -264
6622 -264 -24 131 -29 -8 -138 153 -274 439 737 685 311 559 -280 -388 317 317 199 513 -605 -134 124
6643 124 -428 -111 371 732 -9 -721 -153 57 -318 -20 -185 351 181 -822 -149 49 466 -172 -194 90
6663 90 -751 -319 244 -147 347 -536 -102 -260 -497 -113 637 401 367 413 994 -156 34 -958 -180 236 -628
6684 -628 778 -429 92 299 786 -847 817 -130 -213 -165 -584 -800 -626 78 746 230 -437 -567 -524 -560
6704 -560 413 714 -223 -317 -23 -743 -661 511 -575 264 724 -400 393 -77 722 884 193 209 801 58
6724 58 -283 -225 47 206 -922 447 -647 -1270 -179 581 -377 93 56 -19 -126 469 730 -466 -802 -894
6744 -894 -1040 -1 -247 -300 734 -280 -994 328 -83 149 29 683 524 383 -5 81 -182 -866 126
6763 126 876 -581 250 -251 261 -335 -21 15 61 74 194 -400 358 524 686 -529 -433 -49 213 839 -723
6784 -723 8 -109 -713 678 -150 -61 -192 507 365 -690 303 -410 -237 -395 -116 1173 -29 -782 -731
6803 -731 894 -11 -582 -449 135 -111 -318 635 -585 208 -1372 -103 28 636 258 -786 -454 345
6821 345 328 -93 -589 -976 843 -568 -273 -1047 -365 -747 -67 -630 410 237 -233 618 -61 -14 -358 262
6841 262 27 -126 423 -183 386 -327 -281 249 -522 -1098 489 1051 -517 255 522 -938 -1269 775 -784
6860 -784 -552 -483 161 109 1218 -435 205 53 607 -157 -570 1009 143 -641 279 -52 -348 500 -636
6879 -636 -442 -28 1008 -1229 -360 312 304 57 72 52 14 -746 -19 615 490 -896 732 -19 -741 1295
6899 1295 895 601 -76 -224 245 -406 -133 134 784 2 199 -812 -363 365 425 -120 243 694 903 257
6919 257 -305 -247 -35 -426 335 -70 -1217 -27 -516 -113 -396 -183 -480 341 810 684 -109 -951 -136 147
6939 147 -548 -944 -317 836 88 283 264 317 -179 900 471 286 -7 396 81 682 224 -347 -357 -68
6959 -68 1147 -447 689 799 -611 196 62 -854 -111 318 -581 885 445 803 -711 317 51 -990
6977 -990 298 1022 921 571 724 -382 91 511 400 63 207 181 -368 833 411 -14 52 902 44 -137
6997 -137 -48 -329 299 960 484 -704 610 -336 432 -314 272 449 -738 -332 608 -241 103 465 497 306
7017 306 -15 -129 -132 785 945 321 -5 -367 -899 332 -186 -756 -584 -914 324 19 -174 -1385 -559 -790
7037 -790 903 -504 -682 88 -1124 -950 44 1492 358 -6 249 49 -1466 988 -313 -45 11 847
7055 847 -504 -105 462 711 -1039 -969 108 -131 692 366 -409 -111 -631 1618 113 -680 86 -198 569
7074 569 -782 720 -419 152 394 -298 -34 -193 -118 -118 -1087 1290 213 -153 415 -273 -602 -533 320 -389
7094 -389 279 479 620 -131 176 -468 -641 500 84 -731 42 124 507 774 -130 -180 -391 421 794 -58
7114 -58 353 850 255 546 288 -305 203 68 335 -816 1423 853 583 -685 -478 621 -187 -660 -332
7133 -332 445 1 309 -282 419 -170 354 239 -227 -594 311 339 -369 24 225 -493 199 110 591 -298 -244
7154 -244 608 -432 502 -1129 -375 97 -118 -199 721 363 385 997 -346 572 -127 35 -295 -19 827 475
7174 475 -388 -660 797 328 634 -811 -33 449 -453 -210 -322 882 -243 -423 -986 459 454 473 149
7193 149 -151 -522 225 944 -296 -675 329 -105 -273 847 -493 -922 452 1035 492 -385 1109 -136
7211 -136 -214 606 838 -677 -601 -139 -377 248 -524 -424 419 891 86 -229 -279 92 -190 -799 578 756
7231 756 -220 -331 102 419 -840 -569 413 89 -646 -95 569 245 869 256 765 -118 246 -112 -385 -542
7251 -542 -496 168 -199 577 -149 12 450 -128 401 485 -507 -95 -935 213 -160 -11 -64 257 -225 -99 231
7272 231 316 378 -551 26 -858 -297 -443 130 -50 -162 107 -238 186 -125 -304 173 1044 426 -237 609 708
7293 708 -108 309 200 -110 -63 679 -498 -219 718 505 435 39 -270 -309 179 -272 97 339 -747 -366
7313 -366 113 -7 -60 -1270 -53 -140 -291 -438 869 -1025 -243 236 209 -1139 -336 849 -278 -809 -880
7332 -880 -701 -672 761 -1618 -164 729 285 1025 -123 -464 -244 -85 -179 -333 233 13 -96 -442 -294
7351 -294 -254 36 94 -74 -765 342 115 -140 -410 -413 625 1008 -193 883 406 -315 331 562 178 1109
7371 1109 284 -327 -616 130 -239 -532 412 -392 -557 -1155 -464 -627 62 20 -510 -746 -215 -667 -136 -809
7391 -809 380 207 -431 -606 419 -373 157 -311 109 68 362 -233 1126 814 -20 -569 159 410 -219
7410 -219 -603 -729 290 -1232 443 -170 396 765 -670 934 -723 656 -875 -545 -291 304 129
7427 129 -696 664 -851 -403 487 -234 -809 402 -213 -200 -1179 -307 -302 -1092 -693 -90 -954 98 357 -1145
7447 -1145 -412 -1476 -614 746 797 -648 99 -328 -762 -136 781 66 -637 -1173 -771 342 478 1459 -364
7466 -364 884 -302 378 23 432 712 -416 -731 1146 -83 -417 -843 -16 666 569 -446 -501 263 751
7485 751 -335 -402 61 93 18 291 -552 995 936 348 437 540 -817 -534 -166 -353 233 -83 -741 837
7505 837 -748 -319 613 -287 -77 484 -103 -876 459 60 -650 -376 641 281 -423 147 -911 -1077 109
7524 109 794 195 -306 -140 64 -241 185 614 -164 -259 -108 669 -67 -429 200 326 -263 696 -519 -800
7544 -800 1110 166 -175 285 338 -281 -1151 327 1346 -584 148 328 -158 539 -192 806 -955 -212 2
7563 2 56 655 224 -848 -496 744 -174 1065 446 640 -153 -469 812 42 -455 -673 -695 -24 -109 690
7583 690 373 -681 -217 -85 269 -96 3 -561 11 214 326 -960 113 -709 401 -293 -197 -56 -676
7602 -676 649 -6 17 -265 91 122 -627 460 1060 336 121 -611 245 86 -321 166 -130 225 -188 117
7622 117 531 -391 561 434 -883 861 312 1429 127 82 -523 762 -17 -126 405 108 -284 -459 204
7641 204 301 137 1014 -337 430 -578 -1005 227 1018 -804 -41 209 -402 423 -248 -267 -922 427 283
7660 283 337 144 490 789 96 -266 -753 -686 1028 -544 600 -78 -557 -281 -204 -120 -575 46 -12 -619 190
7681 190 -295 -793 448 204 444 1184 -464 371 -188 -254 180 105 830 -540 707 168 -517 -39 140
7700 140 133 262 172 -100 425 -173 -717 277 164 -504 98 -330 -190 -308 58 -122 185 800 -151 193 70
7721 70 252 320 -803 -785 191 20 341 36 -1394 80 -173 767 -154 -1377 818 -195 -1054 -3 943
7740 943 -420 -174 9 662 328 -1137 322 224 166 257 -436 -151 77 730 -113 495 -148 -57 351 421 -261
7761 -261 -363 -128 433 -493 993 -295 -523 953 -86 14 751 567 -297 167 311 1358 -698 111
7779 111 -482 -133 -835 507 -481 -382 793 143 -148 817 -538 -334 -137 -660 237 323 -1172 -656 1142
7798 1142 -724 -31 -114 -546 -1169 -104 -180 -884 -286 -284 750 -663 -558 86 400 429 -73 435 50 760
7818 760 81 -116 -199 6 -1113 -108 -375 226 764 -731 672 470 271 706 327 -242 944 358 438
7837 438 323 1304 -151 224 224 -91 673 1023 -504 37 475 -384 34 -246 224 667 401 20 -287 -243
7857 -243 -374 -796 104 131 -396 435 151 -438 -51 89 -291 277 -219 -164 342 -258 -267 -74 -114 456 -249 -810
7879 -810 -306 274 1467 -1292 183 -426 -530 347 72 -124 864 369 1077 30 -744 -297 -190 211 -195
7898 -195 206 -275 -288 769 598 1063 -57 -576 211 265 -86 680 -532 -301 -98 459 537 300 -7 -353
7918 -353 1084 -68 -268 157 -575 99 -351 29 -34 -136 -453 320 -118 97 -43 247 -884 801 -394
7937 -394 118 339 987 -423 -337 -322 149 -235 -355 424 -12 -427 692 54 -242 4 -948 -288 1246 268
7957 268 -21 976 -508 915 839 -419 -437 553 -328 926 1077 -45 -595 368 104 58 303 1815 245
7976 245 -164 945 -363 -144 335 -132 771 -495 -176 -1206 896 -226 -218 -1114 -81 -585 817 1184
7994 1184 -320 87 49 -484 -1083 -9 780 -190 -1097 2 306 -637 -293 -390 -86 -302 -236 1129 162
8013 162 -439 -506 -41 949 425 -582 733 461 -727 369 155 -781 18 -285 245 -147 322 170 -99
8032 -99 -218 -642 230 -203 538 518 -829 -1078 -157 1227 -977 -275 360 298 -147 293 -649 -25 421 261
8052 261 292 159 904 -374 665 455 -30 -1679 -378 146 197 125 873 275 -608 507 240 -1021 8
8071 8 219 -554 1694 601 363 63 328 -601 135 -533 -264 43 -256 -397 293 -838 404 -350 226
8090 226 -442 -102 478 -647 -37 63 130 -291 -457 780 -210 -48 311 -406 -696 231 888 -199 231
8109 231 1629 533 -436 -78 1719 964 -111 -176 185 326 1370 327 -702 85 106 -157 -668 -42
8127 -42 -323 528 950 313 -245 -701 274 340 834 -334 -330 29 334 334 -339 -828 -167 114 -795 323 486
8148 486 583 -1 -858 -143 -49 -364 -309 472 165 -55 -610 699 1317 -750 95 -1225 655 262 -92 518
8168 518 -10 -55 -216 -229 76 590 367 1158 -50 -377 -335 -505 -670 -159 209 54 -1546 -898 -173 706
8188 706 36 -243 70
8191G0
$$ Imaginary data points
##PAGE= N=2
##DATA TABLE= (X++(I..I)), XYDATA
0 1 0 1 5 3 15 14 19 24 16 22 13 14 8 15 11 11 10 11 7 2 12 2 3 -8 9 -12 5 -19 8 -26 7 -18 9 -20 -1 -13 -15 26 -87 133 -297
41 -297 577 -1343 3977 -26634 -320812 -277706 -274483 -285416 -287211 -293673 -295040 -296258 -294772 -292545 -283115
56 -283115 -275739 -264025 -250581 -234035 -216022 -196838 -175778 -154139 -131173 -107093 -84955 -60044
68 -60044 -35137 -12859 9882 31652 52575 71635 90006 105415 119684 131676 139993 149267 154684
81 154684 157994 157921 156683 153991 148482 141159 132804 121975 110282 97343 82770 67595 51659 34854
95 34854 21357 3484 -13113 -28772 -43400 -57705 -71247 -83151 -93790 -102883 -112211 -118126 -122888
108 -122888 -126984 -127336 -128986 -126416 -124041 -119504 -114621 -107957 -99985 -90923 -81084 -70407 -60671 -48309
122 -48309 -37062 -25526 -13890 -3241 8164 17556 27973 36174 44146 50432 57670 61521 64477
135 64477 66710 68445 68778 67148 66032 62494 58087 52930 47138 40122 33794 25351 17495 9746 1353
150 1353 -7831 -15760 -23427 -31086 -38526 -44940 -51461 -57214 -61170 -65007 -67870 -71175 -71856 -72067 -72062 -70338
166 -70338 -67800 -64234 -61295 -56519 -51502 -46625 -39953 -34275 -28428 -21338 -14780 -8110 -1641 5040 10751
181 10751 16235 22186 26429 30875 34723 37970 40571 40991 42244 41630 43133 41411 39329 37167 33743
196 33743 30127 26717 22829 18290 13146 8581 4359 -786 -7519 -11621 -16878 -22030 -24212 -29818 -33271
211 -33271 -36555 -38091 -40747 -41275 -43508 -43026 -44185 -42492 -42725 -40974 -38757 -35545 -33556 -29876 -27013 -23447
227 -23447 -19731 -15838 -11642 -7593 -3419 157 4250 8467 12204 13194 15945 19342 21099 22121 24202
242 24202 24379 25294 24263 23876 22458 21570 19975 19558 15601 13289 12103 8893 5820 2734 227 -3280
258 -3280 -6728 -8768 -11226 -14327 -16642 -19498 -20283 -21485 -23015 -24060 -23973 -24559 -24817 -24326 -23832 -22334 -21277
275 -21277 -19172 -17691 -16851 -14047 -11449 -7875 -6831 -2913 -2854 1565 4134 5821 8200 11489 13351 15191
291 15191 15993 17426 17988 19553 20104 19879 20804 20089 19652 18486 17004 14763 14118 12952 10214 8941 7029
308 7029 5540 1895 821 -1510 -3130 -5962 -6590 -9538 -11230 -13692 -13731 -16274 -17389 -17732 -17613 -18173 -18920
325 -18920 -18752 -17500 -16438 -16711 -15847 -15270 -13892 -12311 -10548 -9285 -7183 -5429 -4121 -1920 251 1389
341 1389 4056 5940 7633 8958 10875 11397 12209 13911 13816 14357 15808 16290 16682 14605 15671 14501 14269
358 14269 13703 11496 11390 10059 9241 7654 6620 4867 3450 1701 -154 -775 -2076 -3419 -5092 -6494
374 -6494 -7287 -7912 -8966 -9359 -9948 -10471 -10124 -10610 -10141 -10443 -10496 -10139 -10598 -7642 -7245 -7608 -4746 -4737 -4906 -3023
394 -3023 -834 757 1202 2096 3500 4629 4422 5930 6512 7713 8666 9397 9617 9713 9682 10710 9169 10161
412 10161 9981 9822 8981 8464 8817 6604 5583 5588 5729 4590 2672 1038 1597 -699 -886 -2459 -2042 -3831
430 -3831 -5321 -4802 -4444 -5734 -6396 -7112 -6159 -6753 -6581 -6197 -5821 -5861 -6378 -4516 -4575 -3553 -3754 -2984 -2691
449 -2691 -378 -513 207 2505 3101 3582 3415 5127 5032 5340 6324 6700 7491 8626 7851 8266 8766 8631 7648
468 7648 7866 7339 7280 6825 5523 5448 4321 3519 1984 1292 339 91 -876 -2081 -2567 -4284 -3855 -3993 -4695
487 -4695 -5150 -6665 -5969 -6463 -6602 -6158 -6105 -6398 -6009 -5562 -4756 -4679 -3993 -3526 -2424 -1989 -872 -1721 -450
506 -450 1255 1744 3545 3163 5148 5765 5140 6305 6655 7940 7847 8072 8554 8722 8216 8239 8240 7529 7478 6385
526 6385 6416 5452 4683 4333 3031 2429 1757 1177 31 -1239 -1877 -2540 -3410 -4392 -5211 -6462 -6557 -7041 -8110
545 -8110 -7828 -7372 -7198 -8373 -7647 -7391 -7098 -5940 -5736 -4642 -4957 -4342 -2291 -1827 -1441 -270 444 1133
563 1133 1419 2982 3421 4548 6058 6658 5857 7220 7674 6931 8131 8358 8768 8565 7623 8426 8308 6956
581 6956 6742 5941 6523 4011 3441 2004 2895 1332 217 -312 -1336 -1554 -3284 -3622 -3567 -4295 -6313 -6031
599 -6031 -5752 -6529 -6734 -6512 -7421 -7219 -6674 -6821 -6588 -5037 -5380 -5519 -4376 -4236 -2941 -2676 -1553 -1542 -85
618 -85 1077 2787 1282 3573 3940 4434 5783 6113 6622 5600 6561 7000 7349 6448 6378 6648 6435 6552 4829
637 4829 5677 4823 4177 2920 2835 1671 1447 818 -832 -233 -2042 -2451 -4463 -3584 -4646 -3677 -4656 -5591
655 -5591 -6165 -5535 -6423 -5653 -6639 -5496 -4595 -5907 -4627 -5087 -4466 -4030 -2655 -2464 -575 -650 868 -147
673 -147 299 1138 2198 3181 2859 3157 3752 4846 5182 5583 5937 5209 4980 5428 4881 4248 4916 4769 4811 3656
693 3656 4400 3297 2014 1927 1429 894 -165 313 -1830 -1693 -2671 -2366 -2033 -2956 -3297 -3767 -4490 -4852 -3703
712 -3703 -4051 -4890 -5242 -4933 -4054 -3819 -4099 -3389 -3973 -2158 -2445 -2580 -117 -1150 -940 -382 1178 1946 1069
731 1069 1678 2806 2570 2965 3679 4031 4468 3684 4985 4114 4644 4041 4045 3655 4248 2835 3331 3318 2397 1807
751 1807 1449 2237 1811 56 -705 532 -859 -1552 -2318 -2490 -3018 -2613 -2481 -3791 -4020 -3434 -3885 -3806 -4337
770 -4337 -3831 -2757 -3250 -2871 -3565 -2014 -1636 -979 -1287 -1037 -705 -387 446 1184 1524 1858 2023 2781 3205
789 3205 3393 3039 2655 3570 4245 3765 4397 3652 3376 4434 3947 2582 2926 2621 2777 2382 1879 1818 1308 372
809 372 -203 -1027 -1203 -2043 -1293 -2640 -2312 -3414 -3644 -3669 -2310 -3339 -4488 -3994 -3585 -3329 -3868 -3431 -3180
828 -3180 -3356 -2339 -2246 -2258 -1735 -1756 -1361 -1438 -94 334 759 1660 1747 1900 2090 2021 2280 3507 3742 3901 3180
849 3180 3419 3844 3457 4328 2891 5344 3850 3049 2282 2813 3127 1621 1679 2098 740 691 1745 -318
867 -318 -277 -308 -629 -1544 -2177 -1622 -2551 -2215 -2967 -3443 -3293 -2928 -2568 -3496 -3042 -2837 -3473 -2852 -1594 -2712
887 -2712 -1477 -2567 -883 -1420 -1346 548 54 262 969 1351 1477 1443 1495 1728 1792 2003 2480 2756 2542 2578
907 2578 2499 2824 2522 3345 3325 2323 2205 2363 1850 2038 2051 1508 1355 -175 -196 195 170 -343 -832 -1228 -776
928 -776 -1319 -2031 -2239 -1285 -1164 -725 -1468 -2934 -2443 -673 -2582 -1493 -2024 -1650 -1714 -1272 -152 -958 -432
947 -432 -307 -470 60 773 -115 882 2039 298 1764 1374 1558 1499 1700 2411 1611 1551 1495 2528 2039 1616
967 1616 1479 2463 1642 1828 3144 945 1246 1009 1117 514 166 56 -417 -702 447 -1059 -503 -873 -919
986 -919 -853 -457 -1106 -1637 -1882 -659 157 -1484 -1195 -662 -314 -1182 62 -994 -384 531 -389 -226 445
1005 445 -134 232 345 511 973 1062 2320 1321 1794 844 2245 1409 920 1875 1525 1787 1488 1599 1899 1831
1025 1831 1451 1855 1127 1219 812 -689 1190 795 -321 617 131 -183 101 -767 205 444 -1222 307
1043 307 -946 -1459 -294 -1229 -1637 -723 -1277 -979 -594 -475 -627 -1422 -1049 321 -891 -578 48 61 152
1062 152 720 -209 400 -205 839 745 1510 1106 1241 1095 2101 1114 779 1027 2154 1081 1894 1515 595
1081 595 1512 268 1323 1029 887 -202 92 674 69 -483 -918 -386 298 -79 -480 -855 73 -233 -367
1100 -367 -371 -110 -1936 301 -1100 -938 -255 -1385 -1326 -803 -99 -1024 -887 -570 357 -327 726 594 237
1119 237 713 -392 -266 61 741 371 -136 1180 -169 587 1580 736 2355 843 2156 1000 1011 1919
1137 1919 1611 1059 444 1337 150 941 579 213 611 85 843 167 -180 -589 -108 63 -782 -32 -742
1156 -742 -51 -713 -1725 144 -1028 -1348 -752 -197 -752 -372 -413 29 -846 -586 -220 364 176 365 173
1175 173 -499 -12 -88 1112 -298 -201 1226 897 -14 687 445 1376 935 1518 1342 954 1865 1074 725 213
1195 213 835 -183 952 808 -125 234 676 -75 581 672 354 -90 -359 91 -126 141 146 -674 -1331 -728
1215 -728 -634 -947 -733 -93 -132 461 -1265 -450 -801 -752 -599 975 524 -56 -1799 53 -756 67 1337
1234 1337 -660 225 497 641 -168 743 911 647 1124 295 838 878 625 987 1255 1408 -330 -840 960
1253 960 35 619 909 1060 410 -668 -326 162 -298 596 -973 -457 291 -1500 112 30 -319 -1186 -478
1272 -478 -530 302 -710 -652 86 143 -339 -524 -771 -603 -9 -327 -714 -158 -756 1100 570 -136 641 -157
1292 -157 504 815 486 1143 881 433 375 603 -69 159 1180 638 1186 651 -597 690 966 897 -668
1311 -668 135 -13 -547 1060 -772 474 322 279 -377 692 -498 193 -684 40 -818 -761 -946 -507 -1222
1330 -1222 -196 -899 368 -283 -130 -669 -501 -764 -91 145 -8 -37 -795 731 -189 -564 291 432 971
1349 971 -57 54 745 619 -390 493 280 -492 842 -182 618 861 878 805 453 68 420 -330 -800
1368 -800 948 -19 -64 -86 -41 -512 -184 179 -536 -199 -347 -791 -82 32 -659 392 -363 -1020 558 -145
1388 -145 214 -1007 542 765 -425 493 -742 -101 -450 686 -210 178 20 121 170 -489 -463 739 284
1407 284 -268 509 173 -554 464 101 1007 278 822 526 261 941 -147 -58 1472 491 -310 661 200
1426 200 424 424 88 969 243 -968 -1291 -992 -17 -446 -563 -346 59 -566 42 -1141 245 992 12 304
1446 304 342 402 -15 414 -158 64 436 361 -673 418 -389 -572 1165 -258 331 -273 99 1413 1271
1465 1271 277 126 659 -304 -246 580 1056 -593 704 133 22 214 -146 -960 656 -594 -802 734
1483 734 -330 22 -443 -764 -96 -309 -1040 -134 160 -78 358 -14 -908 139 378 -385 515 -617 -128
1502 -128 1095 -395 -268 254 707 -388 -62 -1012 416 -565 -1324 -456 26 97 97 171 627 376 821 414
1522 414 -273 -513 -231 75 439 939 -686 852 752 -197 858 63 39 -1452 473 -165 -217 734 1680
1541 1680 -269 -1116 128 -153 -275 -265 -702 53 235 565 271 -491 -831 -1259 -368 -480 594 -173 84
1560 84 -443 331 -6 205 1136 -34 92 488 -866 -26 -592 28 -1173 33 872 -745 216 -782 475
1579 475 1154 158 -491 1275 693 168 288 811 168 113 225 859 125 -455 -120 -439 566 598 226 -119
1599 -119 800 185 -118 -559 -765 -635 766 764 -706 -116 138 -571 -196 223 -49 1153 -454 176 -99
1618 -99 -1969 -325 573 -108 -154 -882 -231 53 -539 -375 16 495 1104 -113 -442 242 161 -136 659 1053
1638 1053 -413 -643 475 396 31 -45 80 -268 647 -505 442 -438 -240 -691 -537 942 -153 114 358
1657 358 203 -235 16 -37 -649 234 -42 -336 -827 -755 332 422 51 -923 106 -544 -259 29 681 -5
1677 -5 -500 181 553 -99 424 321 -449 -12 -1111 607 339 -325 -21 249 444 442 285 -1240 592 -123
1697 -123 -148 836 286 446 -237 533 -277 365 -165 70 651 -210 984 384 885 489 -311 265 -214 -219 -590
1718 -590 -291 561 -546 -1061 121 -1292 57 -9 -223 -300 -1013 -151 -1613 -378 219 -281 -423 -1075 -496
1737 -496 -581 451 -241 485 939 -252 174 447 202 -252 922 -334 -314 -381 26 353 -386 976 -243
1756 -243 505 1249 793 267 765 -73 -1 845 -782 520 -258 -1097 -302 -567 -93 742 427 -87 -55 -816
1776 -816 -609 -49 -955 754 432 -31 193 -114 384 -288 -622 -386 118 150 286 118 -730 -800 752 477
1796 477 -81 422 687 -474 -612 -40 -99 153 -496 -398 373 193 750 -13 -49 -309 -298 906 361 -67 -174
1817 -174 42 118 -294 56 435 -325 -539 -729 129 -200 -315 297 1201 -59 -429 -161 -1017 -724 -706 353
1837 353 -162 -199 -338 -151 -733 -932 -224 830 289 590 365 183 283 -171 637 480 125 -161 371 312
1857 312 -328 820 -65 -895 -265 -387 533 541 596 68 349 302 -293 138 -67 978 -1579 601 936 561
1877 561 -477 -932 -178 -209 -152 506 151 -1043 88 183 -1098 -540 -61 211 311 371 -64 392 165 165 -176
1898 -176 27 52 257 857 20 -73 -1196 688 317 -1010 -133 742 458 314 1543 110 1206 -441
1916 -441 51 153 536 372 639 684 -994 -411 237 -196 -773 145 165 280 -283 -133 488 -565 -86 166
1936 166 534 92 -440 225 613 -71 -208 -199 -111 -6 344 -738 -297 493 218 46 -451 221 896 313 169
1957 169 312 -424 895 -533 -234 -971 -1722 719 -201 -579 -308 -434 -136 -508 430 -1650 489 533 -225
1976 -225 442 -79 -587 -52 304 211 353 153 73 310 418 -232 335 227 -228 -685 29 251 641 -890
1996 -890 396 -644 323 1035 -835 -5 376 -51 -14 -710 -230 -230 -367 -466 265 -708 862 335 -318 41
2016 41 -147 -135 292 463 11 161 248 -294 -211 1722 470 -286 -123 425 1428 -179 -879 -100 588 -742
2036 -742 -1597 355 1132 -376 170 200 259 760 782 -317 -649 -903 -786 -601 -481 -310 991 895 -583 -479
2056 -479 -228 55 531 871 -192 -871 362 -231 -288 870 246 503 -388 -202 464 -594 -402 -343 1257
2075 1257 1203 -206 -755 253 899 -306 -384 310 187 -225 1357 604 -33 154 1055 -32 -827 725
2093 725 607 -503 -361 -193 233 131 926 -576 732 -480 -754 19 609 34 -725 -955 -319 725
2111 725 454 -678 -943 -203 -924 -303 409 509 134 -907 -395 -529 -492 -141 236 -707 152 -121 650 -62
2131 -62 -818 -341 -723 672 10 -41 334 552 657 -339 -57 -362 -498 200 -946 -4 764 -527 -329 -199
2151 -199 109 -103 185 -853 399 142 -714 -400 702 101 179 -155 -309 -779 -760 -408 1221 -835 -1842
2170 -1842 1 145 219 128 550 579 -351 -388 163 -466 -385 -697 339 143 -987 -97 529 289 -522 416
2190 416 -5 720 -60 227 -548 303 -578 867 1197 267 616 639 -428 -13 -86 -12 99 -42 20 -867 -910
2211 -910 -10 391 -328 -548 441 -161 642 -997 -375 221 -138 141 -72 -362 285 -945 43 -506 586
2230 586 434 -572 -830 348 666 -1084 500 -1032 -687 344 -1027 -903 394 903 200 71 -608
2247 -608 639 522 382 584 376 186 169 223 -338 -532 1037 656 561 166 -616 341 -435 -342 -279 -171 308
2268 308 7 970 355 476 769 287 766 -1 663 -312 518 196 -982 -876 308 150 -345 -862 -641
2287 -641 525 -357 -289 481 -517 -688 -529 711 -239 -140 -479 -281 -1626 -509 496 -895 634 -742
2305 -742 -134 -122 -637 -475 212 188 -593 -352 579 689 91 233 -777 -442 267 -568 865 131 466 705
2325 705 -71 37 727 214 600 -22 -76 -741 -633 -114 -368 -617 252 324 -319 -161 141 502 -602 -71
2345 -71 41 -138 -24 533 -182 -360 542 569 -120 -27 -872 -43 -375 -738 -776 -415 -449 1243 -493 -650 396
2366 396 -873 635 669 612 567 517 -500 587 6 -170 346 -411 -74 -204 -75 -1432 276 426 -301
2385 -301 -665 -443 -471 647 -678 -968 847 498 -65 38 173 125 3 -304 -163 263 64 1027 -192
2404 -192 -44 347 410 272 -413 1036 626 217 -289 309 75 562 -592 -276 1169 831 288 513 -425
2423 -425 209 -510 -41 -484 -818 903 -216 72 -55 -431 173 530 1 3 -412 -209 -6 486 466 -588
2443 -588 15 -509 -635 156 -389 880 -184 291 6 -778 -378 -90 339 -339 -777 -359 41 431 936
2462 936 -608 315 887 -328 -381 -359 7 405 -84 -64 332 102 -588 -299 842 -267 821 266 303 403
2482 403 -631 -39 -205 -574 995 -1093 622 -403 -930 -259 387 613 -626 434 -892 -688 250
2499 250 1098 -272 -399 -77 490 926 96 -895 420 367 -241 -411 -4 461 289 -112 -666 -8 -792 1251
2519 1251 387 148 548 504 -8 555 -168 301 -320 806 680 -52 127 -496 -117 -396 -533 280 395 -966
2539 -966 -40 926 693 -412 256 -764 438 -143 94 -40 778 -6 -1122 736 -943 -597 -576 64
2557 64 315 -544 -145 -230 454 -274 235 668 113 284 -302 -13 392 924 632 -718 -530 285 -130 247
2577 247 277 904 -3 241 -200 -304 1638 48 -322 793 -1452 83 381 -56 86 -345 -1192 -1273 -727
2596 -727 -219 648 500 148 184 -714 986 -66 -617 744 27 353 574 -693 -225 261 -637 379 1103
2615 1103 -238 -163 -250 404 -20 -684 -60 313 -1247 306 -304 235 -99 1024 -379 614 860 -710
2633 -710 -701 118 632 -880 1101 426 -761 101 -570 290 546 -88 -960 857 -954 864 818 -432 -214
2652 -214 -499 -215 -124 863 653 -1286 -618 -344 -171 668 -268 -245 95 -606 244 -369 356 -414 10 -422
2672 -422 -60 -720 -681 -653 -853 -569 160 -361 58 26 -192 182 -269 -895 -459 248 -991 -243 846 371
2692 371 -312 571 398 20 -158 970 -12 -185 -887 163 -116 287 -762 103 -795 913 689 603 513
2711 513 283 319 -729 -766 285 479 -126 572 -508 527 -108 -1304 -800 113 461 -784 -235 -206 398
2730 398 -323 50 -34 -310 198 -182 -288 -223 706 157 -69 1413 -756 291 184 -117 415 606 -439
2749 -439 -631 180 -306 -446 79 18 253 -799 -785 -698 20 -93 234 665 213 -189 871 -903 230 -24
2769 -24 -100 384 -612 406 -18 -30 238 282 62 207 34 201 -449 4 10 -516 -422 406 144 -158 391 -815
2791 -815 -872 140 372 -10 -576 -680 -1074 175 -557 357 1081 -376 -307 -44 116 -417 427 -94 31 -408
2811 -408 642 71 386 800 869 110 562 923 306 1185 -280 662 221 498 -692 40 198 -619 842
2830 842 -5 285 224 -388 -386 -11 -216 -847 516 -294 -172 819 201 -238 -1192 11 5 -388 546 514 -387
2851 -387 761 747 -155 -534 -241 696 403 -663 170 -278 -74 643 122 -677 -40 912 106 -691 888
2870 888 -594 -496 -402 -41 756 433 58 906 258 557 -174 -591 920 -958 -77 -539 38 -8 456 84
2890 84 -382 -637 33 -32 12 -515 1351 -642 406 143 162 -1061 393 1089 -203 -24 197 -196 -219 -143
2910 -143 595 324 -39 30 -250 618 -191 357 483 736 573 -423 -603 -208 525 -924 -136 74 -385 590
2930 590 -224 -178 429 -226 -718 29 527 -151 -698 479 -450 -919 456 -434 -159 156 -329 222 913 324
2950 324 -55 377 -153 283 29 163 894 -420 -436 399 -88 -499 -680 -131 -766 -59 1971 -748 745
2969 745 -512 335 -330 107 1601 -111 771 13 -226 75 450 -5 -464 317 205 -97 -1237 -386 169
2988 169 -304 611 -280 639 279 340 -62 -70 -359 -169 243 113 327 -172 1111 -308 828 919 984 1053 -276
3009 -276 273 549 -22 474 257 514 -446 621 -120 79 -632 -199 -348 -1351 -844 -446 324 335 -41 -586
3029 -586 -402 622 -1554 -69 121 -944 365 658 69 590 -323 -3 787 -1411 66 -1081 145
3046 145 305 -269 597 349 126 14 -458 491 -64 -185 -901 662 -1087 -547 -173 1251 907 -229 232
3065 232 -412 -113 454 -358 73 616 -407 -363 -579 -99 -78 -37 -31 743 -744 391 -213 207 -555 13 -108
3086 -108 -1702 -141 334 -87 33 -360 -632 -243 449 308 -193 -224 -471 -578 55 560 -54 146 716 547
3106 547 22 -425 -517 -794 -216 -1038 -58 527 163 284 -528 -111 -196 -76 -550 -163 -158 -29 -860 89 411
3127 411 -713 890 -231 -706 88 -476 -243 85 -723 430 617 -446 829 -584 402 -485 -593 363
3145 363 51 -309 494 -9 -405 106 -731 -492 36 268 4 -178 89 286 464 882 690 149 355 367
3165 367 90 -390 170 32 623 -195 -646 87 -143 810 -593 449 612 628 974 -108 228 811 -305
3184 -305 473 -422 -760 -33 -851 -206 -276 488 165 -1066 -49 65 -103 -387 531 485 622 -244 397 -58
3204 -58 -982 -375 102 -422 816 -103 -967 -954 -887 815 71 235 319 -438 507 -844 -791 -664 -163 -407 306
3225 306 144 -594 -591 158 -936 -90 328 -430 -294 -1035 -117 -267 -490 -1282 398 632 -110 -145 -769 134
3245 134 263 -206 198 426 -688 -488 237 768 -145 859 -674 248 579 402 142 -506 645 -407
3263 -407 251 124 128 -564 438 1087 -614 -64 -717 396 516 321 621 393 -606 -961 295 51 -369
3282 -369 -660 462 750 -693 -548 1126 553 -879 651 35 1178 -26 818 -867 201 -69 31
3299 31 790 253 -316 242 388 -611 319 399 264 -228 889 963 199 586 598 -281 -449 -437 164 -588 -87
3320 -87 -1321 -716 -399 -821 -211 -467 732 264 -285 -586 1104 -645 435 132 1016 -234 -9 -58 -756
3339 -756 396 -919 -628 137 -481 -116 -964 -907 -415 364 518 382 -531 -404 238 -339 76 74 -767 373
3359 373 -215 401 -213 170 583 317 741 144 -1028 172 -145 -705 55 67 -922 972 935 313 -99 724
3379 724 182 191 790 -513 206 71 522 378 -311 216 -203 -463 -383 412 -245 330 770 367 564 -377 39
3400 39 292 -125 -122 -77 -643 -40 400 -1082 608 620 -569 145 34 409 -531 2 109 691 242 538 335
3421 335 55 301 -396 -896 108 284 689 503 -993 -19 -81 149 250 763 -260 -528 -536 328 778 318
3441 318 -171 70 1367 1124 1528 -404 556 456 850 -417 414 -491 209 916 -383 82 778 -815
3459 -815 531 283 -12 -64 186 -10 -440 -764 -32 514 1016 -304 183 11 98 393 228 -1108 -558 -200
3479 -200 494 -216 -614 424 584 536 -277 -208 -834 493 -303 659 -254 84 311 583 -380 -992 -451 669
3499 669 239 -711 33 -770 178 -449 -771 840 -1141 -384 564 619 -299 -660 560 174 -884 884 605
3518 605 72 -281 94 -457 -171 -399 -320 -557 -847 -596 -213 -126 -152 -868 -481 -693 -655 375 -526 81 1024
3539 1024 -315 462 -259 245 626 455 -228 148 -279 499 106 -251 -871 -36 575 721 -760 -608 841
3558 841 -189 -790 -122 242 543 -633 -48 -483 210 -190 442 698 -964 735 24 340 385 407 136
3577 136 649 536 375 555 -309 -416 393 -686 129 -368 400 -294 -391 43 147 365 308 -916 -385 -62
3597 -62 69 346 785 181 -479 -409 -601 81 -2 -505 -113 -503 500 575 842 739 308 -322 -49 810 -220
3618 -220 -133 -67 -300 455 480 77 -957 386 250 495 487 -258 -426 -100 314 -180 237 995 -22 -6 302
3639 302 -106 416 154 -688 386 -430 796 367 876 -165 556 -351 -129 480 174 -546 1561 -698
3657 -698 -53 -414 980 565 190 781 -602 -155 -36 -2 205 226 -190 -225 -80 353 564 -216 358 -149
3677 -149 -297 -198 185 -568 -604 2 -221 -138 -389 -326 -563 50 129 -770 208 201 -248 -570 -715 1001 1117 1037
3699 1037 -395 948 -649 353 -357 -1005 -1115 69 -131 103 -549 -122 372 159 -531 402 293 -113
3717 -113 -450 -38 1456 286 637 855 -112 649 -221 -222 77 8 -459 647 -29 -20 155 392 300 456 89
3738 89 -160 -303 -161 -440 104 18 427 34 1373 510 -1373 197 709 -177 -717 -553 -1154 -557 1091
3757 1091 1322 -216 540 -193 472 80 -82 -736 41 -982 161 937 -223 -342 -428 389 412 504 -647
3776 -647 -615 87 -699 -355 -1393 -1368 117 279 744 -134 62 -1162 235 -532 -152 -964 -5 777 -407
3795 -407 518 -72 107 146 26 -275 243 805 -81 -208 -106 18 519 -1092 -263 -373 712 -1048 -844
3814 -844 379 -286 570 -174 125 118 -921 765 -212 -313 -47 60 307 -610 404 -95 521 -316 298
3833 298 484 442 324 -790 1171 333 -225 720 867 519 451 797 -220 129 161 -51 -395 678 -776
3852 -776 771 -502 -485 -23 456 417 -313 111 898 19 -256 -66 -191 -688 17 372 -145 -166 805 153
3872 153 -198 -186 -361 -517 276 -385 -1267 505 184 485 -389 574 -378 201 247 -538 -536 717 552 -189 -110
3893 -110 409 -105 -275 -409 275 -410 399 -78 437 807 407 485 541 -551 302 -90 844 561 315 738
3913 738 -535 418 -67 -138 164 -547 -210 112 -248 -1085 246 529 -190 517 -278 -726 -403 -142 413 535
3933 535 98 -112 -197 286 -454 -55 699 -405 -690 -249 258 461 588 -173 212 889 104 417 -125 336
3953 336 605 -97 -328 -102 -570 -38 -794 -1270 -926 -639 1186 737 262 -246 1228 -571 421 699 -410
3972 -410 1009 209 -368 -170 94 -600 324 131 3 -561 -296 468 79 -626 73 1276 -567 -256 -1827
3991 -1827 1005 737 -961 554 -978 188 -112 -1246 -653 -139 1092 -551 140 721 144 -127 287
4008 287 -147 896 542 89 -333 -252 499 -623 468 468 -872 303 -64 1039 -49 -26 898 -990 -255
4027 -255 1243 -330 -194 -22 1404 -324 82 -434 94 -33 -826 968 -164 382 -218 547 237 -360
4045 -360 649 1075 278 -80 -535 -504 -313 800 -324 109 138 541 143 -414 136 -177 -710 -177 -107 -49
4065 -49 283 378 200 23 553 21 465 1115 -501 -243 -638 539 -496 567 328 256 188 -885 -310 -404
4085 -404 397 234 368 -1004 230 200 -269 439 -274 -648 -764 1047 441 35 -718 353 292 146 440
4104 440 -464 1488 778 -795 7 -390 674 -112 -365 -134 1475 -362 -429 95 -459 240 -723 -351 365
4123 365 -566 506 223 1325 31 -35 272 -665 -108 -377 -1021 -151 255 -484 -30 4 -963 482 -155
4142 -155 -346 1120 -251 -853 -211 -86 203 -984 -376 434 -303 832 239 18 530 -241 113 -373 107
4161 107 -21 -969 -308 147 -39 657 874 200 97 227 472 601 35 -32 -887 263 -605 561 173 -53
4181 -53 -138 560 764 -1031 604 -113 453 -624 -98 720 -569 -115 -222 919 512 -40 -167 -505 -812
4200 -812 -456 -1097 -345 288 -927 -128 11 397 -770 -427 518 -20 508 -64 -646 368 684 23 71
4219 71 -630 944 579 -169 -198 -128 155 56 -761 342 1506 161 -314 -765 293 -85 -230 -792 670
4238 670 255 -16 206 -522 -207 79 -278 42 -903 -62 181 163 -90 444 183 -933 750 -346 531
4257 531 433 -653 -932 -130 -249 -781 455 242 689 -281 95 -154 723 274 608 593 -187 -857 1098 134
4277 134 -48 613 -139 403 -119 18 32 442 683 283 -1354 449 -836 26 650 337 -356 1159 234
4296 234 84 294 -74 422 642 433 1328 1340 -212 1090 -568 55 259 416 -7 824 12 -241 1232
4315 1232 -879 -1 398 -709 -724 -221 -803 -487 342 -462 144 -559 760 1140 -78 -228 -475 -497 429
4334 429 -544 755 -218 -699 -283 280 11 -930 -79 -5 -207 320 177 -462 -432 610 222 -292 429 -1042
4354 -1042 182 -389 86 -97 14 384 972 495 165 -552 674 216 324 -480 -363 -77 509 436 -576
4373 -576 1023 -1 -1183 -391 162 25 354 614 1125 -215 350 202 -203 -648 325 -878 -263 -547
4391 -547 201 597 -469 103 -766 -227 4 -362 650 -666 911 -1113 457 -334 -228 198 383 444
4409 444 -925 159 553 -215 -598 306 -821 389 1040 346 -871 -124 -267 498 0 -511 388 142
4427 142 862 184 197 -849 742 -11 517 -464 200 165 -444 -167 21 -612 62 -331 -38 254 497 822
4447 822 171 -192 562 -205 -568 655 -52 -30 -278 -788 1184 218 -771 -759 -369 1247 -46 -62 607 -39
4467 -39 246 -352 -155 -70 285 -41 -584 127 274 779 -118 149 -444 -130 156 547 -519 584 859 -1234
4487 -1234 414 -77 346 263 -657 -1198 -178 203 -203 186 275 -79 -922 -605 1222 -204 254 6 -260
4506 -260 -55 -470 222 234 274 700 -633 196 32 -96 -27 41 9 -307 1234 -156 -487 74 320 619 -1174
4527 -1174 -312 97 277 66 -432 -328 -288 -166 350 -174 46 -1360 498 91 -246 105 -29 489 125
4546 125 -401 325 708 -278 10 148 414 375 134 638 -721 -1026 255 583 702 597 -127 68 -562 101
4566 101 955 885 143 1046 759 -276 -26 510 706 -377 807 382 132 -346 -690 231 24 -375 -1617
4585 -1617 -353 242 1338 -94 -1222 -128 -498 289 1123 150 -895 -422 -432 79 416 349 512 186
4603 186 -515 -1117 806 116 -292 -377 37 -17 -486 -232 749 180 10 385 -574 -175 561 -438 7 -65 -42
4624 -42 -98 -67 -303 300 -415 80 -244 -393 200 466 1063 -290 435 -376 488 -903 -396 -316 414 7 384
4645 384 -445 -521 1110 -450 84 418 256 -755 -293 -125 -704 148 -112 527 417 593 -391 -1428 -460
4664 -460 -159 243 720 -139 245 317 184 -166 -217 596 -171 26 827 676 -274 -545 -307 190 254 -227 54
4685 54 428 17 797 -204 682 -491 532 53 -38 -444 -238 218 398 -231 -437 342 -315 -394 1126 -482
4705 -482 336 657 -537 1127 -853 311 -379 434 243 570 -242 860 1192 -459 135 -40 19 -393
4723 -393 -134 -432 155 511 376 109 108 -755 -476 257 33 -439 -314 323 529 -409 -970 -331 121 531 649
4744 649 -669 216 -634 -621 214 459 547 -415 -681 -734 -510 -42 1062 148 41 422 -572 -18 194 -107
4764 -107 300 -28 -326 802 800 539 212 396 266 129 -309 -270 -255 362 -559 -295 -995 994 591 -618
4784 -618 270 441 716 540 33 -166 -233 -1265 252 861 11 -692 -135 -56 744 -563 -456 -219 -552 -1015
4804 -1015 -1032 379 882 518 -36 -360 28 -269 1045 314 -808 -1043 -89 384 143 269 -311 527 27
4823 27 371 -692 -184 -1067 -960 -1285 293 765 784 -71 -60 22 70 160 703 -400 314 398 24 698 351
4844 351 510 -761 -140 249 251 233 651 -613 -103 805 227 191 -628 -204 -727 -408 -799 -240 -538 525
4864 525 -352 -806 -315 -547 -2 476 655 -462 -465 -448 -705 -217 35 533 -57 -871 333 -486 100 -73
4884 -73 100 1210 651 266 -585 -401 -329 -134 292 39 309 -883 -349 -286 -155 460 -236 363 -352 857
4904 857 -1235 -712 93 831 -241 -343 397 245 -203 499 -61 554 227 629 -782 -617 292 -754 -214
4923 -214 -793 916 156 798 193 -402 19 74 694 281 181 -60 -75 -113 215 -283 -581 205 -183 -24 -311
4944 -311 -487 -381 -911 -850 256 326 -23 670 164 -374 -433 1149 -247 -886 747 264 79 604 290 49
4964 49 41 91 -313 -316 634 -543 -344 7 -251 592 408 -223 605 31 -765 1743 693 -917 0 804 644
4985 644 -279 427 234 439 906 1059 -602 -292 35 623 -797 718 900 679 305 926 161 680 -436
5004 -436 136 70 129 163 223 -684 -410 -464 421 788 128 779 550 -108 217 -91 16 -605 233 505 655 -673
5026 -673 -701 -215 -70 432 -413 -688 515 -404 -524 856 -167 1059 1096 -187 -463 438 -878 -217 -393
5045 -393 -44 -693 -244 -59 -1555 -713 105 407 686 -1035 595 209 269 -180 -1130 822 385 -453 -802
5064 -802 -159 -464 -600 -898 -647 -241 -254 237 178 -705 1 513 5 -88 811 52 585 202 325 -261 422
5085 422 169 188 -135 316 246 158 -98 -165 897 1400 -681 -957 -1001 -815 40 26 34 -661 33 -365 -602 231
5107 231 -158 -506 94 -76 1095 131 -424 27 252 -81 300 454 925 583 -219 -819 221 1071 774
5126 774 33 211 -799 -387 48 643 448 222 12 544 -249 964 -775 -677 605 -7 593 -1483 873
5145 873 -1 935 74 81 -114 -334 -905 -76 -456 -325 -146 -327 -315 375 204 632 -37 761 302 -1472 -160
5166 -160 167 425 -340 651 -724 1462 46 -159 364 52 274 -213 -19 144 -271 -430 -933 492 -669
5185 -669 -18 547 -501 464 -315 -533 -371 -745 -845 -328 49 -708 -125 605 444 292 314 -114 -312 -5
5205 -5 372 858 -869 15 576 -50 315 -285 389 -109 342 170 -896 692 678 346 -871 27 -79 -474
5225 -474 716 297 99 29 219 -539 -20 551 810 326 812 206 -488 -534 66 119 -314 -491 -927 184
5245 184 507 -497 -79 436 67 -227 -264 365 609 -738 145 -482 178 298 510 623 -981 -312 120
5264 120 1597 246 -180 485 -99 -715 298 -306 819 -730 -151 -1136 262 -1214 -8 1294 332
5281 332 1040 -396 429 275 -696 -542 162 334 521 43 194 37 449 74 -93 600 711 -309 431
5300 431 257 733 207 88 -608 -3 -587 519 230 242 24 415 1021 -157 -1 -387 992 275 -25
5319 -25 -1255 -163 -195 343 270 -494 236 310 23 1179 -626 -440 194 -39 74 409 -619 199 219 -977
5339 -977 943 202 -84 833 -74 942 490 705 210 -266 184 -736 -1315 156 -397 90 610 30 -866
5358 -866 -714 -286 915 -104 702 -657 111 333 -437 -695 191 214 -701 481 1053 -100 -783 -112 666
5377 666 358 732 -253 -112 -111 -411 -814 160 -221 9 -1098 -455 60 81 583 195 -208 -119 590 162 531
5398 531 -414 -782 261 789 -204 1337 -641 -924 -469 -572 -699 423 -288 -212 -704 335 731 675 80
5417 80 -53 -356 462 401 317 11 1097 -82 -138 -120 -1313 65 -407 -145 703 2 300 396 -356 68 448
5438 448 595 63 192 1112 388 598 93 -803 -307 300 -363 -66 -329 245 508 -632 859 615 87
5457 87 45 -343 -40 -644 -309 168 14 -569 485 12 -456 655 -518 456 174 -942 19 18 -1411 1275
5477 1275 163 -296 -855 373 227 614 -756 1336 -465 -102 70 667 -1586 -522 46 -807 62
5494 62 -85 1017 -316 -272 -52 311 457 528 -533 518 44 813 -429 -560 611 -389 -133 -504 -184
5513 -184 -183 -355 12 498 -418 -549 -301 -1213 -401 513 -197 454 -331 -428 158 443 267 431 -1094 58
5533 58 368 -601 -336 -106 939 -996 1434 475 535 -392 661 137 307 -676 -380 -909 728 6 -1196
5552 -1196 -46 277 -745 -497 165 -715 -605 -327 -69 -627 -201 -264 637 66 347 130 -211 -558 -589 -1379
5572 -1379 -541 601 258 277 -1217 -11 877 -384 232 119 -312 -438 -42 -794 -831 -385 -361 284 -104
5591 -104 -210 712 1257 -519 417 -329 -919 -769 -951 -205 715 593 -337 -837 -396 -409 -746 442 -72 -367
5611 -367 766 -74 803 483 346 179 -363 321 69 98 700 -1794 -341 426 -180 -1001 685 13 64
5630 64 89 552 146 -303 929 413 312 194 122 458 -668 -39 -358 -422 668 -298 -839 629 -473 -269
5650 -269 -1201 -631 -92 757 1207 909 359 0 521 -879 -1005 -160 -1679 924 385 -501 -281 -111 -642
5669 -642 277 664 -489 661 -542 1251 622 -905 -22 -87 -577 412 1041 -373 -400 -279 -209 836 -355
5688 -355 1461 495 -460 386 -68 1622 -68 303 -711 286 199 -308 286 256 -1334 -94 130 517 368
5707 368 -607 731 205 60 26 110 877 455 -480 -525 45 -142 1082 -745 936 -157 -44 -655 -348
5726 -348 -353 431 558 943 759 314 -499 848 183 199 -73 -48 -20 -78 -540 -496 1194 627 -544 684 153
5747 153 -808 -421 -163 -693 -460 -640 -572 322 531 425 634 -540 -108 411 339 1033 -878 -257 489 -24
5767 -24 856 957 639 -77 1075 -113 -366 -11 234 10 310 84 -118 102 -1191 107 468 296 739
5786 739 -391 349 703 -655 -548 381 377 -326 -117 -745 663 973 218 325 71 257 386 561 -274 -573
5806 -573 -251 34 -614 -57 -7 549 526 472 605 -238 88 188 443 399 273 423 70 1079 114 925 436
5827 436 167 -645 170 -600 421 560 10 -399 403 511 332 -147 -421 92 314 -584 -110 121 -750 747
5847 747 -543 738 -13 -492 -276 -579 430 245 106 -106 112 -621 -532 7 -633 266 -140 -344 -154
5866 -154 68 177 -411 783 741 747 670 395 -212 -703 -568 -218 -539 460 -139 -71 -72 -1363 -220 -413 729
5887 729 -518 50 -978 -1100 -321 52 213 -14 521 252 458 1092 -1116 374 121 649 133 -445 419
5906 419 340 1031 819 71 939 -212 -1183 -76 -163 347 -691 -706 -164 -595 775 207 959 -677 1050
5925 1050 328 -215 -64 -27 228 -614 -219 762 -683 -21 491 -361 -831 -220 295 -317 -59 -1213 112
5944 112 153 604 -960 594 -527 -183 225 14 -624 1016 367 744 -704 -400 124 -635 -52 40 -194
5963 -194 -639 -170 331 699 -456 11 253 150 75 -186 -442 -798 -315 -455 31 575 323 402 1256 866
5983 866 140 835 21 813 371 -964 -64 289 827 -467 228 623 347 314 -169 -470 -659 -35 301 -157
6003 -157 867 55 -53 46 -627 -165 -38 16 -384 -642 -272 -463 -649 109 -669 157 -544 623 124 667
6023 667 292 -168 413 -734 -520 -474 -888 -519 -180 347 71 -546 273 34 -669 300 408 -107 447 163
6043 163 1084 265 -494 161 84 -600 -273 872 1595 622 -432 -199 394 -458 419 425 600 426 324 16
6063 16 199 -1518 481 745 -1680 -423 111 439 547 -142 -249 388 -726 1141 325 -775 564 -473
6081 -473 -24 1172 -365 -35 211 -1191 671 -120 -6 621 -722 -378 250 -884 845 -485 1350
6098 1350 335 -163 630 34 -542 963 742 753 298 565 -127 133 119 -194 -175 525 -930 961 47
6117 47 953 203 -222 560 154 221 450 442 980 -594 -98 -552 -738 24 -1098 -174 -942 -721 701 955
6137 955 -449 689 -94 -698 64 -420 785 609 722 -776 350 -1728 154 257 -210 -243 -75 -716
6155 -716 -488 493 -57 957 239 -131 -353 -599 -535 954 -730 -22 22 116 778 240 259 901 -213 -771
6175 -771 -102 -547 -51 870 125 134 85 358 -249 1222 303 730 -77 -328 -168 -182 123 -55 -220 610 233
6196 233 -1177 -438 -438 773 -10 79 192 372 -1227 -507 34 -1635 -384 652 609 -35 -103 -597 -187 272
6216 272 245 764 -872 871 -761 301 -313 606 15 -297 -983 675 26 438 -87 -640 285 335 -131
6235 -131 -864 798 -884 66 -231 364 1173 316 -466 -195 -694 800 -353 -62 255 -748 112 -494
6253 -494 -466 195 -27 956 517 202 -747 1253 1108 1353 315 -170 476 86 125 146 -12 363 -340 231
6273 231 1439 304 819 42 -477 -416 28 -267 -600 -388 22 -43 165 -442 -718 522 -481 662 520
6292 520 -200 35 682 463 -854 -402 -88 821 -147 284 621 663 -421 840 -701 -349 -25 -762 691
6311 691 13 -834 1050 496 -109 -679 -432 234 -100 -119 1 -43 715 -220 -168 -1229 294 309 -361 -763
6331 -763 238 -49 -470 -484 -359 488 -67 367 172 38 841 -664 -471 -263 45 348 -898 -887 432
6350 432 -318 -567 225 -41 587 -491 754 377 755 829 747 214 163 -801 39 283 -311 -197 -428 61
6370 61 -518 35 239 165 1349 -409 385 -1018 -530 -202 186 602 -716 -32 -125 -595 -1083 -803 1387
6389 1387 -248 178 -225 -469 283 167 -811 721 255 59 137 441 275 -614 569 1099 623 208 599
6408 599 -546 -176 -733 -321 144 -293 -65 -503 725 500 25 -76 -320 648 904 532 429 292 -159
6427 -159 -385 807 -317 199 -236 55 -213 -180 207 -174 758 -356 209 -874 -556 -324 -200 168 148
6446 148 -1210 37 373 268 797 -241 -662 -234 556 520 -491 491 -327 -84 515 -110 847 254 -1229
6465 -1229 -253 216 520 -52 712 -467 681 -963 235 -654 772 251 656 825 -499 -97 -378 93
6483 93 -844 -1780 -986 -24 305 281 -1273 84 -1666 647 -957 774 388 -471 -666 -846 693 633 -595
6502 -595 -592 351 -104 452 515 235 -101 -216 195 432 806 -612 65 -131 -404 622 -1305 198 -477 111
6522 111 136 1176 -124 -187 -13 -1044 148 -435 204 273 502 79 46 -217 -739 99 761 599 -735 -206
6542 -206 363 143 751 -840 -743 39 -387 -94 -549 -836 -254 -210 -842 525 783 76 -197 -435 -1019 -308
6562 -308 267 -177 -846 -551 -147 440 256 -487 -938 -1671 893 -901 886 614 141 -263 739 -105 103
6581 103 225 -587 801 -295 103 -90 580 -513 857 88 582 -1486 204 -33 335 471 -286 -159
6599 -159 -141 -689 129 388 -50 64 -355 426 -112 -305 -83 -355 538 454 -110 1215 524 -833 691 -130
6619 -130 -248 -66 149 -77 -72 491 -204 -274 823 67 229 -503 -4 679 -412 -885 190 -97 -647 -454
6639 -454 117 91 -510 -545 -416 413 -311 -228 133 -383 -80 -221 -152 -145 309 -722 340 706 -209 270 -1074
6660 -1074 -834 -1078 -209 -496 -185 461 494 -242 287 181 -314 -370 -872 -175 47 170 -1223 -21 -398 680
6680 680 284 -98 -98 415 379 -544 -544 287 -681 -568 707 247 581 -253 199 -1395 -591 59 528 -212 555
6701 555 -393 -326 -985 787 -24 45 378 104 -52 -93 -171 -180 -985 938 -50 785 -357 15 -218 -823 210
6722 210 -636 -801 254 467 75 200 1079 326 549 149 371 681 -81 810 -801 -17 381 406 247 726
6742 726 -544 141 -294 -826 48 -973 744 561 -113 135 -1036 -332 -799 -571 773 155 99 125 300
6761 300 -71 -320 -346 502 -20 -1486 560 -39 -522 964 883 264 -93 -345 171 350 -490 794 304
6780 304 929 529 -667 -476 -446 262 680 106 -467 174 -239 -427 -284 -218 -360 244 656 -757 -158 -716
6800 -716 397 -447 -731 -302 970 -344 951 216 404 186 -950 -526 -354 -1066 265 -94 100 64
6818 64 -24 -344 -136 -548 -959 -302 78 848 -726 280 451 -224 -762 627 -259 -106 621 -52 16 294
6838 294 -600 42 -44 -853 -599 -633 376 -478 114 -660 -5 -430 -408 698 557 -1052 638 -188 -181 456
6858 456 -379 582 680 708 457 52 241 -437 194 1587 -306 252 -555 384 -278 315 348 -180 226 -237
6878 -237 149 -454 -113 -85 351 19 118 -615 304 -244 368 -297 600 -425 510 440 7 526 -202 -155 -188
6899 -188 -342 1402 -344 -741 -682 112 -325 -294 -707 -567 -120 61 747 -65 1085 196 -62 177 596 392
6919 392 115 400 -330 66 -59 575 -114 528 -234 -1193 -424 289 816 78 1220 44 -347 769 139
6938 139 -653 -1 162 -713 298 79 -831 879 -489 333 -187 -992 989 122 480 211 393 -329 641
6957 641 -76 401 34 287 399 -680 165 358 -803 299 546 58 -811 -227 -133 -164 -424 308 949 86
6977 86 -225 -341 -484 422 292 -340 536 -347 1104 -599 -327 1050 -215 -29 239 301 -571 -10 235
6996 235 254 -260 570 288 -65 -705 -1139 -50 636 -559 128 -333 -812 31 -110 502 584 218 -229 148
7016 148 385 207 86 -596 403 106 504 315 63 628 -305 485 1487 -183 -569 89 -74 494 707
7035 707 398 -281 -795 521 -32 -235 -757 -137 421 798 -788 -1593 -76 681 -568 -623 499 38 -987
7054 -987 -18 1169 505 176 927 99 -280 74 609 -119 198 -557 -982 -1022 -664 250 361 131 -744 137
7074 137 353 -907 -1519 -259 -359 149 -362 132 -82 -521 -742 244 -327 107 -26 392 1414 3 39
7093 39 360 -547 378 -128 204 -261 1138 89 -605 7 -1 -568 -199 -1170 739 665 -615 -487 -767 -350
7113 -350 -218 670 -46 -478 70 -163 179 194 954 623 -393 -1064 -314 457 134 -298 -182 520 945 124
7133 124 -67 395 -24 139 690 385 -354 -1219 322 275 1485 -13 138 694 -284 -195 -43 -367 42 478
7153 478 -55 181 -401 -409 81 -293 738 -276 -26 374 1115 -322 -129 235 199 -126 124 148 -379 -752
7173 -752 -921 130 -455 168 529 342 322 5 -462 516 -28 -113 -669 236 -209 -277 -56 -527 -286 348 -689
7194 -689 -399 43 -734 -157 -264 -722 269 -453 -131 -430 -206 -1022 1058 291 -918 -306 -165 -390 -403 -581
7214 -581 306 -670 -883 533 -50 30 607 840 259 -506 94 40 462 -224 237 -1088 304 1602 -116
7233 -116 685 -223 208 -366 -894 1378 -944 -160 402 -78 -6 872 -347 268 -727 -586 -934 703 -811
7252 -811 -596 -559 -346 489 974 -610 -502 -164 -224 -187 -191 -850 -1295 -977 884 -787 -638 739 472 763
7272 763 901 -861 -105 -232 -5 508 699 470 884 79 68 736 -919 -796 -250 120 402 -219 559 -60
7292 -60 -384 959 -354 823 18 -842 243 115 656 -677 -237 12 108 -271 571 383 402 -258 -274 723
7312 723 -172 -287 729 1325 906 726 -865 310 237 809 200 -102 -196 -494 94 -575 1366 -386 374
7331 374 648 320 171 79 -393 -99 -263 818 87 477 -16 120 397 174 -450 331 643 952 91 -46
7351 -46 215 -4 246 -272 -276 316 -690 64 523 -171 -650 -39 312 -835 -522 44 391 21 251 575
7371 575 -300 174 446 -418 182 -54 147 -557 939 -415 -158 135 -174 -358 114 966 -52 -88 494
7390 494 -262 404 22 1324 -607 759 120 -415 398 528 1110 115 -1063 471 497 -726 709 -320
7408 -320 -680 -583 602 -35 -447 706 -77 -647 334 -49 -284 -363 173 160 140 765 -671 -665 -411 451 -651
7429 -651 -1279 518 -60 -49 668 474 567 56 -544 -369 -661 -459 568 -421 -65 -1441 -589 541 144
7448 144 119 -852 -871 412 875 1120 -277 -50 -353 410 732 -429 -341 -553 158 48 -541 292 639 479
7468 479 1075 514 328 3 41 317 -998 -526 191 154 -541 -1035 383 -1031 -478 -585 680 918 -341
7487 -341 121 -343 78 283 -550 -262 -288 106 378 374 167 -455 65 596 -226 -389 262 -197 -541 278 275 -759
7509 -759 -323 1377 606 -88 -131 586 -326 53 367 -290 231 15 746 -694 537 -723 206 623 822
7528 822 165 18 79 -1135 -598 -371 -304 -959 -169 -246 -718 16 536 628 123 124 -288 538 -901 -86 903
7549 903 612 -718 -282 -376 -650 322 2 504 -263 382 336 -280 118 497 1056 1406 622 533 729 -87 -477
7570 -477 -89 -175 657 -58 859 -783 160 -84 -1313 -395 923 388 -789 466 -274 584 -91 -270 -745
7589 -745 -568 -664 -425 -734 -398 -65 -252 -27 786 -543 52 56 -397 143 517 397 -747 -101 -34 -254 -182
7610 -182 114 868 -432 -44 269 -941 -1254 577 631 374 -428 -142 -682 320 380 -220 503 513 451 1308
7630 1308 542 -66 223 -737 -1214 145 -48 191 338 -1006 -374 -1247 -409 310 -422 87 -145 252 -671
7649 -671 51 53 243 480 737 615 -448 -930 521 -123 590 -376 640 310 -203 276 -619 -713 535 -479
7669 -479 -823 124 45 212 164 -358 498 -818 -149 25 -673 177 1192 710 -565 -60 -852 628 46
7688 46 509 205 534 -492 -823 95 88 64 -171 55 -149 830 397 117 -154 781 871 528 -61 844 -285
7709 -285 -87 -439 -806 -447 863 -18 -556 437 -711 345 570 -57 417 562 -444 22 162 -769 -52
7728 -52 255 -1438 105 -111 889 376 79 351 -123 1069 655 -98 -7 -387 -1711 -314 -283 677 36
7747 36 85 -171 -702 -132 986 -696 103 -158 -153 -734 727 -160 -512 -549 -658 -166 623 329 176 243 -39
7768 -39 -213 -1242 -762 263 -52 -143 289 -455 -365 714 238 -783 469 -697 193 443 -315 132 249
7787 249 -621 -260 727 -710 30 -171 -200 866 535 -719 1242 -128 713 113 304 156 83 -121 -564
7806 -564 1089 480 -9 272 -433 201 284 -940 299 147 -313 265 1566 645 -1048 -219 -467 395 490
7825 490 475 -34 102 -430 -502 -541 470 776 -868 358 -458 -154 183 -177 -674 -684 261 332 566 739 -672
7846 -672 476 747 652 270 489 600 -648 124 -500 -256 -232 806 885 68 132 -173 -437 -504 494 332 904
7867 904 -472 630 48 718 1298 -609 293 590 -1121 -629 171 438 -296 -68 -15 -496 -187 665 520
7886 520 447 57 -234 -934 -529 -64 -170 247 516 517 231 602 -353 474 239 720 457 84 -294 -459 1439
7907 1439 621 680 272 -260 813 902 359 -76 123 80 12 -148 -198 716 -1295 411 193 88 24 -19 327
7928 327 -476 -167 620 -275 -454 -268 247 234 1102 -148 -1012 -632 538 41 -91 986 -242 -557 948
7947 948 181 -375 -248 -805 -680 397 -1183 232 173 -730 995 -723 649 -360 657 -224 34 -674
7965 -674 -74 -447 383 -320 540 -574 286 403 122 334 -232 -625 228 -319 672 862 437 270 -606 503
7985 503 696 -360 -316 80 -250 -2 819 -308 -471 -289 5 -233 65 1300 116 751 -245 175 -335
8004 -335 187 -184 -651 -769 -29 -360 613 664 -466 286 174 240 105 -93 -1110 -1018 -143 -224 -276 -717 216
8025 216 -741 322 592 -463 844 -559 358 103 451 -21 -867 -165 -871 -7 -305 -567 249 357 -186
8044 -186 286 -29 575 639 -680 -127 438 839 528 342 357 639 466 -359 -721 918 632 -794 -189 -595
8064 -595 -12 572 208 -86 185 -8 44 -16 256 1169 -503 -728 451 -66 603 -615 -52 -194 279 55
8084 55 -395 396 -273 381 -1466 -17 -490 951 -85 326 849 -419 284 -744 -13 -150 440 -922
8102 -922 -10 -521 306 168 920 626 -1005 -131 304 -471 517 141 -716 242 -173 111 623 -251 733 127
8122 127 782 813 -650 -325 156 -509 265 -404 465 -21 485 246 1025 689 -1125 679 -223 -835 871
8141 871 -145 372 780 -171 446 -620 -225 -399 581 257 -237 -1278 -55 -1087 -371 -579 -881 -543
8159 -543 804 225 48 -549 -120 185 -1240 -118 572 -17 564 -530 110 -511 247 8 149 -245 792
8178 792 -523 -248 -868 -98 456 -360 -125 127 -454 745 -4 -200 333
8191C33
##END NTUPLES=NMR FID
##END=
