##TITLE=1H_KYU-20'+DMSO 2d
 CDCl3, 100 sc, 
 15.3.2019
##JCAMPDX= 6.0         $$ Bruker NMR JCAMP-DX V2.0
##DATA TYPE= NMR FID
##DATA CLASS= NTUPLES
##ORIGIN= UXNMR, Bruker Analytische Messtechnik GmbH
##OWNER= root
$$ XWIN-NMR		Version 3.5
$$ Fri Mar 15 17:06:16 2019 Russian Standard Time (UT+4h)  she@DPX200
##.OBSERVE FREQUENCY= 200.1316
##.OBSERVE NUCLEUS= ^1H
##.DELAY= (6, 6)
##.ACQUISITION MODE= SIMULTANEOUS
##.ACQUISITION SCHEME= undefined
##.AVERAGES= 100
##.DIGITISER RES= 16
##SPECTROMETER/DATA SYSTEM= spect
##.PULSE SEQUENCE= zg30
##.SOLVENT NAME= CDCl3
##.SHIFT REFERENCE= (INTERNAL, CDCl3, 0, 15.7039)
##AUDIT TRAIL= $$ (NUMBER, WHEN, WHO, WHERE, WHAT)
$$ ##TITLE= Audit trail, XWIN-NMR		Version 3.5
$$ ##JCAMPDX= 5.01
$$ ##ORIGIN= Bruker BioSpin GmbH
$$ ##OWNER= she
$$ F:/spectra/data/she/nmr/H-F/1/audita.txt
$$ ##AUDIT TRAIL=  $$ (NUMBER, WHEN, WHO, WHERE, WHAT)
(   1,<2019-03-15 17:04:00.62 +0400>,<she>,<DPX200>,
      <created by zg, POWCHK disabled, PULCHK disabled
       configuration hash MD5:
       00 E9 B6 7A A2 85 ED C7 34 08 36 98 17 FE 4E 26
       data hash MD5: 16K
       2F 31 40 D4 74 33 6A 40 9F A3 F4 4A AC E6 DA 18>)
$$ ##END=
$$ 
$$ hash MD5
$$ 43 69 2C 89 E1 44 8D 3D 85 17 00 4F A8 9A 1C 0B
##$RELAX= 
##$RELAX= 
##$RELAX= 
##$RELAX= 
##$RELAX= 
##$RELAX= 
$$ Bruker specific parameters
$$ --------------------------
##$DU= <F:/spectra>
##$EXPNO= 1
##$NAME= <H-F>
##$PROCNO= 1
##$TYPE= <nmr>
##$USER= <she>
##$AMP= (0..31)
100 100 100 100 100 100 100 100 100 100 100 100 100 100 100 100 100 100 
100 100 100 100 100 100 100 100 100 100 100 100 100 100 
##$AQSEQ= 0
##$AQ_mod= 1
##$AUNM= <au_zg>
##$AUTOPOS= <>
##$BF1= 200.13
##$BF2= 200.13
##$BF3= 200.13
##$BF4= 200.13
##$BF5= 200.13
##$BF6= 200.13
##$BF7= 200.13
##$BF8= 200.13
##$BYTORDA= 1
##$CFDGTYP= 0
##$CFRGTYP= 5
##$CHEMSTR= <none>
##$CNST= (0..31)
1 1 145 1 1 1 1 1 1 1 1 1 1 1 1 1 1 1 1 1 1 1 1 1 1 1 1 1 1 1 1 1 
##$CPDPRG= <>
##$CPDPRG1= <>
##$CPDPRG2= <>
##$CPDPRG3= <>
##$CPDPRG4= <mlev>
##$CPDPRG5= <mlev>
##$CPDPRG6= <mlev>
##$CPDPRG7= <mlev>
##$CPDPRG8= <mlev>
##$CPDPRGB= <>
##$CPDPRGT= <>
##$D= (0..31)
0 1.2 0 0 0 0 0 0 0 0 0 0.03 0 0 0 0 0 0 0 0 0 0 0 0 0 0 0 0 0 0 0 0 
##$DATE= 1552654948
##$DBL= (0..7)
120 120 120 120 120 120 120 120 
##$DBP= (0..7)
150 150 150 150 150 150 150 150 
##$DBP07= 0
##$DBPNAM0= <>
##$DBPNAM1= <>
##$DBPNAM2= <>
##$DBPNAM3= <>
##$DBPNAM4= <>
##$DBPNAM5= <>
##$DBPNAM6= <>
##$DBPNAM7= <>
##$DBPOAL= (0..7)
0.5 0.5 0.5 0.5 0.5 0.5 0.5 0.5 
##$DBPOFFS= (0..7)
0 0 0 0 0 0 0 0 
##$DE= 6
##$DECBNUC= <off>
##$DECIM= 2
##$DECNUC= <off>
##$DECSTAT= 4
##$DIGMOD= 1
##$DIGTYP= 9
##$DL= (0..7)
0 120 120 120 120 120 120 120 
##$DP= (0..7)
150 150 150 150 150 150 150 150 
##$DP07= 0
##$DPNAME0= <>
##$DPNAME1= <>
##$DPNAME2= <>
##$DPNAME3= <>
##$DPNAME4= <>
##$DPNAME5= <>
##$DPNAME6= <>
##$DPNAME7= <>
##$DPOAL= (0..7)
0.5 0.5 0.5 0.5 0.5 0.5 0.5 0.5 
##$DPOFFS= (0..7)
0 0 0 0 0 0 0 0 
##$DQDMODE= 0
##$DR= 16
##$DS= 0
##$DSLIST= <SSSSSSSSSSSSSSS>
$$ [...]
##$SUBNAM2= <"">
##$SUBNAM3= <"">
##$SUBNAM4= <"">
##$SUBNAM5= <"">
##$SUBNAM6= <"">
##$SUBNAM7= <"">
##$SUBNAM8= <"">
##$SUBNAM9= <"">
##$SW= 359.47569520838
##$SWIBOX= (0..15)
0 0 2 0 0 0 0 0 0 0 0 0 0 0 0 0 
##$SW_h= 71942.4460431655
##$TD= 16384
##$TD0= 1
##$TE= 0
##$TE2= 300
##$TE3= 300
##$TEG= 300
##$TL= (0..7)
0 120 120 120 120 120 120 120 
##$TP= (0..7)
150 150 150 150 150 150 150 150 
##$TP07= 0
##$TPNAME0= <>
##$TPNAME1= <>
##$TPNAME2= <>
##$TPNAME3= <>
##$TPNAME4= <>
##$TPNAME5= <>
##$TPNAME6= <>
##$TPNAME7= <>
##$TPOAL= (0..7)
0.5 0.5 0.5 0.5 0.5 0.5 0.5 0.5 
##$TPOFFS= (0..7)
0 0 0 0 0 0 0 0 
##$TUNHIN= 0
##$TUNHOUT= 0
##$TUNXOUT= 0
##$USERA1= <user>
##$USERA2= <user>
##$USERA3= <user>
##$USERA4= <user>
##$USERA5= <user>
##$V9= 5
##$VALIST= <valist>
##$VCLIST= <CCCCCCCCCCCCCCC>
##$VD= 0
##$VDLIST= <DDDDDDDDDDDDDDD>
##$VPLIST= <PPPPPPPPPPPPPPP>
##$VTLIST= <TTTTTTTTTTTTTTT>
##$WBST= 1024
##$WBSW= 4
##$XGAIN= (0..3)
0 0 0 0 
##$XL= 0
##$YL= 0
##$YMAX_a= 506785
##$YMIN_a= -316403
##$ZGOPTNS= <>
##$ZL1= 120
##$ZL2= 120
##$ZL3= 120
##$ZL4= 120
##$ABSF1= 10
##$ABSF2= 0
##$ABSG= 5
##$ABSL= 3
##$ALPHA= 0
##$AQORDER= 0
##$ASSFAC= 0
##$ASSFACI= 0
##$ASSFACX= 0
##$ASSWID= 0
##$AUNMP= <proc_1d>
##$AZFE= 0.1
##$AZFW= 0.1
##$BCFW= 1
##$BC_mod= 2
##$BYTORDP= 1
##$COROFFS= 0
##$CY= 11.3945322036743
##$DATMOD= 1
##$DC= 2
##$DFILT= <>
##$DTYPP= 0
##$F1P= 18.9103706918063
##$F2P= -1.10871071338519
##$FCOR= 0.5
##$FTSIZE= 0
##$FT_mod= 4
##$GAMMA= 1
##$GB= 0.15
##$INTBC= 1
##$INTSCL= 1
##$ISEN= 128
##$LB= 0.24
##$LEV0= 0
##$LPBIN= 0
##$MAXI= 10000
##$MC2= 0
##$MEAN= 0
##$ME_mod= 0
##$MI= 1.114404
##$NCOEF= 0
##$NC_proc= 0
##$NLEV= 6
##$NOISF1= 3.799351
##$NOISF2= 2.8
##$NSP= 1
##$NTH_PI= 0
##$NZP= 0
##$OFFSET= 15.70392
##$PC= 1
##$PHC0= -9167.362
##$PHC1= 15.20026
##$PH_mod= 1
##$PKNL= yes
##$PPARMOD= 0
##$PSCAL= 0
##$PSIGN= 0
##$REVERSE= no
##$SF= 200.130013532006
##$SI= 16384
##$SIGF1= 3
##$SIGF2= 2
##$SINO= 400
##$SIOLD= 16384
##$SREGLST= <1H.CDCl3>
##$SSB= 0
##$STSI= 0
##$STSR= 0
##$SW_p= 3612.71676300578
##$SYMM= 0
##$S_DEV= 0
##$TDeff= 0
##$TDoff= 0
##$TI= <>
##$TILT= no
##$TM1= 0
##$TM2= 0
##$TOPLEV= 0
##$USERP1= <user>
##$USERP2= <user>
##$USERP3= <user>
##$USERP4= <user>
##$USERP5= <user>
##$WDW= 1
##$XDIM= 8192
##$YMAX_p= 0
##$YMIN_p= 0
$$ End of Bruker specific parameters
$$ ---------------------------------
##NTUPLES= NMR FID
##VAR_NAME=  TIME,          FID/REAL,        FID/IMAG
##SYMBOL=    X,             R,               I
##VAR_TYPE=  INDEPENDENT,   DEPENDENT,       DEPENDENT
##VAR_FORM=  AFFN,          ASDF,            ASDF
##VAR_DIM=   8192,          8192,            8192
##UNITS=     SECONDS,       ARBITRARY UNITS, ARBITRARY UNITS
##FACTOR=    1.39e-05,      1,               1
##FIRST=     0,             0,               0
##LAST=      0.1138549,     0,               0
##MIN=       0,             -316403,         0
##MAX=       0.1138549,     506785,          0
$$ Real data points
##PAGE= N=1
##DATA TABLE= (X++(R..R)), XYDATA
$$ [...]
2865b487j06j54j41n1L78k95p49K41J564m60L18J2K88O50K68Q52j27L0J140k8
$$ -2487 -2593 -2747 -2888 -2939 -2561 -2856 -3605 -3364 -1800 -2260 -1942 -1930 -1642 -992 -724 128 1 31 1171 1143
2885A143M64O1K98n0n08M09L88o04P26J274n49p84j30n15N63n83L80l46o0j068
$$ 1143 1607 1668 1966 1916 1408 1817 2205 1601 2327 3601 3052 2268 2138 1623 2186 1603 1983 1637 1577 509
2905E09q33O62Q7n31j204l34L1K86J92m9j119k68j27m00L06N15k18N23K26M18
$$ 509 -324 338 425 -106 -1310 -1644 -1613 -1327 -1135 -1184 -2303 -2571 -2698 -3098 -2792 -2277 -2495 -1972 -1746 -1328
2925a328K56Q7PO25k65k46R75l04K27O78j08P1ro08Q73K032n11n99Q18j280N54
$$ -1328 -1072 -985 -978 -353 -618 -864 111 -193 34 712 604 675 666 58 931 2963 2452 1853 2671 1391 1945
2946A945m4O84n16P51m56J256k202J94r08L20j49L79p29r4r03j31n34K92J8j067
$$ 1945 1901 2585 2069 2820 2364 3620 1418 1612 704 1024 875 1254 525 431 -472 -603 -1137 -845 -827 -1894
2966a894l43P00n99J32L96q34J456o77n43pJ300j299j76J416P6J31O84p1r14R95
$$ -1894 -2237 -1537 -2136 -2004 -1608 -2442 -986 -1663 -2206 -2213 -913 -2212 -2388 -972 -896 -765 -81 -152 -1066 -71
2986g1R97K52j36k80O09K26L63o6P44r02N44j10J38J116j081L83k207J505o42
$$ -71 926 1178 1042 762 1371 1597 1960 1894 2638 1736 2280 2170 2308 3424 2343 2726 519 2024 1382
3005A382j8l7O37j825M35J26p48l46n08O60j276j72k3L06Q66N97j505r91P03N98
$$ 1382 1364 1327 1964 139 574 700 -48 -394 -902 -242 -1518 -1690 -1713 -1407 -541 56 -1449 -2440 -1737 -1139
3025a139m48m43L09j96J790j433K79R35r42R54J4K04Q36o25O65j32m92R06Q06
$$ -1139 -1587 -2030 -1721 -1917 -127 -1560 -1281 -346 -1288 -334 -320 -116 720 95 760 628 136 1042 1848
3044A848L81j91j336J403n01Q83j86j03j87qO96q59K37q31m63K84q42R86j270
$$ 1848 2229 2038 702 2105 1604 2487 2301 2198 2011 2003 2699 1840 2077 1246 783 1067 225 1211 -59
3063e9J44N36n23j305J424k00q61k68k49l67l7m37J295l76O4P44n52L83n49N24
$$ -59 85 621 98 -1207 217 17 -844 -1112 -1361 -1728 -1765 -2202 -907 -1283 -1219 -475 -1027 -644 -1193 -669
3083f69j800J708n38J388N7l3K73J96p09R10N6l38J286k86Q74n48j01Q92j829
$$ -669 -2469 -761 -1299 89 146 113 386 582 -127 783 839 501 1787 1501 2375 1827 1726 2618 789
3102G89J633J17p57O91j208K45J99L18p20p64j42n67J246j874N98M62q76k27k90
$$ 789 2422 2539 1782 2473 1265 1510 1709 2027 1307 543 401 -166 1080 -794 -196 266 -610 -837 -1127
3121a127p55J166O1p60o7j04O05n69n04M67k63k88J158n29Q43o18K59R28kR43
$$ -1127 -1882 -716 -655 -1415 -1482 -1586 -981 -1550 -2054 -1587 -1850 -2138 -980 -1509 -666 -1284 -1025 -97 -99 844
3141H44j624J964j331M59M17o09N98L14P69j044P36k14R08m05M24L8q97O30m61
$$ 844 -780 1184 -147 312 729 120 718 1032 1801 757 1493 1279 2187 1782 2206 2244 1347 1977 1516
3160A516k4J30r58o16J204p04o16m3j69O71j55l46j044qJ6k97k65r27J994m41
$$ 1516 1492 1622 664 48 1252 548 -68 -111 -280 391 236 -110 -1154 -1162 -1146 -1443 -1708 -2635 -641 -1082
3180a082p6r32N33n27L76P49m53L47N86j009R81L81j96R9j63J326q22P10n81Q06
$$ -1082 -1158 -2090 -1557 -2084 -1708 -959 -1412 -1065 -479 -1488 -507 -126 -322 -223 -386 940 118 828 247 1053
3200A053k34K55L62NR6j862J525k06J464j850J511j48j565J501p77l20j37L03
$$ 1053 819 1074 1436 1441 1537 -325 1200 994 2458 608 2119 1971 406 1907 1130 810 673 976
3218I76o34m58o01J23O15J32j161N91q64p33N26j72P29n5j07J2q74j45N97L62
$$ 976 342 -116 -717 -594 21 153 -1008 -417 -1281 -2014 -1488 -1660 -931 -986 -1093 -1081 -1955 -2100 -1503 -1141
3238a141j5j091M84o59J843J56K0j79J323J49j040R13q26K32R95N45M74m45m98
$$ -1141 -1156 -2247 -1763 -2422 -579 -423 -403 -582 741 890 -150 763 -63 169 1164 1709 2183 1738 1240
3257A240l80K1N74l03J114j557J061J04J86j577M97k89l89J98N1o5o46n02P52
$$ 1240 860 881 1455 1152 2266 709 1770 1874 2060 483 980 691 302 500 551 486 -160 -662 90
3276I0j9o61J2K22o42k7p03M88n43R5O53K53j209J096o58N6n4P44k32M35M43J6
$$ 90 71 -590 -578 -356 -998 -1025 -1728 -1240 -1783 -1688 -1035 -782 -1991 -895 -1553 -1497 -1551 -807 -1039 -604 -161 -145
3298a45l41K45L2N69O56l46N56m71R59k35j074J489k29p74J031q60M45r9o21R9
$$ -145 -486 -241 -209 360 1016 670 1226 755 1714 1479 405 1894 1665 891 1922 1062 1507 1408 787 886
3318H86O80q28J016l33j94j62r92m01J44M08j463J658k74m64k75m42n45r2P30
$$ 886 1566 738 1754 1421 1227 1065 73 -328 -184 224 -1239 419 145 -319 -594 -1036 -1581 -1673 -943
3337i43l6J86j070N52j98K98j33o7L44j77n9J518j401P31K97j026J569k73O22
$$ -943 -979 -793 -1863 -1311 -1509 -1211 -1344 -1411 -1067 -1244 -1303 215 -1186 -455 -158 -1184 385 112 734
3356G34Lq79l11J484q55J246j689M58N51J073j639J646k69q08M5k16P33K16j025
$$ 734 737 -142 -453 1031 176 1422 -267 191 742 1815 176 1822 1553 745 790 574 1307 1523 498
3375D98J52k52Q10k219J846l26j198n33O93n08Q8P55q73p87J310o3o19O6L0N17
$$ 498 650 398 1208 -1011 835 509 -689 -1222 -529 -1037 -949 -194 -1067 -1854 -544 -607 -1226 -1160 -1130 -613
3395f13p09L66O4Q67l07o42j2J400p60k77J489N9j000J118L85j194Q82M09p78
$$ -613 -1322 -956 -892 -25 -332 -974 -986 414 -346 -623 866 925 -75 1043 1428 234 1116 1525 747
3414G47R48M10j282L72r00O42K87J29m21J47J257p38l58r11m93J007j182P87M00
$$ 747 1695 2105 823 1195 295 937 1224 1353 932 1079 2336 1598 1240 329 -164 843 -339 448 848
3433H48p76j373J02R24j393M57Q23j54l02O24n57r02K76J321J96p19o6m57O37
$$ 848 72 -1301 -1199 -275 -1668 -1211 -388 -542 -844 -220 -777 -1679 -1403 -82 114 -605 -671 -1128 -491
3452d91r28J472O1j812K690j738J463q60J721o16n33L20O76L96j943J071O04N7
$$ -491 -1419 53 114 -1698 992 -746 717 -143 1578 962 429 749 1425 1821 -122 949 1553 1610
3470A610j180J644j311Q5k21J126j598K29k97Q86j037k93P99P54j309q46N9Q5
$$ 1610 430 2074 763 848 627 1753 155 384 87 973 -64 -357 442 1196 -113 -959 -900 -815
3488h15K13k19o7l05L30p9j50N15L68p61m33j61R53l50J90P7k56O55J8qL76J37
$$ -815 -602 -821 -888 -1193 -863 -942 -1092 -577 -209 -970 -1403 -1564 -611 -961 -771 -694 -950 -295 -277 -285 91 228
3510B28n7n47lM58N77q1K02m38N72O34n41j69J47M39j264N79k7l50j6k96P70j176
$$ 228 171 -376 -379 79 656 575 777 339 911 1545 1004 835 982 1421 157 736 709 359 343 47 817 -359
3532c59N37K6Q42q62K3j207J515j87m54N32j417M12N43m51n02J124j168l6L06
$$ -359 178 204 1046 184 207 -1000 515 328 -126 406 -1011 -599 -56 -507 -1009 115 -1053 -1089 -783
3551g83L27p71M81l91Q61m26J66K10J187l32l64R62j171J95M84q5n95R92j27J13
$$ -783 -456 -1227 -746 -1137 -276 -702 -536 -326 861 529 165 1127 -44 151 635 550 -45 947 820 933
3571I33l31k76P53J79l28r43J003l35M79j026K21n83J029r44o86N31O45m91p38
$$ 933 602 326 1079 1258 930 -13 990 655 1134 108 329 -254 775 -169 -855 -324 321 -170 -908
3590i08J84N51N77q48l04o8l73Q74j159P01j46J6J44j38O97q78M80p68O48L04
$$ -908 -724 -173 404 -444 -748 -816 -1189 -315 -1474 -773 -919 -903 -759 -897 -200 -1078 -598 -1366 -718 -414
3610d14R63o49K61j315J239O51l33l85O23m80k69J639j475J104p93J159n34R86
$$ -414 549 -100 161 -1154 85 736 403 18 641 161 -108 1531 56 1160 367 1526 992 1978
3628A978j865L8J66p66P58o37N25k2J36n64M58n90j54n54J17k24O19j89j059K532
$$ 1978 113 151 317 -449 309 -328 197 175 311 -253 205 -385 -539 -1093 -976 -1200 -581 -770 -1829 703
3648G03m63j578J017j217L37J05P0J21p41K09J018R7J56m30J82J92L76o26O29
$$ 703 240 -1338 -321 -1538 -1201 -1096 -1026 -905 -1646 -1437 -419 -322 -166 -596 -414 -222 154 -472 157
3667A57n82%P68J024j371J000J260j802k28N5P1n15L29L63j00p10P04L09j199
$$ 157 -425 -425 343 1367 -4 996 2256 454 226 281 352 -163 166 529 429 -281 423 732 -467
3686d67J122j135R16m67O73m57j640J449M87j222N55j353P60m23K64k58O71k23
$$ -467 655 -480 436 -31 642 185 -1455 -6 481 -741 -186 -1539 -779 -1202 -938 -1196 -525 -748
3704g48o85N74M56n23P50M4n76J45n18K89J36N82O7j33N56r35M75L23N33k55L38
$$ -748 -1433 -859 -403 -926 -176 -132 -708 -563 -1081 -792 -656 -74 -7 -140 416 -519 -44 279 812 557 895
3725H95q57l67L23j14J219j100O20j034N46o75J024k12L66q25L70O66o90q34N42
$$ 895 38 -329 -6 -120 1099 -1 619 -415 131 -544 480 268 634 -191 179 845 155 -679 -137
3744a37N75j053L98r37P81m8j3j5L36q52L98o44L87M3n87N52k88M44J600q60k60
$$ -137 438 -615 -217 -1154 -373 -421 -434 -449 -113 -965 -567 -1211 -824 -781 -1368 -816 -1104 -660 940 80 -180
3765a80n55R80j262N81N08o36J489o53l06N2Q47j310P99L14r66j27Q12m70M80
$$ -180 -735 245 -1017 -436 72 -564 925 272 -34 18 865 -445 354 668 -298 -425 387 -83 397
3784C97N58q01k75J01n8J232q26N92j498Q6n91J519o08j134L7R99L17p65N92m14
$$ 397 955 154 -121 -20 -78 1154 328 920 -578 -492 -1083 436 -172 -1306 -1269 -270 47 -718 -126 -540
3804e40K51o6K93j495K062n89K22m31m37j93L44m94J252q17K99q83J000j29j58
$$ -540 -289 -355 -62 -1557 505 -84 138 -293 -730 -923 -579 -1073 179 -638 -339 -1222 -222 -351 -509
3823e09L81N78K67p68J038j408L79O08N43j111Q32J8p26N99n10L54l10o30L70
$$ -509 -128 450 717 -51 987 -421 -42 566 1109 -2 830 848 122 721 211 565 255 -375 -5
3842el09Q65l36m05P03j061L53J11r7m74M63J007n17r32m48K7J247l60K61J54
$$ -5 -314 551 215 -190 513 -548 -195 -84 -181 -655 -192 815 298 -634 -1082 -1055 192 -168 93 247
3862B47o77m6o44J87R14J00l97J267p97j90l77Q19o87K74J59l1K58O21n32N03
$$ 247 -430 -476 -1120 -933 -19 81 -316 951 154 -36 -413 406 -281 -7 152 121 379 1000 468 971
3882I71r86J391r11O04j734J166n9n62Q87j316M67J338n99m40L41m46LK25j204
$$ 971 -15 1376 465 1069 -665 501 442 -120 767 -549 -82 1256 657 217 558 112 115 340 -864
3901h64P51O72J014k307M91m66Q61n83N44l20m60P84j581J572l82p76O22Q42p05
$$ -864 -113 559 1573 -734 -243 -709 152 -431 113 -207 -667 117 -1464 108 -274 -1050 -428 414 -291
3920b91n2pJ75M63q8M7K28j475J296j10O02r73l9k82P91J31m94J56L91n00J00
$$ -291 -343 -350 -175 288 200 247 475 -1000 296 186 788 -185 -224 -506 285 416 -78 78 469 -31 69
3941F9M41K6p89L36K08K03m81J59K09j452M13P46n0n36P04q05l4N55M48l33M7
$$ 69 510 536 -253 83 291 494 13 172 381 -1071 -658 88 38 -498 206 -599 -633 -78 370 37 84
3962H4l82N76n19J7Q92j503J605j578J018j64N6j10J93o9L08Q78j629J101P6j243
$$ 84 -298 278 -241 -224 668 -835 770 -808 210 46 102 -8 185 116 424 1302 -327 774 850 -393
3982c93M18k82O43l0Q8M5N72q52K51j259J041J95j266N22k72Q72q26Q63j65n77
$$ -393 25 -257 386 356 444 489 1061 209 460 -799 242 437 -829 -307 -579 293 -533 330 165 -412
4002d12J71m59J082k93m80N65k99j07j508J868k10j60j1j3J498j668k13L82o82
$$ -412 -241 -700 382 89 -391 174 -125 -232 -1740 128 -82 -242 -253 -266 1232 -436 -649 -267 -949
4021i49N97K31q0P48q12J34R72j086O46K12j05K32j045P53j99Q61p26o94K68O64
$$ -949 -352 -121 -201 547 -265 -131 841 -245 401 613 508 740 -305 448 249 1110 384 -310 -42 622
4041F22r86P3R77l87p9J55k06Q15j62j737J252k03j593N11P09N74j388M98J233
$$ 622 -364 -291 686 299 220 375 169 984 822 -915 337 134 -1459 -948 -239 335 -1053 -555 678
4060F78j481J196j031P08J84j057oP16O46n77J38l29m59j5J643j075L2j68K71
$$ 678 -803 393 -638 70 254 -803 -809 -93 553 -24 114 -215 -674 -689 954 -121 -89 -257 14
4079A4J001j36r91OJ8j74R36Q38m19j069o5L90m5j05j17p8J26o99j37R59J40l02
$$ 14 1015 879 -112 -106 -88 -262 674 1512 1093 24 -41 349 304 199 82 4 130 -569 -706 253 393 91
4101I1m19K56q9J128j608L37p55J330o71O88o33J366j142l09R00m79J13L33l68
$$ 91 -328 -72 -161 967 -641 -304 -1059 271 -400 288 -345 1021 -121 -430 470 -9 104 437 69
4120F9O87j94K67j885J044o62j86J490l74o94N41k00R2P77k11J181j422p3M88
$$ 69 756 562 829 -1056 -12 -674 -860 630 256 -438 103 -97 -5 772 561 1742 320 247 735
4139G35m26R1k40P18o85lj7k84J39k35K67o33P98m33p07O72R0j40J221j324M16
$$ 735 309 400 160 878 193 190 173 -111 28 -207 60 -573 225 -208 -915 -243 -153 -293 928 -396 20
4160B0q2p11J396m4l18j255K76M86m5L60q23Q67O72n34L07n16j17j30O49M16p58
$$ 20 -62 -773 623 579 261 -994 -718 -232 -277 83 -740 127 799 265 572 56 -61 -191 458 874 116
4181A16R52p96n34O02K59m8p07O70o1M92r57N40J12n87q69L85L70P18q64M78N03
$$ 116 1068 272 -262 340 599 551 -156 514 453 945 -12 528 640 53 -816 -431 -61 657 -207 271 774
4202G74q47k6o00N54j47J50r18J167J34J81n10r3L50J26L9l5K11k35J80J99j67
$$ 774 -73 -99 -699 -145 -292 -142 -1060 107 241 422 -88 -181 169 295 334 299 510 275 455 654 487
4223D87r16j17m36J356j110O69L25q50M64J057j56j77K9p04J525q59n89M68j117
$$ 487 -429 -546 -982 374 -736 -67 258 -592 -128 929 773 596 625 -79 1446 587 -2 466 -651
4242f51R66j74k41P74K88k47p05q1n30j99J218o98n96P67j9k2M11J39p47m26M19
$$ -651 315 141 -100 674 962 715 10 -71 -601 -800 418 -280 -876 -109 -128 -150 261 400 -347 -773 -354
4263c54j88R16k00J77m12LP54n68j55K46M74j214J256m80o33N57m8P82j473n2
$$ -354 -542 374 174 351 -61 -58 696 128 -27 219 693 -521 735 255 -378 179 131 913 -560 -612
4283f12J293o18N40n34j00Q72M11o31n24M65r51Q4k59J597j482J201j412Q61r55
$$ -612 681 63 603 69 -31 841 1252 621 97 562 -389 -305 -564 1033 -449 752 -660 201 -754
4302g54K73Q04r17J98J90j285N30K131o18o51K34l10k64k55M86k34J36L97R5q21
$$ -754 -481 323 -594 -396 -206 -1491 -961 1170 552 -99 135 -175 -439 -694 -208 -442 -306 91 186 -635
4322f35j15Q74J85k91M88N81q25j371O89o29J674nk35L77r29K16k04K59l6J11
$$ -635 -750 124 309 18 506 1087 262 -1109 -420 -1049 625 620 385 762 -167 49 -155 104 68 179
4342A79L49o53K15P66p41O24j248O90l62P68j093N13k65O75p36J06j34K00M19
$$ 179 528 -125 90 856 115 739 -509 181 -181 587 -506 7 -258 417 -319 -213 -347 -147 272
4361B72l56P1q6j19J191j391K07o85K74M09r84N95M48K33p20L66o77O26K04K73
$$ 272 -84 -13 -99 -218 973 -418 -211 -896 -622 -213 -1197 -602 -154 79 -641 -275 -952 -326 -122 151
4381A51k51j87J221j387J150n11p8O35j27o30N99nl20N22p69M66J10o32L02j346
$$ 151 -100 -287 934 -453 697 186 108 743 616 -14 585 580 260 782 13 479 589 -43 259 -1087
4401a087P37O93l1P29j080L35o35j72J195j217l68M49P13j392M16K61Q99o75k87
$$ -1087 -350 343 312 1041 -39 296 -339 -511 684 -533 -901 -452 261 -1131 -715 -454 445 -230 -517
4420e17J35o39J155J94N0j58l55K80n58J87p74R83N43O4j085J270r26r6L60j71
$$ -517 -382 -1021 134 328 378 220 -135 145 -413 -226 -1000 -17 526 590 -495 775 -151 -247 113 -58
4440e8P76n6r63J10J077r86J6q7K84P57M13r61M10p04k93P6j78J17l59M54j93
$$ -58 718 662 -301 -191 886 -100 -84 -171 113 870 1283 322 732 28 -265 -189 -367 -250 -609 -155 -348
4461c48J14J65J04L57k64l51P09l58q08m62J211j099J796l21j59j194N87o80J351
$$ -348 -234 -69 35 392 128 -223 486 128 -680 -1142 69 -1030 766 445 286 -908 -321 -1001 350
4480C50m05O04o81j6K76j86j14J47l39J222n72O78l36J86o83P91r60q8j59J580
$$ 350 -55 549 -132 -148 128 -58 -172 -25 -364 858 286 964 628 814 131 922 -38 -126 -285 1295
4500A295p43N79K40j984J884k056J090n43j0J96k60K49q51N27J89M5r93J700r55
$$ 1295 552 1131 1371 -613 1271 -785 305 -238 -248 -52 -312 -63 -914 -387 -198 -153 -1146 554 -401
4519d01l58o16Q16q48N60O24K36l07L20K42j033L02J19k69L31Q84q19L13O57J11
$$ -401 -759 -1375 -559 -1407 -847 -223 13 -294 26 268 -765 -463 -344 -613 -282 602 -217 96 753 864
4539H64n74J61n64Q99r65R91p72P3L94J86k65J01k29J082j768M66K73n76L68L00
$$ 864 290 451 -113 786 -179 812 40 113 507 693 428 529 300 1382 -386 80 353 -223 145 445
4559D45m11qn4P16n63n31n01N89N51r89L22k21K0L67L6oo6K67j356J29K112j80
$$ 445 34 26 -28 688 125 -406 -907 -318 233 -756 -434 -655 -635 -268 -232 -238 -304 -37 -1393 -1264 848 668
4581F68j073J273j07j311N97J93Q2r95J692q27qr7k82P89K35N69o73o68Q22L51
$$ 668 -405 868 761 -550 47 240 322 -673 1019 192 184 87 -195 594 829 1398 725 57 879 1230
4601A230n78m94n00M93N21n36Oq95N39K22q12P45p2j173J059O31p04J47r02Q49
$$ 1230 652 158 -342 151 672 136 142 -753 -214 8 -804 -59 -131 -1304 -245 386 -318 -171 -1073 -224
4621b24M8l00j84O98j79o41J17O3K14n18O23o0o07N26l74M00J229j94o65l9Q89
$$ -224 -176 -476 -660 38 -141 -782 -665 -602 -388 -906 -283 -343 -950 -424 -798 -398 831 637 -28 -67 822
4642H22j297P42n2k6N02k7n19J39J15Q10o61k84l09J320j533m52J723j597O71
$$ 822 -475 267 215 189 691 664 145 284 399 1209 548 264 -45 1275 -258 -710 1013 -584 87
4661H7m72N73j61p6r43L52Q36j61j95j80L64n42K37k64l93p65N84Q05p11J189
$$ 87 -385 188 27 -49 -992 -640 196 35 -160 -340 24 -518 -281 -545 -938 -1703 -1119 -314 -1025 164
4681A64k73L0J42j37J67p42J53J258j036N83j09k78O51o32N41p75Q26n19J60K92
$$ 164 -109 -79 63 -74 93 -649 -496 762 -274 309 200 -78 573 -59 482 -293 533 14 174 466
4701D66J73k00J05k22L10l02K09m62J242q43j172J338K66l24L35q28l08M78j175
$$ 466 639 439 544 322 632 330 539 77 1319 476 -696 642 908 584 919 91 -217 261 -914
4720i14J430o92L12j187J359j83l48J7l32O7l8m89P18m36L83l88J052m47M58k50
$$ -914 516 -176 136 -1051 308 125 -223 -206 -538 -471 -509 -998 -280 -716 -333 -721 331 -116 342 92
4740I2n74O59j444J938j33j53p91J208L00j124r3M68N67n18j5J55p94K71P23m96
$$ 92 -482 177 -1267 671 538 385 -406 802 1102 -22 -115 353 920 402 387 542 -252 19 742 246
4760B46M13k54p61J339j371M85M70j185JK69R33j348O43n60P13j197N71N86m36
$$ 246 659 405 -356 983 -388 97 567 -618 -617 -348 585 -763 -120 -680 33 -1164 -593 -7 -443
4779d43K43P99j184m15O05j99K34N78m16j15J30l89M10M9J74J06K91J41o13J248
$$ -443 -200 599 -585 -1000 -395 -594 -360 218 -198 -313 -183 -572 -162 -113 61 167 458 599 -14 1234
4799A234r39K01k95n2Q73q2o62J9J25j6L02n7O5k41r75R26j52m7l17N39nq90j65
$$ 1234 295 496 201 149 1022 940 278 297 422 406 708 651 716 475 -500 426 274 227 -90 449 444 -446 -611
4822f11M00N83o69j44M36l72p63k16O69L25R1p61l28J309j014P4Q98L97M75P8
$$ -611 -211 372 -297 -441 -5 -377 -1140 -1356 -687 -362 -271 -1032 -1360 -51 -1065 -991 -93 304 779 857
4842H57j206K82k18P49n50L98M47n62J16K25j28Q67p3k34q99K17J191l22p13m78
$$ 857 -349 -67 -285 464 -86 312 759 197 313 538 410 1277 1204 970 71 288 1479 1157 444 -34
4862c4N2P19o08O94J200k089j110J578j74Q80j635k21J0N29M52p90m1O3RO00M3
$$ -34 18 737 129 823 2023 -66 -1176 402 228 1108 -527 -748 -738 -209 243 -547 -588 -525 -516 84 127
4883A27n26P8j80p04J836l78m1l83k51j147R48O89k46J26p64J189K56m71n30K17
$$ 127 -399 -321 -501 -1205 631 253 212 -171 -422 -1569 -621 68 -178 -52 -816 373 629 158 -372 -155
4903a55L12K06MK89M96j517J062O60K5l34m07j107M47M93r50J418j99m22n39N28
$$ -155 157 363 367 656 1152 -365 697 1357 1382 1048 641 -466 -19 474 -476 942 743 321 -218 310
4923C10q03R3J08l86R41k30j72m0L49j87n28L71j444P96l26K1L05k07N66R7j13
$$ 310 -493 -400 -292 -678 263 33 -139 -179 170 -17 -545 -174 -1618 -822 -1148 -1127 -822 -1029 -463 -366 -479
4944d79O07J84j043R49n05K80j14L03K44K80M39n55o58m12P82k78J211r90l97
$$ -479 128 312 -731 218 -287 -7 -121 182 426 706 1145 590 -68 -480 302 24 1235 245 -152
4963a52J291n35j26M06N1J7j651J460p61l98J374j232L97m70N40l00p75O07Q0
$$ -152 1139 604 478 884 935 952 -699 761 0 -398 976 -256 141 -329 211 -89 -864 -257 -177
4982a77M60j089K07K56j49l41k24J723r33m82M72n79J108r79J439k072R54j07
$$ -177 283 -806 -599 -343 -492 -833 -1057 666 -267 -749 -277 -856 252 -727 712 -1360 -406 -513
5000e13N35J53j2j6O98n62r8N45k09j28K98K00j085J064N40j154J02N02k90K57
$$ -513 22 175 163 147 845 283 185 730 521 393 691 891 -194 870 1410 256 358 860 570 827
5020H27K91n52r4q3j06J90j40N54o93K47m04M78q19j25p95J307O8j339M33L00
$$ 827 1118 566 472 389 283 473 333 887 194 441 37 515 -304 -429 -1224 83 151 -1188 -755 -455
5040d55R8k09Q1K96j159m94Q00j71L23R64p90N67l7n8j27M06L37K2O83J06K46
$$ -455 -357 -566 -485 -189 -1348 -1842 -1042 -1213 -890 74 -716 -149 -186 -244 -371 35 372 394 1077 1183 1429
5061A429m78r34J53J71P08j051L48J196n90K84j133R91j49j85n78K59L43k33o38
$$ 1429 951 17 170 341 1049 -2 346 1542 952 1236 103 1094 945 760 182 441 784 551 -87
5080h7J84l09Q24q10n37J512j126p9j69m41K60J72j14r2M62r98P7Q20j100J537
$$ -87 97 -212 612 -198 -735 777 -349 -428 -597 -1038 -778 -606 -720 -812 -350 -1348 -1271 -451 -1551 -14
5100a4o23L65p62L81R43QJ96p61m49R36P74j419L95R55K65n49L25k31o4J90P57
$$ -14 -637 -272 -1034 -653 290 298 494 -267 -716 220 994 -425 -30 925 1190 641 966 735 671 861 1618
5121A618p26p51J771j539j18j54M92p5p74P03M62o92l9k61m3o60J57l83M8N59
$$ 1618 892 141 1912 373 255 101 593 518 -256 447 909 217 178 -83 -126 -786 -629 -1012 -964 -405
5141d05j93j164K520r28r10N54J51l75J3J03L11J42o25k10l67J759l96r8J44L87
$$ -405 -598 -1762 758 -170 -1080 -526 -375 -750 -737 -634 -323 -181 -806 -1016 -1383 376 -20 -118 26 413
5161D13p7k4M89n26R95q48K09j111O76n22R65q01P02k47n74K36K14R79r77k62
$$ 413 336 312 801 275 1270 422 631 -480 196 -326 639 -162 540 293 -281 -45 169 1148 171 -91
5181i1P86n42o88J179j105P95m06p35k64L37J25N83l25L44j07j363R61k51J47
$$ -91 695 153 -535 644 -461 334 -72 -807 -1071 -734 -609 -26 -351 -7 -114 -1477 -516 -767 -620
5200f20J52j42m22R88j304Q29K00j97M47r8Q14p70J008q39J55J23k20J237k368
$$ -620 -468 -610 -1032 -44 -1348 -519 -319 -516 -69 -167 647 -123 885 46 201 324 104 1341 -1027
5219a027J316J089p29q7r37J295o03M03l87l85L84M1j63m32N73q72J055ML18j321
$$ -1027 289 1378 649 562 -375 920 317 720 333 -52 332 373 210 -222 351 -521 534 538 856 -465
5239d65n3K08j85m68P54K30L32j603O92J84L65q72P53q53L8R14j994J371n89p8
$$ -465 -518 -310 -495 -963 -209 21 353 -1250 -558 -374 -9 -881 -128 -981 -943 -29 -2023 -652 -1241 -1319
5259a319J691p31k55QN9M75o88K076j287o82O0J520n70m30J59L19j07M59k35O20
$$ -1319 372 -359 -614 -606 -547 -72 -760 1316 29 -653 -593 927 357 -73 86 405 298 757 522 1142
5279A142n03rk18L70j316J095L21n31j53L48J9O4m77j30l81j58K96q17J198m78
$$ 1142 639 630 412 782 -534 561 882 351 198 546 565 629 152 22 -359 -517 -221 -1038 160 -318
5299c18r13P50L06j512J208R83j859N42l59M02J37J325n33j24k01j08P2l66n8
$$ -318 -1231 -481 -175 -1687 -479 504 -1355 -813 -1172 -770 -633 692 159 35 -166 -274 -202 -568 -626
5318f26O50M7o35O37J154l41j319Q87J44L36k31j95O93j48n79j34n49R61M07o79
$$ -626 24 71 -564 73 1227 886 -433 454 598 934 703 508 1201 1053 474 340 -209 752 1159 480
5338D80m19J054m96j062O98j019O94M74l04p83P62o11Q65q92l99J179k46p3r41
$$ 480 61 1115 619 -443 255 -764 -70 404 100 -683 79 -532 333 -559 -958 221 -25 -98 -1039
5357a039J293m08M18j626J298m25L72P9j2J86O41j111M19o3Q03j70L9j80L44n67
$$ -1039 254 -154 264 -1362 -64 -489 -117 -38 -50 136 777 -334 85 22 825 655 694 514 858 291
5377B91K58P78j013J81J23l87O57Q75j807J519r30p18K53M63p42J122l23j115
$$ 291 549 1327 314 495 618 231 888 1763 -44 1475 545 -173 80 543 -199 923 600 -515
5395e15N59O9k95Q15j307N20l82j90L38l93n07J562j210nJ18N58m94Q34j76j21
$$ -515 44 113 -182 633 -674 -154 -536 -726 -388 -781 -1288 274 -936 -941 -823 -265 -759 75 -101 -222
5415b22J02J30r51k68J236j39k00j56R78K09k57M96j354J181n5l49m34j8N34n88
$$ -222 -120 10 -941 -1209 27 -112 -312 -468 510 719 462 958 -396 785 730 381 -53 -71 463 -125
5435a25J142k40J38r55J399m87j56j76K79m61J94o29k60K45L52r04L37o83j68
$$ -125 1017 777 915 -40 1359 872 716 540 819 358 552 -77 -337 -92 260 -644 -307 -990 -1158
5454a158N12M97r25O31J623k502Q82k87O24p03O64k41m17P84n7o11Q86K46r84
$$ -1158 -646 -149 -1074 -443 1180 -1322 -440 -727 -103 -806 -142 -383 -800 -16 -73 -684 202 448 -536
5473e36N90o94O83qk59J664j085J056r41k25r1J0K75R42l17j131O84p95J653r71
$$ -536 54 -640 43 35 -224 1440 355 1411 470 245 154 164 439 1381 1064 -67 617 -178 1475 504
5493E04m06L99l53p72K36M07M58k73l98N79J17j796J836j770J026m18o82N2m2
$$ 504 98 497 144 -628 -392 15 473 200 -198 381 498 -1298 538 -1232 -206 -624 -1306 -1254 -1296
5512a296L05L37n39R11Q7r24J090l60J39K34o65m15P34J412j98o36N01PJ48p31
$$ -1296 -991 -654 -1193 -282 -195 -1119 -29 -389 -250 -16 -681 -1096 -362 1050 852 216 717 724 872 141
5532A41N21m54l75N33K46J18l74N33l75K13l95L08j51q8O54n6j148L26j19n60
$$ 141 662 208 -167 366 612 730 356 889 514 727 332 640 489 401 1055 999 -149 177 58 -502
5552e02N03J179n55m71q64K61P37q01j22k67N96r86N66k62j78J105k62j5p42O3
$$ -502 1 1180 625 154 -710 -449 288 -513 -635 -902 -306 -1292 -726 -988 -1166 -61 -323 -338 -1080 -1017
5572a017J677r13M6r5o37N12j56J67M25N95p24M68M00j26P6n0l64OK1J923j584
$$ -1017 660 -253 -207 -302 -939 -427 -583 -416 9 604 -120 348 748 622 698 648 284 290 311 2234 650
5593F50j102J494o42N8j003J515j168O77q24R56M29m34j133J503k80j819J032
$$ 650 -452 1042 400 458 -545 970 -198 479 -345 611 1040 606 -527 976 696 -1123 -91
5610i1r46J113J03j996J509J0J44n68k34j62p23J476j151O38L04J60j50J67l76
$$ -91 -1037 76 179 -1817 -308 -298 -154 -722 -956 -1118 -1841 -365 -1516 -878 -574 -414 -564 -397 -773
5629g73L81O38K59q19R46n85n56O51j8J82L65m93M16k50J492j225L92m06q9N40
$$ -773 -392 246 505 -314 632 47 -509 142 124 306 671 178 594 344 1836 611 1003 597 508 1048
5649A048n73p64J433j134m52j86J296p74L40O2j35k93m72L98j308L8l12R72m71
$$ 1048 475 -289 1144 10 -442 -628 668 -106 234 296 161 -132 -604 -206 -1514 -1476 -1788 -816 -1287
5668a287R2j69l2J078m23k4J54J214j572P15J86k37j56j34k90M08K39l98K80J328
$$ -1287 -1195 -1364 -1396 -318 -741 -765 -611 603 -969 -254 -68 -305 -461 -595 -885 -477 -238 -636 -356 972
5688I72n06L6j63Q2j5N92L13r14J11O03K66r76R94l63j926R61K7K49m00k66J025
$$ 972 466 502 339 421 406 998 1311 397 508 1111 1377 401 1395 1032 -894 67 94 343 -57 -323 702
5709G02m53r69P10LK71m79k48O72j489M83o1j07P95j58m61J95O1qm16Q81m03q4
$$ 702 249 -720 -10 -7 264 -215 -463 209 -1280 -797 -858 -965 -170 -328 -789 -594 -533 -541 -957 -76 -479 -563
5731e63K30L96j72l39N77K24K96k44L77n38Pj07J080r18Q9K81K83q07N08n18J367
$$ -563 -333 63 -109 -448 129 353 649 405 782 244 251 144 1224 306 395 676 959 152 660 142 1509
5752A509m72j14j073M15Q08q25K35j32m1K36q82J156q22k45j08Pj92k17J89l21
$$ 1509 1037 923 -150 265 1073 248 483 351 310 546 -336 820 -2 -247 -355 -348 -540 -757 -568 -889
5772h89Q5M42n40Q46p91q24J101N02l78n20J112j083R20j5q02P36N79m89K38r93
$$ -889 -804 -362 -902 -56 -847 -1671 -570 -68 -446 -966 146 -937 -17 -32 -834 -98 481 -8 230 -763
5792g63Q26K5m32J013k34J71k05N07j163J333M96j427Q49R1r04k55M30M99k81
$$ -763 63 88 -344 669 435 606 401 908 -255 1078 1574 147 996 1087 183 -72 358 857 576
5811E76m41k35k85J189p54Q3o42n60J232p91J93n30j84NNP20J72n51o4Q34j218
$$ 576 135 -100 -385 804 50 133 -509 -1069 163 -628 -435 -965 -1149 -1144 -1139 -419 -247 -798 -862 -28 -1246
5832a246J788r60N21r06l50J023o36Q93q76J065r54J424n33k38Q28j298M47N63
$$ -1246 542 -418 103 -803 -1153 -130 -766 127 -749 316 -638 786 253 15 843 -455 -8 555
5850E55J78q48M0J34q1p84J307j008J885r66j021J152k11n60K30J060j851Q23
$$ 555 733 -115 -75 59 -22 -806 501 -507 1378 412 -609 543 332 -228 2 1062 -789 34
5868C4l43Q0Kl52N04n68K88J99n62m81J484j705O81L49J086j162L65J18j095J228
$$ 34 -309 -229 -227 -579 -75 -643 -355 -156 -718 -1199 285 -1420 -739 -390 696 -466 -101 17 -1078 150
5888A50o91J042r6l18o63O32L17RJ484j504R26r40O9j45J90j09k04o57J229o8
$$ 150 -541 501 405 87 -576 56 373 382 1866 362 1288 348 417 272 462 353 149 -508 721 653
5908F53j202J699N5q49l02j33P35p42k54R39q33l41J020j165K89K57o12j09J23
$$ 653 -549 1150 1205 356 54 -79 656 -86 -340 599 -234 -575 445 -720 -431 -174 -786 -895 -772
5927g72R64j177J239j16j817J193M42q45N63j195K681j506M50K6L75o12J060N0
$$ -772 192 -985 254 138 -1679 -486 -44 -889 -326 -1521 1160 -346 104 130 505 -107 953 1003
5945A003j758J042L25J94l86Q59j179L96j03Q64J69j560J123n45m18M94r1q52
$$ 1003 -755 287 612 806 420 1279 100 496 393 1257 1426 -134 989 444 26 520 429 -423
5963d23R93r69J137r51L56L73q96J66k44J034p82L07o08J47l25J458j306O03l59
$$ -423 570 -399 738 -213 143 516 -380 -214 -458 576 -206 101 -507 -360 -685 773 -533 70 -289
5982b89l96P69k36N92r12K73l75l5m20L06J048k98k46Q03N63j237J24J37M00k30
$$ -289 -685 84 -152 440 -472 -199 -574 -609 -1029 -723 325 27 -219 584 1147 -90 34 171 571 341
6002C41J99o05J231r43J64l94L71n0p16K32Q23r30P84J56P7j102N9j66L95O49
$$ 341 540 -65 1166 223 387 -7 364 314 -402 -170 653 -277 507 663 740 -362 -303 -469 -74 575
6022E75r80j13N13J344j541N36j209j21k18J651j240J068j037Q53l54k92k83P1
$$ 575 -405 -518 -5 1339 -202 334 -875 -996 -1214 437 -803 265 -772 81 -273 -565 -848 -777
6040g77k92L46J38j8l99J784j080Q2N87j317J389m01N98N16r30o87J284k37j198
$$ -777 -1069 -723 -585 -603 -1002 782 -298 -216 371 -946 443 42 640 1156 226 -461 823 586 -612
6059f12J319k01l85L02M82N93l49r40k01N1M41j013J729r23m4j92q74M70K25L59
$$ -612 707 506 121 423 905 1498 1149 209 8 59 500 -513 1216 293 249 57 -817 -347 -122 237
6079B37P23j346m51N07j59J366j189Q0q35rL29M87m15M0j09R2P50r49M73N80o73
$$ 237 960 -386 -837 -330 -489 877 -312 -232 -1067 -1076 -747 -260 -675 -635 -744 -652 98 -851 -378 202 -471
6100d71k40O63k01N75q83J14n15J194l94M84j13q85Q97j83r10J538j55O28m6l68
$$ -471 -711 -48 -249 326 -557 -443 -958 236 -158 326 213 -672 225 42 -868 670 515 1143 1097 729
6120G29M64o83N95j68j976J281m51N0R50j302K40K6n01j66Q67j040P77l88J22
$$ 729 1193 510 1105 937 -1039 242 -209 -159 791 -511 -271 -245 -746 -912 -45 -1085 -308 -696 -574
6139e74J59L59q11j62K69J0J236j347N20R54o76o4q4j74J67L27M46n88R47q01
$$ -574 -415 -56 -867 -1029 -760 -750 486 -861 -341 613 -63 -127 -211 -385 -218 109 555 -33 914 113
6159A13P38j746J058Q34q41P61j52L39p73j67j13k94K122j056j006J045n30N32
$$ 113 851 -895 163 997 156 917 765 1104 331 164 51 -243 1879 823 -183 862 332 864
6177H64r89J363n38n64o93K19L46K90q22K19k01m95Q80j60R31j614J95O64J28
$$ 864 -125 1238 700 136 -557 -338 8 298 -524 -305 -506 -1001 -121 -281 650 -964 -769 -105 23
6196B3l49m53N90p9n75k49P38m35K08N75m26J71M94n74J104n02K53L15L90j095
$$ 23 -326 -779 -189 -268 -843 -1092 -354 -789 -581 -6 -432 -261 233 -341 763 261 514 829 1219 124
6216A24P1O98j377J591j20r74Q33K91jp05p08K21N48q25O63k57k88J102o1j442
$$ 124 195 893 -484 1107 987 13 846 1137 1136 431 -277 -56 492 -333 330 73 -215 887 826 -616
6236f16Q17p68K69L73j238O24l60J622j053j081K56L21L10n07Q57n38q4J092n9
$$ -616 201 -567 -298 75 -1163 -539 -899 723 -330 -1411 -1155 -834 -524 -1031 -174 -712 -796 296 237
6255B37l90k66P88k44m24k2K0Q46Q3n00M75j88N4k59o42J829j370L80l25P8K64
$$ 237 -153 -419 369 125 -299 -321 -301 545 628 128 603 415 469 210 -432 1397 27 407 82 160 424
6276D24m07N42J65q70J161p70J14n63J385j842J311K61j115N61m7o51l88L29l66
$$ 424 17 559 724 -146 1015 245 359 -204 1181 -661 650 911 -204 357 310 -341 -729 -400 -766
6295g66J189k98n52p5J61o7q31M68Q76M17k81q54q4j21M1Q68J92l74K40L02q60
$$ -766 423 125 -427 -502 -341 -408 -1239 -771 105 522 241 -613 -697 -818 -777 91 283 -91 149 451 -409
6316d09Q05j084P37LN45j01K14L6j28M26o48Q53j606J729q06K66r35m17K09O39
$$ -409 396 -688 49 52 597 496 710 746 618 1044 396 1249 -357 1372 566 832 -103 -520 -311 328
6336C28O94j861O32k73K57K1n53L24k78M07J67j44N4j95R23q10n8m61J068j28
$$ 328 1022 -839 -207 -480 -223 -202 -755 -431 -709 -302 -135 -279 -225 -420 503 -307 -365 -826 242 114
6356A14k39l49N97q74J09J488r10J75K02J64J89r62J119J01m27q1P40m79J65j329
$$ 114 -125 -474 123 -751 -642 846 -64 111 313 477 666 -296 823 924 497 416 1156 677 842 -487
6376d87M49O33j70k63M3k6m58M29L01o58p43J774j116M65r91m19J180J77K16O1
$$ -487 -38 595 425 162 205 179 -279 150 451 -207 -950 824 -292 173 -818 -1237 -57 120 336 397
6396C97n38o32m33J331m42j53N22R0j008O35l34M56k40M0J27k04j187J148J083
$$ 397 -141 -773 -1206 125 -317 -470 52 142 -866 -231 -565 -109 -349 -309 -182 -386 -1573 -425 658
6415F58n80m91P10j91J38j53p4l5J211k28l73J81p6l21K41l38L08J02j096R08
$$ 658 78 -413 297 106 244 91 17 -18 1193 965 592 773 697 376 617 279 587 689 -407 501
6435E01Q0m76K86Q13q88n61N77m72j024J185q98M00K24k33L7p7P57q96O91p95
$$ 501 581 105 391 1204 316 -245 332 -140 -1164 21 -877 -477 -253 -486 -449 -526 231 -665 26 -769
6455g69J79R94r33J06k30M37j200P85P43O9j167N90K28R27J55n8q60O58j049J076
$$ -769 -590 404 -529 -423 -653 -216 -1416 -631 112 181 -986 -396 -168 759 914 856 -4 654 -395 681
6475F81J55r14J23Q11k79j389J173J518j247j72N2K25m75k72L40J91j1j47o93
$$ 681 836 -78 45 856 577 -812 361 1879 632 460 512 737 262 -10 330 521 510 363 -330
6494c30l34R0L49Q51k89k35j158J795p04m5K16k42m87M45n12m39L84M29j110J223
$$ -330 -664 -574 -225 626 337 102 -1056 739 35 -10 206 -36 -523 -78 -590 -1029 -645 -216 -1326 -103
6514a03n40J290n57j429J511M22j086j02ql09J234j094J714k30j2m60P40p18k34
$$ -103 -643 647 90 -1339 172 594 -492 -594 -602 -911 323 -771 943 713 701 241 981 263 29
6533B9L06L89o78P91j82l12K49n51O49q11J62L58m68P13k38L7l49J34p23Q84o69
$$ 29 335 724 46 837 655 343 592 41 690 -121 41 399 -69 644 406 443 94 228 -495 389 -280
6554b80M41l72p17k88Q16K24p15Q74p27P0m07J155q13J211o49M69j72j62m9O0
$$ -280 161 -211 -928 -1216 -400 -176 -891 -17 -744 -674 -1081 74 -739 472 -177 292 120 -42 -91 -31
6574c1j46o09L58J373p23K38p52o64R71k89m96J619q01M14rJ06l4r24R76k73M40
$$ -31 -177 -786 -428 945 222 460 -292 -956 15 -274 -770 849 48 462 453 559 525 -399 577 304 744
6595G44o18J38r4K20k35M17n17p97Q73o58J192q63O51n63k11j081J441r7M67j188
$$ 744 126 264 170 390 155 572 55 -742 131 -527 665 -198 453 -110 -321 -1402 39 -58 409 -779
6615g79K55m46Q01J71o11m33K16L56J87j23M08j088J199N15j011J262o59K48m47
$$ -779 -524 -970 -169 2 -609 -1042 -826 -470 -283 -406 2 -1086 113 628 -383 879 220 468 21
6634B1n61J939m01j151K02N29l12n33R56j461J345q04j14j23M66m46J728m60r25
$$ 21 -540 1399 998 -153 49 578 266 -267 689 -772 573 -231 -345 -468 -2 -448 1280 820 -105
6653a05J16L10j548J001J127j427N86j22K27o74P79m30r5o83N99p42R96L93r48
$$ -105 11 321 -1227 -226 901 -526 60 -62 165 -509 270 -160 -255 -938 -339 -1081 -85 308 -640
6672f40L24l21J618q61J232j739r08J116M52j03R5l61L08l18J237r78K32P56j342
$$ -640 -316 -637 981 120 1352 -387 -1295 -179 273 170 265 -96 212 -106 1131 153 385 1141 -201
6691b01J58Q6J12K22O29l51m57L39P79j976O07J18R85j560M14J47K26J62L5p73
$$ -201 -43 43 155 377 1006 655 198 537 1316 -660 -53 65 1050 -510 -96 51 277 439 474 -299
6711b99n5M33j133R41p48N77L68q33L0K31j25L93k39k60N50L75l62p65Q26R2k53
$$ -299 -354 79 -1054 -113 -861 -284 84 -749 -719 -488 -613 -220 -459 -719 -169 206 -156 -921 -95 -3 -256
6732b56K78J115m09j226j82Q91n96J609q16l63P4K47r25O84r02J058J64j47O62
$$ -256 22 1137 728 -498 -680 211 -385 1224 408 45 119 366 -559 125 -777 281 445 298 960
6751I60o37n89Q19J75o35o69N89K28j003M38P32r87J26M33m03J50J46K90P5L57
$$ 960 323 -266 553 728 93 -576 13 241 -762 -324 408 -579 -453 -20 -423 -273 -127 163 238 595
6771E95p36j122K7J684k30j66l59l96L04K77J62J09j59L27q35M17J11P81n99j064
$$ 595 -141 -1263 -1236 448 218 52 -307 -703 -399 -122 40 149 -10 317 -518 -101 10 791 192 -872
6791h72J162L34j707K102l17r32O26P41l95r8l44q00M31J02N58l56n91o71P92
$$ -872 290 624 -1083 1019 702 -230 396 1137 742 644 300 -500 -69 33 591 235 -356 -1027 -235
6810b35N34L37j207N69m52k28J377l04q53j277m5K917k039J460o59q25J390j209
$$ -235 299 636 -571 -2 -454 -682 695 391 -462 -1739 -1784 1133 -906 554 -105 -930 460 -749
6828g49Q25J5R6M45j116k25N63O32k60l14O93o74O39m6j055J075jj204J794n18
$$ -749 76 91 187 632 -484 -709 -146 486 226 -88 605 -69 570 524 -531 544 543 -661 1133 615
6848F15o10j26Q5J105k39K01j73p77P77j145QL50l20P9P72l94R2j102M71j67J25
$$ 615 5 -121 -36 1069 830 1031 858 81 858 -287 -279 71 -249 -170 602 208 300 -802 -331 -498 -373
6869c73Q37n73p31P78j57n84J060p00O58m47l7m86M71k09K84O9K64l00n00J226
$$ -373 464 -109 -840 -62 -219 -803 257 -443 215 -232 -269 -755 -284 -493 -209 -140 124 -176 -676 550
6889E50L02j336R65K71j137lJ068q75M34m69M38o5p37J364r29L39p8l77k71M22
$$ 550 852 -484 481 752 -385 -388 680 -195 239 -230 208 143 -594 770 -159 180 102 -275 -546 -124
6909a24J017o27j82o80O72K89p32P43M09m09o35q03N39O16k33N85r46k4P00l3
$$ -124 893 266 84 -596 76 365 -367 376 785 376 -259 -1062 -523 93 -140 445 -501 -525 175 142
6929A42K22n9j244M03J219q10L33m91J43O30p99K72L14n91R03o77K89q64N54m9
$$ 142 364 305 -939 -536 683 -127 206 -285 -142 488 -311 -39 275 -316 587 -90 199 -665 -111 -160
6949a60n67M88n0Q6M52M47n82N84j9o30k14L57N37q64J13Q92j576j68J163q09
$$ -160 -727 -239 -289 -203 249 696 114 698 679 49 -165 192 729 -135 -22 870 -706 -874 289 -520
6969e20J136n32M38r11N92l1o36R24K1j710M06J76L76O19o10P83r82l37J358o45
$$ -520 616 84 522 -389 203 172 -464 460 481 -1229 -823 -647 -271 348 -262 521 -461 -798 560 -85
6989h5k79P09J94j063O52M11o67R02n92R6p63M12M30N79j139N10k22n43J52Q63
$$ -85 -364 345 539 -524 128 539 -128 774 182 278 -485 -73 357 936 -203 307 85 -458 -306 557
7009E57q52L28K2m36m43J332m33M93o07j11MK72K80o92L24J10j61r9K72j175O33
$$ 557 -295 33 55 -381 -824 508 75 568 -39 -150 -146 126 406 -286 38 148 -13 -112 160 -1015 -382
7030c82L93Q1m32j99N03k03n10n4O9K42j27O20k81p22R84j30k98Q90n05P58j180
$$ -382 11 92 -340 -539 -36 -239 -749 -803 -734 -492 -619 1 -280 -1002 -18 -148 -446 444 -61 697 -483
7051d83J65Q76j52L26M76o91K99n70k87o86J282M8k41L22K79j329O01L29o18j41
$$ -483 -318 558 406 732 1208 517 816 246 -41 -727 555 603 362 684 963 -366 235 564 -54 -195
7071a95P88o42O37l07p14M80R28j717M08k03P31n49n17Q57l75J366j137q1m48
$$ -195 593 -49 588 281 -433 47 975 -742 -334 -537 194 -355 -872 -15 -390 976 -161 -242 -690
7090f90Q53n70O70p77L33K87J43Pm78R7K01j217Q68J159j394n95R60K35m72Q65
$$ -690 163 -407 263 -514 -181 106 249 256 -222 -125 76 -1141 -273 886 -508 -1103 -143 92 -380 485
7110D85j57K59p23OK47O96j368L27m32R52K2j24j8o96N84J04n58O59L13k88k57
$$ 485 328 587 -136 -130 117 813 -555 -228 -660 292 314 190 172 -524 60 164 -394 265 578 290 33
7131C3m72J066n51N4N32j64q99j53P33N7R4j103N30L79j217K551p46m66J04l66
$$ 33 -439 627 76 130 662 498 -401 -554 179 236 330 -773 -243 136 -1081 1470 724 258 362 -4
7151do88Q73J31O9p3l01p5m65O6L62M60o51k84J293j000Q02m17m55J87M64J9m89
$$ -4 -692 181 312 381 308 7 -68 -533 -467 -105 355 -296 -580 713 -287 515 98 -357 -170 294 313 -176
7173a76o65L33J514m76p03J337j464p5O25p15J06K22k53Q80j124J140M72j579
$$ -176 -841 -508 1006 530 -173 1164 -300 -375 250 -465 -359 -137 -390 490 -634 506 978 -601
7191f01M53l00k84O03L17r72J188p55P97r36O17K40p60O12j77R5m07M85k69m04
$$ -601 -148 -448 -732 -129 188 -784 404 -351 446 -490 127 367 -393 219 42 137 -270 215 -54 -458
7211d58P61J83m6l59M68n24j05m2Q91j198R08R4l08l71K7K00n4M44j575R86p13
$$ -458 303 486 440 81 549 25 -80 -122 769 -429 479 573 265 -106 -79 121 67 511 -1064 -78 -791
7232g91J109m42n40N44j38P60m56M54o80j88L65J38o52P89l95L2K08L03m83l06
$$ -791 318 -124 -664 -120 -258 502 46 500 -180 -368 -3 135 -517 272 -123 -91 117 420 -63 -369
7252c69R15m56l01M49j48n67J01R97j326J36P76J37n79N56j244J472k78m35M39
$$ -369 546 90 -211 238 90 -477 -376 621 -705 -569 207 344 -235 321 -923 549 271 -164 275
7271B75j617J280Q4J30m59N65L32l57m05n23m89O04p46J909k57n43J81K47l20
$$ 275 -1342 -62 22 152 -307 258 590 233 -172 -695 -1184 -580 -1326 583 326 -217 -36 211 -109
7290a09J99N3k87o01pJ061m98k6K59j28Q67p19L88J58j49l8j399J518l76r10J372
$$ -109 90 143 -144 -745 -752 309 -189 -215 44 -84 783 64 452 610 461 423 -976 542 166 -744 628
7311F28o93N85k13J76k96m67J517j210o93K33N78J17M4j41p83J113q82J52l72
$$ 628 -65 520 307 483 187 -280 1237 27 -666 -433 145 262 306 165 -618 495 -387 -235 -607
7330f07P57k9p4J190j273k01J371j081m80J7O76j265J104k29L34O1K53j67k70
$$ -607 150 121 47 1237 -36 -237 1134 53 -427 -410 266 -999 105 -124 210 271 524 357 87
7349H7m13J41L99m03Ql99l09M49K25K69O55p27m59k16L75L17M4k92O32K78o62
$$ 87 -326 -185 214 -189 -181 -580 -889 -440 -215 54 709 -18 -477 -693 -318 -1 43 -249 383 661 -1
7370al98k23k10P45n52O77P69J78j179j67N67l13q76K043p49m33k69m94M78J308
$$ -1 -399 -622 -832 -87 -639 38 807 985 -194 -361 206 -107 -983 1060 311 -122 -391 -885 -407 901
7390I01r6j495J83j73J095J98N20j444j46N25q32J603j340J644j430r1N42j91
$$ 901 805 -690 -507 -680 415 613 1133 -311 -457 68 -764 839 -501 1143 -287 -378 164 -27
7408b7P3M21o04M23j17m32N53M3l84p92p2Q36j99P69J93n80L75j737J686j13L44
$$ -27 46 467 -137 286 169 -263 290 333 -51 -843 -915 -79 -278 491 684 104 479 -1258 428 315 659
7429F59r19j43L24K39M36L06n75K28j79M84j032l78j60J322L6r57L41j62L8K88
$$ 659 -260 -403 -79 160 596 902 327 555 376 860 -172 -550 -710 612 648 -309 32 -130 -92 196
7449A96N52j125R43p52q5J14j030J380P24n62K66K49J45k060P66Q55o43J68p68
$$ 196 748 -377 566 -186 -271 -157 -1187 193 917 355 621 870 1015 -1045 -279 576 -67 101 -667
7468f67o58M63L34J055j59m62j42O69n70k09M41q10J021J226j337o77Q4O5Q10
$$ -667 -1325 -862 -528 527 368 -94 -236 433 -137 -346 95 -715 306 1532 195 -482 -398 -333 477
7487D77j150L65j40p2j60J172l49N23k53P8j053L26K25P98j403R18L28j658J407
$$ 477 -673 -308 -448 -520 -680 492 143 666 413 491 -562 -236 -11 787 -616 302 630 -1028 379
7506C79j61M53n94O07o04O68p38j80J31j120R87o53Q74N08q20L19k87l6P31K06
$$ 379 218 671 77 684 80 748 10 -170 -39 -1159 -172 -825 49 557 -263 56 -231 -267 464 670
7526F70j397P58o58J109p74J96K00m94L70m5O07k68N32n66q40M63N43o68j079
$$ 670 -727 31 -627 482 -292 -96 104 -390 -20 -65 542 274 806 240 -600 -137 406 -262 -1341
7545a341J432R39q33J247j849O12l17K73J4q25R45j382J386j03j57Q03o57n70
$$ -1341 91 1030 197 1444 -405 207 -110 163 177 -648 297 -1085 301 198 41 844 187 -383
7563c83O22k27L01j172P47N11m99m5Q0o5j71o61O43Q97j406K59J014L54j314K13
$$ -383 239 12 313 -859 -112 399 -100 -145 -65 -130 -301 -962 -319 578 -828 -569 445 799 -515 -302
7583c02j0R19j753M54K42L9q7p95R07L84L87Rk25q99O92P7nM84j483P15J221j257
$$ -302 -312 607 -1146 -692 -450 -411 -498 -1293 -386 -2 385 394 169 -730 -38 39 34 518 -965 -250 971 -286
7605b86n38J421q01m08J124r3M34n25L12k18q60J369j252J050m00pJ5p00J094
$$ -286 -824 597 -204 -612 512 419 853 328 640 422 -438 931 -321 729 329 322 337 -363 731
7624G31n06l29K93L67r59O35o8p0p42P49R4N21r45N67j63q8J43n48k21J074k16
$$ 731 225 -104 189 556 -403 232 164 94 -648 101 195 716 -229 338 175 87 230 -318 -539 535 319
7645C19j020pM83J042o71k13K24j079Q51L21r9J80k95M3l25M65l26O40k44J21
$$ 319 -701 -708 -225 817 146 -67 157 -922 -71 250 151 331 36 79 -246 219 -107 533 289 410
7665D10r44M70k26q8R4j1J62j80o2O61r5k17N52Or02l91J188n54P03O36j098o1
$$ 410 -534 -64 -290 -378 -284 -295 -133 -313 -375 286 191 -26 526 532 -370 -761 427 -127 576 1212 114 53
7687E3L90l46o56n14k67R05O60o12M17J274j077k42R63p65o3p32J311p15k88M18
$$ 53 443 97 -559 -1073 -1340 -435 225 -387 30 1304 227 -15 948 183 120 -612 699 -16 -304 114
7707A14O92l68k88ro0K84O93k282J012M4J06M08j42l43O70o35k96J048j022K84
$$ 114 806 438 150 141 81 365 1058 -1224 -212 -168 -62 346 204 -139 531 -104 -400 648 -374 -90
7727i0J34M93q42J315j785L05K80J24J91q48l50P82R59l00l61j158J302j147P95
$$ -90 44 537 -305 1010 -775 -470 -190 -66 125 -723 -1073 -291 668 368 7 -1151 151 -996 -201
7746b01N11n56K6j87R06k3r2o78J116m83o40R4P56l64Q2o1N6M97q64N78N79j045
$$ -201 310 -246 -220 -407 499 476 384 -294 822 339 -301 -207 549 185 267 206 262 759 -105 473 1052 7
7768GP87o39p12O4j2N20O0N12j105M26J88j3R84k26j592O86l16n5J373j784N07
$$ 7 794 155 -557 -493 -505 15 75 587 -518 -92 96 83 1067 841 -751 -65 -381 -436 937 -847 -340
7789c40K20O70K18m25r66O93m75J2p3N69L3J6l10k52R25j341OQ82O08j072J023
$$ -340 -120 550 768 343 -623 70 -405 -393 -466 103 136 152 -158 -410 515 -826 -820 62 670 -402 621
7810F21k39n16J59R42j615J479m11J73j62m55o62J166o49J42N92k33l96q60P60
$$ 621 382 -134 25 967 -648 831 420 593 431 -24 -686 480 -169 -27 565 332 -64 -924 -164
7829a64R21l50n14p89N17L42J82J34p61J137p91K91M78j745K26J204K69r31L36
$$ -164 757 407 -107 -896 -379 -37 145 279 -482 655 -136 155 633 -1112 -886 318 587 -344 -8
7848ho5L59r33J46L37O83p00L21J54O99q42O02l55q06P29K87q04o33J728r89K50
$$ -8 -73 286 -647 -501 -164 519 -181 140 294 993 151 753 398 -408 321 608 -196 -829 899 -90 160
7869A60O87o62J189j990J104j492J843l96j061J727j305P7j31Q94j207O93m27
$$ 160 847 185 1374 -616 488 -1004 839 443 -618 1109 -196 -119 -250 644 -563 130 -297
7886b97r1o12R48k3M13l24j68K65L1k86M46l04L14J26q83N86l56J69J09k30k99
$$ -297 -388 -1000 -52 -75 338 14 -154 111 142 -144 302 -2 312 438 -445 141 -215 -46 63 -167 -466
7907d66O52O58j465K098j309r60L26O43J79K25l46M86l6j091N76M21o42J40j18
$$ -466 186 844 -621 1477 168 -792 -466 177 356 581 235 721 685 -406 170 591 -51 89 -29
7926b9m20Q06k57N11l69J5q84P10j097M21Q61m10n74M66L93J11k60j77j8n19M36
$$ -29 -449 357 100 611 242 257 -627 83 -1014 -593 268 -142 -716 -250 143 254 -6 -183 -201 -720 -284
7947b84M66L80j223M36N72o03l18J241j77j327J044J6o99K27j25L67k31O16j039
$$ -284 182 562 -661 -225 347 -256 -574 667 490 -837 207 223 -476 -249 -374 -7 -238 378 -661
7966f61J676j300l54J536l12r83l9P47J6M50j02p18M06q98P63r71J172N65j616
$$ -661 1015 -285 -639 897 585 -398 -437 310 326 776 674 -44 362 -536 227 -744 428 993 -623
7985f23K72P31K46j614J292m0r01J117r53m5J026q53L20L46n22o0j06l18J034
$$ -623 -351 380 626 -988 304 264 -637 480 -473 -518 508 -345 -25 321 -201 -261 -367 -685 349
8004C49o61K77Q36j197J46M44o68P03J4m86J019j605O34m5m28M40R84j114J14
$$ 349 -312 -35 801 -396 -250 194 -474 229 243 -243 776 -829 -195 -240 -668 -228 756 -358 -244
8023b44L80r21N39O2L21L51q80J137q85J588j427M27N3l75n66R14K00k85m11o2
$$ -244 136 -785 -246 -184 137 488 -392 745 -140 1448 21 448 501 126 -440 474 674 389 -22 -84
8043h4l01Q27p23k06O76j68q04Q70l87k98Q45p0j84P15N03j195l62o70J396P1
$$ -84 -385 442 -281 -487 189 21 -783 87 -300 -598 247 177 -7 708 1211 16 -346 -1016 380 451
8063D51o13n56Q50N89p56k31l40lR83j076N98K28N2m42J067j315Q85K04k96J32
$$ 451 -162 -718 132 721 -35 -266 -606 -609 374 -702 -104 124 176 -266 801 -514 371 575 279 411
8083D11o30O43p05O84k55R2j061O18q26J039m07L60l3n88O44OJ17p74R26q30O81
$$ 411 -219 424 -281 403 148 240 -821 -203 -1029 10 -397 -37 -70 -658 -14 -8 109 -665 261 -569 112
8104A12J71L09m23K48m58j08N20Q12p40o64M29J174j516k75J088j097O16M91k18
$$ 112 283 592 169 417 -41 -149 371 1183 443 -221 208 1382 -134 -409 679 -418 198 689 471
8123D71M23r97M68p24Q83J22j337J069j04K95j049j4N23l57L53n4n36R02k82j15
$$ 471 894 -103 365 -359 524 646 -691 378 274 569 -480 -494 29 -328 25 -29 -565 337 55 -60
8143f0k86O44j18j061J098l60j83J6K52l68N18j081J123m66R53l69N49p60k39
$$ -60 -346 298 180 -881 217 -143 -326 -310 -58 -426 92 -989 134 -332 621 252 801 41 -198
8162a98L57J30m30j55J366p59j096K171j461L29k42O80r47M71l00l56R26J8K52
$$ -198 159 289 -141 -296 1070 311 -785 1386 -75 254 12 692 -255 216 -84 -440 486 504 756
8181G56j299J91O79O8n88l27O63Q66j188l08
$$ 756 -543 -352 327 395 -193 -520 143 1009 -179 -487
8191d87
$$ Imaginary data points
##PAGE= N=2
##DATA TABLE= (X++(I..I)), XYDATA
0@%%NnJ7k1L1l3M1m6N4o1P2r3J08j28J45j67J96k32K58k97L33l73M19m78N40o13
$$ 0 0 0 5 0 17 -4 27 -6 35 -11 43 -18 54 -39 69 -59 86 -81 115 -117 141 -156 177 -196 223 -255 285 -328
28c28O87p70Q61r66J070j199J344j507J701j924K180k477K828l205L457k587j3918
$$ -328 359 -411 450 -516 554 -645 699 -808 893 -1031 1149 -1328 1500 -1705 1752 -835 -14753
45a4753l01650K5386J9482k0878L249j0345J706l878M684J635R951P796J4029
$$ -14753 -316403 -291017 -271535 -292413 -289164 -299509 -297803 -301681 -296997 -295362 -285411 -277615 -263586
58b63586J1690J7456J7862K1002K1247K2024K3867K5497K2659K5347K2573K3658
$$ -263586 -251896 -234440 -216578 -195576 -174329 -152305 -128438 -102941 -80282 -54935 -32362 -8704
70h704K1547K1840J9211J9627J6653J5595J2467R282R719O084L870K230k757j069
$$ -8704 12843 34683 53894 73521 90174 105769 118236 127518 137237 143321 147191 149421 146664 145595
84A45595n022o930r663j0534j1637j3704j4380j5541j7449j5495j7149j6655j6767
$$ 145595 140573 133643 123980 113446 101809 88105 73725 58184 40735 25240 8091 -8564 -25331
97b5331j7097j6403j4298j4137j1786j1693j0781q039o221n328l636k360J58J721
$$ -25331 -42428 -58831 -73129 -87266 -99052 -110745 -121526 -129565 -135786 -141114 -144750 -147110 -146952 -145231
111a45231M369M496O248P564R965Q742J0005J2242J0511J3909J1736J2071J2344
$$ -145231 -140862 -136366 -130118 -122554 -112589 -103847 -93842 -81600 -71089 -57180 -45444 -33373 -21029
124b1029J2210J1355J0724J0334Q790P305P393N938M975L661K511P4p94j923k802
$$ -21029 -8819 2536 13260 23594 32384 39689 47082 53020 57995 61656 64167 64241 63447 61524 58722
139E8722m668o274n597p288p417r124p577j0297r952r116j0427p813j0144p047
$$ 58722 54054 47780 42183 34895 27478 18354 10777 480 -9472 -18588 -29015 -36828 -46972 -54019
153e4019p951p493o083n532m592k195k591j212r95P80K410M265K289M804O029
$$ -54019 -61970 -69463 -75546 -81078 -85670 -87865 -90456 -91668 -92663 -91883 -89473 -85208 -82919 -78115 -72086
168g2086O119Q016P022P398Q045P747Q196R786P663R018N979P272O576N819M879
$$ -72086 -65967 -57951 -50929 -43531 -35486 -27739 -19543 -9757 -2094 6924 12903 20175 26751 32570 37449
183C7449L729J772M242O78L0j160q58j389m107l833l511n821o608n337o819o548
$$ 37449 41178 42950 47192 47870 47900 46740 45882 44493 40386 36553 33042 27221 20613 15276 8457 1909
199A909o834p617o309p783o255m700p123n313l914m364k623k859j832j17o52J583
$$ 1909 -4925 -12542 -18851 -26634 -32889 -37589 -44712 -50025 -53939 -58303 -60926 -63785 -65617 -65734 -66386 -64803
215f4803M04K309K455L629N318M706N780M794M503P967O796O467N989P246M926
$$ -64803 -64399 -62090 -59635 -56006 -50688 -45982 -40202 -35408 -30905 -22938 -16142 -9675 -3686 3560 8486
230H486N991O800M463M671K802K337L646J654K011j051J247q49k528j693l485
$$ 8486 14477 21277 25740 30411 33213 35550 39196 40850 42861 41810 43057 42208 39680 37987 34502
245C4502l043l635l988n289m747m902m829o338m803n889m279m925m469m172l119
$$ 34502 31459 27824 23836 18547 13800 8898 4069 -2269 -7072 -12961 -17240 -22165 -26634 -30806 -33925
260c3925l492l169m02j296r09K37O85K475J302J841K814M674K597M538M482N790
$$ -33925 -37417 -40586 -40988 -42284 -43193 -42956 -42271 -39796 -38494 -36653 -33839 -29165 -26568 -22030 -17548 -11758
276a1758L805M231O195M723M806M180L900N138K470L758L052K235J570l58J886
$$ -11758 -7953 -3722 2473 7196 12002 16182 20082 25220 27690 31448 34500 36735 38305 37947 39833
291C9833J11j927p38j860k756k323l843m160k840n781m054l774o117l284m651
$$ 39833 39944 38017 37279 35419 32663 30340 26497 22337 19497 13716 9662 5888 -229 -3513 -8164
306h164n546m712m306l687k765l056k613j576j870j611R18m63J672J802J545K327
$$ -8164 -13710 -18422 -22728 -26415 -29180 -32236 -34849 -36425 -38295 -39906 -38988 -39451 -37779 -35977 -34432 -32105
322c2105K515L289N290L164M969L684M106N404M820N707N222M038M618M252K852
$$ -32105 -29590 -26301 -21011 -17847 -12878 -9194 -5088 316 5136 10843 16065 20103 24721 28973 31825
337C1825L032K845L015J815J246J171m42j136p06L1l306k752l699l395l033m871
$$ 31825 34857 37702 40717 42532 43778 44949 44507 43371 42665 42696 39390 36638 32939 29544 26511 21640
353B1640l427o587l485l987m781m751n692l555m255l707l339j914l827j907k530
$$ 21640 18213 11626 8141 4154 -627 -5378 -11070 -14625 -18880 -22587 -25926 -27840 -31667 -33574 -36104
368c6104l59q08k65M49P40J584J587M258K691K336L847N199M283L204M855M021
$$ -36104 -36463 -37271 -37536 -37087 -36347 -34763 -33176 -28918 -26227 -23891 -20044 -14845 -10562 -7358 -2503 1518
384A518L728M243N119L182N735K374K803K529L050K314P31J352r7j74p60p02j441
$$ 1518 5246 9489 14608 17790 23525 25899 28702 31231 34281 36595 37326 38678 38581 38407 37647 36945 35504
401C5504j725l884q20k857l618m218k847m557l850k833m929l948l216l265l866
$$ 35504 33779 29895 29075 26218 22600 18382 15535 10978 7128 4295 -634 -4582 -7798 -11063 -14929
416a4929k917k510j957j073k639p40j052M73j340J429J104J784J057K113K790
$$ -14929 -17846 -20356 -22313 -23386 -26025 -26765 -27817 -27344 -28684 -27255 -26151 -24367 -23310 -21197 -18407
431a8407L417K214K976L349L881L211L503L812L036L323K757K252L519J778J945
$$ -18407 -14990 -12776 -9800 -6451 -2570 641 4144 7956 10992 14315 17072 19324 22843 24621 26566
446B6566J893N21J318j367l1O17j726o81k532j873j589k213l080k550k841l154
$$ 26566 28459 28980 30298 28931 28900 29517 27791 27110 24578 22705 21116 18903 15823 13273 10432 7278
462G278l029l612k875k901l504l22l834j967j626j995q31k470P67j737J683L31
$$ 7278 4249 637 -2238 -5139 -8643 -8965 -12799 -14766 -16392 -18387 -19218 -21688 -20921 -22658 -20975 -20644
478b0644K96J868R32K579L988M32J947K703L396K798L030L456K016J859M126J907
$$ -20644 -20348 -18480 -17548 -14969 -10981 -10549 -8602 -5899 -2503 295 3325 6781 8797 10656 14782 16689
494A6689K183K698R28J301J734m33J108J67j86o26n30r87l787p74j561l081k201
$$ 16689 18872 21570 22498 23799 25533 25100 26208 26375 26189 25563 25033 24046 20259 19485 17924 14843 12642
511A2642k428k801l159k204l027k717l382j049l067k382j430j636k628L24j438
$$ 12642 10214 7413 4254 2050 -977 -3694 -7076 -8125 -11192 -13574 -15004 -16640 -19268 -18944 -20382
526b0382n76Q33O25O10J145N04K393K105J281K685K992L633J793M320J284L214
$$ -20382 -20958 -20125 -19500 -18890 -17745 -17241 -14848 -12743 -11462 -8777 -5785 -2152 -359 3961 5245 8459
542H459L346J710L136K216K748K245N90J330J522J414o72L4q98Q1k319o0k465
$$ 8459 11805 13515 16651 18867 21615 23860 24450 25780 27302 28716 28044 28078 27180 27261 24942 24882 22417
559B2417k546j544l447j952k916l102k870l643l862k241l116j522l142l675j554
$$ 22417 19871 18327 14880 12928 10012 6910 4040 397 -3465 -5706 -8822 -10344 -13486 -17161 -18715
574a8715k062n62j435j302o7o07K82M49K082J829R84J741K086L182L285J480M124
$$ -18715 -20777 -21339 -22774 -24076 -24143 -24750 -24468 -24019 -21937 -20108 -19124 -17383 -15297 -12115 -8830 -7350 -3226
591c226L032K950L636K393L093K806M058J548K573J286J980K217P8K126m64k05
$$ -3226 -194 2756 6392 8785 11878 14684 18742 20290 22863 24149 26129 28346 28424 30550 30086 29881
607B9881q3j165j163k145k307j994k017l170j856l392l435k965l196l654l345
$$ 29881 29798 28633 27470 25325 23018 21024 19007 15837 13981 10589 7154 4189 993 -2661 -6006
622f006k324l335k707l275j203j295l132q24j036m54j882K623q6Q53K001J599
$$ -6006 -8330 -11665 -14372 -17647 -18850 -20145 -23277 -24101 -25137 -25591 -27473 -24850 -24936 -24083 -22082 -20483
638b0483J511R13L743K252L205J801N031L264K167K885L451L307K406J525J218
$$ -20483 -18972 -18059 -14316 -12064 -8859 -7058 -2027 1237 3404 6289 9740 13047 15453 16978 18196
653A8196M227Q88N66K414k01m8j23p77Rk07j624l406j326j977l444j597k763m315
$$ 18196 22423 23311 23877 26291 26090 26042 25919 25142 25151 24944 23320 19914 18588 16611 13167 11570 8807 4492
671D492j700k605l518l451k506k757k984k050o46k538j590j469L74j548O22K30
$$ 4492 2792 187 -3331 -6782 -9288 -12045 -15029 -17079 -17725 -20263 -21853 -23322 -22948 -24496 -23874 -23644
687b3644P17O25J182J607K171K493K395J616M000J796K593L305K458M227J969
$$ -23644 -22927 -22302 -21120 -19513 -17342 -14849 -12454 -10838 -6838 -5042 -2449 856 3314 7541 9510
702I510K150K044L727J56K900K00Q48P82P53n26Q72n60j559j681j049l263j399
$$ 9510 11660 13704 17431 17587 20487 20687 21535 22317 23070 22544 23416 22856 21297 19616 18567 15304 13905
719A3905j539k276k963l742k048j640l170l046k678l088k674p93k514j684p00
$$ 13905 12366 10090 7127 3385 1337 -303 -3473 -6519 -9197 -12285 -14959 -15752 -18266 -19950 -20650
734b0650j238p75O08n01j019J288J138J245J254J747J126L585K109K252K625K944
$$ -20650 -21888 -22663 -22055 -22556 -23575 -22287 -21149 -19904 -18650 -16903 -15777 -12192 -10083 -7831 -5206 -2262
750b262L225K310K335J613K388L938J466J450J704Q55K517n16J18K83j03j42o77
$$ -2262 963 3273 5608 7221 9609 13547 15013 16463 18167 19022 21539 21023 21141 21424 21321 21179 20502
767B0502j259j514r67k650j813k444l201j894k535j877l390k963j192k227m370
$$ 20502 19243 17729 16762 14112 12299 9855 6654 4760 2225 348 -3042 -6005 -7197 -9424 -13794
782a3794P66l466j322r85j480N93k013q6K44Q99K34R96J773J826J435K707J483
$$ -13794 -13028 -16494 -17816 -18801 -20281 -19688 -21701 -21787 -21543 -20644 -20410 -19414 -17641 -15815 -14380 -11673 -10190
799a0190K581L068J319K096L453J927J839K060L488J266K549J556J210o10J757
$$ -10190 -7609 -4541 -3222 -1126 2327 4254 6093 8153 11641 12907 15456 17012 18222 17612 19369
814A9369N52Q6j01j413L43k334n66j791r18k216l115k116k629k103j765k773k218
$$ 19369 19921 20007 19906 18493 18836 16502 15936 14145 13227 11011 7896 5780 3151 1048 -717 -3490 -5708
831e708l428j329k559j040j684j005j214o22j729K70m00L87J237J194P30M25K234
$$ -5708 -9136 -10465 -13024 -14064 -15748 -16753 -17967 -18589 -20318 -20048 -20448 -20061 -18824 -17630 -16900 -16475 -14241
848a4241K069J934J982J769K775L346K153K981J584K272K080J283K598J258K565
$$ -14241 -12172 -10238 -8256 -6487 -3712 -366 1787 4768 6352 8624 10704 11987 14585 15843 18408
863A8408Q78m50J815L6K06n37j023j83q33j199k923j232j259k424k300k558j758
$$ 18408 19286 18836 20651 20687 20893 20356 19333 19150 18317 17118 14195 12963 11704 9280 6980 4422 2664
880B664l810k473j182k994j318l361j899k249q07j427q64j162o84p7J265l38J204
$$ 2664 -1146 -3619 -4801 -7795 -9113 -12474 -14373 -16622 -17429 -18856 -19720 -20882 -21566 -21643 -20378 -20716 -19512
897a9512j75K113J784K255K411M3L400J495L404J075L210L070J938K826K164J536
$$ -19512 -19687 -17574 -15790 -13535 -11124 -11081 -7681 -6186 -2782 -1707 1503 4573 6511 9337 11501 13037
913A3037J965J819J533L74R27J062J65N88j295k47p74j057o22j854j941j908j287
$$ 13037 15002 16821 18354 18728 19655 20717 20882 21470 20175 19928 19154 18097 17475 15621 13680 11772 10485
930A0485k154l119j802j051l163k727l087j865j384j114l323J24l175L12n00r94
$$ 10485 8331 5212 3410 2359 -804 -3531 -6618 -8483 -9867 -10981 -14304 -14180 -17355 -17043 -17543 -18537
946a8537p80Q73r71J665N54N61L195k23K084J552M26K602L525J332J774J670K129
$$ -18537 -19317 -18444 -19415 -17750 -17196 -16635 -13440 -13663 -11579 -10027 -9601 -6999 -3474 -2142 -368 1302 3431
963C431K281K736J386J510J010J763R59P81l03K325j126M82m5n83k484j126j52
$$ 3431 5712 8448 9834 11344 12354 14117 15076 15857 15554 17879 16753 17235 17190 16607 14123 12997 12845
980A2845j219j471k173l89l100p13k696k226k489j600o82j242k610j052j246p86
$$ 12845 11626 10155 7982 7593 4493 3780 1084 -1142 -3631 -5231 -5913 -7155 -9765 -10817 -12063 -12849
996a2849j535M1o7o87M29n38K544l0K58J423L39J518J737J219J830J784J731P25
$$ -12849 -14384 -14343 -14410 -15097 -14668 -15206 -12662 -12692 -12434 -11011 -10672 -9154 -7417 -6198 -4368 -2584 -853 -128
1014a28J915J471J513J949J807N01J612J333O2K17K93M14K13m48L26p96o86j194
$$ -128 1787 3258 4771 6720 8527 9028 10640 11973 12035 12252 12545 12959 13172 12724 13050 12254 11568 10374
1032A0374l07q22k221j112j765k007q38j621o32l005o42j534j664q94r65k055
$$ 10374 10067 9245 7024 5912 4147 2140 1302 -319 -951 -3956 -4598 -6132 -7796 -8690 -9655 -11710
1048a1710J13n49j159K62K95O70L86n67L41O44J116P12J380J485LL417P41O53
$$ -11710 -11597 -12146 -13305 -13043 -12748 -12078 -11692 -12259 -11918 -11274 -10158 -9446 -8066 -6581 -6578 -3161 -2420 -1767
1066a767J281K663J03J431J715J455Q07N50O42Q90O05O44o68N10j42m40n39m10
$$ -1767 -486 2177 2280 3711 5426 6881 7688 8238 8880 9770 10375 11019 10351 10861 10719 10279 9740 9330
1084I330o91j528n21j266o66j789k109q00j260k71j955r26j467r11j406p97j317
$$ 9330 8639 7111 6590 5324 4658 2869 760 -40 -1300 -1571 -3526 -4452 -5919 -6830 -8236 -9033 -10350
1101a0350p7j066K29n60o65P40j96P59O55L94R06l5J283J102J280J653Q17J016
$$ -10350 -10427 -11493 -11264 -11824 -12489 -11749 -11945 -11186 -10531 -10137 -9231 -9266 -7983 -6881 -5601 -3948 -3131 -2115
1119b115J093J660O09K473J527n16J359M30N40J60L95R53J327q33j081M30m21
$$ -2115 -1022 638 1247 3720 5247 4731 6090 6520 7060 7220 7615 8568 9895 9062 7981 8411 7990
1136G990o72j335P3j271m46k189K3r83j723l94k167J8k207k63j330q41l51o94
$$ 7990 7318 5983 6056 4785 4339 2150 2173 1190 -533 -927 -3094 -3076 -5283 -5546 -6876 -7717 -8068 -8762
1154h762o71q59l15k40K14k0J02j25j18J029j60K119J317P70P45J654Q14J103
$$ -8762 -9433 -10292 -10607 -10847 -10633 -10653 -10551 -10676 -10794 -9765 -9925 -7806 -6489 -5719 -4974 -3320 -2506 -1403
1172a403N30J397J442o29K199J277K0N51J179l77J333M58M24l25K5j19r33J01
$$ -1403 -873 524 1966 1337 3536 4813 4833 5384 6563 6186 7519 7977 8401 8076 8101 7982 7049 7150
1190G150r40n61j929N45k245l59j067q06q24p22j129j107j836p43j288J16j136
$$ 7150 6210 5649 3720 4265 2020 1661 594 -212 -1036 -1758 -2887 -3994 -5830 -6573 -7861 -7745 -8881
1207h881l76l85j436N82l48n4J074l94N54O74N8J312o81K098N61J095P67P14J380
$$ -8881 -9257 -9642 -11078 -10496 -10844 -10898 -9824 -10218 -9664 -8990 -8932 -7620 -8301 -6203 -5642 -4547 -3780 -3066 -1686
1226a686J024J421M89J146L44R73J606J519k55P64Q40J04K15P1o22q11J537j329
$$ -1686 -662 759 1248 2394 2738 3711 5317 6836 6581 7345 8185 8289 8504 8575 7953 7142 8679 7350
1244G350j30j227j07j620m10k153j41j008m12k11k131j312j213J55j324j84q41
$$ 7350 7220 5993 5886 4266 3856 1703 1562 554 142 -69 -2200 -3512 -4725 -4570 -5894 -6078 -6919
1261f919K14q97j213m56J409r13M0j22O00O15J92N19j82J243J086P55J973K1J185
$$ -6919 -6705 -7602 -8815 -9271 -7862 -8775 -8735 -8857 -8257 -7642 -7450 -6931 -7113 -5870 -4784 -4029 -2056 -2035 -850
1280h50j10J806Q95L5K383n6R01N87J311N31j14O21M97L7j255J228j29o36o68
$$ -850 -960 846 1741 1776 4159 4103 5004 5591 6902 7433 7319 7940 8437 8474 7219 8447 8318 7682 7014
1299G014k49r41n16o23o1k181Q94l108r25Q7k16j021N4k263j11n0k056K6o87J319
$$ 7014 6765 5824 5308 4685 4624 2443 3337 229 -696 -609 -825 -1846 -1792 -4055 -4166 -4216 -6272 -6246 -6933 -5614
1319e614r27p6j827J899R49l15M95P63Q8J11N11Q09J990J9N69J324M72R25J073
$$ -5614 -6541 -6617 -8444 -6545 -5596 -5911 -5416 -4653 -4565 -4454 -3943 -3134 -1144 -1125 -556 768 1240 2165 3238
1338C238J734J98r8J051J014L1N22M51p17J095j166m21N22o51r92k59l7k03o61
$$ 3238 4972 5170 5072 6123 7137 7168 7690 8141 7424 8519 7353 6932 7454 6803 5811 5552 5515 5312 4651
1357D651r38j029m58p36P0j933o52K81j847j51k14P1j460m35m58M86P27o92o94
$$ 4651 3713 2684 2226 1490 1560 -373 -1025 -744 -2591 -2742 -2956 -2885 -4345 -4780 -5238 -4752 -4025 -4717 -5411
1376e411J70L59J048L89J251KN56L69R46Q11J152p93R57P47J279L66J202M15n0
$$ -5411 -5241 -4882 -3834 -3445 -2194 -2192 -1636 -1267 -321 490 1642 849 1806 2553 3832 4198 5400 5815 5765
1395E765J38J167O41m49r4K97r06O09k14j97q71j246q9p53l48j687J101j431l12
$$ 5765 5903 7070 7711 7262 7168 7465 6559 7168 6954 6757 5886 4640 4551 3798 3450 1763 2864 1433 1121
1414A121m03k214P23o77L46j415o26k85M77r18r14J113m88Q4J104j283J49N16
$$ 1121 718 -1496 -773 -1450 -1104 -2519 -3145 -3430 -2953 -3871 -4785 -3672 -4160 -4076 -2972 -4255 -4106 -3590
1432c590N89P94l5R34P52m79J288J084O67R27j067J215J527j66Q26J03L76J336
$$ -3590 -3001 -2207 -2242 -1308 -556 -1035 253 1337 2004 2931 1864 3079 4606 4440 5266 5369 5745 7081
1450G081k55r23o63Q18n91J26n65l01K87Jq21j61j123n71j629j427R95j099j61
$$ 7081 6826 5903 5240 6058 5467 5593 5028 4727 5014 5015 4194 4033 2910 2339 710 -717 278 -821 -982
1469i82L23q06j528n32k87m58O50j113pj208K073n38Q84j174J076o77J251M21
$$ -982 -659 -1465 -2993 -3525 -3812 -4270 -3620 -4733 -4740 -5948 -3875 -4413 -3529 -4703 -3627 -4304 -3053 -2632
1487b632J05P78N36J147K48m14J242Q78m23M2K121J58m9J221l29L22R30l51M6
$$ -2632 -2527 -1749 -1213 -66 182 -232 1010 1888 1465 1507 3628 3786 3737 4958 4629 4951 5881 5530 5576
1506E576m81Q59j561m43N65m16o30j511J202p56L00r62j112R9j536j833N11R3
$$ 5576 5095 5954 4393 3950 4515 4099 3469 1958 3160 2404 2704 1742 630 729 -807 -2640 -2129 -2036
1524b036o61j254K17J8k81n3j054J000j134l5J025L12n44k75O88P86Q38L63j10
$$ -2036 -2697 -3951 -3734 -3716 -3997 -4050 -5104 -4104 -5238 -5273 -4248 -3936 -4480 -4755 -4067 -3281 -2443 -2080 -2190
1543b190l4J923JL09O09N50K08m35J377J604j211r6Q71K80q76Q07j665J567o70
$$ -2190 -2224 -301 -300 9 618 1168 1376 941 2318 3922 2711 2615 3486 3766 2890 3697 2032 3599 2929
1562B929N30n13p28r56O99l19j138k0j182J67L93j904L2J93j646r23J249j023
$$ 2929 3459 2946 2218 1262 1961 1642 504 484 -698 -531 -138 -2042 -2010 -1817 -3463 -4386 -3137 -4160
1580d160o4N17O07j218o42N87r52N42n77R36J90R35l05R47k84P04K12k11J059
$$ -4160 -4224 -3707 -3100 -4318 -4960 -4373 -5325 -4783 -5360 -4424 -4234 -3299 -3604 -2657 -2941 -2237 -2025 -2236 -1177
1599a177J230m36J699o38L81j07J444K13j049J597o09Q7K2N65m67k83J074p76
$$ -1177 53 -383 1316 678 1059 952 2396 2609 1560 3157 2548 2635 2657 3222 2755 2472 3546 2770
1617B770k95q00p3k18n73o47k12r05pK13k80j647M15k28j519J731j282p79K92
$$ 2770 2475 1675 1602 1384 811 164 -48 -953 -960 -747 -1027 -2674 -2259 -2487 -4006 -2275 -3557 -4336 -4044
1636d044J58N45k60n56j37o50J766p79O39Q90m88N27q31J555L89J72n06J169N36
$$ -4044 -3886 -3341 -3601 -4157 -4294 -4944 -3178 -3957 -3318 -2428 -2916 -2389 -3220 -1665 -1276 -1104 -1610 -441 95
1655I5O5L15oP02J350j056O92m6Q06m47N68n15j06Ko23Q96p84m43M71l35L38j241
$$ 95 160 475 469 1171 2521 1465 2157 2111 2917 2470 3038 2523 2417 2419 1796 2692 1908 1465 1936 1601 1939 698
1677F98j204P04k14k27n71m67O7j110L05J18l02J82R7o32l82M8K10J06n45l0Q3
$$ 698 -506 198 -16 -243 -814 -1281 -1214 -2324 -2019 -1901 -2203 -2021 -1924 -2556 -2938 -2890 -2680 -2574 -3119 -3149 -3066
1698c066j94J016j17R84l83L52J072n04o34K086o06O6J154q77O50L61q1M7m73
$$ -3066 -3260 -2244 -2361 -1377 -1760 -1408 -336 -840 -1474 612 6 72 1226 349 999 1360 1279 1326 853
1717H53J518q36M37R83m66K42L17o26M39p94j021l05N29k92J45J019k488J400
$$ 853 2371 1535 1972 2955 2489 2731 3048 2422 2861 2067 1046 741 1270 978 1123 2142 -346 1054
1735A054k011Q29j106N68l07j6l62r65K46N79q12m91N22K8K70k5m03J110j220
$$ 1054 -957 -128 -1234 -666 -973 -989 -1351 -2316 -2070 -1491 -2303 -2794 -2272 -2244 -1974 -1999 -2402 -1292 -2512
1754b512R43K32L17M52K80P80P34q19P37k98K23J078j06j43R9O27J96P0q68Q19
$$ -2512 -1569 -1337 -1020 -568 -288 492 1226 407 1144 846 1069 2147 2041 1898 1997 2624 2820 2890 2022 2841
1774B841Q5O99K48q88o03m81Q60o9N3r13k64k63q69Q26m04j136o8l92l90Ql44
$$ 2841 2926 3625 3873 2985 2382 1901 2761 2692 2745 1832 1568 1305 436 1262 858 -278 -346 -738 -1128 -1120 -1464
1795a464K22n09l53J734j576o08M13J04J89O3r65P15N54L31j79k0J687j235P96
$$ -1464 -1242 -1751 -2104 -370 -1946 -2554 -2141 -2037 -1848 -1785 -2750 -2035 -1481 -1150 -1329 -1349 338 -897 -101
1814a01J077K67m8r16N54J96J033J477j367q8R91K52l61K62N19r20j53R60r95
$$ -101 976 1243 1195 279 833 1029 2062 3539 2172 2084 3075 3327 2966 3228 3747 2827 2674 3634 2639
1833B639l21N87j180M82n58O17j023K41k98j880J047o03m52j62j71j058m31J253
$$ 2639 2318 2905 1725 2207 1649 2266 1243 1484 1186 -694 353 -250 -702 -864 -1035 -2093 -2524 -1271
1851a271j788P32N50l64p18K93R84j102p0R23p69Q63k22O16N69p7R61p83J134
$$ -1271 -3059 -2327 -1777 -2141 -2859 -2566 -1582 -2684 -2754 -1831 -2600 -1737 -1959 -1343 -774 -851 110 -673 461
1870D61J48L18K38P87N35O9N93k50J135p85j37O43J203k176L8J209l14j044Q72
$$ 461 609 927 1165 1952 2487 2556 3149 2899 4034 3249 3112 3755 4958 2782 2820 4029 3715 2671 3543
1889C543m77K39p41q23n70P34j207n88O75k047l5j18p20j22J49j61j3m12p49n94
$$ 3543 3066 3305 2564 1741 1171 1905 698 110 785 -1262 -1297 -1415 -2135 -2257 -2108 -2269 -2282 -2694 -3443 -4037
1909d037J665n11j280J178J272r89k34N30L54Q13J079j189J266N45O5L19L42N81
$$ -4037 -2372 -2883 -4163 -2985 -1713 -2702 -2936 -2406 -2052 -1239 -160 -1349 -83 462 527 846 1188 1769
1927A769j93J217R7j05Q23N23p08K30R4m62P32Ol33m79J43K7j215L34j072M2p18
$$ 1769 1576 2793 2890 2785 3608 4131 3423 3653 3747 3285 4017 4023 3690 3211 3354 3381 2166 2500 1428 1470 752
1948G52o55L29j277J100j157j298M56o74P77j233k52j7n55l08J083j177O38j56
$$ 752 97 426 -851 249 -908 -2206 -1750 -2424 -1647 -2880 -3132 -3149 -3704 -4012 -2929 -4106 -3468 -3624
1966c624L43n6M41Q56L6L71k0K32O38P67O20M74k33J465L37J26m7m00R85J48j14
$$ -3624 -3281 -3337 -2896 -2040 -2004 -1633 -1653 -1421 -783 -16 604 1078 845 2310 2647 2773 2726 2326 3311 3459 3345
1987C345q12J449p08L24l00r7p14jm1o73Q08j586o97M69n76j12o50J22j384o97
$$ 3345 2533 3982 3274 3598 3298 3201 2487 2486 2445 1772 2580 994 297 766 190 78 -572 -450 -1834 -2531
2007b531O70j449J536r74N4M04j881L62m81j14J300j62j48R36L76J27L14K89j1
$$ -2531 -1861 -3310 -1774 -2748 -2694 -2290 -4171 -3809 -4290 -4404 -3104 -3266 -3414 -2478 -2102 -1975 -1661 -1372 -1383
2026a383J079K96J96J431l21J213p49J068J08M58M17j227J071P5k62J60q87J140
$$ -1383 -304 -8 188 1619 1298 2511 1762 2830 2938 3396 3813 2586 3657 3732 3470 3630 2743 3883
2044C883J63r21m60p1L0j209j30J88j156M47n84p05m61l34r80n90r76J284n71
$$ 3883 4046 3125 2665 2594 2624 1415 1285 1473 317 764 180 -525 -986 -1320 -2300 -2890 -3866 -2582 -3153
2063c153j164L72L04l9n20Q29L8q31J084n13O43M80n51P81J236L72O72l06L21
$$ -3153 -4317 -3945 -3641 -3680 -4200 -3371 -3333 -4164 -3080 -3593 -2950 -2470 -3021 -2240 -1004 -632 40 -266 55
2082E5R80P11o27J041L45j05M37M23M6M63K78j200K91J6L66L63p37j218n27l49
$$ 55 1035 1746 1119 2160 2505 2400 2837 3260 3306 3769 4047 2847 3138 3154 3520 3883 3146 1928 1401 1052
2102A052N20j139K92p62o35n24J82r80j4k46j42l61J67k167J455j338Q24L79j226
$$ 1052 1572 433 725 -37 -672 -1196 -1014 -1994 -2008 -2254 -2396 -2757 -2590 -4757 -3302 -4640 -3816 -3437 -4663
2121d663J269K21q56M76M96J062m48R83p17K256r66L39O47J253M75k03J216m58
$$ -4663 -3394 -3173 -4029 -3553 -3057 -1995 -2443 -1460 -2177 79 -887 -548 99 1352 1827 1624 2840 2382
2139B382N60P1n22J326j73R20j001L35j84M27j392K32k71j055J44j014O04n11
$$ 2382 2942 3013 2491 3817 3644 4564 3563 3898 3714 4141 2749 2981 2710 1655 1799 785 1389 878
2157H78n79j388M0o45p48j70l37M86m40Q5M2K20j730P42j176P57R66l13M11j32
$$ 878 299 -1089 -1049 -1694 -2442 -2612 -2949 -2463 -2903 -2818 -2776 -2556 -4286 -3544 -4720 -3963 -2997 -3310 -2899 -3031
2177c031O15M22j48L95J288l19k97M87J496l51J26J291M50K84j32n96J868N91
$$ -3031 -2416 -1994 -2142 -1747 -459 -778 -1075 -588 908 557 683 1974 2424 2708 2576 1980 3848 4439
2195D439j378J290p60j56M99j45P9q85K40o71j165O24r62J69l72p64j057J26k50
$$ 4439 3061 4351 3591 3435 3934 3789 3868 2983 3223 2552 1387 2011 1049 1218 846 82 -975 -849 -1099
2214a099n42p24j098L03J77o73r26M19O63r00J655j407R18J88L17o36P17J567
$$ -1099 -1641 -2365 -3463 -3160 -2983 -3656 -4582 -4163 -3500 -4400 -2745 -4152 -3234 -3046 -2729 -3365 -2648 -1081
2232a081O5r0K84R00n07J393m38M93O33K36N37J54k68Q91l42L66M08N48K38r41
$$ -1081 -1016 -1106 -822 78 -429 964 526 1019 1652 1888 2425 2579 2311 3202 2860 3226 3634 4182 4420 3479
2252C479k10L68n38l81R5p78o4j284O22r00n35m35k6j342j49k74j47m31J46M06
$$ 3479 3269 3637 3099 2718 2813 2035 1971 687 1309 409 -126 -561 -587 -1929 -2078 -2352 -2499 -2930 -2784 -2378
2272b378j357J87j146R28r02P93J430n52o12Q31j01M56N06m56J04J503l8M12M09
$$ -2378 -3735 -3548 -4694 -3766 -4668 -3875 -2445 -2997 -3609 -2778 -2879 -2423 -1917 -2373 -2269 -766 -804 -392 17
2291A7J122O73p04J194n77J153N86J3N4Q8r16J87J250j018l67J10k19j36k77q07
$$ 17 1139 1812 1108 2302 1725 2878 3464 3477 3531 3619 2703 2890 4140 3122 2755 2865 2646 2510 2233 1426
2311A426M17M16o83j734M71N9j096j121J20j52q23M25j465J072l59j081N76o0
$$ 1426 1843 2259 1576 -158 313 372 -724 -1845 -1725 -1877 -2700 -2275 -3740 -2668 -3027 -4108 -3532 -3592
2329c592o62N50J9j58J435r48O73jN58R42J27Q56k7L72J386k71K61O03j95J073
$$ -3592 -4254 -3704 -3685 -3843 -2408 -3356 -2683 -2684 -2126 -1184 -1057 -201 -228 144 1530 1259 1520 2123 1928 3001
2349C001l47O15K48q08J461l13j62j323N32J053l28q16K44j532L20N92j565J05
$$ 3001 2654 3269 3517 2709 4170 3857 3695 2372 2904 3957 3629 2813 3057 1525 1845 2437 872 977
2367I77j168O94r36m51n72P55j233r06J178j793J01J2l36P37J21n25m93O19m59
$$ 977 -191 503 -433 -884 -1456 -701 -1934 -2840 -1662 -3455 -3354 -3342 -3678 -2941 -2820 -3345 -3838 -3219 -3678
2386c678K08n09J951j346R89O80L62M98N36R61kL25j27P62J17N92J170j016J97
$$ -3678 -3470 -3979 -2028 -3374 -2385 -1705 -1343 -845 -309 652 650 975 848 1610 1727 2319 3489 2473 2670
2405B670L34p03Q76O58n68K13j059M13m58J830k938J281o64R0j394M45n65j183
$$ 2670 3004 2301 3177 3835 3267 3480 2421 2834 2376 4206 1268 2549 1885 1975 581 1026 461 -722
2423g22k34J96j161M89l87q52K73j033K31k21K50q26L88N63k84R52n88l3Q25k19
$$ -722 -956 -760 -1921 -1432 -1819 -2671 -2398 -3431 -3200 -3421 -3171 -3997 -3609 -3046 -3330 -2378 -2966 -2999 -2174 -2393
2443b393O22P03N68J38L54O87q73Q58N55P47k67M86j228J693P00l81J87J18P39
$$ -2393 -1771 -1068 -500 -362 -8 679 -194 664 1219 1966 1699 2185 957 2650 3350 2969 3156 3274 4013
2462D013j376J075n16l01q7J79j934M24M3j024l20K33k52j397L38J32n85J27q08
$$ 4013 2637 3712 3196 2895 2808 2987 1053 1477 1520 496 176 409 157 -1240 -902 -770 -1355 -1228 -2036
2481b036o35p18P74j75L4o25p72Q50J81l20n7P85Q07o81p95J688N57l71P01P95
$$ -2036 -2671 -3389 -2615 -2790 -2756 -3381 -4153 -3303 -3122 -3442 -3499 -2714 -1907 -2588 -3383 -1695 -1138 -1509 -808 -13
2501a3J237N9k39K7M93J073r83J258r35K03R49mL68o37O90j051J267j019p52Q56
$$ -13 1224 1283 1044 1071 1564 2637 1654 2912 1977 2180 3129 3125 3493 2856 3546 2495 3762 2743 1991 2847
2521B847r72M28r89J80m82j75r97q63L53n71p90k66l73O87o07k14o35J50N14j036
$$ 2847 1875 2303 1314 1494 1012 837 -160 -1023 -670 -1241 -2031 -2297 -2670 -1983 -2590 -2804 -3439 -3289 -2775 -3811
2541c811J33O66M97q56J247q06K91R91m19N83L62L10n83J653L31O40K19l44R4
$$ -3811 -3678 -3012 -2515 -3371 -2124 -2930 -2639 -1648 -2067 -1484 -1122 -812 -1395 258 589 1229 1448 1104 1198
2560A198J045M69j549K301J24q03O45j657J706q55l36L28J33L15j876j11l08M57
$$ 1198 2243 2712 1163 3464 3588 2785 3430 1773 3479 2624 2288 2616 2749 3064 1188 1077 769 1226
2578A226j318N77o28J233k429k48m6M32l02p92k66k04p39J86O76j244Q04m86J103
$$ 1226 -92 485 -143 1090 -1339 -1587 -1633 -1201 -1503 -2295 -2561 -2765 -3504 -3318 -2642 -3886 -3082 -3568 -2465
2597b465n75O90r76J077OJ004q87J117N01n54J836o03R59q52M79K75J147p0J98
$$ -2465 -3040 -2350 -3326 -2249 -2243 -1239 -2126 -1009 -508 -1062 774 171 1130 278 757 1032 2179 2109 2307
2616B307J370n33J363r45p64k0m82K40j31m83R00j046J47j600J043L20l063J004
$$ 2307 3677 3144 4507 3562 2798 2778 2296 2536 2405 1922 2822 1776 1923 323 1366 1686 -1377 -373
2634c73r21R27l08r33K84m25l59j122M55l0o21p75J430k56P67q91K72Q31q36O84
$$ -373 -1294 -367 -675 -1608 -1324 -1749 -2108 -3230 -2775 -2805 -3426 -4201 -2771 -3027 -2260 -3151 -2879 -2048 -2884 -2200
2654b200O15j40r91J604O40Q90R31r30P66O85j021R68K93k56N71N24p30O51N45
$$ -2200 -1585 -1725 -2716 -1112 -472 418 1349 419 1185 1870 849 1817 2110 1854 2425 2949 2219 2870 3415
2673C415j639J142j73M34k02m57O15j379p62j033K28J13j87no81r29j00k95k68
$$ 3415 1776 2918 2745 3179 2977 2520 3135 1756 994 -39 189 302 115 110 -571 -1500 -1600 -1895 -2163
2692b163m1j231L29J169p06n32p3K34N58L5j44j111J792p3o9K29M45N7J298k33
$$ -2163 -2204 -3435 -3106 -1937 -2643 -3175 -3248 -3014 -2456 -2421 -2565 -3676 -1884 -1957 -2026 -1797 -1352 -1295 3 -230
2712b30O71j076J565K96L06l06J249p13R88r72J286j069J341o73M53J62j397N07
$$ -230 441 -635 930 1226 1532 1226 2475 1762 2750 1778 3064 1995 3336 2663 3116 3278 1881 2388
2730B388J82p33r76n17L70n02k38k92k81k25j005M35o39o8m88kj151M81K72Q1
$$ 2388 2570 1837 861 344 714 212 -26 -318 -599 -824 -1829 -1394 -2033 -2101 -2589 -2591 -3742 -3261 -2989 -2908
2750b908q2r5J373j082J09Q2J02Q32J078j189J066o50J244j076J240N86L28Q75
$$ -2908 -2990 -3085 -1712 -2794 -2685 -2603 -2501 -1669 -591 -1780 -714 -1364 -120 -1196 44 630 958 1833
2768A833l14P51k87o16J331k22Q12n97O59j347O42J201q93j457O30j25j09j161
$$ 1833 1519 2270 1983 1367 2698 2476 3288 2691 3350 2003 2645 3846 2953 1496 2126 2001 1892 731
2786G31J265j068r18j07o65K18L4l40o03j158R45n92M46k75J59j616Q0K33L43
$$ 731 1996 928 10 -97 -762 -544 -510 -850 -1453 -2611 -1666 -2258 -1812 -2087 -1928 -3544 -3464 -3231 -2888
2805b888RK93N99M9l7R2M63K76L19k16J156J340j253J000M46m34J028m19J114
$$ -2888 -2879 -2586 -1987 -1938 -1975 -1883 -1420 -1144 -825 -1041 115 1455 202 1202 1648 1214 2242 1823 2937
2824B937q11Q22n64K30J53o33Q92r26J265o54n72p90p33J72N86n46j28J38j083
$$ 2937 2126 2948 2384 2614 2767 2134 3026 2100 3365 2711 2139 1349 616 788 1374 828 700 838 -245
2843b45n84K03M48k221L94q59L59M49M21J45j137O15q0r87O86O90M43j008L67
$$ -245 -829 -626 -178 -2399 -2005 -2864 -2505 -2056 -1635 -1490 -2627 -2012 -2092 -3079 -2393 -1703 -1260 -2268 -1901
2862a901J172p96R34m07J353o6l59O98O67r26J447O9r55J484L93L27K0q70N82
$$ -1901 -729 -1525 -591 -998 355 289 -70 628 1295 369 1816 1885 930 2414 2807 3134 3154 2284 2866
2881B866N86N08q47j388P97n03qP6j197M55r11N64m15K33j415J93o94L33l26m07
$$ 2866 3452 3960 3113 1725 2522 2019 2011 2087 890 1345 434 998 583 816 -599 -406 -1100 -767 -1093 -1500
2901a500k04o65l45l60L29n30J512r85R24N26K09o44O3j99P87J5N08N05j156J593
$$ -1500 -1704 -2369 -2714 -3074 -2745 -3275 -1763 -2748 -1824 -1298 -1089 -1733 -1670 -1869 -1082 -1067 -559 -54 -1210 383
2921C83m63J011K53j26J584j034J51O32n44K65J237j313K83Q48j13r66r38J09
$$ 383 -80 931 1184 1058 2642 1608 1759 2391 1847 2112 3349 2036 2319 3167 3054 2088 1150 1259
2939A259P89o10mM20o93l45K31p71k75j136M56N63p48o81R8M47M19j389q24J149
$$ 1259 2048 1438 1434 1854 1161 816 1047 276 1 -1135 -679 -116 -864 -1545 -1447 -1000 -581 -1970 -2794 -1645
2959a645j609N47J040o55L62P90p96J95Q76o60R19N57K01j32K37N38J14O94Q3
$$ -1645 -3254 -2707 -1667 -2322 -1960 -1170 -1966 -1771 -895 -1555 -636 -79 122 -10 227 765 879 1573 1656
2978A656j07J388l97n86n56R00K75j29O25o10o45n2o70j036J989l64q40p86m58
$$ 1656 1549 2937 2540 1954 1398 2298 2573 2444 3069 2459 1814 1762 1092 56 2045 1681 841 55 -403
2997d03N61j34q19J746j458l63l45m05J63J00l67n17l70J66J091j270K14J129
$$ -403 158 24 -795 951 -507 -870 -1215 -1620 -1457 -1357 -1724 -2241 -2611 -2445 -1354 -2624 -2410 -1281
3015a281n63J42K12n43J265N58j88m77J11N28L88J68n86J139K74J12O06K25M9
$$ -1281 -1844 -1702 -1490 -2033 -768 -210 -398 -875 -764 -236 152 320 -266 873 1147 1259 1865 2090 2139
3034B139Q62q19j113R41m40M93r20Q00n16q33J313j040m41k35J22r99m6K01K42
$$ 2139 3001 2182 1069 2010 1570 2063 1143 1943 1427 594 1907 867 426 191 313 -686 -732 -531 -289
3053b89o49R28j647J644j200j15n40L98j41J06M91r36k66L96J07l42Q09j784L238
$$ -289 -938 -10 -1657 -13 -1213 -1328 -1868 -1470 -1611 -1505 -1014 -1950 -2216 -1820 -1713 -2055 -1246 -3030 208
3072B08p34p8k72J71J636j447R02J181r77M47R9O38j127J08Q04L12Q39j714R4
$$ 208 -526 -604 -876 -705 931 -516 386 1567 590 1037 1136 1774 647 755 1559 1871 2710 996 1090
3091A090R1m00J507q43j208O68p9m92L53q27N53j73j234R30q47K45j148J413n46
$$ 1090 1181 781 2288 1445 237 905 826 334 687 -140 413 240 -994 -64 -911 -666 -1814 -401 -947
3110i47j408M44J286j753J256j44j264J652j326L43n73Q94j72L15R05r83J653
$$ -947 -2355 -1911 -625 -2378 -1122 -1266 -2530 -878 -2204 -1861 -2434 -1540 -1712 -1397 -492 -1475 178
3127A78p05K31j92R47m20M46O01j6M28Jl95J065J39p42m00l8J145j535Q3NQ19
$$ 178 -527 -296 -488 459 39 485 1086 1070 1498 1499 1104 2169 2308 1566 1166 1128 2273 738 821 826 1645
3148A645j269J057J0m77m26o1j171Q49N4j445m90O28j021J46n6O95l94r10J077
$$ 1645 376 1433 1443 966 540 479 -692 157 211 -1234 -1724 -1096 -2117 -1971 -2027 -1332 -1726 -2636 -1559
3167a559J20O05j057J95k15m49J069k12J079m14l85P02J92P40m46O17m9M49l56
$$ -1559 -1439 -834 -1891 -1696 -1911 -2360 -1291 -1503 -424 -838 -1223 -521 -329 411 -35 582 533 982 626
3186F26k90P43J6K62n42l93J247M4j94L41P4r87J154j071r5K02M87j662N14R16
$$ 626 336 1079 1095 1357 815 422 1669 1713 1519 1860 1934 947 2101 1030 935 1137 1624 -38 476 1392
3206A392j613o21j48N13l43n63m4R75j416R00n35M62M50j313P46n87J477j641
$$ 1392 -221 -842 -990 -477 -820 -1383 -1427 -452 -1868 -968 -1503 -1041 -591 -1904 -1158 -1745 -268 -1909
3224a909J120j78n32L83O9m50J132K71N45o96M61Q46j146J549o88k91P99RL9J35
$$ -1909 -789 -967 -1499 -1116 -1047 -1497 -365 -94 451 -245 216 1062 -84 1465 777 486 1285 1294 1333 1468
3244A468K42K22r92j38K09R13k50p99k56P20k30j109J102n58J64J02p95J3K92
$$ 1468 1710 1932 940 802 1011 1924 1674 875 619 1339 1109 0 1102 544 708 810 15 28 320
3263C20n47r74O81m02k86r96M40o9P79k04l50n46P25J387n28j971J017L56R51
$$ 320 -227 -1201 -520 -922 -1208 -2204 -1764 -1833 -1054 -1258 -1608 -2154 -1429 -42 -570 -2541 -1524 -1168 -217
3282b17j94k42J317r24N1l0k11O75O36M02o81k75J671o62k49K12l63K94n39J334
$$ -217 -411 -653 664 -260 -209 -239 -450 225 861 1263 582 307 1978 1316 1067 1279 916 1210 671 2005
3302B005p25O91L7K2l51L2q05N52j124j030j38L07J607n87j467j2p49R7J335j405
$$ 2005 1280 1971 2008 2030 1679 1711 906 1458 334 -696 -834 -527 1080 493 -974 -986 -1735 -1638 -303 -1708
3322a708P87p21l29J089j053J426n82q5J42Q10k09m39j08M16L63m87K53J198m7
$$ -1708 -921 -1642 -1971 -882 -1935 -509 -1091 -1176 -1034 -224 -433 -872 -980 -564 -201 -688 -435 763 716
3341G16j417R29o83O72M45K58N14j489J922o91K14J35o76o32J167J02m52Q35q47
$$ 716 -701 228 -455 217 662 920 1434 -55 1867 1176 1390 1525 849 217 1384 1486 1034 1869 1022
3360A022j006R7L52m86L38J67j128J46k14m67J503j981M49K4r7k65L04R19m14
$$ 1022 16 113 465 -21 317 484 -644 -498 -712 -1179 324 -1657 -1208 -1184 -1281 -1546 -1242 -323 -737
3379g37j921J519M22N31n55l79p78J085J86N05N13O9p4l70J096j181O8R87j43
$$ -737 -2658 -1139 -717 -186 -741 -1120 -1898 -813 -627 -122 391 460 386 16 1112 -69 -1 986 843
3398H43l85J106l20l39J88L29n23Q04p72J600j114j134J4M38L73l39k82p30K2
$$ 843 458 1564 1244 905 1093 1422 899 1703 931 2531 1417 283 297 735 1108 769 487 -243 -221
3417b21L50l56m14J36r79J30J183l50q83K67J1k75J71J25k69J974j558j19q6J049
$$ -221 129 -227 -641 -505 -1484 -1354 -171 -521 -1404 -1137 -1126 -1401 -1230 -1105 -1374 600 -958 -1077 -1163 -114
3437a14k04R94k638P39L56p62J164O45p84M02N21l59R31n70J39k11L36J63N22
$$ -114 -318 676 -1962 -1223 -867 -1629 -465 180 -604 -202 319 -40 891 321 460 249 585 748 1270
3456A270l45j33K49k36J14K35p90j67m97L36R31j617P26J22l49n22O45k1q80p23
$$ 1270 925 792 1041 805 919 1154 364 197 -300 36 967 -650 76 198 -151 -673 -28 -49 -929 -1652
3476a652J028Q04p99o16N50M47k04j12L88p25O0j60L25l20P96l37Q14j372J19
$$ -1652 -624 180 -619 -1235 -685 -238 -442 -554 -166 -891 -831 -991 -666 -986 -190 -527 287 -1085 -966
3495i66M81N50r17K031j027p58J018J078J2j394N35j18O68l24n97K13M12L9l03
$$ -966 -485 65 -852 1179 152 -606 412 1490 1502 108 643 525 1193 869 272 485 897 936 633
3514F33l10J30o19P11o80J474r78k67P07j658J050m72N73k013J123k03M8P34j034
$$ 633 323 453 -166 545 -135 1339 361 94 801 -857 193 -279 294 -1719 -596 -799 -751 -17 -1051
3533a051N38r86p1J086l07q47o54P06J981j100K73M4n40n53O43k42J082J88J53
$$ -1051 -513 -1499 -1570 -484 -791 -1638 -2292 -1586 395 -705 -432 -388 -928 -1481 -838 -1080 2 190 343
3552C43O41j89k95N41j93M62p12k97o8On45L92J018j193K46N24j36k79p35K8N99
$$ 343 984 795 500 1041 848 1310 598 301 233 239 -306 86 1104 -89 157 681 545 266 -469 -441 158
3573A58m51k27M40r10J005K40j420J51O83k64o79N36j198O58M91p71k17J68jJ05
$$ 158 -293 -520 -80 -990 15 255 -1165 -1014 -331 -595 -1274 -738 -1936 -1278 -787 -1558 -1775 -1607 -1608 -1503
3593a503K52N14n2J092j276J333M14j663Q70J32l93Q66m05j94J559k54l05m7o2
$$ -1503 -1251 -737 -789 303 -973 360 774 -889 -19 113 -280 586 181 -13 1546 1292 987 940 878
3612H78o45q3Q69n60j683J889J74K92q59P64R4j066J09M41p75p53N34n67L35J214
$$ 878 233 150 1019 459 -1224 665 839 1131 272 1036 1130 64 173 614 -161 -914 -380 -947 -612 602
3632F02m44j209m20M1J345j206P08j58n73K47O33r34N70R7o8J216j030Q49j01
$$ 602 158 -1051 -1471 -1430 -85 -1291 -583 -741 -1314 -1067 -434 -1368 -798 -701 -769 447 -583 266 165
3651A65n99R18q51L99M76O07N42j442K90j0N51J79j38j062M07K74o54Q78j79p37
$$ 165 -434 484 -367 32 508 1115 1657 215 505 495 1046 1225 1087 25 432 706 52 930 751 14
3671A4L77J40n61J16J400j219j6j260P73p9p63m03K103r79J24Lj166J798K92k256
$$ 14 391 531 -30 86 1486 267 251 -1009 -236 -315 -1078 -1481 622 -357 -233 -230 -1396 402 694 -1562
3691a562J038l23J02K50j84N07l38l08J52p5K90M33m30O9J299j085J130m97L82
$$ -1562 -524 -847 -745 -495 -679 -172 -510 -818 -666 -741 -451 -18 -448 -379 920 -165 965 468 850
3710H50q74M38J70k26M57j39R41k11q01L25J258q71j240J90K37M62j113J27J71
$$ 850 -24 414 584 358 815 676 1617 1406 605 930 2188 1317 77 267 504 966 -147 -20 151
3729A51M86L07j184K00O52j538J108j810R79MJ1o57J257r61J061l77j086J084
$$ 151 637 944 -240 -40 612 -926 182 -1628 -649 -645 -634 -1291 -34 -995 66 -311 -1397 -313
3747c13k78l10J010j333O31R72k61L06r94m9Q15k68M36Q5N44o05k63J25q31J157
$$ -313 -591 -901 109 -1224 -593 379 118 424 -570 -619 196 -72 364 449 993 388 125 250 -581 576
3767E76p76P70j714O55R34N61j064O26Q1p81O20p71k31J000P03q69k44j06m11
$$ 576 -200 570 -1144 -489 445 1006 -58 568 649 -132 488 -283 -514 486 1189 320 76 -30 -441
3786d41N23J16j55l83k27P78j462J09O10J44K99o58R80Mm09m75R34j328k73P96
$$ -441 82 198 43 -340 -567 211 -1251 -1142 -532 -388 -89 -747 233 237 -172 -647 287 -1041 -1314 -518
3806e18k97J164M77Q1j190M18k18L57O76o33O0m70M35m69M39L27m44l9J58jQk58
$$ -518 -815 349 826 907 -283 135 -83 274 950 317 377 -93 342 -127 312 639 195 156 314 313 321 63
3828F3N22n76l82J063r93O23j1m83P01j277O11j60q71J827j156k98M60K89l47
$$ 63 585 9 -373 690 -303 320 309 -174 527 -750 -139 -299 -1170 657 -499 -797 -337 -48 -395
3847c95R43m97p87J748j704J110q42J77L82k80m82P93O59j822J266l8N01r04L61
$$ -395 548 51 -736 1012 -692 418 -424 -247 135 -145 -627 166 825 -997 269 231 732 -172 189
3866A89J34P58j86m53J88O13k79J15j050P88K01n69n90j10J208k161J322L30r38
$$ 189 323 1081 895 442 630 1243 964 1079 29 817 1018 449 -141 -251 957 -1204 118 448 -490
3885d90O66j00K35l23j78n43M72K82j256N34P06p35k54J20N81Q04l16m31J87N84
$$ -490 176 76 311 -12 -190 -733 -261 21 -1235 -701 5 -730 -984 -864 -283 521 205 -226 -39 545
3905E45k00r36N06O06k41l48J387j206J47N20p48k09P54O37j07m37n06K76J12
$$ 545 345 -591 -85 521 280 -68 1319 113 260 780 32 -177 577 1214 1107 670 164 440 552
3924E52o47Q15q28m11R78l42J82N75j526J010n35O37j215J379j806N92O02l90
$$ 552 -95 720 -108 -519 459 117 299 874 -652 358 -177 460 -755 624 -1182 -590 12 -378
3942c78Q4k67M6O37L31j056R38j52N15j967Q64J189o86K92J58O45k328J110j24
$$ -378 -294 -561 -515 122 453 -603 335 183 698 -1269 -405 784 98 390 548 1193 -1135 -25 -149
3961a49K11O79q44J83n47P89n73O96M85j494Q34l73M19o30J316n91J23J069j673
$$ -149 62 741 -103 80 -467 322 -251 445 930 -564 270 -103 316 -314 1002 411 534 1603 -70
3980g0l43P16N60j636J090k72R00j870L77J557j415P66j128J820j287n20J92K57
$$ -70 -413 303 863 -773 317 45 945 -925 -548 1009 -406 360 -768 1052 -235 -755 -563 -306
3998c06J85L82m05m66N63j09R2o26R05M41k7j272J82P39Q49j172m95P84K46j551
$$ -306 -121 261 -144 -610 -47 -156 -64 -690 215 656 629 -643 -461 278 1127 -45 -540 244 490 -1061
4018a061J895q57O63P14j212N58P72p54k45j32j022J361n29p90O10L3K95j040
$$ -1061 834 -23 640 1354 142 700 1472 718 473 341 -681 680 151 -639 -29 4 299 -741
4036g41L49J53j24O31L55k33L78j350K16J690k012P24k58R84o45r42L65L72L36
$$ -741 -392 -239 -363 268 623 390 768 -582 -366 1324 -688 36 -222 762 117 -825 -460 -88 248
4055B48l24J23q05J037r1L07k25o05Q0J23L57l85M37p83J560l59l08p08R0oN42
$$ 248 -76 47 -758 279 188 495 270 -335 -255 -132 225 -160 277 -506 1054 695 387 -321 -231 -237 305
4076C05%P60j229m89P98r3j399Q08P76q60R25k1l36m74J004j428J476p93n26J043
$$ 305 305 1065 -164 -653 145 52 -1347 -539 237 -623 302 281 -55 -529 475 -953 523 -270 -796 247
4096B47j64m21R50j025L4K01j04k47J067j235Q31m61P51k72J5j6k01P26l78k99
$$ 247 83 -338 612 -413 -379 -178 -282 -529 538 -697 134 -327 424 152 167 151 -50 676 298 -1
4116aK24n38r93K55K68O85J70k32N67o23J112r33k39P38j605J748o32N68j259
$$ -1 223 -315 -1308 -1053 -785 -100 70 -162 405 -218 894 -39 -278 460 -1145 603 -29 539 -720
4135g20J690j328J71M9L67o39P92j045k9k06Q56p2K03k40P78r16k76N60q8M05
$$ -720 970 -358 -187 -138 229 -410 382 -663 -692 -898 -42 -114 89 -151 627 -289 -565 -5 -93 312
4155C12K18n79N3j93J145j764J157k14p20M92j35O45n59J005L60j122j93J85R85
$$ 312 530 -49 4 -189 956 -808 349 135 -585 -93 -228 417 -142 863 1223 101 -92 93 1078
4174A078j339J51j44K15l4N70o81K20L82n48O0L43p09K07KL95m67P22r73j23K43
$$ 1078 -261 -110 -254 -39 -73 497 -184 36 418 -130 -70 273 -436 -229 -227 168 -299 423 -550 -673 -430
4195d30o04J262j114N15O89n74R5R98k57j169k17Q07j94M28p62K04R18r87O46
$$ -430 -1034 228 -886 -371 318 -256 -161 837 580 -589 -806 1 -193 235 -527 -323 595 -392 254
4214B54m08J029r56K8j08O68k48P11j205J285j208k56Q85r52R0m96J835m85m22
$$ 254 -154 875 -81 -53 -161 507 259 970 -235 1050 -158 -414 471 -481 -391 -887 948 463 41
4233D1K28m63J216j131J80o29k9J21o11O85j61O47j452J726m02l70r9J07l27K65
$$ 41 269 -194 1022 -109 71 -558 -587 -466 -1077 -392 -553 94 -1358 368 -34 -404 -503 -396 -723 -458
4253d58J63j49o3m46J658o94n19J27M72j79N12J44j942J568m99M48J16L61m52
$$ -458 -295 -444 -507 -953 705 11 -508 -381 91 -88 424 568 -1374 194 -305 143 259 620 168
4272A68J12k31L75m14K13L33j075M95N83p38Q79q2j869J708p76J3M50P0Ok64J49
$$ 168 280 49 424 10 223 556 -519 -24 559 -179 700 618 -1251 457 -319 -306 144 214 220 -44 105
4293A05p02K40j021J105l70O21r62O85J659j361k16J211n94j027k8O48M1M68m9
$$ 105 -597 -357 -1378 -273 -643 -22 -984 -299 1360 -1 -217 994 400 -627 -655 -7 34 502 453
4312D53r37P37L65j4r03O51L21r89J070r91Q04o69l44M12N8o65J021k02j44r04
$$ 453 -484 253 618 604 -299 352 673 -316 754 -237 567 -102 -446 -34 24 -641 380 178 34 -870
4332h70R3m8Q88L5p46O30N15m91o07K40J56J02p41J142q8k9m82j28j69p11J10
$$ -870 -777 -825 63 98 -648 -18 497 6 -601 -361 -205 -103 -844 298 210 181 -301 -429 -598 -1309 -1199
4353a199N72P67n22l05P99n90R84R3j033J43m54P02J40P67j449R87J11p60M87
$$ -1199 -627 140 -382 -687 112 -478 506 599 -434 -291 -745 -43 97 864 -585 402 513 -247 240
4372B40l47K22L16m45J06j23L79m1k1j269m85J423l48M17L52K42q66P56J21j198
$$ 240 -107 115 431 -14 92 -31 348 307 286 -983 -1468 -45 -393 24 376 618 -248 508 629 -569
4392e69J925j520l60j52rJ89J350k021P68n9M02j83j153J881j773R25J01K86K40
$$ -569 1356 -164 -524 -676 -685 -496 854 -1167 -399 -458 -56 -239 -1392 489 -1284 -359 -258 28 268
4411B68p28K24j03J066o58p11K50N79j17J014jp90L4O4k55P24n92R81l58j496
$$ 268 -460 -236 -339 727 69 -642 -392 187 70 1084 1083 293 327 391 136 860 268 1249 891 -605
4431f05M62L21m42M10N73m13J63Q62j689J121o08J48o01K66j052J127l44O42K6
$$ -605 -143 178 -264 146 719 306 469 1331 -358 763 155 303 -298 -32 -1084 43 -301 341 367
4450C67n55O61q57r81L81J452j060O20j96m92N87n12L58K18j87Q8Q40j96j010
$$ 367 -188 473 -384 -1365 -984 468 -592 28 -168 -660 -73 -585 -227 -9 -196 -108 732 536 -474
4469d74R82M79K4j254J14J59j04J61M69o75N04o22J32N95j412K026r70l40O20
$$ -474 508 987 1011 -243 -129 30 -74 87 556 -119 385 -237 -105 490 -922 1104 134 -206 414
4488D14l96j76n12o1Q16l15K81r1N87j891J353n66N86k07K19o01m47J01K0J89
$$ 414 18 -158 -670 -731 85 -230 51 -40 547 -1344 9 -557 29 -178 41 -560 -1007 -906 -886 -697
4508f97L01jO96r97M65J78n32R5J60J02m26M39K63p4J94o70K00J277j406l33J649
$$ -697 -396 -397 299 -698 -233 -55 -587 -492 -332 -230 -656 -217 46 -28 166 -504 -304 973 -433 -766 883
4529H83l48k59l04Q03M02m52o38N27p46L06L62L76p34o42n60R35j22m35J120j203
$$ 883 535 276 -28 775 1177 725 87 614 -132 174 536 912 178 -464 -1024 -89 -211 -646 474 -729
4549g29J361j179l52P95k56K19P3j99l50K95j201P39o2J067q86l03L36L48J276
$$ -729 632 -547 -899 -104 -360 -141 -68 -267 -617 -322 -1523 -784 -846 221 -665 -968 -632 -284 992
4568I92j972J006L38j108J004j48p32J184p64M1L67K89M80n73L55n45J10j56N37
$$ 992 -980 26 364 -744 260 112 -620 564 -200 -159 208 497 977 404 759 214 324 168 705
4587G05rJ62q75L75j126Q99R99j329Q30j062O60N34o01m89n94J344M58j968M18
$$ 705 696 858 -17 358 -768 131 1130 -199 631 -431 229 763 162 -327 -921 423 881 -1087 -669
4606f69J72k98P34j48O47j66q79K53n73O6J536q23J54j45K08n86j38P86k10o81
$$ -669 -497 -795 -61 -209 438 272 -607 -354 -927 -861 675 -148 6 -139 69 -517 -655 131 -79 -760
4626g60J314R5N47j691J332J68n93J05P4l53Q58K03r52P31q11j34K92J002j122
$$ -760 554 649 1196 -495 837 1005 412 517 591 238 1096 1299 347 1078 267 133 425 1427 305
4645C05N14l06j247n56J247k06J86l7N31q19M77m43O73p31N01k75j129O35n05
$$ 305 819 513 -734 -1290 -43 -249 -63 -100 431 -388 89 -354 319 -412 89 -186 -1315 -680 -1185
4664a185P63l6J83o51k67K103r86o68P9J003n94J3J77L24K46l2r93J495j064K93
$$ -1185 -422 -458 -275 -926 -1193 910 -76 -744 -665 338 -256 -243 -66 258 504 472 -521 974 -90 203
4684B03k10P4J406m18r8o74O28M04j110J119n22k90R85j325L44M42p34q49O43
$$ 203 -7 67 1473 1055 957 283 911 1315 205 1324 802 512 1497 172 516 958 224 -625 18
4703A8j4L37r36P02l93M64m13L21k80o33K95j37P09j645J036j09K36K55J67j520
$$ 18 4 341 -595 107 -286 178 -235 86 -194 -827 -532 -669 40 -1605 -569 -678 -442 -187 -20 -1540
4723a540J164q38P39n44J56P21N31k63K09k39L15j30J11PK56K53j151J030r00
$$ -1540 -376 -1214 -475 -1019 -863 -142 389 126 335 96 411 281 392 399 655 908 -243 787 -113
4742a13L04O32o24k10L54J27o08N22j037J190L95j619M89Q58m6p96l85O95j91
$$ -113 191 823 199 -11 343 470 -138 384 -653 537 932 -687 -198 660 614 -182 -567 128 -63
4761f3n6j79J5k96l83j00L36R58k61q99M96r13J17J078n15N76L75o42j29R50m09
$$ -63 -119 -298 -283 -579 -962 -1062 -726 232 -29 -928 -432 -1345 -1228 -150 -665 -89 286 -356 -485 465 56
4782E6Q57j072O77N42o06n26R74l00kN65j03p74P79K82n50q91J022q17K83N97
$$ 56 913 -159 518 1060 454 -72 902 602 600 1165 1062 288 1067 1349 799 -92 930 113 396 993
4802I93L39n16r39L38J97n48M98M02n53j852L07P56N9j41k70M7R57j172M74O16
$$ 993 1332 816 -123 215 412 -136 362 764 211 -1641 -1334 -578 -519 -660 -930 -883 74 -1098 -624 -8
4822hp6P72K82q08R3j453m27J949m35R51j506L16N64l50O17m49J229j118N89k28
$$ -8 -84 688 970 162 255 -1198 -1625 324 -111 840 -666 -350 214 -136 481 32 1261 143 732 504
4842E04M21M7n21j93L92j98J57N83j7o98n03R81J15j168O05j95l47M75l46m82
$$ 504 925 972 451 258 650 452 609 1192 1175 477 -26 955 1070 -98 507 312 -35 440 94 -388
4862c88J153k207M96O38l68N1p72J371r95P87m87O19o93j261N01P21N74j75k94
$$ -388 765 -1442 -946 -308 -676 -625 -1397 -26 -1021 -234 -721 -102 -795 -2056 -1555 -834 -260 -435 -729
4881g29K22R46p01L93n01J133J47j488J296n99l33N23L00Q5m02q5m15J429j170
$$ -729 -507 439 -262 131 -370 763 910 -578 718 119 -214 309 609 694 292 207 -208 1221 51
4900E1Q46J416k042N40p39K14k6o25j74Q63n23n38M01N69j227Q37k93M41n53l5
$$ 51 897 2313 271 811 72 286 260 -365 -539 324 -199 -737 -336 233 -994 -157 -450 -9 -562 -597
4920e97K71m34p86J134L1L54p72N4L72K71q02r6R38n07J33l85P75m14n86J014
$$ -597 -326 -760 -1546 -412 -381 -27 -799 -745 -373 -102 -904 -1000 -62 -569 -436 -821 -46 -460 -1046 -32
4940c2P36M09j140J162j050J38O31oo81Q95k61M1k45O66J53r95L87%q64K64p14
$$ -32 704 1113 -27 1135 85 223 854 848 167 1062 801 842 597 1263 1416 421 808 808 -56 208 -506
4961e06R40j74L28j66o13R58j429j49N42M9k85J073l0j780N37L92q0o77K62j481
$$ -506 434 260 588 422 -191 767 -662 -811 -269 -220 -505 568 538 -1242 -705 -313 -393 -1070 -808 -2289
4981b289J705J48j8K28R3J214l34k39P6r13L79K8P08j493Q44o65R92L62o61oL38
$$ -2289 -584 -436 -454 -226 -133 1081 747 508 584 -329 50 78 786 -707 137 -528 464 826 165 159 497
5002D97O27r77O25L95j03q66K85O90q15J07L1m02k81L50p01p48R57Q7m40M98l0
$$ 497 1124 147 772 1167 1064 198 483 1173 358 465 496 94 -187 163 -538 -1286 -329 -242 -682 -184 -214
5023b14m61Q21m13l58o95O29J28O32r45j72M62K17M27r48J624j140J244k079L30
$$ -214 -675 146 -267 -625 -1320 -691 -563 69 -876 -1048 -586 -369 58 -890 734 -406 838 -1241 -911
5042i11j38O18O29K74m51J51O63R9j96q6J99k56K05J166p75o86L00K09r41m45
$$ -911 -1049 -431 198 472 21 172 835 934 738 652 851 595 800 1966 1191 505 805 1014 73 -372
5062c72Q40j87o38K33K76J62K62o9q22K64j8p66L4l30K44L3l88L98R43K14q51
$$ -372 468 281 -357 -124 152 314 576 507 -315 -51 -69 -835 -801 -1131 -887 -854 -1242 -844 99 313 -538
5083e38l96r0M85o0L58L33m77l11K7J435j221j73Q41n3r0m79N98J004j09O8p8
$$ -538 -934 -1024 -539 -599 -241 92 -385 -696 -669 766 -455 -628 213 160 70 -409 189 1193 1084 1152 1074
5104A074p31K30m13M48O08q51N80m79K14n91J276l47k85q09M94j698J250l87l93
$$ 1074 343 573 160 608 1216 365 945 466 680 89 1365 1018 733 -76 418 -1280 -30 -417 -810
5123h10J231l87N38n27k87l89J139o89p33O10o91P71r6j88l47M98j175J32N00
$$ -810 421 34 572 45 -242 -631 508 -181 -914 -304 -995 -224 -320 -508 -855 -357 -1532 -1400 -900
5142i00n27J255N63J77m08j023O21K38J99L47j153L57Q86J3L29Q06j581N94j91
$$ -900 -1427 -172 391 568 160 -863 -242 -4 195 542 -611 -254 632 645 974 1780 199 793 602
5161F02p09n27J006m33J248j51j185J690j570n67J718j358n42R78r44Q13n67N49
$$ 602 -107 -634 372 -61 1187 1036 -149 1541 -29 -596 1122 -236 -778 200 -744 69 -498 51
5179E1n93q6j25K39L09n34J62n48j151J494K60o22L36O58r77J390M2j370O98J73
$$ 51 -542 -628 -753 -514 -205 -739 -577 -1125 -2276 -782 -522 -1144 -808 -150 -1127 263 305 -1065 -367 -194
$$ [...]
8191d44
##END NTUPLES=NMR FID
##END=
