##TITLE=1H_KYU-20'+DMSO 2d
 CDCl3, 100 sc, 
 15.3.2019
##JCAMPDX= 6.0         $$ Bruker NMR JCAMP-DX V2.0
##DATA TYPE= NMR FID
##DATA CLASS= NTUPLES
##ORIGIN= UXNMR, Bruker Analytische Messtechnik GmbH
##OWNER= root
$$ XWIN-NMR		Version 3.5
$$ Fri Mar 15 17:17:09 2019 Russian Standard Time (UT+4h)  she@DPX200
##.OBSERVE FREQUENCY= 200.1316
##.OBSERVE NUCLEUS= ^1H
##.DELAY= (6, 6)
##.ACQUISITION MODE= SIMULTANEOUS
##.ACQUISITION SCHEME= undefined
##.AVERAGES= 100
##.DIGITISER RES= 16
##SPECTROMETER/DATA SYSTEM= spect
##.PULSE SEQUENCE= zg30
##.SOLVENT NAME= CDCl3
##.SHIFT REFERENCE= (INTERNAL, CDCl3, 0, 15.7039)
##AUDIT TRAIL= $$ (NUMBER, WHEN, WHO, WHERE, WHAT)
$$ ##TITLE= Audit trail, XWIN-NMR		Version 3.5
$$ ##JCAMPDX= 5.01
$$ ##ORIGIN= Bruker BioSpin GmbH
$$ ##OWNER= she
$$ F:/spectra/data/she/nmr/H-F/1/audita.txt
$$ ##AUDIT TRAIL=  $$ (NUMBER, WHEN, WHO, WHERE, WHAT)
(   1,<2019-03-15 17:14:24.59 +0400>,<she>,<DPX200>,
      <created by zg, POWCHK disabled, PULCHK disabled
       configuration hash MD5:
       00 E9 B6 7A A2 85 ED C7 34 08 36 98 17 FE 4E 26
       data hash MD5: 16K
       F3 6D 85 F4 91 62 68 BA 23 A6 CB BD 04 2B D1 EB>)
$$ ##END=
$$ 
$$ hash MD5
$$ CC E0 9A 16 1B 8C 71 29 51 1B 53 05 A0 F0 A3 C4
##$RELAX= 
##$RELAX= 
##$RELAX= 
##$RELAX= 
##$RELAX= 
##$RELAX= 
$$ Bruker specific parameters
$$ --------------------------
##$DU= <F:/spectra>
##$EXPNO= 1
##$NAME= <H-F>
##$PROCNO= 1
##$TYPE= <nmr>
##$USER= <she>
##$AMP= (0..31)
100 100 100 100 100 100 100 100 100 100 100 100 100 100 100 100 100 100 
100 100 100 100 100 100 100 100 100 100 100 100 100 100 
##$AQSEQ= 0
##$AQ_mod= 1
##$AUNM= <au_zg>
##$AUTOPOS= <>
##$BF1= 200.13
##$BF2= 200.13
##$BF3= 200.13
##$BF4= 200.13
##$BF5= 200.13
##$BF6= 200.13
##$BF7= 200.13
##$BF8= 200.13
##$BYTORDA= 1
##$CFDGTYP= 0
##$CFRGTYP= 5
##$CHEMSTR= <none>
##$CNST= (0..31)
1 1 145 1 1 1 1 1 1 1 1 1 1 1 1 1 1 1 1 1 1 1 1 1 1 1 1 1 1 1 1 1 
##$CPDPRG= <>
##$CPDPRG1= <>
##$CPDPRG2= <>
##$CPDPRG3= <>
##$CPDPRG4= <mlev>
##$CPDPRG5= <mlev>
##$CPDPRG6= <mlev>
##$CPDPRG7= <mlev>
##$CPDPRG8= <mlev>
##$CPDPRGB= <>
##$CPDPRGT= <>
##$D= (0..31)
0 1.2 0 0 0 0 0 0 0 0 0 0.03 0 0 0 0 0 0 0 0 0 0 0 0 0 0 0 0 0 0 0 0 
##$DATE= 1552655663
##$DBL= (0..7)
120 120 120 120 120 120 120 120 
##$DBP= (0..7)
150 150 150 150 150 150 150 150 
##$DBP07= 0
##$DBPNAM0= <>
##$DBPNAM1= <>
##$DBPNAM2= <>
##$DBPNAM3= <>
##$DBPNAM4= <>
##$DBPNAM5= <>
##$DBPNAM6= <>
##$DBPNAM7= <>
##$DBPOAL= (0..7)
0.5 0.5 0.5 0.5 0.5 0.5 0.5 0.5 
##$DBPOFFS= (0..7)
0 0 0 0 0 0 0 0 
##$DE= 6
##$DECBNUC= <off>
##$DECIM= 2
##$DECNUC= <off>
##$DECSTAT= 4
##$DIGMOD= 1
##$DIGTYP= 9
##$DL= (0..7)
0 120 120 120 120 120 120 120 
##$DP= (0..7)
150 150 150 150 150 150 150 150 
##$DP07= 0
##$DPNAME0= <>
##$DPNAME1= <>
##$DPNAME2= <>
##$DPNAME3= <>
##$DPNAME4= <>
##$DPNAME5= <>
##$DPNAME6= <>
##$DPNAME7= <>
##$DPOAL= (0..7)
0.5 0.5 0.5 0.5 0.5 0.5 0.5 0.5 
##$DPOFFS= (0..7)
0 0 0 0 0 0 0 0 
##$DQDMODE= 0
##$DR= 16
##$DS= 0
##$DSLIST= <SSSSSSSSSSSSSSS>
$$ [...]
##$SUBNAM2= <"">
##$SUBNAM3= <"">
##$SUBNAM4= <"">
##$SUBNAM5= <"">
##$SUBNAM6= <"">
##$SUBNAM7= <"">
##$SUBNAM8= <"">
##$SUBNAM9= <"">
##$SW= 359.47569520838
##$SWIBOX= (0..15)
0 0 2 0 0 0 0 0 0 0 0 0 0 0 0 0 
##$SW_h= 71942.4460431655
##$TD= 16384
##$TD0= 1
##$TE= 0
##$TE2= 300
##$TE3= 300
##$TEG= 300
##$TL= (0..7)
0 120 120 120 120 120 120 120 
##$TP= (0..7)
150 150 150 150 150 150 150 150 
##$TP07= 0
##$TPNAME0= <>
##$TPNAME1= <>
##$TPNAME2= <>
##$TPNAME3= <>
##$TPNAME4= <>
##$TPNAME5= <>
##$TPNAME6= <>
##$TPNAME7= <>
##$TPOAL= (0..7)
0.5 0.5 0.5 0.5 0.5 0.5 0.5 0.5 
##$TPOFFS= (0..7)
0 0 0 0 0 0 0 0 
##$TUNHIN= 0
##$TUNHOUT= 0
##$TUNXOUT= 0
##$USERA1= <user>
##$USERA2= <user>
##$USERA3= <user>
##$USERA4= <user>
##$USERA5= <user>
##$V9= 5
##$VALIST= <valist>
##$VCLIST= <CCCCCCCCCCCCCCC>
##$VD= 0
##$VDLIST= <DDDDDDDDDDDDDDD>
##$VPLIST= <PPPPPPPPPPPPPPP>
##$VTLIST= <TTTTTTTTTTTTTTT>
##$WBST= 1024
##$WBSW= 4
##$XGAIN= (0..3)
0 0 0 0 
##$XL= 0
##$YL= 0
##$YMAX_a= 610301
##$YMIN_a= -227688
##$ZGOPTNS= <>
##$ZL1= 120
##$ZL2= 120
##$ZL3= 120
##$ZL4= 120
##$ABSF1= 10
##$ABSF2= 0
##$ABSG= 5
##$ABSL= 3
##$ALPHA= 0
##$AQORDER= 0
##$ASSFAC= 0
##$ASSFACI= 0
##$ASSFACX= 0
##$ASSWID= 0
##$AUNMP= <proc_1d>
##$AZFE= 0.1
##$AZFW= 0.1
##$BCFW= 1
##$BC_mod= 2
##$BYTORDP= 1
##$COROFFS= 0
##$CY= 11.3945322036743
##$DATMOD= 1
##$DC= 2
##$DFILT= <>
##$DTYPP= 0
##$F1P= 18.9103706918063
##$F2P= -1.10871071338519
##$FCOR= 0.5
##$FTSIZE= 0
##$FT_mod= 4
##$GAMMA= 1
##$GB= 0.15
##$INTBC= 1
##$INTSCL= 1
##$ISEN= 128
##$LB= 0.24
##$LEV0= 0
##$LPBIN= 0
##$MAXI= 10000
##$MC2= 0
##$MEAN= 0
##$ME_mod= 0
##$MI= 1.114404
##$NCOEF= 0
##$NC_proc= 0
##$NLEV= 6
##$NOISF1= 3.799351
##$NOISF2= 2.8
##$NSP= 1
##$NTH_PI= 0
##$NZP= 0
##$OFFSET= 15.70392
##$PC= 1
##$PHC0= -9165.694
##$PHC1= 15.20026
##$PH_mod= 1
##$PKNL= yes
##$PPARMOD= 0
##$PSCAL= 0
##$PSIGN= 0
##$REVERSE= no
##$SF= 200.130013532006
##$SI= 16384
##$SIGF1= 3
##$SIGF2= 2
##$SINO= 400
##$SIOLD= 16384
##$SREGLST= <1H.CDCl3>
##$SSB= 0
##$STSI= 0
##$STSR= 0
##$SW_p= 3612.71676300578
##$SYMM= 0
##$S_DEV= 0
##$TDeff= 0
##$TDoff= 0
##$TI= <>
##$TILT= no
##$TM1= 0
##$TM2= 0
##$TOPLEV= 0
##$USERP1= <user>
##$USERP2= <user>
##$USERP3= <user>
##$USERP4= <user>
##$USERP5= <user>
##$WDW= 1
##$XDIM= 8192
##$YMAX_p= 0
##$YMIN_p= 0
$$ End of Bruker specific parameters
$$ ---------------------------------
##NTUPLES= NMR FID
##VAR_NAME=  TIME,          FID/REAL,        FID/IMAG
##SYMBOL=    X,             R,               I
##VAR_TYPE=  INDEPENDENT,   DEPENDENT,       DEPENDENT
##VAR_FORM=  AFFN,          ASDF,            ASDF
##VAR_DIM=   8192,          8192,            8192
##UNITS=     SECONDS,       ARBITRARY UNITS, ARBITRARY UNITS
##FACTOR=    1.39e-05,      1,               1
##FIRST=     0,             0,               0
##LAST=      0.1138549,     0,               0
##MIN=       0,             -227688,         0
##MAX=       0.1138549,     610301,          0
$$ Real data points
##PAGE= N=1
##DATA TABLE= (X++(R..R)), XYDATA
0 -2 -3 -8 -4 -15 -9 -32 0 -36 9 -42 18 -48 28 -62 43 -76 55 -89 82 -109 105 -129 135 -163 168 -205 214 -249
28 -249 268 -303 338 -391 434 -506 582 -681 805 -973 1215 -1573 2168 -3223 5551 -12645 65601
45 65601 610301 456062 415852 393739 370868 354939 336687 323488 309551 296614 284568 271870
57 271870 259705 248526 236988 225834 215318 204957 193557 183079 172175 162412 151641 141857
69 141857 132638 123198 113463 104749 95744 87077 79017 71038 62569 55710 48047 40555 34633 28202 22058
84 22058 15743 9754 4033 -1523 -5257 -10364 -14910 -18814 -23016 -26844 -29660 -33318 -34571 -38392 -40409
99 -40409 -42736 -45765 -47539 -48974 -49881 -52066 -53382 -54058 -55248 -55623 -55526 -56101 -55828 -56264 -56305 -56441 -55755 -55910
117 -55910 -55448 -54778 -54712 -53384 -53283 -52435 -52626 -51592 -51208 -51694 -50322 -50717 -49197 -48092 -48733 -48527 -47245 -48149
135 -48149 -47476 -47434 -48078 -47025 -47503 -46538 -46229 -45931 -45555 -46259 -46478 -47139 -47472 -47548 -47595 -46529 -47080 -47105 -46659 -47053
155 -47053 -46742 -45623 -45623 -44312 -44094 -43157 -42961 -42445 -41130 -40674 -39582 -37495 -36248 -35533 -33054 -31803 -30311
172 -30311 -28688 -25456 -24033 -22392 -20910 -18033 -15954 -12640 -10197 -7718 -5267 -2971 50 1988 6300
187 6300 8589 10480 14350 16756 18560 21495 23962 26351 29475 32310 35955 37146 39155 40896 44304
202 44304 45633 47236 48174 50161 51789 53510 54897 56006 59098 57181 58727 59945 60457 59723 59934 59856
218 59856 60563 60821 60867 59814 58941 58655 56887 56576 56055 54867 53540 52060 51896 49870 47810 46169 44443
235 44443 42135 40964 38995 37297 35166 33275 30924 30443 28169 25775 23372 21717 19853 17598 16627
250 16627 13946 13304 10510 9459 6810 6611 3831 1555 1304 -688 -1457 -3097 -4407 -5478 -5993 -7967
266 -7967 -7975 -10098 -10760 -11393 -13552 -13556 -14395 -14373 -15509 -16357 -16994 -17750 -18665 -19149 -20010 -20532 -21556 -21522 -22560 -22966
286 -22966 -23917 -24129 -25122 -25117 -25772 -26185 -26131 -28406 -28923 -28426 -30445 -30550 -31064 -31670 -31848 -32494 -33060 -33902 -34177 -33557
306 -33557 -35337 -35362 -35416 -35710 -36891 -36434 -36325 -36837 -36433 -37248 -36818 -37289 -37113 -37950 -37650 -37609 -37393 -36972 -36435 -35696
326 -35696 -35998 -35735 -35293 -34640 -33659 -32941 -32749 -31957 -30191 -29993 -27844 -27245 -27298 -25731 -25237 -24167 -22326 -22209
344 -22209 -18774 -18514 -16952 -16239 -15219 -12982 -11768 -10978 -9346 -7812 -6519 -4884 -4453 -2166 -962 591
360 591 2519 4099 4215 6268 7325 7918 9872 10699 11927 12845 13558 15476 15115 16155 17974 18614 19104
377 19104 20889 21680 21355 22121 22411 23330 23151 23813 24724 23720 24178 25528 26230 24989 26646 26159 25458 25803
395 25803 26011 26761 26564 25962 26000 26798 26639 26640 25044 26227 25662 25894 24390 24774 25509 25508 24827 24296 24724 23606
415 23606 24426 23752 23325 22885 22072 22247 22455 20889 20895 21224 21091 20295 19874 19107 19487 19615 18793 17151 19123
434 19123 18539 15744 16532 15057 15806 14909 14011 13929 13082 12810 12416 10648 10541 9261 8878 7549 7416 6845
452 6845 5463 5123 4905 3684 3070 1753 985 1059 -913 -1730 -1955 -2953 -3053 -4689 -5803 -6242 -7634 -9017
470 -9017 -9532 -9472 -10267 -11856 -12655 -12744 -14121 -13956 -15309 -15779 -16108 -16228 -17184 -18014 -18133 -17082 -17310 -18072 -19269
489 -19269 -18769 -19675 -18563 -19218 -19708 -18744 -18869 -19123 -18875 -18410 -18199 -18390 -17717 -17590 -17852 -16895 -17336 -15774 -15966
508 -15966 -14745 -13900 -13208 -14345 -12901 -12695 -12160 -11627 -12111 -10242 -9784 -8348 -7902 -8383 -7049 -5944 -5856 -4477
526 -4477 -4262 -3486 -2695 -2349 -2317 -1462 -238 -119 662 832 1246 1560 2665 2797 4366 3739 4311 5155 4791
545 4791 5675 6603 7034 7488 7851 7803 8736 8923 8587 10018 10715 10223 10244 11810 11752 11307 11925 11750 12331 13588
565 13588 12724 13752 14722 14455 14863 15343 15152 15641 16058 15690 16349 16666 16754 16565 17303 17552 18093 18120 17463 18505
585 18505 18279 19050 18557 18979 19111 19872 19774 19183 19580 20110 19792 19325 20056 19354 19741 18496 18796 18892 18760 18423
605 18423 17530 18696 16881 17063 16931 16449 17079 14845 15167 14789 12896 12817 12339 11826 11029 11930 9680 8642
623 8642 8899 8211 7582 6330 5669 5733 4097 3447 3090 2600 1475 1125 21 -1033 -1874 -2949 -2666 -3766
641 -3766 -4509 -4798 -6632 -5876 -7198 -7854 -8412 -9181 -9078 -9154 -11336 -10503 -11198 -12704 -11987 -12395 -13110 -13555 -13060
660 -13060 -13389 -13555 -14924 -15426 -14057 -14811 -14838 -15279 -14997 -15395 -15131 -14892 -15692 -15829 -15460 -13930 -15124 -15050 -14795
679 -14795 -14795 -14999 -14482 -15027 -13457 -13872 -14331 -13636 -14538 -12682 -13181 -13751 -12035 -12176 -11400 -11795 -11421 -11284 -10465
698 -10465 -10758 -10502 -9457 -9843 -8672 -8926 -7485 -7947 -7846 -7411 -7402 -6494 -5905 -6414 -6569 -4073 -4763 -4614 -3466
717 -3466 -5041 -3631 -3176 -3002 -2798 -1686 -1489 -1004 -1353 734 -154 -41 960 1149 3143 2587 3176 3139
735 3139 3065 4564 4776 5146 5308 5316 7246 7103 7711 7962 7159 8292 8785 8953 9753 10144 10108 11044 10349 11149
755 11149 11736 11583 12219 11571 11586 12498 13197 13192 12921 12458 13128 14059 13243 12694 13840 13718 13218 13601 12815 13735
775 13735 12843 13321 13021 12257 12877 12733 12229 12524 11911 11832 10366 10056 10268 9562 8913 8536 8300 7491 8294 8700
795 8700 6500 6494 5804 5003 4024 5832 3692 3823 3333 2896 1806 2664 1160 777 270 -1110 -232 -831 -1435
814 -1435 -1741 -2583 -3511 -3436 -4621 -3976 -4119 -5267 -6103 -5958 -5891 -6170 -6795 -7157 -7246 -7816 -8125 -8658 -8108 -8850
834 -8850 -8473 -8904 -9568 -9690 -8898 -10327 -9629 -9955 -11803 -9383 -11234 -11266 -11060 -11668 -11770 -11379 -11327 -10588 -11854
853 -11854 -11416 -11956 -12277 -11620 -11938 -12419 -11493 -11470 -11960 -11099 -10890 -10818 -10912 -10117 -12263 -11608 -11780 -10745 -10401 -10733
873 -10733 -11719 -9779 -10348 -10356 -9929 -9125 -8533 -8923 -8830 -8598 -7849 -8336 -7989 -7896 -6592 -7468 -6926 -6681 -6349 -5154
893 -5154 -4905 -5503 -4052 -4318 -4825 -3550 -3094 -2858 -2206 -2738 -1756 -925 -211 -602 555 -290 562 1796 1621
912 1621 2569 2060 2818 2335 4301 4174 4807 4612 5045 4463 6226 6440 6106 6477 6412 7123 7294 7224 7319 7952
932 7952 8584 8667 8911 8282 8199 8680 8744 9314 9278 9187 10342 9270 9666 10137 9792 8530 9135 9292 9629 8537
952 8537 10274 9365 9741 8785 7946 8802 9496 9109 9901 7965 8317 7450 8703 7813 7894 7624 6898 6706 6476
971 6476 7559 6487 6718 6122 6150 5948 5569 6302 4887 4294 4918 5138 4164 4358 3694 3711 3665 3567 2868 3454
991 3454 2066 2300 2236 1944 1778 2222 1376 54 749 701 808 -68 -396 -517 527 -1000 -833 -645 -1423
1010 -1423 -71 -1674 -2224 -1587 -2876 -2435 -2502 -3004 -3657 -3164 -3516 -2909 -4058 -3213 -4354 -4333 -4994 -4598 -4084
1029 -4084 -5871 -4655 -5299 -4966 -5328 -5863 -6472 -5820 -5427 -5043 -5551 -5769 -5132 -5007 -6371 -5455 -5879 -5441 -5460
1048 -5460 -6033 -5666 -6233 -6579 -6087 -5266 -6343 -5309 -5321 -5301 -4397 -5395 -4990 -5533 -4862 -4844 -4140 -3509 -4873 -3411
1068 -3411 -4355 -4284 -4184 -3444 -3409 -2617 -2502 -2045 -2134 -2416 -1806 -2191 -1675 -1577 -767 -1955 -1889 -2235 -171 -890 -576
1089 -576 -256 -874 -50 569 442 -35 1006 1262 1623 1198 1554 710 171 1729 983 1861 1923 1896 1379 1709
1109 1709 2005 1963 2524 3052 2953 3328 3242 2712 2868 3605 2978 3480 4127 4870 3905 4958 4618 3169 4226 3733
1129 3733 4657 4865 4355 3821 4557 4294 3695 4297 4641 4565 4420 4847 5434 3952 4473 3271 4425 4756 3643
1148 3643 5087 4481 5369 5032 5309 5042 4995 4179 5381 4985 4959 4677 2836 4673 3974 4365 4770 4471 4777
1167 4777 3160 2700 3101 2580 2781 2366 3053 2958 2318 2181 2140 1674 2281 2041 1167 2286 1498 846 -39 437
1187 437 299 383 243 -268 -839 325 -525 -1297 -973 -1388 -1336 -1229 -1281 -1869 -414 -1724 -2860 -2404 -1938 -3138
1207 -3138 -2997 -2028 -2709 -2704 -1976 -3407 -2988 -4041 -3565 -2915 -4291 -3221 -3706 -3406 -2942 -3753 -3859 -3663 -3435
1226 -3435 -4223 -3431 -2348 -3748 -3041 -4332 -3567 -3034 -3608 -4211 -3018 -3892 -4083 -2956 -4051 -3450 -4048 -3597
1244 -3597 -2701 -3326 -3051 -3264 -3448 -2624 -2907 -3120 -2295 -4239 -3302 -2470 -3726 -1872 -3324 -2401 -3550 -3845
1262 -3845 -2441 -2893 -2674 -3175 -3135 -2775 -2586 -3640 -2530 -1699 -2761 -2818 -1416 -2300 -1680 -1350 -2896 -1673
1280 -1673 -2110 -2975 -2359 -1914 -2854 -2031 -2129 -2190 -1332 -737 -1258 -2077 -1311 -932 -853 -1929 -432 -847 163 -489
1300 -489 -166 -1180 288 556 296 272 -282 905 994 449 1594 1290 607 1218 1129 1378 1471 1905 2580 2110
1320 2110 2083 2580 2642 1509 2906 3078 2681 3527 2792 2880 2613 2532 3098 2910 2461 3176 3039 1981 3017 3798
1340 3798 3435 2651 2163 1976 3350 2476 3333 3112 3067 2340 2621 2859 2085 1651 3460 2177 1916 1732 1712
1359 1712 2699 2005 2480 1762 1128 932 1725 1609 1301 1485 1867 1125 -116 1656 1514 -44 655 8 515
1378 515 87 1013 -715 515 -83 -743 -1056 392 -235 252 -268 -278 50 -579 -164 -1076 -649 -1170 -278
1397 -278 -380 -1001 -159 -1171 -778 -1413 -1761 -774 -1051 -1081 -1352 -1734 -1399 -1460 -651 -1794 -1990 -1832 -929 -1817
1417 -1817 -2260 -2025 -1610 -1666 -2570 -3178 -1035 -1013 -1132 -2243 -874 -1617 -2550 -2632 -2163 -2487 -1081 -2020 -1819
1436 -1819 -1835 -1291 -1889 -1932 -2366 -2209 -1703 -2201 -2764 -2271 -2255 -1972 -1901 -2093 -2337 -2103 -2972 -2672 -2200 -2581 -1375
1457 -1375 -1942 -1359 -1487 -2500 -1160 -1551 -1902 -2151 -1418 -2100 -995 -512 -2134 -1592 -1332 -971 -779 -1327
1475 -1327 -332 -1081 -1081 33 35 453 -107 -105 394 -494 26 -243 -944 554 1085 -828 368 394 20 795 597
1496 597 815 1403 1062 1451 1556 546 1088 1587 1329 1320 1246 1668 2107 1517 218 1265 2633 1703 1430 1803
1516 1803 2946 783 1551 1507 1364 2212 1646 1535 1822 1373 667 2789 1565 1553 1753 1547 1227 2076 1314
1535 1314 17 1035 1820 1729 1844 985 1276 995 1144 1649 1074 917 218 1697 1427 1527 1063 512 1536
1554 1536 693 1347 197 156 -195 594 906 1072 413 157 -377 951 418 345 460 833 -27 -364 511 261
1574 261 486 -726 -376 546 -93 877 839 315 9 -523 31 -196 -860 45 -253 1270 -343 343 -686
1593 -686 190 -60 -667 8 -74 -523 -716 -692 -111 4 -610 143 -541 191 -287 -930 -81 -1173 -1903 -1249
1613 -1249 -132 -625 -1034 -700 -1228 -1003 -1764 -565 -1166 -666 -293 -363 -737 -211 -1931 -1428 -191 -725 -1343
1632 -1343 -1425 -406 -1514 -678 -719 -296 -910 -978 -1718 -2036 -666 -880 -1338 -567 -1449 -235 -1120 -1593 14
1651 14 -660 -1777 -1153 -1366 -799 -269 -420 -659 -367 -915 -1001 -441 -785 625 -799 162 -131 531 -172 577
1671 577 211 -926 237 -78 -286 -698 1336 228 -1279 -156 -167 1037 777 175 826 -192 1047
1688 1047 -146 379 1375 775 1406 -433 383 149 435 1029 84 815 477 231 1150 1254 460 141 1295
1707 1295 621 1352 1451 1061 371 1177 132 563 690 -648 1050 1090 207 1558 1029 -426 676 -162
1725 -162 771 287 274 934 433 585 1 37 472 193 281 227 1231 268 1242 610 307 414 59 462 478
1746 478 138 972 1053 766 1376 -623 696 -675 383 427 -284 -420 365 835 956 423 286 859 -34
1765 -34 870 156 805 1068 -214 808 371 106 -291 273 -980 -261 346 881 468 373 -520 -712 -1313 148
1785 148 -375 118 -406 322 110 -973 196 -676 -363 -602 756 -1424 -872 -1362 -219 -246 -872 -893 -867
1804 -867 -1588 -465 -1438 -523 -902 -819 -2179 -688 -881 -1299 -1121 -1596 -788 -677 -574 -886 -804 -1285 -1046 -1187
1824 -1187 -1080 -1134 -1534 -1830 -344 -1496 -276 -2492 -1722 -73 -1111 -1606 -1437 -1457 -881 -1038 -1079 -1164 -1437
1843 -1437 -2025 -1069 -368 -1697 -1443 -1152 -579 328 -605 -392 -985 -544 -212 -343 364 -571 -468 -1034 -506
1862 -506 -754 -652 -762 -48 -238 -1167 449 -238 46 141 -253 239 -137 -927 -287 1016 306 1039 33
1881 33 535 -362 -288 223 149 477 -13 394 983 -28 218 -308 -779 -423 170 197 145 -70 -150 1503 -18
1902 -18 1809 -317 -703 229 45 838 767 469 1295 1677 1502 245 439 580 133 326 1238 1357 793 758
1922 758 390 701 1540 1098 790 1237 1142 1026 654 1217 572 422 568 1606 770 504 2349 877 1123
1941 1123 1533 930 1671 579 651 708 259 450 1214 889 1068 652 761 -52 370 509 -9 272 504 750
1961 750 -19 -169 312 294 480 412 -511 -609 247 -34 -907 -357 -345 -47 74 262 -52 -1220 -717 -547 -255
1982 -255 -1146 -73 -280 -1005 -196 -52 -1407 -678 -1275 -728 -1063 -1537 -472 -54 -974 -1708 -472 -1509
2000 -1509 -847 -1887 -1176 -1345 -1180 -708 81 -952 -371 -414 -1301 -1020 -148 -1264 -1170 -658 -427 -1170 -953
2019 -953 -889 -136 -660 -1520 235 -152 -924 -865 -949 -1512 135 -1074 -622 -1517 -1087 -1052 -803 -1165 -1720 83
2039 83 -41 -510 -877 -434 -547 -1113 -191 1078 -482 -69 -424 46 -95 -346 -51 -326 47 735 -872
2058 -872 -448 377 -660 129 3 -53 -331 304 424 280 411 -161 657 -94 548 1387 991 77 -82 178
2078 178 1159 901 497 -329 -111 1284 787 572 1004 1088 -402 867 1471 -244 1386 682 1236 779 276
2097 276 644 235 932 254 1089 479 730 382 303 1265 -168 459 772 286 1796 673 707 369 458 843
2117 843 422 1551 516 -187 1466 1362 82 1184 722 895 421 539 625 303 460 1028 268 -203 637
2136 637 92 973 -621 -334 311 -838 596 -315 -69 779 314 56 -280 -67 85 -319 100 351 -167
2155 -167 -229 -452 -390 -689 942 -112 -179 161 -952 -680 -953 -323 -1126 -456 -353 664 -1378 -1055 816
2174 816 -913 82 -860 -699 -182 -286 -1376 -195 -924 -226 -643 -185 -720 -55 -1381 -715 -571 -770 -433
2193 -433 -1168 -520 -1243 -1142 -1426 -217 -309 -589 -1433 -185 -1282 -1284 -805 -1107 -380 -585 -337 -796 -568 -441
2213 -441 -1134 -1276 -703 -452 -81 -225 -828 -1260 -122 -626 -1336 51 231 -815 604 -103 210 7 -273
2232 -273 -922 377 -56 -542 117 468 607 -322 -12 -469 -737 576 661 69 392 609 165 -148 417 38
2252 38 76 1097 821 818 -305 961 -957 993 710 456 647 1295 1070 835 322 819 707 628 1660 568
2272 568 218 394 209 1446 452 218 460 743 1000 487 969 729 -289 186 752 717 1486 -592 509
2291 509 394 483 1196 830 509 472 822 1158 859 798 141 -158 474 632 73 1610 874 938 -248 743 864
2312 864 1120 -202 390 722 -691 1359 747 445 -489 165 39 464 523 -260 200 -44 150 600 97
2331 97 -372 472 221 -233 -719 -399 51 -462 -712 -1194 -506 -381 -683 714 800 -500 562 -440 -70
2350 -70 -1167 14 -291 -135 -174 -1376 -1039 -701 -234 -582 -195 -16 -425 -1766 -7 55 -1162 -306 47
2369 47 -317 -499 -828 -1050 -815 -982 -300 112 -659 70 245 -1515 -280 162 -321 -1615 -879 -726 -577
2388 -577 -259 -82 -561 -1550 -686 -889 90 -81 -152 -512 -544 -229 -886 -234 -863 -1809 -1035 -421 -171 -257 -817
2409 -817 -349 -127 -317 26 -105 -649 745 233 117 714 -897 860 198 -481 -596 365 -277 344 -25
2428 -25 -895 888 -786 1053 675 -333 474 -568 114 267 -13 33 -762 55 92 -146 375 453 974 -530
2448 -530 224 -334 260 186 561 867 -652 604 740 717 1232 1384 1086 587 113 277 249 -387 195 436
2468 436 772 685 -303 -365 -285 628 938 589 -161 15 329 166 774 1476 774 684 851 -187 -1165 208 -304
2489 -304 1154 562 70 420 -84 503 382 61 227 138 445 223 962 -12 157 638 1096 -506 -382 976
2509 976 873 419 347 -167 -243 908 135 652 548 -538 -719 298 204 1027 629 -564 -448 -729 -1140 -1316
2529 -1316 601 -250 -1066 -941 -30 13 -361 99 -108 -260 -508 491 -811 -1133 516 -1272 400 -270
2547 -270 -1335 85 -853 38 39 312 -126 -533 524 -1115 0 306 23 -402 -874 -49 -317 -637 -159
2566 -159 -161 -514 -599 -225 -567 -575 -1397 -253 -1192 -680 -1025 -1305 -1088 6 55 -1248 697 -691 7 -1276
2586 -1276 473 -648 206 -258 149 180 -663 194 -509 -672 232 144 -149 -87 120 -349 666 -888 -422
2605 -422 -592 217 131 -145 -929 261 19 207 -350 -94 -274 -755 -364 289 60 318 -438 8 -561 -698
2625 -698 139 301 162 447 840 -962 1229 791 752 -287 18 743 717 -669 -393 561 -218 111 529
2644 529 -299 135 -371 -339 1070 437 320 255 1535 -61 455 21 960 1010 -304 -294 756 227 -435 1
2664 1 -298 -97 630 296 69 542 513 1223 221 1424 561 992 -344 307 -675 -244 130 -208 271 -211
2684 -211 -792 148 868 328 265 -334 -465 364 -366 423 18 -211 348 725 725 -954 -405 551 107 240 -375
2705 -375 -271 664 -217 125 79 -809 -333 -667 147 656 -1099 377 -67 -290 -193 350 -79 -29 -1069 -464
2725 -464 288 -223 290 -221 201 -69 -1213 -711 554 177 -1080 -123 -303 581 -1781 -100 333 -295
2743 -295 -214 -135 -333 -545 -431 -702 -287 461 -475 -388 -1360 -733 -916 -1106 -361 -1363 400 -1223 -515 -472
2763 -472 -46 50 226 -911 -965 -488 -634 163 741 -444 -1248 -456 260 63 -205 350 137 489 721 -16
2783 -16 -490 402 -574 -828 -77 220 195 -715 -581 -75 -256 -185 -223 -579 550 153 -542 -401 -734 -41 -221
2804 -221 -8 -645 539 1428 54 -738 89 -641 -259 1103 658 -600 222 424 427 -124 424 -186 -259 403
2824 403 317 -205 -553 303 190 338 297 39 -162 1117 -106 868 -55 216 -608 -630 -242 812 -61 -88
2844 -88 207 984 326 1022 261 297 883 669 140 -116 1824 118 37 550 543 803 1530 547 905 -117 370
2865 370 -101 18 -306 -2 -19 129 100 234 532 5 363 -816 -951 -66 31 -679 327 64 -322 -286 245
2886 245 1145 -689 10 -107 647 -601 -688 293 -1258 49 -414 -866 -729 -788 72 227 -92 117 454
2905 454 -819 34 -200 -412 -738 -799 -124 -71 -1058 -383 -788 -905 270 -293 -12 -543 -171 433 -956 -422
2925 -422 -668 2 136 443 -115 -213 389 -524 156 -240 15 -753 -313 -30 47 -205 -215 89 356 -76 -116
2946 -116 -839 176 817 111 531 902 46 -1049 759 -308 -433 318 -403 130 547 1096 389 386 1337
2965 1337 548 -731 -214 142 -19 924 -325 676 -307 -424 16 -7 -62 -188 -598 16 -944 -701 158
2984 158 -559 689 72 1503 810 398 513 32 918 665 550 570 -3 -333 99 -148 473 200 422 89
3004 89 -24 1032 429 318 1069 332 -681 -253 359 912 63 530 219 -594 -131 483 416 1120 69 471
3024 471 -291 -324 -71 402 775 549 331 237 476 -155 -26 268 517 819 236 -445 -460 372 488 -257 -404
3045 -404 256 665 -269 -929 200 1052 601 -6 -117 562 -73 717 -427 -296 -92 28 -939 352 354 -150
3065 -150 -402 -1260 -724 -331 -396 -1036 384 436 -282 536 -207 317 134 -491 -364 163 -1043 -462 -194 -393
3085 -393 353 584 -33 513 -221 -460 -446 162 -149 802 -694 183 713 -460 1030 156 -13 -279 -870
3104 -870 -525 -185 -1291 -190 719 46 300 19 -300 -88 170 -104 -144 -479 -233 398 197 878 -335
3123 -335 -683 675 61 553 -1005 -457 135 240 -176 641 885 130 252 682 186 -269 -390 -103 221
3142 221 -614 201 635 152 -436 -54 358 268 310 -794 443 512 152 202 -145 192 -53 675 299 -83 -40
3163 -40 266 670 634 204 -158 407 -106 -413 199 -414 371 645 1518 -447 77 196 125 33 1029 -954 -128
3184 -128 66 538 -719 -87 376 408 416 508 406 60 527 1700 545 196 11 34 -905 1022 269 -344
3204 -344 1161 294 275 1006 548 37 247 780 734 599 -793 -413 -150 -58 100 614 140 -435 217 130 -426
3225 -426 -160 393 427 1572 -1502 -783 -198 201 641 802 -93 -333 313 93 -293 334 45 -258 -35 -727
3245 -727 519 15 80 368 -400 -163 586 37 -676 -545 640 165 -253 -217 590 -313 -519 -355 137 -498
3265 -498 -95 175 307 341 410 -96 1 139 -71 -293 -384 96 -496 524 262 -809 -955 27 -649 451
3285 451 -292 -966 133 -119 719 778 -135 -248 -138 677 357 -650 -124 -201 222 524 -21 71 -160 536
3305 536 -740 -673 -211 -64 226 1216 -480 415 71 373 -1286 311 124 588 -580 325 400 -116 -735
3324 -735 -344 382 -1069 -715 68 -275 -219 -379 325 -98 450 -158 688 158 -96 -549 -177 -504 156 -151
3344 -151 1561 161 618 707 -615 -160 125 27 -96 122 339 -657 -929 559 132 53 -487 -184 223 -1
3364 -1 227 333 162 18 -434 209 -60 -34 -1158 -292 742 629 120 -225 164 -67 -896 -537 5 -561
3384 -561 -161 -136 -15 -410 -158 -49 -170 -538 294 620 216 0 389 501 67 125 318 313 -382 -160 179
3405 179 -720 -423 462 -550 912 -17 15 -187 -716 -150 290 767 118 997 -213 -255 -723 -36 -489 503
3425 503 -37 -745 -684 -107 -888 -614 157 -455 -348 305 -462 -38 221 243 -102 257 397 -471 321 -563 -509
3446 -509 -561 -547 -103 -471 731 -249 751 -1224 -583 -41 -666 -678 257 1166 -469 -356 1115 148 -117
3465 -117 -686 1017 29 -182 -89 958 -883 -469 -628 -360 -878 14 -334 -353 -452 -322 -145 -383 -9 -1049
3485 -1049 -147 -368 -117 -386 -500 -116 -69 18 -362 -454 837 -168 175 477 -721 1588 -384 -396 425
3504 425 1219 633 -730 236 -356 -173 651 186 1166 436 -405 280 774 790 383 230 -360 -51 862 192
3524 192 519 -345 22 -254 548 44 245 -912 -99 -44 161 -205 932 610 324 -676 329 1782 190
3543 190 317 741 602 45 344 -577 -598 57 -665 27 -643 317 -321 -180 454 783 1176 497 -291 -540
3563 -540 -416 166 570 324 1111 -399 374 620 682 -1236 444 1266 403 -87 -301 -539 32 -503 237
3582 237 -133 450 466 -673 420 -418 -21 -137 546 593 -493 -163 -382 -14 383 -449 76 182 -742 -572
3602 -572 -487 -231 -329 -180 132 -378 -726 -211 -290 -421 640 -46 364 452 663 4 102 -335 441 152 99 -858
3624 -858 -170 -652 297 -270 680 -648 953 -448 -18 -134 360 282 4 599 -586 300 831 -536 -499
3643 -499 -832 -88 -419 149 830 -595 417 35 137 75 -148 -683 -157 304 -1530 380 543 486 -444
3662 -444 21 753 424 576 -267 -1063 -408 1238 711 128 -90 -1031 -510 -73 720 -874 -12 394 -346
3681 -346 -387 -869 -904 -276 -197 1180 224 856 -134 -541 -1133 268 580 153 -339 -14 -554 -1364 735 -332
3701 -332 -129 463 -634 -260 427 -183 549 -613 -825 105 -194 367 325 -773 -176 -455 -442 -178 285 55
3721 55 -810 -232 -266 -652 -68 665 -686 269 393 162 72 -1008 137 321 534 328 715 -197 11 522
3741 522 713 94 -451 582 -643 1437 312 131 -360 387 402 507 131 -46 -147 -280 553 1049 -761
3760 -761 -243 102 636 -623 -43 601 -541 560 320 -52 189 -724 209 -23 235 -453 48 -693 552
3779 552 287 -290 480 -320 68 1273 -732 87 -601 -178 -382 -521 215 -408 455 781 438 -444 -605
3798 -605 427 364 -768 -368 397 -469 -167 -37 -515 514 -170 -280 462 -696 -906 123 -297 -347 -144
3817 -144 -72 741 -337 -282 -545 726 331 -392 176 -131 -215 -719 902 1468 -165 -327 164 292 -171 -243
3837 -243 483 57 223 -286 -318 -656 323 756 235 -651 -160 116 -670 -172 -281 -1 782 -337 -84 447
3857 447 174 -322 267 -1076 -270 -308 545 190 -419 -433 59 331 -271 -288 18 134 -36 -139 -179 987 212
3878 212 157 525 1037 780 -272 -351 -877 652 -368 385 975 -238 888 -1157 125 84 -314 776
3896 776 -342 -322 211 69 261 -506 471 1056 677 73 -338 51 811 -766 -796 452 -7 -449 544 171
3916 171 -173 182 138 -946 255 79 -335 -151 -213 -565 625 120 320 -403 -40 115 114 882 208 270 -121
3937 -121 -300 -7 -443 47 579 -369 106 856 662 34 890 -20 311 -282 -44 485 -583 272 935 400
3957 400 -357 -602 -175 516 445 273 -1339 -794 258 -186 853 -327 -669 -413 -1112 453 -519 881
3975 881 -352 75 -515 -214 272 -23 360 -133 340 550 -566 -477 905 496 151 216 -493 229 1284
3994 1284 353 -227 -557 331 -191 -672 211 49 -137 -10 158 127 192 326 336 -294 845 -204 -18 -76
4014 -76 196 -34 513 -158 270 349 902 -273 456 -142 -629 -337 202 -58 -624 -357 -563 -229 -393 524
4034 524 1120 107 -948 748 -1382 351 842 -410 273 415 707 -254 -298 -631 -546 777 1201 -352
4052 -352 773 -865 482 953 -194 -696 109 -174 -357 10 69 608 149 403 -1027 -919 1029 104
4070 104 -2 295 -465 -498 835 -276 522 179 -729 -206 -61 -519 -62 -1148 -246 229 136 -235 54 846
4090 846 -136 459 119 -439 -335 -289 -692 462 1092 470 374 -40 290 -313 561 -730 239 -393 -179 198
4110 198 -394 -39 -816 597 109 475 543 786 467 16 445 -128 -32 465 -754 -678 -9 -235 280 -231
4130 -231 -204 117 1304 407 -419 487 319 1472 -471 934 481 146 -266 514 -17 633 530 -514 773
4149 773 -418 -642 -43 -779 269 -471 479 -12 -48 59 -216 372 179 298 185 255 169 442 206 445
4169 445 966 -68 -883 223 -11 482 62 -55 158 -30 1005 1168 560 44 -881 -267 -68 844 570
4188 570 269 -16 353 -384 -66 -509 -180 -514 300 454 -119 71 -181 438 -1038 660 370 -1162 -554
4207 -554 -673 115 -479 253 54 530 292 404 266 630 -1220 -590 -901 -663 523 117 -1088 -25 739
4226 739 -616 63 260 770 -187 92 115 -464 390 100 -450 -112 876 21 70 -231 904 -58 -135 732
4246 732 -631 -650 811 282 186 -82 80 659 -707 386 359 -293 -324 -143 -203 -665 249 805 86 -50
4266 -50 224 589 -306 -702 -221 520 270 -26 -227 -332 -337 -285 426 579 479 -32 -576 -183 804 -80 196
4287 196 -662 -418 -146 1175 202 250 243 -525 -279 -497 -357 185 -706 -707 -837 242 -278 317 725 -476 -265
4308 -265 -557 -414 228 -39 221 -152 863 806 -403 -513 265 -123 -173 -387 -437 -55 380 -294 360 201
4328 201 40 -944 -80 -963 -409 373 -851 740 531 314 -228 -98 856 -126 -256 613 80 235 -72
4347 -72 8 412 106 -834 -172 -293 -607 -298 -6 -146 14 585 282 -522 282 -431 -490 -799 141 -532 781
4368 781 138 110 -478 -723 -440 188 153 -86 -292 -685 -1348 400 706 575 41 305 1320 -307 67 -178
4388 -178 430 -1093 249 -260 369 -835 498 10 -594 677 842 -549 -385 156 455 -507 189 2
4406 2 69 -752 -1273 -311 -849 452 -282 181 501 220 -1049 -1139 -127 255 -1516 -1103 213 442 315 1014
4426 1014 -380 720 -84 -943 -158 -520 -48 241 -251 103 882 -258 -106 52 463 -240 -433 155 -257
4445 -257 -227 353 345 450 314 -124 -641 -399 414 -85 348 292 -121 272 514 453 710 -338 -355 -389 -550 -388
4467 -388 -589 325 -63 239 -262 -184 -212 -1172 565 -328 544 -1003 -474 -223 380 -244 255 102 313 110
4487 110 316 -812 259 -767 597 397 -420 845 -722 102 14 516 -294 871 -153 -30 -310 -467
4505 -467 -198 66 -41 -940 -571 341 -719 -598 435 237 -370 -144 -676 328 724 -67 -595 -760 -46
4524 -46 492 686 -426 206 161 -361 452 -129 297 -613 26 -503 -389 841 -1 342 472 -146 691 239
4544 239 -513 -541 429 -120 -114 -94 57 -28 402 -585 -568 150 9 -3 268 891 966 -28 -531 414 -17 26 -119
4567 -119 139 235 237 642 328 724 -561 154 -224 213 467 -282 112 -47 -437 328 -506 648 861 -145
4587 -145 383 362 -1220 569 930 -316 160 -1378 295 341 -36 -120 703 -107 -408 844 -824 -448 58
4606 58 -136 69 906 -533 -139 481 261 541 162 -72 -724 37 -148 574 462 -66 7 755 23 -928
4626 -928 317 1055 -142 -526 96 -32 -520 -246 346 -319 -118 -74 -706 -282 405 -679 134 -192 803
4645 803 -62 523 530 161 143 70 314 468 -174 -593 -1118 -381 115 99 637 297 858 -391 44 215 260 76
4667 76 289 -1097 -394 205 -520 398 448 -100 518 216 162 -559 -822 -887 177 93 337 274 -164 227 -633
4688 -633 -170 -965 -85 85 -350 -337 168 -55 573 1338 -31 682 -122 619 209 51 -73 508 468 154
4708 154 -191 142 -860 361 28 -404 -172 110 316 1185 -34 411 596 -762 -542 -270 371 97 -133
4727 -133 478 -100 127 -97 871 -616 -433 362 771 1020 -537 -83 506 720 -3 -175 527 397 619
4746 619 324 510 70 1610 810 -225 167 -174 -434 -256 -350 12 -15 633 310 539 763 -125 232 450
4766 450 -259 106 -114 2 -43 105 768 214 1131 150 -773 1170 861 -885 -156 -1363 272 -1108 942
4785 942 -30 -337 193 -848 -83 -273 -135 -364 -217 1116 485 41 431 -693 12 137 -1113 -386 -38
4804 -38 368 698 447 -786 -346 532 -344 478 277 252 -229 -105 -758 -20 -444 816 -873 296 -780
4823 -780 -759 1 499 27 -408 -383 192 -270 210 -833 160 -781 75 106 93 -93 483 444 215 39 105 333
4845 333 -1126 367 385 632 -60 -262 646 61 -16 -877 197 452 279 -810 -195 382 -569 -100 -212
4864 -212 -253 -202 494 185 -288 1011 -223 345 209 -134 -5 638 994 992 -1443 -58 -11 -261 493 680
4884 680 455 -758 25 110 187 -707 -22 -451 -427 -99 -267 -111 -411 266 813 -23 195 945 774 -432
4904 -432 502 -743 -390 -381 -534 -379 608 -78 1088 28 713 -296 474 -526 -347 -5 586 -177 456
4923 456 239 -930 255 -221 523 -366 -715 -217 899 374 279 -280 196 200 -627 542 -318 6 229 -537
4943 -537 530 -890 -542 354 -977 -298 447 -518 -132 -1037 -373 -112 77 559 576 421 393 43 895 18
4963 18 589 692 595 -420 1109 350 -599 285 -159 -1196 -24 1236 85 164 548 -248 -48 -310 207
4982 207 -169 379 969 -515 -283 -222 461 418 220 -335 -470 -329 278 157 588 -398 499 821 -476 318
5002 318 -188 -354 -13 -638 -268 188 380 57 565 1108 -215 536 -158 -509 -328 -17 437 350 -499 -177
5022 -177 -263 649 1343 -118 -889 327 -32 1006 -628 -838 243 464 -484 -37 301 -1121 675 -1231
5040 -1231 200 -509 -77 -353 599 216 -1111 1209 -743 150 -178 144 256 591 -55 939 1036 220 -171
5059 -171 -1048 -24 -323 -79 63 -276 -555 -422 -20 603 1157 -1232 -60 290 256 -183 -383 1034 511
5078 511 -200 -80 335 445 -891 594 -897 120 -86 1013 464 -217 -1031 -59 -176 975 662 -676
5096 -676 -246 -246 17 -733 -10 114 91 -553 -619 -183 373 336 2 -1408 132 -336 -763 -405 -467 646 -872
5117 -872 231 369 60 -157 465 -18 347 -794 384 -874 310 422 708 139 45 404 -247 -318 303
5136 303 542 119 -597 692 557 637 46 601 387 -328 -635 292 586 659 -404 -185 17 364 -493 -416
5156 -416 536 366 -715 385 -965 -604 338 184 69 -211 -212 47 443 568 -377 -9 -1175 -407 221
5175 221 162 650 801 -164 -1234 286 -347 -341 -731 -902 294 501 349 358 -38 -537 396 409 -349 28 593
5196 593 540 266 884 -447 -354 0 -668 429 -508 -334 -1088 506 -213 -519 1254 -1225 -661 421 -239
5215 -239 490 187 -562 -510 42 -1111 1011 -614 -555 -250 -391 -345 -29 446 -226 -1202 -717 364 -840
5234 -840 224 287 -311 14 -384 308 318 232 346 723 -85 575 593 -239 -556 -39 337 -848 -582 -417 -696
5255 -696 255 170 -781 -1197 -815 350 -219 -489 -297 41 -264 -18 234 -345 236 -702 97 493 -29 93
5275 93 -814 745 47 482 263 540 48 137 314 243 491 -162 -231 15 231 980 -597 144 480 -579
5295 -579 398 -577 304 -935 941 -145 -902 -1079 -136 97 -303 75 -124 33 -213 -275 -120 311 535
5314 535 363 -465 397 485 -102 642 500 20 652 -157 746 -695 -199 573 -840 -624 788 140 817
5333 817 723 179 -240 696 211 -255 -218 335 -235 -433 -318 206 508 342 420 232 473 295 -45 260 138
5354 138 688 316 -387 -1009 -256 -617 685 423 -88 940 -794 -482 -447 186 757 611 1234 787 831 336
5374 336 366 424 -852 -91 680 -657 -662 -102 -612 -385 609 601 -241 -522 -352 -785 282 240 -221 -506 -35
5395 -35 -76 -829 50 268 382 -248 -187 471 411 399 -212 44 -265 -172 -947 -169 171 -266 -7 240 653 -366
5417 -366 -705 404 -341 -220 -258 -252 -472 780 -783 209 978 -291 -584 299 -307 -255 17 202 1 348
5437 348 -461 -575 -105 -327 -157 -542 -262 -458 1179 -454 831 -120 733 32 339 -468 -1042 52 -305
5456 -305 -301 363 311 -274 205 73 -232 217 490 -306 -179 713 -391 962 819 -443 -1363 -747 238 -285
5476 -285 -414 -6 553 -57 443 -953 278 159 129 4 637 -592 2 401 79 -335 904 339 -313
5495 -313 -165 87 918 735 377 421 606 -371 -534 -293 204 -183 590 349 77 405 783 -758 -11 419
5515 419 632 -197 -68 92 -524 270 -98 126 -65 -362 640 -220 67 438 -115 -1034 -147 -121 187 -432
5535 -432 -114 364 138 -215 -190 -825 -120 -1260 95 335 103 -296 236 281 129 599 -188 47 182 45
5555 45 -277 -354 232 189 -124 -310 292 391 -1319 -399 -233 -8 -116 367 99 -291 -63 -672 -1464 -152 719
5576 719 877 838 385 144 459 1669 -395 -1397 363 65 2 -473 -672 -235 -651 666 -372 587 -368
5595 -368 -828 1074 520 103 867 64 -203 -779 32 622 197 316 -479 547 -60 -751 -590 -552 889
5614 889 -53 -114 31 -598 265 237 -1020 -433 690 -260 1080 86 33 81 433 1275 447 -540 1171 -548
5634 -548 563 -737 -329 330 -1437 -222 -475 5 -545 292 370 -780 745 276 -85 374 -952 1429
5652 1429 179 305 106 -1168 714 -63 -1129 253 1523 390 513 454 -1104 -795 -431 423 -809
5669 -809 -550 383 -292 798 7 199 619 -196 140 -1068 -234 -981 -375 -343 232 -114 75 889 869 -652
5689 -652 619 1237 -795 -527 -403 210 -830 227 41 10 -718 -136 668 249 506 -294 276 451 930
5708 930 44 -440 -308 596 -806 -120 -17 -63 526 -602 -543 294 483 -135 -314 -355 205 -214 101 743
5728 743 516 -449 241 1077 571 56 114 -278 309 11 199 70 -177 -1223 -155 791 -113 -1202 -112
5747 -112 -25 -420 -772 -333 -826 252 -255 -1365 -206 -944 -115 -686 281 101 146 -266 -639 112 793 22
5767 22 -97 847 -260 -470 682 -226 358 277 105 399 -610 660 33 -494 -59 367 591 531 319 694
5787 694 66 346 822 225 362 654 -1089 -91 409 108 -430 -228 608 -121 -1483 124 -1928 128
5805 128 -342 658 -648 -152 449 -623 -365 -27 804 743 -9 422 -765 -421 -144 -782 505 754 314
5824 314 -174 -375 -244 50 675 290 408 -365 618 -361 208 376 -1155 371 -350 -327 222 101 443 55
5844 55 -257 -346 367 823 -25 -193 -1339 616 -242 -177 356 -655 -1062 -818 -782 -685 -493 106 385 -102 -216
5865 -216 -576 1027 -216 -21 -186 -451 -1020 204 773 436 -110 181 -42 145 753 -45 222 -101 625
5884 625 182 522 -196 -1192 -919 -281 -111 454 -509 -59 -49 -65 720 114 314 -339 369 861 367 -234 -411
5905 -411 213 4 -324 228 -450 -57 603 -1183 608 73 71 -158 219 795 430 -755 570 556 -189 -950
5925 -950 284 -298 -127 -264 -160 -443 1193 -118 886 30 -90 700 116 -346 420 -265 258 189 40
5944 40 911 420 239 181 56 895 103 -62 -310 267 -218 624 356 500 -618 -582 592 -10 -653 546
5964 546 968 -137 1425 148 4 -219 -550 -693 827 -392 135 562 367 146 -46 -921 -263 33
5982 33 29 858 183 -36 1408 -467 145 -945 109 -299 -591 -501 -17 622 -295 -223 558 406 357 -394 103
6003 103 771 -115 -899 -97 -281 504 413 558 -196 404 203 -356 -435 -557 129 44 190 174 706 -658 183
6024 183 451 202 97 97 -193 132 299 14 -53 500 -158 -650 678 216 -411 -200 -208 325 322 292 150 328
6046 328 -553 -1642 998 -247 -231 -467 -711 -1195 -91 -298 97 16 425 673 362 -332 -237 -268 207 -60
6066 -60 423 -812 -416 844 -123 46 -447 -618 251 454 495 702 -685 -420 -88 131 143 342 -31 -93
6086 -93 -681 -244 -623 987 -524 -257 -363 -156 126 1162 -702 344 148 248 352 -88 427 542 1182
6105 1182 -1116 -106 328 -100 715 245 -324 263 -244 -505 -951 -111 -269 -325 379 430 680 427 385 -23
6125 -23 540 255 -171 -12 708 723 421 70 439 -561 -506 -76 -101 -19 -1702 178 -163 244 -324 -3 -239
6146 -239 -364 377 -354 178 -321 530 -521 10 118 -442 369 -386 -248 -159 -647 562 -391 -199 -99 120
6166 120 499 70 764 711 -571 -762 -647 -541 557 218 -109 -569 -712 -332 84 -114 667 343 -223 -500
6186 -500 -838 483 753 640 136 521 -101 -123 -401 103 -170 18 -268 980 1392 -1196 -139 -87 264
6205 264 625 -995 -369 42 758 465 261 -141 949 43 705 916 -297 -583 548 528 -823 107 464
6224 464 221 869 231 -917 -185 224 -24 207 910 333 -184 24 -191 -451 172 262 -663 -83 43 -117
6244 -117 -154 185 -548 -338 278 517 -817 88 -183 -169 250 -237 335 -423 -38 811 1146 -485 339 -1472
6264 -1472 385 -506 185 -793 -378 559 -1013 109 331 -294 263 48 -328 -292 617 -75 -746 -267 190
6283 190 40 -5 -95 -36 -305 520 743 98 -90 -166 -599 -39 -137 127 121 158 986 462 -309 398 -468 -1185 -37
6306 -37 -361 756 -285 -877 -378 303 336 85 97 502 439 -72 -91 178 -600 -443 303 120 219 -577 728
6327 728 385 -447 -186 -593 -157 -75 447 590 -604 2 -141 218 164 -73 -437 -251 -805 -123 550 298
6347 298 89 1082 83 318 -417 -631 381 -169 -631 -888 1307 157 40 366 -670 67 -261 519 -248
6366 -248 -46 825 675 558 -512 -304 -112 470 168 68 -1069 -615 -321 93 -23 -38 1012 -211 522
6385 522 -217 482 585 -435 -596 350 418 -527 978 -260 -136 -1606 216 252 84 481 -630 289 -742
6404 -742 430 -930 -127 -555 -437 -843 -882 -64 -317 -90 139 356 582 473 -884 -483 -494 81 308 659
6424 659 -45 867 152 275 -530 458 -401 -961 473 -285 -439 -420 360 -58 393 -752 -24 989 -293
6443 -293 404 -587 -712 -715 -290 -223 -153 -161 1001 -381 26 96 -382 -273 8 473 197 325 338 -186 -625 -828
6465 -828 -724 289 160 363 -623 -471 343 -467 -333 -734 -144 575 -330 -290 -223 -222 171 45 318 -5 480
6486 480 261 -75 -338 84 -1275 369 -457 551 -82 -395 -669 207 872 -99 67 -22 -280 398 -6
6505 -6 30 783 -78 -117 156 -251 926 -146 -581 205 154 -206 130 163 373 260 -43 -740 114 429 734
6526 734 142 36 162 978 275 -283 599 -111 95 140 -409 -319 263 183 -256 151 -140 464 -365 -1375 -307
6547 -307 388 191 -1165 230 330 667 -887 -439 678 154 -559 -930 171 130 -395 315 360 -813 -539
6566 -539 -796 -320 -199 123 148 -45 -938 -494 210 -194 -374 142 274 95 -684 -1042 877 81 -385 119
6586 119 428 -511 -82 -1478 495 -208 -545 -406 93 317 108 -38 -402 -304 -595 65 -277 -131 772 -440
6606 -440 -813 358 -444 154 204 -781 -1230 360 -107 415 121 687 397 1126 104 574 53 -406 -313 310
6626 310 348 -331 398 34 -250 -476 -69 -428 -1041 -873 24 -169 -176 924 -259 -716 -281 -852 368 6
6646 6 731 767 1176 221 -578 -1166 -88 -501 573 513 -961 -537 -267 444 -414 408 895 332 -243 -763
6666 -763 -594 116 -496 -48 186 -149 156 180 589 793 -499 84 334 -714 4 88 -352 43 448 -960
6686 -960 -108 -78 759 -175 432 563 -497 188 -92 -547 -188 200 -559 83 164 556 637 -898 89 479
6706 479 908 -418 -924 53 -469 -380 -129 -874 -1091 292 233 86 -435 -215 -577 15 -692 -334 -187 -489
6726 -489 -204 401 409 -526 -1511 538 -536 -417 -390 -689 -270 -49 732 545 284 -388 -286 -276 559 -258 -740
6747 -740 -378 -185 -900 266 -222 -34 960 -330 94 687 -623 145 268 60 70 975 -96 52 -679
6766 -679 -190 90 -280 -305 -108 614 -225 -101 33 -1268 306 196 -97 362 -230 15 -103 724 386 -619
6786 -619 804 -454 -190 -30 802 -901 -775 132 1499 -1025 -285 556 51 -523 -348 -72 -29 -115 641
6805 641 177 -317 -241 -371 616 226 83 -412 -15 -33 -453 -431 -229 238 -273 726 264 -479 -434 252 -931
6826 -931 1241 348 459 28 -667 -457 292 951 430 111 -579 -297 1024 175 1018 70 -668 259 -851
6845 -851 454 -1087 100 -339 9 -252 829 628 127 -175 38 -613 534 450 -525 -371 -23 511 219
6864 219 921 589 742 869 -273 231 466 -229 -282 109 214 662 507 -128 247 284 -353 -1146 -500 -96
6884 -96 -372 -508 631 -543 -270 510 1159 -811 -851 315 341 179 -95 -312 302 -48 -376 219 -310 -1347
6904 -1347 266 127 -503 372 -370 732 -674 -796 -179 -635 -402 -146 396 -456 -245 -872 588 -62
6922 -62 463 1434 555 -115 -715 209 424 534 -764 168 -467 188 -1037 -702 415 170 -355 -295 723
6941 723 -138 112 -97 -135 -825 601 391 -748 30 320 -974 -284 -56 -87 -730 -303 119 -509 -378 -941
6961 -941 -242 27 -845 235 -288 51 -379 -680 -284 -436 -354 -232 -342 266 -560 497 -10 -525 -552 -158
6981 -158 -367 -888 -969 -338 -555 -77 238 -296 360 321 -822 56 254 -53 418 314 263 235 -341 354 180
7002 180 -61 126 -217 316 -394 -1075 -189 94 44 -466 -67 -10 297 465 -369 -155 -1661 530 88 -182
7022 -182 1262 5 304 6 654 283 634 449 -119 -158 -397 305 493 -188 128 -22 -346 -629 878
7041 878 818 91 180 -170 -395 955 -25 -17 -389 -228 110 -42 99 1189 741 -104 294 -125 -115 -581 266
7062 266 265 -218 -257 -395 258 -366 752 -21 -32 -455 282 -311 -1082 -33 -102 554 -648 -255 310 -1015
7082 -1015 -826 -323 304 568 201 1220 -243 1314 1174 638 408 -41 818 1421 93 -806 527 -608
7100 -608 377 1076 -360 58 -813 -297 -40 -539 142 -20 -332 60 -63 -158 502 -1338 44 348 -331
7119 -331 626 -72 -104 90 445 -39 474 -244 94 -334 -1048 -45 969 637 -88 -295 755 55 669
7138 669 642 405 684 226 -549 689 269 284 -278 179 -279 -417 7 326 210 -180 -328 -684 552 -853
7158 -853 -38 -534 -848 -263 -128 -594 -1191 282 1425 -113 -493 127 -51 1305 109 -118 -109 -191 566
7177 566 101 -289 -3 583 364 14 -235 190 -250 -1156 80 719 -34 479 -503 242 -764 320 255
7196 255 113 125 -654 -642 -90 673 485 433 -744 -728 -127 -816 -1312 859 209 118 510 -275 1100 -549
7216 -549 -357 455 500 -147 -486 154 -576 116 -4 468 -276 285 -456 -588 -220 599 -88 -798 -229 -591
7236 -591 39 -279 -30 -147 199 259 -157 117 -221 -536 -647 -1076 -75 8 559 -563 -83 325 -587 274
7256 274 850 -747 -579 -67 -387 -241 612 140 383 -971 -281 -277 74 1021 872 1481 -375 -539 -435 263
7276 263 290 -871 -107 -110 -186 -91 659 -51 -43 826 17 -707 512 -338 -576 -547 -917 -481 -363 -731 455 382
7298 382 -475 78 -516 -157 465 -800 311 246 -86 231 -380 319 442 -564 -46 790 341 -446 -794
7317 -794 -591 592 214 -39 -798 197 -235 334 -531 570 45 -856 109 -148 605 -868 -435 -456 855
7336 855 -244 -526 1004 553 54 658 -248 -150 -70 -453 286 -53 59 -188 715 -791 -655 837 370
7355 370 -206 -245 221 -538 622 -55 -141 427 -246 -248 -54 201 89 -480 629 1172 -356 -385 90 -73 -396
7376 -396 -841 749 509 532 717 224 990 1083 102 690 74 -936 -124 -593 669 19 -179 140 175 -551
7396 -551 -468 -525 40 -38 245 1263 -672 -193 -538 -646 -257 377 -313 -147 41 -311 464 318 521 -221
7416 -221 261 657 -182 -490 -1514 -113 415 159 229 -436 -126 -1418 174 813 -600 368 244 32 -448
7435 -448 -228 700 -639 533 -1431 752 -477 -172 172 -1 252 -276 1188 920 -321 -1334 430
7452 430 415 -707 464 -938 -572 -555 771 -115 765 164 -297 -351 -350 138 234 161 259 -523 147 316 -82
7473 -82 140 -973 -341 479 -428 878 634 362 139 -912 700 -731 -97 -319 146 654 490 397 -187
7492 -187 427 -836 -140 662 409 407 -863 -769 217 383 -177 134 -272 -563 -1046 -530 130 627 -280 1064
7512 1064 502 268 -1182 -344 -409 -879 -402 -560 -625 -501 -447 234 -898 -854 451 451 468 332 390 410 -674
7533 -674 71 569 -56 375 567 -799 25 649 -50 300 -8 308 -323 464 -606 -718 425 488 -107
7552 -107 -139 -180 -1371 -64 -224 259 411 241 152 -852 441 -45 320 1328 -826 -284 -108 -1342 -504
7571 -504 -698 566 -14 49 -361 745 268 -788 -422 -897 315 1746 526 295 -282 112 -47 110
7589 110 367 -7 -516 12 -91 389 -436 425 -532 -648 -414 -364 94 257 413 300 528 750 872 -50
7609 -50 -85 -868 851 375 91 -1128 233 -166 -117 119 1201 54 -498 -122 -47 1057 -1042 255 796
7628 796 343 271 -43 160 326 669 198 563 -683 547 -885 527 176 557 627 -266 390 -44 51 99
7648 99 596 358 469 -108 -50 231 -459 -451 -384 314 158 -987 154 -532 -738 -88 237 1111 -515 -428 -776
7669 -776 -283 264 -201 -106 -223 92 316 588 424 117 -610 90 728 309 -108 -387 605 413 -210 673
7689 673 -631 -228 -159 95 61 170 1115 -232 925 761 302 375 190 -784 -283 -166 -164 413 37 34 -576
7710 -576 -396 590 614 536 -576 -408 -323 -703 -243 -356 785 -418 -33 555 -493 -476 -200 -555 574 298
7730 298 -5 446 -504 -319 1 -1019 709 -232 406 -89 96 -109 297 -473 -160 -191 -491 -27 -248 -598
7750 -598 609 -62 556 648 -907 -530 -1046 244 29 -203 525 136 -119 612 610 173 922 -117 0 17
7770 17 344 -386 -447 -1027 -518 -166 723 -36 -296 -359 -758 -494 -55 343 -712 233 -11 -464 -142 490 545
7791 545 640 -24 54 -233 326 -260 227 772 -72 86 168 131 487 -428 -720 446 -113 -155 291 415 412 -961
7813 -961 162 558 897 408 -142 -395 -1283 -208 15 199 307 845 246 63 -554 1067 750 -113 -56
7832 -56 531 -11 -479 890 -137 -504 102 21 105 364 -540 -279 441 -362 394 183 163 253 171 977 -765
7853 -765 661 250 207 -4 1128 -251 1248 -204 -311 -145 278 -10 -373 -680 -459 94 -55 184 626
7872 626 146 -229 278 -414 -91 -1048 -527 -322 628 -187 482 -389 -357 -301 174 145 -20 -440 305 486 798
7893 798 -460 477 -108 -122 150 -111 746 -940 478 -758 343 8 525 169 -119 -1037 32 278
7911 278 -388 -521 998 -84 -203 123 432 -611 606 347 -338 588 -1077 434 96 -1348 1480
7928 1480 818 432 -492 621 -382 453 -901 -702 32 347 -268 206 -355 -1047 -693 -197 -62 547 3
7947 3 -380 -273 -90 -727 270 259 -1046 23 -160 424 -842 -1503 -661 395 -91 665 425 1091 1521 -817
7967 -817 45 -84 -334 -407 -671 -130 1403 289 423 -28 -199 -364 -681 -316 1130 -890 -421 42 -853
7986 -853 -420 80 647 662 -398 366 259 142 -698 -220 -321 73 648 954 -806 -135 -554 -1039 88
8005 88 620 -619 -295 -321 521 336 121 1036 300 84 322 162 87 -281 -802 10 395 -485 -546 -192 835
8026 835 -329 137 72 -927 -403 569 -109 426 -139 -1419 -262 -1117 207 333 -544 -23 233 -193 -802
8045 -802 831 -1179 -240 488 132 376 81 460 243 1292 147 -533 805 186 264 -300 -546 -409 825
8064 825 568 -467 26 -361 -229 -771 -762 -149 -279 -897 485 -523 -247 713 58 -1237 441 305 -615
8083 -615 38 322 -746 -694 80 -162 -257 233 1024 -473 444 -385 -91 -219 -443 -9 -307 66 -72 -505
8103 -505 74 300 -548 -4 -742 212 -21 -424 -119 744 -1115 -408 660 -563 -278 -1101 4 198 -195
8122 -195 289 -39 73 189 210 -1039 -665 764 -264 696 934 -152 -557 -123 -317 710 1027 52 217
8141 217 698 -386 -374 966 -463 -468 472 183 -180 239 267 -213 -489 341 497 -29 9 -254 222 541 -131
8162 -131 -627 -208 -1046 119 151 -1102 1379 -1305 -350 -257 -344 -551 214 -253 -678 -823 -744 678 -254 -11
8182 -11 -683 -648 -137 -212 -553 405 -314 -291 -1237
8191 -1237
$$ Imaginary data points
##PAGE= N=2
##DATA TABLE= (X++(I..I)), XYDATA
0 0 4 -2 26 -23 64 -62 98 -101 132 -146 194 -216 268 -296 362 -413 485 -536 636 -708 821 -921
22 -921 1050 -1170 1328 -1483 1667 -1860 2099 -2335 2627 -2939 3309 -3714 4215 -4774 5470
37 5470 -6311 7391 -8794 10758 -13661 18568 -28759 69038 -66064 -227688 -128502 -166525
49 -166525 -127791 -145644 -122919 -136937 -120240 -131173 -119488 -126810 -118328 -124327 -118379 -122972 -117728
62 -117728 -121653 -118472 -121486 -118104 -122252 -119537 -121339 -120100 -123732 -122723 -124442 -123898 -125175 -125406 -127000
77 -127000 -126988 -129132 -130253 -130536 -131343 -133039 -132872 -133794 -134465 -134102 -135292 -134974 -135801 -136276 -135618 -135703 -136414 -134924 -134233
96 -134233 -134202 -133929 -131497 -131117 -130477 -128176 -127329 -125328 -123577 -120646 -118788 -116585 -113928 -111193 -108471 -105406
112 -105406 -102027 -98540 -94898 -91749 -87158 -82879 -80270 -75104 -70066 -65724 -61182 -57531 -52948 -48474 -42700
127 -42700 -37966 -33481 -28154 -24118 -19665 -14376 -8929 -4555 680 5801 9849 13883 18089 22161 25692
142 25692 30130 34333 38118 40954 44339 47702 49576 52563 54970 58899 59777 61042 63157 64879 66389
157 66389 66800 68105 69326 69705 69449 70174 69351 69955 69563 68652 67701 67510 66597 65995 65403 63987 62160 61197
175 61197 59282 58777 57607 54870 54340 51534 51765 49234 47034 47383 44697 43142 41551 40023 38095 36408
191 36408 34725 34125 32092 30169 29510 26733 26201 25914 24852 23688 21197 22304 20506 19579 18417 16005
207 16005 15502 15159 14120 13555 12144 12229 10678 9984 9588 8716 7855 7115 5948 4610 5323 3971 2474 1390
225 1390 1124 455 -840 -2081 -1843 -4209 -5431 -5633 -6576 -8183 -10155 -11331 -11263 -12962 -13609 -16072 -17237
242 -17237 -18374 -20062 -21749 -22462 -24689 -25958 -26868 -27967 -30218 -31266 -32605 -33278 -35066 -36199 -38337 -39075
258 -39075 -39364 -40308 -41158 -42900 -42310 -43426 -43673 -43928 -44834 -45144 -45212 -45840 -45229 -45401 -44775 -44847 -44215 -43525 -42770 -43622
278 -43622 -40358 -40187 -38938 -39004 -38776 -36590 -35942 -34419 -33366 -31506 -29890 -29204 -28184 -25193 -23661 -23246 -20990
295 -20990 -19040 -17795 -15339 -14427 -12031 -11035 -9426 -7735 -6383 -5157 -3666 -1697 -850 1027 4939 4177
311 4177 6253 7218 9467 9551 11652 12889 13802 15386 16838 17427 18813 18779 20021 21433 22808 24657 24468
328 24468 25685 24729 26049 26200 26500 26895 27777 28198 28225 28421 29912 30149 30617 30718 30672 30759 32148 31231 31615
347 31615 32718 31872 32078 33488 32881 32582 32768 32683 32816 32802 32224 33470 33522 33699 32465 32909 33546 33064 33655
366 33655 32887 33283 32205 32289 32260 32229 30963 31264 31398 31307 30838 30540 28994 29621 29130 28968 28383 27103 26516 25932
386 25932 25695 23798 23875 22707 22447 21626 20596 18887 18747 17478 16222 16238 13906 13838 12148 11337 9744 8613
404 8613 8743 5775 5870 4493 2629 2830 1508 -222 -946 -2315 -4580 -4725 -4640 -6670 -7614 -8433 -9470 -9704
422 -9704 -10749 -11790 -14138 -14660 -15238 -15377 -15271 -16104 -17719 -17362 -17809 -18318 -19525 -19200 -19740 -19958 -20437 -20277
440 -20277 -21063 -20963 -20016 -19493 -21156 -20543 -20295 -21141 -20633 -19539 -18921 -19543 -19141 -18981 -19098 -18151 -17912 -17256 -17202
459 -17202 -17144 -15915 -16220 -15440 -14699 -15910 -15445 -13813 -14152 -14411 -13068 -12113 -11636 -11566 -10800 -11961 -10798 -9958
477 -9958 -9199 -9326 -9211 -7792 -7695 -7416 -7258 -6368 -5491 -5412 -5082 -4515 -4991 -4416 -3776 -3094 -3007 -1836 -2484 -809
497 -809 -470 -706 695 410 1150 2285 2574 2488 2709 3664 3407 4425 4641 5135 6894 7762 7183 8640 9666
516 9666 10069 9894 10552 11303 12528 12130 12028 13886 14755 14558 15094 14849 16189 15369 16486 17094 16812 18382
534 18382 18114 19654 19170 18866 19309 20079 19748 19762 19673 20128 20417 18664 18845 20460 19153 20274 19450 19099 19950
553 19950 19590 18220 18209 18062 17247 16022 14872 16109 14830 15514 13396 14202 13427 12169 11892 11423 11646 10447
571 10447 8437 8635 8256 7407 5885 4285 3753 3604 2754 2138 1497 236 526 -257 -1765 -2709 -2968 -4067
589 -4067 -4315 -4704 -5216 -6075 -7187 -7749 -7737 -7911 -8888 -9401 -9844 -10555 -10992 -11136 -12384 -12358 -14135 -12602 -12522 -13317
609 -13317 -14022 -14127 -13706 -13683 -15407 -14459 -14940 -15409 -14774 -15415 -14987 -15825 -15021 -15493 -15190 -16183 -16583 -15885 -15530 -15624
629 -15624 -16278 -15786 -15910 -16067 -15380 -16214 -15685 -15165 -16279 -16370 -15139 -15865 -15219 -16135 -15476 -15326 -14673 -15533 -14569
648 -14569 -13395 -13694 -14614 -15151 -14016 -14139 -14027 -13556 -12127 -12765 -11996 -11881 -12030 -10359 -10548 -11122 -10208 -10433
666 -10433 -8824 -9364 -8588 -7541 -7882 -7545 -6193 -6194 -5553 -4023 -4884 -4128 -3045 -2647 -2221 -2101 -633 -324
684 -324 642 950 527 3323 2455 3378 3153 4526 5029 5860 6981 7256 7564 9016 9489 8810 10114 10424 11104
703 11104 10742 11730 12515 11826 13225 12738 13173 14270 13660 14049 14314 14074 13581 14615 15775 15202 14712 14978
721 14978 16074 14940 14099 14537 14334 15416 14056 13866 13264 14093 14733 13081 13976 12600 13006 12058 12578 12008
739 12008 11125 11090 10845 10568 9466 9492 9317 9124 8052 7949 7306 7089 6885 6223 5485 5273 4315 4824 4055 4009
759 4009 3093 2951 2748 2344 1977 986 1011 536 -116 -538 -873 -1334 -2241 -1365 -1676 -1732 -3688 -3337 -3197 -3874
779 -3874 -5086 -5096 -4575 -6467 -4778 -5619 -6838 -7460 -7156 -7317 -7728 -8629 -8118 -8418 -9172 -8236 -9675 -10260 -9560
798 -9560 -9715 -9867 -9680 -11033 -11366 -12001 -11418 -11832 -11800 -10942 -11786 -10862 -11373 -11307 -12211 -11587 -11234 -10992 -12171 -11135
818 -11135 -11499 -11342 -11986 -11291 -12489 -12016 -10937 -10701 -10648 -11045 -10199 -9805 -9675 -9838 -9174 -9544 -8183 -8805 -8272
837 -8272 -8077 -7536 -7357 -7895 -6637 -6274 -5779 -5306 -5002 -4388 -4267 -3696 -2999 -2704 -2153 -1359 -1399 -1132 291 246
857 246 386 1940 1072 1864 2142 2585 3152 4490 4225 4551 4718 5617 5687 6111 6400 6461 6610 8311 7968 8420
877 8420 8534 9483 9434 9595 8639 8263 9808 9235 9733 9782 9857 10796 11069 10792 10122 10567 10699 11090 10807 11265 11531
898 11531 10976 10891 11945 11451 11818 10942 13101 10994 11274 11515 11365 11578 10343 10844 10911 9777 11381 10095
916 10095 10144 10751 10075 8468 10215 9464 10043 8036 9138 8505 8682 8522 7440 8192 7351 7412 6718 7009 5802
935 5802 7029 6703 6826 6000 4857 5507 5327 4566 5178 4260 3425 3970 3252 3404 2773 3473 2886 3278 2100
954 2100 1168 987 353 100 308 -544 -633 -1379 -1100 -1297 -1631 -1723 -2431 -3806 -2967 -3982 -4298 -4011 -3284 -4741
974 -4741 -5163 -5204 -4852 -4889 -5202 -4986 -5957 -5591 -5828 -5186 -6654 -5896 -6281 -6511 -5985 -6630 -7019 -7703 -6460 -7128
994 -7128 -7598 -6706 -6468 -7319 -6528 -6455 -5657 -6412 -7305 -5948 -6065 -7261 -7056 -6326 -5958 -4993 -5574 -5951 -5681 -5872
1014 -5872 -5301 -5091 -5390 -4947 -4453 -5488 -4200 -4653 -3854 -3481 -3722 -3373 -4654 -4492 -2838 -3334 -3182 -2768
1032 -2768 -2393 -1255 -2507 -2323 -686 -748 -1046 -988 -1205 -407 -930 -660 453 227 343 533 998 933 1098
1051 1098 1784 2416 1200 1936 1164 1938 2120 1874 2018 2414 2309 2498 3883 3351 3803 3948 3104 3545 3181
1070 3181 3544 3372 4666 4317 4304 4233 3968 5108 4681 6078 5265 5784 5256 4845 5574 5728 5129 4921 5029
1089 5029 6134 5884 5203 4837 5278 5688 5651 5056 5190 5358 5475 4592 6402 4652 5254 4582 4254 5106 4732
1108 4732 4487 4864 4335 3848 5175 3454 3751 4443 3991 4425 3699 3688 2459 2968 3912 3272 2299 1748 1156
1127 1156 2207 1415 1921 1788 1271 1478 1792 1688 399 -593 -124 664 471 -125 779 -391 -975 136
1145 136 -850 -1200 -1562 -928 -1088 -1446 -2293 -1000 -2441 -1634 -2775 -2244 -1910 -2594 -2260 -2423 -3163 -2763 -2816
1164 -2816 -2421 -2624 -2909 -2060 -1778 -2317 -2819 -3359 -2930 -3480 -3857 -4141 -3503 -3369 -4213 -3889 -4031 -2845 -2661
1183 -2661 -3453 -3718 -3718 -4349 -3919 -4549 -3467 -3501 -3312 -4096 -4088 -3277 -4293 -4133 -4041 -3742 -4029 -4209 -4176 -3937 -3663
1204 -3663 -3495 -4603 -4932 -4101 -4405 -5113 -3209 -4005 -3854 -3631 -3984 -3466 -3202 -3729 -3617 -3013 -3496 -4224 -4090
1223 -4090 -2908 -2630 -2998 -2744 -1611 -2313 -2303 -1912 -1905 -3040 -2437 -1747 -771 -1479 -1856 -853 -711 -725 84 183
1243 183 -1387 -600 -958 -147 735 -118 1270 -886 69 965 632 1783 2312 847 2707 2178 2998 2304
1261 2304 2723 1952 2701 1630 2810 2935 1625 2400 2276 2919 3863 2836 2134 3028 3195 2449 3381 3207
1279 3207 2751 3112 2197 4351 3910 3146 1454 3373 3566 3784 3084 3016 3533 2388 2714 2632 2684 2509 1505
1298 1505 2958 2358 2558 2043 2100 2313 2932 2451 3248 2480 2295 1635 2736 2354 2248 1679 1696 1096 2345
1317 2345 2595 2167 1205 1788 1940 1693 1261 805 2572 1806 1407 1876 2207 1674 1546 1824 1335 1837 977
1336 977 296 169 704 846 922 997 851 794 252 263 438 -494 339 388 469 683 -289 -419 -1132 -243 114 -332
1358 -332 -256 -232 -1630 -607 -1483 -1747 -929 -1037 -1603 -1694 -2301 -1936 -967 -873 -1707 -1688 -1292 -774 -2851 -2226 -2145
1379 -2145 -2309 -1899 -3244 -3180 -2621 -2869 -2477 -3419 -2771 -2566 -2511 -2411 -2041 -2259 -2134 -1212 -2428 -2364 -3135 -2098
1399 -2098 -2216 -2607 -3501 -1721 -1205 -2268 -2531 -1796 -2073 -1838 -1423 -2015 -1926 -2019 -1926 -1817 -1791 -762 -637 -2231
1419 -2231 -176 -690 -757 -401 -1276 -693 271 -990 -76 262 -382 -260 -44 -83 -511 -552 811 490 1023 1219
1439 1219 753 752 -61 973 1028 1137 2115 1017 1342 1760 745 222 1487 864 1733 1549 1980 1920 1339 1005
1459 1005 1574 1750 1318 1832 1886 1934 1455 1717 2336 1639 2628 1719 1394 2498 2626 981 2582 639 2200
1478 2200 2811 1390 2184 1550 1679 2191 2532 2727 1199 865 1463 1634 1651 2096 2066 1611 1730 1377 1320 1518
1498 1518 1530 1847 1612 1619 1453 2113 1184 2321 806 1699 952 1157 1172 1435 1442 572 1664 1571 949 1900 422
1519 422 342 648 1851 948 1155 800 1241 469 1199 -829 254 1145 -619 -186 1179 134 -402 -147
1537 -147 -339 663 -112 -604 479 -523 -1251 248 -171 -1105 -629 -330 -849 -214 -253 -335 -729 -1314 -610
1556 -610 -1250 -1575 297 -1924 -654 -1474 -1493 -1694 -833 -1160 -660 -1893 -1321 -1070 -1129 -1847 -1297 -781 -1093
1575 -1093 -1172 -1051 -1271 -1358 -1501 -2065 -2033 -763 -1717 -1131 -759 -1999 -156 -964 -1413 -1856 -1181 -1679 -950 -545
1595 -545 -1003 -1242 -1352 -2068 -998 -808 -1528 -608 -854 76 -694 -287 -963 606 -134 -466 -620 -525 -1425 -283
1615 -283 163 680 -55 -143 705 -396 -1191 -176 -87 -109 -389 495 740 109 34 -33 324 420 -236 57 631
1636 631 587 546 -133 -8 952 1041 359 614 879 13 392 713 1051 317 1353 1118 879 879 -31 1168 836
1657 836 926 1354 319 590 858 739 -628 121 931 509 1440 358 804 331 1661 1345 1258 1148 1714
1676 1714 713 279 746 744 1069 881 765 1553 580 772 135 1125 585 1154 1153 486 902 660 533 -459 519
1697 519 1596 1113 1032 -690 501 1285 -11 922 161 587 683 1607 687 842 447 420 817 518 107 -630
1717 -630 -239 -743 1487 1042 110 -111 92 266 137 -440 66 -555 125 -484 -243 1038 -1302 128 -333
1736 -333 -172 -1033 -434 -778 -526 -932 -989 -100 -407 116 -1465 -901 -619 -1870 -241 -258 -1036 -130 -1669
1755 -1669 -873 -283 -1043 -1490 -1060 -1198 -469 -816 -733 -948 -1636 -660 -322 -351 -1015 -2253 -1181 -937 -1062 -57
1775 -57 -796 -1177 -1186 -1306 -1743 -1369 -1619 344 -1080 -1022 -497 -748 454 -1131 -1197 -1655 -77 -1813 -1242 584
1795 584 -374 238 -394 -328 -1237 -1226 -668 -567 -461 -938 196 -136 -808 -50 525 -166 -546 -824 -347 -657
1815 -657 -1041 -161 -486 -231 -466 -50 1090 -671 -253 -1034 -1082 -1176 176 314 -676 54 736 310 -270 547
1835 547 -1177 183 -155 -742 -105 -1833 -16 689 -349 292 -229 19 -207 -715 -318 1300 373 542
1853 542 1116 202 566 347 283 682 110 862 1485 1298 1237 583 651 628 730 799 1379 970 850 -218 457
1874 457 748 1750 1296 1282 450 966 600 1088 564 671 1020 287 1359 587 539 1729 885 747 457 935
1894 935 355 944 1237 1261 1744 929 1081 344 936 782 203 801 612 1371 295 855 1566 697 -189 960
1914 960 411 12 799 -232 495 -335 184 410 -267 -793 -1024 -121 557 1144 -684 -347 -693 -195 480
1933 480 -1431 542 54 -293 -242 -664 276 -545 96 -342 -541 -410 -886 -721 -500 -985 -1223 -369 -182 -319
1953 -319 -239 -729 -221 -469 -588 -527 -1469 -897 -864 -787 -1163 -1113 -1392 -599 -241 -478 -994 -1109 -791 52 -1397
1974 -1397 104 -1054 -1326 -876 -828 -1431 -306 -1073 -147 -364 -645 -539 627 -482 -262 -193 -814 62 -1240
1993 -1240 -612 -869 -499 -132 -193 115 -253 -345 750 22 22 -1279 -654 492 -680 691 125 -574 37
2012 37 -813 -238 -279 -822 842 456 149 -367 -579 408 963 -173 199 1232 917 486 1449 122 -19
2031 -19 1378 947 1379 135 362 1673 495 407 187 1394 1220 1492 884 1122 1066 942 1135 1255 1418
2050 1418 1152 45 1195 1011 972 1233 198 947 1152 892 -116 1016 1284 1324 1323 326 1871 1541 1596
2069 1596 1470 300 707 371 -150 711 1119 1453 782 204 375 98 970 522 1266 1521 334 -220 -227 113
2089 113 471 455 -220 37 411 -693 228 -1054 208 -726 678 488 -117 376 253 -164 289 749 -180
2108 -180 255 363 202 402 -184 -307 404 59 -185 -526 22 -477 1228 -683 28 -757 -348 -683 223
2127 223 -981 -889 237 -1559 -1689 -1398 393 -277 -513 253 -1114 -35 -1048 -926 -802 -462 -795 -1372
2145 -1372 -236 -481 -176 -1664 -1891 -651 -1472 -1209 -751 -570 -560 -1352 -1488 -463 -497 -514 -762 -1146 -1656
2164 -1656 -127 404 -93 -1618 -406 -1676 -337 -3 -1717 -498 -271 -1408 205 -792 -8 -270 -917
2181 -917 168 -277 -399 141 -879 -142 -27 131 365 45 -1120 -138 -197 -473 405 306 -132 -601 278 -656
2201 -656 587 329 941 -90 -4 509 -252 118 -259 -184 -305 807 711 793 -318 156 782 695 555 1112
2221 1112 526 694 846 706 1541 316 659 75 513 1541 1068 70 -110 145 1012 560 1233 690 685 617
2241 617 551 245 533 588 618 836 507 915 681 1311 -82 259 843 1039 1032 942 321 1032 -64 520 185
2262 185 255 646 185 46 991 -186 -145 646 214 112 518 428 -219 244 787 420 159 1160 -246 280
2282 280 -369 -43 577 275 -153 -311 -154 281 -161 313 139 -687 -357 232 443 -283 -744 162 483 -582
2302 -582 -251 -439 51 -180 -155 -140 -572 438 -1157 -952 -1101 -376 -618 -569 -1274 -225 -170 603 -1275 -2114
2322 -2114 -15 -1400 -42 -611 464 -307 -1735 -1146 -690 -703 -380 -549 -570 -1212 527 -172 -221 -1135 -723
2341 -723 -966 -874 -257 -768 -600 -895 -478 -518 -1117 -1379 -1205 68 -1283 -777 -1302 -1047 -426 612 62 626
2361 626 -301 -656 162 115 -835 -998 -230 -909 -68 469 1480 -439 389 -355 55 -1388 45 -485 359
2380 359 351 -440 -362 269 842 -287 -40 570 113 731 360 -389 159 156 -59 -569 -446 607 -9 -258 -322
2401 -322 -171 345 480 -176 907 719 447 899 -15 1044 422 165 348 821 138 1166 -626 338 1004
2420 1004 764 915 -123 399 304 1185 -118 737 902 187 709 1681 971 1174 1153 427 50 224 1509
2439 1509 1156 1188 530 634 132 321 -315 976 455 -227 335 -654 366 547 961 -52 -173 -605 -398
2458 -398 923 970 36 -446 567 210 -124 345 -734 -303 1 -391 -186 -987 82 -83 -1 551 417
2477 417 33 487 89 -754 -607 -523 511 9 697 -300 -78 48 -240 -1037 -581 -193 -223 142 -14 86
2497 86 -502 49 -384 -391 -34 -760 -304 -645 -266 253 -204 -467 -634 -1246 -1129 -1007 -809 219 -153 281 483
2518 483 -949 -1108 -426 -1536 161 -433 620 -744 -326 -521 91 -881 -1675 -376 -1415 -1052 -218 -314
2536 -314 -43 134 -133 -751 453 313 73 -957 -1409 1078 -226 -199 -869 -203 519 -486 379 -661
2554 -661 -488 -734 -946 -415 629 -42 -93 167 231 -547 -53 -295 -520 -341 -1033 -333 22 -798 834 304
2574 304 1368 -102 478 186 106 -229 -133 420 170 716 170 -253 -72 832 836 993 665 -368 314 346 213
2595 213 -294 240 694 -79 666 -180 1303 857 724 -262 1622 1025 170 784 525 531 23 354 639 1197
2615 1197 131 -22 672 -227 535 380 379 270 840 -893 589 -248 398 614 619 442 935 -204 194 828
2635 828 363 216 -430 99 362 -50 358 25 148 -487 402 171 198 142 -36 -120 -474 69 832 -1 -1086
2656 -1086 -232 -176 -541 -510 -109 763 922 -777 -130 -685 451 -474 -259 -907 731 -104 -359 368 -129
2675 -129 10 -215 -544 -228 -167 40 -15 234 -1148 -598 102 -603 -272 904 -965 427 -960 -2058 -1079
2694 -1079 -83 -528 -32 -442 207 -363 -78 -111 -327 -464 -425 -682 -520 -251 -715 -349 -52 -291 -102 -519
2714 -519 -347 -479 -223 -624 76 123 -979 669 162 -464 -254 -555 -117 -1154 14 851 1152 87 -508
2733 -508 241 -435 -953 -346 -575 -782 -456 689 -679 330 253 -261 584 -589 112 84 -872 -102 382
2752 382 23 -372 -291 286 -660 -789 61 279 122 -441 403 -138 433 904 -220 493 926 233 301 -711
2772 -711 464 659 -163 725 451 61 210 392 -102 -355 -354 -153 -758 1026 136 224 -288 -903 71 68 574
2793 574 1168 359 436 1082 -338 -448 -119 34 1024 134 -108 453 744 213 622 458 791 -651 205 1263
2813 1263 162 -318 -75 -161 -357 42 -771 397 588 -474 477 -106 409 92 694 -29 380 143 -570
2832 -570 809 -908 -222 -460 -316 626 -1085 74 206 601 745 1579 434 1425 -409 -210 333 -153
2850 -153 -287 113 -255 -220 -907 -109 -405 258 -579 -76 -692 -287 475 23 -119 -14 -155 -737 -293 -894
2870 -894 119 -1195 -942 -149 -390 -154 -697 -428 -289 -251 -592 -787 -571 -396 -357 -296 -191 -786 -156 215
2890 215 176 -523 -769 434 -16 -266 -159 -283 213 -128 -99 372 -327 -1026 -125 -1370 72 616 -236 74
2910 74 147 797 20 -1100 567 -254 1294 741 -278 959 509 -358 -835 -190 118 -727 -311 -923 -231
2929 -231 713 -619 918 707 737 565 -1059 -244 -264 -262 -526 -123 185 -42 332 -78 143 187 -490 173 170
2950 170 157 450 1026 416 321 685 209 400 932 -124 893 422 945 617 1145 494 323 -24 1018 539
2970 539 418 675 -137 263 495 448 326 596 215 886 -74 232 -333 -511 -768 730 928 33 481 -235
2990 -235 -634 533 -132 407 -192 -328 -209 -585 382 364 373 -156 60 110 337 -373 -437 -952 -86 41 -286
3011 -286 425 -623 -522 492 -733 131 372 182 -183 223 709 -559 -88 -156 -288 178 -690 -647 548
3030 548 -257 -730 303 -493 -383 -173 -218 -295 250 -509 -69 -416 -1300 786 418 -716 230 -1267 -180
3049 -180 -396 -556 -1 -831 294 77 -137 52 -32 -401 -228 287 -119 -875 -308 -273 -675 122 629 308
3069 308 -756 -530 609 -461 120 -664 40 -837 -430 583 488 -364 12 -109 245 -158 -191 -335 -189
3088 -189 29 375 583 49 859 164 361 272 -69 90 -122 -382 -402 690 782 -90 -651 605 713 164
3108 164 -549 -507 -89 433 -1031 -487 130 -799 562 752 67 -188 -255 171 586 -4 215 94 1315 125
3128 125 -165 360 216 453 -71 -743 -647 475 -244 -488 -148 -21 267 -49 -116 534 -160 1055 158 566
3148 566 -963 -319 591 -107 -326 -632 -529 -35 549 616 113 345 132 126 81 -240 -595 -832 -381 179 -449
3169 -449 1080 607 -507 -549 809 813 -384 -37 -458 -17 733 1153 70 531 -874 71 484 -521 311
3188 311 12 434 614 158 301 618 -179 -178 -268 199 -232 233 -677 639 423 -95 345 -975 317 -406
3208 -406 237 -670 -297 -489 -501 442 -923 120 57 19 -610 -1383 -769 -575 -256 252 -977 504 208 -688
3228 -688 406 -343 -389 -345 -343 722 398 449 -623 -535 -251 423 -736 -1035 -100 -526 370 52 -17 300 14
3249 14 -221 -852 98 -597 -334 382 -947 348 -1059 -5 -371 451 440 -871 -486 -757 -167 124 -180
3268 -180 -811 432 600 328 -183 101 -42 390 -1038 -642 790 351 -623 -108 293 200 349 20 -530
3287 -530 705 -149 282 90 -7 232 114 -784 162 -371 569 609 68 -490 253 67 -250 740 945 -567
3307 -567 447 517 63 -9 435 190 380 735 -394 -160 272 1233 -930 -719 399 334 80 862 -587
3326 -587 -181 188 -159 541 705 71 397 627 283 8 216 -711 612 -559 -999 -274 -1031 -801 -540
3345 -540 -605 -277 -211 602 624 744 -599 608 685 -253 28 -718 -280 -2 -56 116 228 -894 -838 -397 -108
3366 -108 2 -521 -787 -986 183 -317 12 -285 238 127 -614 -175 -176 62 465 620 462 -628 640 496
3386 496 328 -35 -566 36 574 473 146 -251 -189 10 985 -273 -1047 -492 57 -207 -461 360 -165 369
3406 369 381 -334 122 -133 -229 -493 28 267 -161 -464 77 16 305 58 240 128 325 312 -790 -105 -7
3427 -7 319 205 599 -468 321 321 371 -437 1061 -1383 67 368 -665 -96 -31 -318 -753 -1212 -208 -938
3447 -938 289 -367 -107 424 755 230 -483 -75 243 399 263 -152 823 561 1239 -599 318 430 695
3466 695 136 -485 389 -193 -73 -174 12 220 293 444 -4 -79 231 -49 -634 -309 -431 -182 50 -622 -36
3487 -36 -565 775 19 -74 -981 -184 388 -545 -299 159 -688 -84 -1014 420 204 -725 -556 -36 -158 604
3507 604 -467 -159 -192 768 66 -287 783 -16 121 464 525 829 684 174 6 -200 885 -465 186
3526 186 -118 342 78 108 -743 288 128 455 1061 -668 119 26 -28 -102 -782 -90 -1169 -164 236 -321
3546 -321 266 674 148 -208 -302 200 -1018 -217 -34 986 -17 185 -446 -215 235 156 869 -97 368 -289
3566 -289 261 531 80 -459 -792 500 1684 -273 552 344 -308 570 644 -282 -1377 225 -684 -268 298
3585 298 139 147 -718 1017 204 -450 -317 58 -232 188 354 -18 372 309 -767 -1024 84 185 -202 -195 435
3606 435 -713 219 -680 -895 1007 67 312 -12 106 107 -502 72 -399 -344 302 -73 418 240 671 -232
3626 -232 202 -319 -92 24 -917 -252 -580 -171 102 -23 834 -210 -817 332 -208 -195 206 -113 208 811
3646 811 -1054 838 320 -484 384 276 525 885 -614 -167 -1146 626 -580 161 -12 -834 -205 116
3664 116 -212 -99 -493 -721 -125 188 309 594 -144 -589 -538 1074 511 -462 476 347 -485 61 -531 -42
3684 -42 -82 -850 213 -165 930 309 -261 -573 309 777 655 900 662 -143 -126 326 -388 169 -659 239
3704 239 647 115 37 67 58 207 -230 -10 482 43 -817 885 294 -470 -577 391 658 -391 804 148
3724 148 -335 -237 -175 -116 67 -520 -888 -113 509 255 704 -458 -409 749 874 545 1516 -383 586 -687
3744 -687 -620 206 -398 156 -869 723 159 -904 568 -295 -531 151 -427 -150 282 253 -216 -302 218 -539
3764 -539 -500 577 172 491 364 -517 594 -846 106 -507 204 839 -431 -496 -390 597 -214 368 57
3783 57 -566 167 -560 1056 -315 -909 -22 417 -594 -1143 444 -528 -898 -253 -951 -836 -128 -713 387
3802 387 691 386 12 189 102 -1102 352 -634 307 -310 313 -423 -557 753 -84 210 299 -13 481 -450
3822 -450 -58 842 112 -726 -66 -509 -175 -534 -978 535 206 -113 -136 -296 -328 -39 -819 132 -509 -1
3842 -1 -536 -48 27 -788 -91 4 -192 306 497 -985 875 766 327 -290 -197 42 392 39 546 -1032 402
3863 402 -203 184 -60 522 888 -600 -79 -601 763 -439 -98 461 596 720 -382 -69 -113 -432 651
3882 651 -101 -665 -875 -219 -273 -342 -716 8 446 -117 -571 515 -492 946 58 110 -433 -3 523 362
3902 362 734 45 -245 657 638 -599 321 -342 -82 -149 1082 470 697 -727 -457 405 -512 341 293 1385
3922 1385 -42 -170 245 -440 -301 -395 -662 -121 964 464 1299 -297 803 -421 -1033 -116 144 -465
3940 -465 -268 -359 1214 -634 477 459 -524 137 -625 273 1231 -304 210 -354 -239 -190 -581 389 -420 797
3960 797 -55 374 -634 -706 -394 495 535 -756 -129 -893 -716 414 -42 651 966 -835 55 51 510 1184
3980 1184 -246 344 439 -380 -186 -801 162 -460 -421 -231 -317 296 187 -344 180 291 108 -374 342 106
4000 106 -967 187 -33 267 -651 97 211 -63 -551 -589 398 650 -487 304 -278 -74 -285 309 -288
4019 -288 -553 -414 313 235 432 -980 -609 -81 -748 354 -396 355 -210 -442 153 -249 856 -277 60
4038 60 434 -96 60 169 26 505 -276 -492 313 -543 339 528 -3 -352 -235 -352 455 -348 731 703
4058 703 779 234 -189 -23 399 -300 6 406 649 584 383 1170 -382 -191 108 -157 -660 540 -336 -231
4078 -231 -311 -621 648 -829 310 573 72 -106 -569 22 -1169 1212 1017 -622 144 -627 229 -1957
4096 -1957 -250 430 501 134 -462 -745 -39 251 334 -494 -120 -441 208 -124 669 332 81 -363 -949 45
4116 45 -650 -97 -919 52 -298 281 -336 665 -220 -348 -820 249 -330 -879 -295 -47 159 753 528 144
4136 144 -203 388 -735 82 71 -567 26 53 595 -974 -178 -363 -151 -651 -544 8 21 800 139 -23
4156 -23 307 310 518 -422 -296 -619 330 115 683 236 116 489 782 207 -538 117 -185 -84 -148 -149 130 -686
4178 -686 -36 955 -346 -597 56 693 -736 51 118 -110 593 468 -547 220 -303 209 -84 -573 1721
4197 1721 1455 507 657 650 -262 696 -527 -795 221 520 -441 -613 -1334 -817 -957 -912 -63 -146 889 -745
4217 -745 1095 -340 -175 -935 -998 376 -861 -77 726 -131 -89 -708 -1190 -820 183 161 -234 -125 -124 953
4237 953 94 -10 77 305 113 349 -196 1074 516 275 -188 -253 -675 -79 631 -106 -147 -483 380 118 -401
4258 -401 436 -1483 341 -852 -359 -492 266 610 -489 20 260 757 -407 175 766 164 175 -584 -403
4277 -403 203 129 416 256 -441 -339 469 912 424 -328 -502 -495 -344 708 -84 -92 399 465 -12 685 725 -39
4299 -39 -574 33 360 600 707 -248 570 559 -652 -467 -46 -942 76 -140 -849 -29 429 1197 -307 -1160
4319 -1160 -724 369 24 966 -68 -569 439 258 -175 571 -297 -112 585 1296 444 -539 432 -6 1113
4338 1113 319 66 -303 -255 -482 -106 31 270 -788 924 -139 -195 -855 49 236 1011 -109 -103 -760 -182
4358 -182 77 2 -225 -340 204 595 858 599 7 -1119 660 -413 -258 486 -839 104 -437 9 383
4377 383 -261 -36 -688 53 112 -377 -55 799 -259 210 134 -60 66 -85 -185 -92 403 -246 -550 -598 726
4398 726 -428 -295 577 -141 -811 60 -184 -12 478 -360 972 -77 -1020 396 -75 273 136 156 454
4417 454 -798 25 -71 -255 702 -773 78 -520 -176 -387 424 -596 -814 200 328 197 183 451 -563
4436 -563 -251 244 -316 946 510 -481 312 -433 -63 -76 612 -245 -192 692 604 646 -946 1006 -143 -346
4456 -346 -257 -1132 250 791 -725 740 324 -55 300 -516 74 -306 -705 156 720 -327 395 -187 21
4475 21 96 -1104 -4 -426 -98 539 -160 539 -175 369 399 297 249 971 153 831 -518 -452 505 59 287
4496 287 53 640 -768 -28 580 726 -320 233 128 186 116 -779 134 -19 -599 539 -1155 -279 296
4515 296 -149 -108 670 -380 -167 451 18 -268 -582 -214 149 605 833 -362 531 260 826 642 237 -222
4535 -222 284 222 854 207 69 -36 287 155 128 311 -1298 694 -36 -693 1033 284 -1237 359 222
4554 222 -17 -342 523 -401 -216 -410 396 409 -308 304 120 323 675 -33 755 -319 160 -201 -537 928
4574 928 152 1073 132 -914 -267 -590 1112 -435 -801 -250 641 468 686 393 589 -1409 585 -172
4592 -172 164 -299 -196 -595 -11 -1142 -173 -163 455 608 33 -173 -67 290 703 642 -804 -171 -185 -887
4612 -887 -405 -613 511 230 -320 -628 -966 -85 -469 379 -455 23 121 90 604 -130 -704 -687 391 516
4632 516 106 132 -279 413 -126 27 -487 -822 -739 -29 460 -60 372 674 20 452 704 -100 -250 189 312
4653 312 59 17 1145 119 -552 322 915 -425 273 -490 789 381 363 898 -307 618 319 -484 -1015
4672 -1015 384 404 79 -366 -308 205 102 287 -410 115 -155 641 -461 539 223 331 52 108 -22 59
4692 59 516 -948 29 -236 -403 66 605 -484 356 565 -485 581 -649 -1072 -242 130 128 535 86
4711 86 48 422 352 -243 -232 -407 -722 17 457 30 -1061 734 63 614 -293 -81 101 -836 -670 -102 1126
4732 1126 -1342 440 -241 -456 -442 -277 948 1338 521 32 333 -848 117 529 -157 176 566 731 -1147
4751 -1147 -338 -410 -231 -210 -424 246 -559 251 127 -321 405 247 -260 158 900 444 -74 -177 -23 -355
4771 -355 514 194 255 -367 -52 156 29 -106 753 976 -583 -565 -263 806 -371 -474 112 627 -278 -400
4791 -400 1386 -350 -697 107 351 86 -385 -644 -267 -151 378 268 217 -248 453 -431 282 -349 -117 -259
4811 -259 -59 -752 637 -86 -17 -530 385 284 -98 -161 24 90 976 -287 1 -201 -465 225 -211 -300 293
4832 293 123 199 317 630 671 -166 297 -184 -341 -454 140 1211 -34 16 73 -157 -216 -392 -188 -662 1518
4853 1518 666 -196 -366 -557 545 -984 -193 -491 806 522 466 1201 580 557 -215 427 -381 843 -95
4872 -95 748 -138 -477 -782 148 -237 -423 518 -920 624 31 -105 309 607 -517 256 1138 302 433
4891 433 4 389 103 453 -521 -138 -594 268 -458 98 471 -167 -95 236 -636 580 487 735 247 323 791
4912 791 -575 332 -90 -289 299 84 -824 -500 310 -134 -191 322 -137 -44 -130 796 183 -65 557 1070 460
4933 460 -15 147 604 31 -453 -155 -81 579 -798 -1057 -733 266 -185 -238 198 98 -158 -574 -283 -307 290
4954 290 84 993 271 -94 -49 52 301 570 263 -565 -833 -358 -801 -179 -86 96 -807 -135 -363 -1006 -394
4975 -394 8 320 206 532 1020 -45 450 -373 -900 445 -462 727 854 -1085 -438 585 -479 -993
4993 -993 86 2 399 -1010 695 878 292 125 668 -988 -61 228 1186 760 227 -112 -861 383 699
5012 699 -1011 -81 289 -189 -263 -1007 -406 -455 -93 113 -202 571 -548 1130 588 -1336 633 423 49
5031 49 481 467 445 -11 -347 518 401 82 -339 229 677 694 384 -343 -162 -161 952 289 -705 -94 117 471
5053 471 -525 840 -921 -260 57 -520 36 210 -150 -1073 -922 -1270 -380 1025 622 920 683 584 125
5072 125 -521 186 285 -747 323 181 -101 434 -84 131 -293 71 -334 211 -438 -354 -184 223 1350 906
5092 906 -629 478 501 365 -649 340 -517 -375 -421 156 -169 -12 -159 644 -51 -445 -13 -486 -1605
5111 -1605 -537 -366 403 650 -591 -41 111 264 652 -496 -744 473 0 149 302 124 -184 -1328
5129 -1328 466 -545 238 32 886 -155 405 939 87 572 -1103 -871 -134 661 -1136 390 -657
5146 -657 -425 437 -851 379 -565 10 62 403 25 -685 1029 325 -63 2 83 -199 -467 367 -23 -20 425
5167 425 -787 -112 -516 -519 -503 -212 96 49 -472 -557 -834 598 -608 -636 340 460 -171 -217 176 -518 447
5188 447 -205 152 1073 -6 819 636 689 -81 -458 681 -1010 -5 938 1197 -989 -520 297 517 143
5207 143 -76 -89 -681 -79 564 -134 -43 -621 825 559 -408 121 121 722 389 641 1075 45 826 155 -230
5228 -230 -1024 -451 778 -436 -472 -1258 -152 537 881 -73 -632 -633 811 480 302 -353 -146 500 115 -725
5248 -725 109 -95 43 -233 799 -522 -587 557 296 -39 124 51 119 1195 405 133 70 -286 -82 502
5268 502 871 216 184 543 -532 -566 -786 791 -60 -189 483 -512 407 -215 -161 91 746 237 141 29 -398
5289 -398 -393 -633 221 334 121 710 -80 -46 -458 -166 341 11 910 229 564 410 8 84 -561 674 633
5310 633 47 -418 -729 -11 1338 -333 33 718 614 -756 -406 -822 282 37 464 566 -817 516
5328 516 -544 172 -804 402 436 -531 942 778 613 53 -341 235 367 -435 -540 -94 754 -243 155
5347 155 585 459 1387 501 -671 55 -485 -195 83 463 -32 584 -206 1266 75 49 -546 -629 -469 -174
5367 -174 -273 911 -125 -3 765 -813 1043 -948 -88 362 -144 121 69 205 92 -620 189 -98 83
5386 83 330 60 302 -275 -949 119 -519 -88 -97 -603 586 274 622 -233 -306 -214 5 528 -666 -290 191
5407 191 -554 331 -42 -515 -3 -373 270 -230 -9 471 -535 515 -350 -207 21 86 409 286 -849
5426 -849 693 -207 79 149 -213 -596 787 520 -206 -407 39 355 -119 747 -259 595 -245 479 -324
5445 -324 -464 61 768 -861 -1424 664 -205 381 -193 1401 1072 -1813 456 55 161 501 -223 632
5463 632 496 586 415 3 -488 -130 366 215 -566 627 380 383 -44 -431 -301 86 -172 -300 455 1020 1082
5484 1082 85 212 -338 693 45 -1238 234 138 703 283 163 1194 -474 750 -212 360 -559 -811
5502 -811 -292 -252 150 -229 416 -425 -538 -39 1450 -499 -779 347 359 24 -96 -687 -660 375 -144 -11
5522 -11 10 -301 -384 283 -91 793 582 778 374 -55 662 90 233 289 -464 -535 -378 175 -473 -421 -746 208
5544 208 247 -415 -516 449 365 -200 -688 -24 -604 -501 414 219 690 -553 -672 641 161 155 -275 -379 -235
5565 -235 631 -118 309 -890 1180 -528 -454 -139 -77 91 207 -541 -40 398 -352 -10 -174 208 -649 -1103
5585 -1103 343 523 -172 -274 -52 -532 -544 -200 -632 65 -349 560 -49 809 -940 130 -349 269 -983
5604 -983 303 491 632 -125 524 95 -700 180 -171 485 -167 526 -1 -505 -364 -937 151 467 -523
5623 -523 -394 207 151 -91 34 -592 661 -88 -625 303 909 -230 770 198 14 57 793 -291 835
5642 835 -132 448 -422 186 155 53 -542 -92 -672 -679 -82 -49 -110 -624 -39 541 -48 -626 -456 -451 417 190
5664 190 472 317 1257 488 -408 3 -448 -49 189 -559 949 152 -26 -397 -734 586 235 31 937
5683 937 -90 946 -178 -84 644 583 -27 394 -194 -476 -957 278 588 -633 701 -347 314 315 -355
5702 -355 -1193 285 -974 315 -238 -17 597 -1454 -215 -676 -839 -100 -921 -651 -37 701 3 -686
5720 -686 -318 -50 625 -1376 144 486 9 267 237 611 -82 45 423 -203 471 -130 -893 -139 -919 207
5740 207 -73 564 -771 -401 645 235 763 -990 -1134 1012 -76 -565 -1228 -205 390 1028 496 241
5758 241 368 -494 341 -447 746 296 545 -479 26 137 -157 58 528 -242 -269 0 359 -129 978
5777 978 436 -324 -713 591 -1150 -11 -568 -515 565 46 572 283 453 -517 -7 -263 82 437 -165
5796 -165 -631 7 -189 -108 140 484 645 289 -266 -857 -561 -578 -191 740 858 -37 508 255 541 -596
5816 -596 -470 -759 -487 454 375 -348 209 468 -724 -476 -64 -923 384 64 -725 44 666 82 -354 -434
5836 -434 140 -995 153 116 -200 -302 713 -542 -476 385 -215 -603 -797 428 -669 -182 244 -895
5854 -895 517 -65 477 -805 -135 -258 717 61 -124 600 308 612 168 130 4 217 -219 511 -236 -999
5874 -999 500 -375 -835 -342 619 435 429 -460 -1177 -2 -674 206 -369 -752 187 628 25 312 -1002 102
5894 102 226 -405 -6 212 676 181 -371 175 44 -184 629 -961 138 145 1266 -154 68 499 26
5913 26 -4 43 260 133 -790 -698 246 144 -589 -379 -434 12 -615 -292 267 253 -837 859 -344 -326 224
5934 224 -293 31 343 -251 -304 -387 28 568 714 704 -104 726 55 -416 51 -1066 -159 -1074 -1150 -72 75
5955 75 296 -139 -358 -48 -1117 -1040 533 42 650 -342 98 194 167 348 -529 216 -341 -7 75 -424 -866
5976 -866 -879 344 73 -43 940 -400 -691 -660 191 -350 -826 573 -1127 231 -885 75 320 -118 -128
5995 -128 68 -831 771 -54 -415 -1394 467 -106 808 97 357 -282 -149 -128 412 122 -440 56 -52 361
6015 361 581 -217 -181 363 127 531 -564 370 678 -53 -312 -440 249 30 395 -896 -171 -1152 -584 215
6035 215 -403 805 -203 209 141 -318 722 -163 108 -86 -765 518 734 440 606 -497 -306 482 -458
6054 -458 107 -153 508 -828 -192 303 -305 -233 721 220 -561 946 -302 -172 876 -68 1153 30
6072 30 -719 -539 428 24 -1029 -62 314 -244 104 -150 -334 -238 -512 146 -61 -534 943 -395 878
6091 878 -4 781 1011 768 736 -1374 496 -191 737 786 -469 -416 -830 0 -800 -306 448 617 262 -368
6111 -368 63 598 1046 652 415 -952 -301 802 655 132 -392 -527 -291 312 580 299 646 2 245
6130 245 -21 -246 -152 381 -295 -450 498 694 566 -28 128 -261 5 -610 437 -1226 20 185 -11
6149 -11 879 22 -242 227 1525 -42 257 10 -216 740 60 -70 715 -722 -1039 -1341 -137 1492 -75
6168 -75 -488 545 256 50 128 -1251 -233 -382 -591 294 313 842 -25 -270 785 229 115 -724 526
6187 526 570 -193 650 -623 -412 308 302 -579 374 328 165 -537 -26 -183 -125 -38 62 -478 -171 -166 553 235
6209 235 -610 -786 -805 -720 -140 237 331 -393 79 641 -252 414 -389 -993 54 -349 537 84 740 -448
6229 -448 416 -122 -162 -276 -767 1045 -427 816 -14 -47 475 -494 -371 527 193 -309 207 222 873 -587
6249 -587 -433 285 -306 -7 -192 -55 598 -172 -606 -531 365 82 492 353 294 386 -193 -39 -762 -1233 -701
6270 -701 764 404 132 -681 853 174 784 -423 -18 40 -342 -773 -147 278 515 -556 -320 486 349
6289 349 -290 462 -226 261 562 -133 -509 193 120 -203 -18 -649 390 917 -493 -96 100 105 615 -51
6309 -51 -196 -731 379 32 244 558 80 -474 -621 -499 353 264 -700 95 -506 103 44 -510 589 277
6329 277 -351 48 481 651 -97 -318 800 767 -845 1376 803 72 -12 499 71 -181 -421 224 -130 842
6349 842 -451 617 85 -481 -250 -453 191 1042 -120 405 -258 710 432 772 -50 -335 -566 336 -285
6368 -285 -322 -1108 -151 -473 -212 -44 -603 -170 -445 128 -255 -804 -723 756 213 263 308 -548 160 20 -8
6389 -8 632 -736 -686 43 444 -122 466 872 -338 175 718 -510 -80 260 207 -718 -141 512 1284 613
6409 613 -50 -142 -564 -270 1008 -79 460 393 70 -12 886 386 122 127 153 434 31 621 865 370 -467
6430 -467 -564 909 -448 511 -209 72 182 958 -133 -90 911 1173 491 260 -1040 -582 757 -550
6448 -550 532 -51 -418 -7 854 -205 -288 -375 339 189 -171 238 -530 -302 -223 921 944 -672 -222 567
6468 567 1009 124 22 -628 72 -222 525 -504 596 1063 -473 119 207 2 -152 807 560 605 -822
6487 -822 -286 -682 -200 -454 -351 -166 -337 -169 1508 -148 -185 -191 -17 15 526 -563 -329 190 287 25 -395
6508 -395 -373 -627 75 67 340 -435 -673 123 -347 -506 559 234 -698 312 138 74 -1233 -540 345 -1188
6528 -1188 736 381 447 867 -503 -256 856 663 719 798 750 26 430 -512 221 -508 170 140 789 -464
6548 -464 735 -80 -300 -1027 -81 307 -102 1324 -223 643 -273 -581 -353 -105 183 -923 177 373
6566 373 -171 1042 -945 1127 -14 -1092 -93 323 402 620 -435 78 -196 -201 -1121 195 282 234 -871
6585 -871 -261 240 443 447 -494 -319 -508 156 357 -855 -662 370 589 378 417 226 83 64 164 446 -77
6606 -77 22 -782 -630 -278 -188 703 87 -752 1396 53 1519 879 -35 -494 657 217 631 505 135 -353
6626 -353 1181 309 624 180 -420 494 -132 297 615 384 -435 95 -651 143 202 333 -535 950 -245
6645 -245 -219 -9 -878 -345 -361 694 79 -529 524 77 -292 163 567 -529 -131 -74 470 679 288 -113
6665 -113 223 640 654 -797 -145 391 -433 143 605 -91 -562 -57 264 -930 677 -336 -230 224 -77
6684 -77 -347 -234 -257 451 111 233 341 479 -745 -96 -383 -1030 586 -1538 -455 325 -242 28 95 533
6704 533 -134 -428 -519 1071 1011 231 -187 -222 122 -1085 331 -639 -946 61 -495 1188 985 396 597
6723 597 609 118 -141 -688 -305 -56 1505 -318 -542 210 509 325 323 -504 412 227 391 939 378 1823
6743 1823 236 -1258 81 -730 -656 -1143 -112 542 -308 -329 -1038 -436 130 37 465 -1171 191 -266 -636
6762 -636 -442 441 209 186 98 766 -305 814 1364 -655 -297 165 724 -191 -605 537 -199 -594 193
6781 193 52 -1235 -50 139 -283 -128 330 -46 -486 -230 61 293 554 37 216 1275 -165 -316 539
6800 539 -159 -404 217 735 507 105 -312 264 -24 77 5 -379 257 -594 465 74 -486 779 -644
6819 -644 99 297 -947 -385 -94 37 21 -329 -219 185 -683 377 293 -136 -706 868 205 -497 -115 -661
6839 -661 -679 -271 95 -28 -572 -47 -213 151 694 -163 -346 467 33 187 -731 -365 482 234 239 1162 -343
6860 -343 97 -100 -493 733 860 -306 671 -592 141 -583 -632 312 165 -289 -796 -265 814 140 -256
6879 -256 -87 -446 -177 -871 -523 311 -619 477 -476 -535 -46 119 356 492 -414 -336 184 907 660 -1264
6899 -1264 -356 556 736 -37 -365 119 457 -306 -108 -873 937 -830 -553 -302 -425 -760 636 803 -506
6918 -506 303 -514 245 -957 249 -77 28 -642 -674 290 -322 -315 629 -13 1020 238 279 -437 179 -497
6938 -497 -732 121 64 -307 -76 -1089 -789 -91 381 -750 -868 -11 -640 350 -147 -390 565 261 -504 335
6958 335 -142 -561 -215 493 233 195 -410 -476 -1127 -323 886 1069 287 -527 -1143 -267 449 -276 455 509 -403
6979 -403 199 -583 -414 164 -1054 -89 -842 -665 -531 120 160 176 -18 -483 -364 469 -601 76 -167 82
6999 82 -396 685 -419 462 399 143 -538 544 677 -143 -139 -123 424 374 861 146 35 -626 -118 401 -877
7020 -877 -884 172 14 -66 -700 -449 1053 267 -261 1351 -505 -270 280 305 -272 -617 -668 281 187 556 -540
7041 -540 -544 -1035 -676 -496 122 -617 87 -245 35 -129 -26 399 -387 -196 245 583 263 -868 483 466
7061 466 -653 359 10 -615 -461 765 75 -51 351 -536 204 73 -180 -641 -646 -427 -480 6 -505 -348
7081 -348 164 46 -442 -420 82 738 629 -50 407 510 593 -98 488 48 54 -505 -1004 436 -479 471 -379
7102 -379 657 -320 122 -522 -501 759 -701 -519 -255 -242 -688 13 344 329 762 -991 -137 -471 -200 -259
7122 -259 -1252 0 -317 -71 356 -8 -46 -103 186 434 223 494 -792 -353 -801 133 -250 -155 -692 -26
7142 -26 74 97 -1077 220 1311 -503 -1 464 74 560 273 -624 26 293 -426 -73 437 -20 389
7161 389 -157 -54 -234 188 240 -286 -270 -267 164 -35 -458 -32 -100 1023 453 -20 -1147 773 -3 367 98
7182 98 237 -358 -722 -118 -877 162 470 1031 -168 -330 -622 -192 87 849 -362 98 -534 -1399 1646
7201 1646 167 245 -419 1107 -759 -185 -393 -345 -281 383 60 -370 63 605 855 -1401 586 -489 -58
7220 -58 7 818 -350 162 -802 -964 -335 38 -171 62 -217 99 313 -63 379 507 442 782 310 -30 1089
7241 1089 52 -267 -585 417 -998 465 -481 1116 692 2 302 298 567 -130 151 -312 -1155 191
7259 191 6 584 211 6 -925 -468 -362 1 172 -20 -55 -342 120 -548 -212 1207 674 116 572 411
7279 411 -296 -391 213 197 -454 -14 200 544 -335 -859 848 550 511 180 -250 42 626 207 764 432 -667
7300 -667 -482 400 616 74 -900 -445 329 -455 -162 287 539 728 242 552 -339 -200 -1049 -51 748 254
7320 254 -16 443 -1072 221 93 173 -249 -97 143 -1141 416 -235 290 -504 601 -119 305 195 -328
7339 -328 384 -301 441 629 -573 -345 293 -721 178 796 -366 817 -453 712 179 -26 -1220 671
7357 671 539 -1148 642 -503 44 687 -569 -227 -482 -782 1221 291 316 77 1175 935 223 265 -502
7376 -502 516 -881 -50 86 -713 -347 -675 79 494 -318 -587 -754 -578 564 -339 647 168 283 -589
7395 -589 -5 417 -575 547 -873 273 311 -712 -665 -934 848 333 847 187 106 -99 -212 -383 396
7414 396 -242 -334 509 87 -6 -870 617 -681 164 -895 -243 460 457 669 -197 561 613 1074 1356 127
7434 127 185 311 628 -35 0 181 942 -279 248 -36 -542 -794 -103 534 896 -424 -295 603 -183 872
7454 872 26 211 29 -278 -908 -724 -299 60 606 128 -49 36 -317 361 -636 -1093 94 -263 138 -236
7474 -236 1188 1590 -1146 246 -224 0 -512 521 -544 186 -153 352 -174 489 -79 -487 -891 75
7492 75 -64 -636 541 -567 726 -588 -957 476 6 267 36 -1060 -1051 254 355 199 922 102 -577
7511 -577 -633 -827 82 -179 -312 -372 -375 68 283 -462 376 -563 -215 -91 348 -38 -550 907 448 -572 543
7532 543 -363 -56 199 -684 -34 882 213 -725 -651 28 593 748 -746 -28 -245 744 108 213 108 -682
7552 -682 623 -19 45 -980 350 484 -398 351 110 187 -244 -219 541 -1284 -57 153 99 240 100 -233
7572 -233 441 -504 -310 -258 -395 104 -582 -333 1020 403 -606 152 -179 532 -58 -656 -283 -461 -543 -664
7592 -664 129 407 -302 -401 9 424 -440 394 -311 214 251 -171 -780 269 195 259 646 614 -84 -435 -402 -334
7614 -334 -260 440 388 -77 -385 733 -498 212 747 35 0 591 -74 -269 -204 130 794 -476 315 -199
7634 -199 3 -208 257 -871 661 72 370 406 191 -183 -261 354 -718 476 -751 320 -668 -736 411
7653 411 -346 1235 489 -108 758 -514 -64 -150 69 -403 100 -4 -110 82 -1170 -553 331 -484 593
7672 593 -219 275 75 432 -678 365 498 18 129 -131 -176 72 -258 -355 803 -13 340 354 990 -551
7692 -551 -1235 -702 497 -147 660 257 431 7 -290 682 -444 324 -44 781 770 152 -880 -138 636
7711 636 -579 -576 307 -884 -483 527 737 -966 -408 -116 -407 -844 -777 329 93 -798 337 766 378
7730 378 -388 -1163 10 -954 844 -195 -933 740 95 -624 429 446 56 159 330 625 184 -278 -422
7749 -422 247 451 117 782 -308 68 -313 -440 -406 -413 78 207 237 -482 312 -319 1084 304 809 15 85
7770 85 -54 -661 -424 -995 -621 376 -19 -697 -176 -395 -135 530 53 -161 -701 -187 -318 -10 113 862
7790 862 715 -834 -735 -328 234 -79 503 -58 655 550 701 -615 -121 358 759 702 -272 376 -44 -385
7810 -385 -139 652 878 35 6 -138 -305 -92 137 -85 -329 -295 248 111 -131 -314 270 -229 49 -80 752
7831 752 695 -807 277 -67 889 259 119 96 27 -118 -43 393 566 -986 -296 -186 551 193 -445 49
7851 49 30 460 -405 326 59 742 366 -175 939 202 528 -966 -655 -425 1251 448 437 -136 106 -239
7871 -239 -538 169 -736 -106 70 765 -111 568 -485 -557 -218 18 323 -614 -803 222 -836 -249 -763
7890 -763 73 477 -653 -66 -493 -773 732 -193 -537 -37 122 214 697 305 504 561 -1418 614 120
7909 120 62 5 -662 775 245 78 -232 -366 -268 29 391 -670 -28 270 794 -37 484 -157 796 36
7929 36 -377 314 -577 -790 -75 -1095 -273 -1070 -201 -345 -22 -718 -347 289 -408 -71 -831 -183 609 306
7949 306 62 -131 -669 -846 -620 153 -252 318 140 216 -283 -158 417 -730 -165 -520 -848 523 161 -682
7969 -682 812 -295 -489 -819 1009 1094 144 -225 -291 -649 -846 -201 -249 -530 -674 -354 -145 -48 377 -800
7989 -800 -421 -1131 -543 13 -739 -460 561 64 -202 7 1 1635 88 -450 -504 629 -570 -23 -366
8008 -366 -7 380 -366 -183 -215 889 385 588 -4 -573 -578 -135 95 -196 -227 -305 -467 -363 63 278 -613
8029 -613 333 129 -155 -446 -560 -566 244 117 -429 -90 143 179 -908 -188 -289 -629 164 334 -519 -127 -963
8050 -963 -748 -581 632 631 -295 -131 89 769 -713 614 -413 396 103 -736 308 -131 -549 594 737
8069 737 171 -229 -72 187 634 206 -464 103 -506 76 193 -147 40 74 -392 -662 -330 -549 -748 889
8089 889 709 -1206 155 154 -306 210 259 -99 1204 327 -88 458 -8 -609 -189 -97 -636 392 -372 862
8109 862 -213 -132 160 -100 460 -258 265 548 -286 18 798 299 -859 604 -168 -438 1092 368 1
8128 1 -314 -104 -151 307 589 296 279 1013 -127 -116 -574 537 284 621 540 546 -271 -286 -419 -31 -25 709 -1091
8151 -1091 -327 263 -146 -82 -982 -431 -814 480 197 -102 783 272 846 -1062 -300 44 929 632 9
8170 9 206 -197 -280 228 703 -462 640 -18 498 861 -744 212 -6 630 -140 80 767 368 280 -921
8190 -921 213
8191B13
##END NTUPLES=NMR FID
##END=
