##TITLE=1H_KYU-20'+DMSO 2d +t
 CDCl3, 100 sc, 
 15.3.2019
##JCAMPDX= 6.0         $$ Bruker NMR JCAMP-DX V2.0
##DATA TYPE= NMR FID
##DATA CLASS= NTUPLES
##ORIGIN= UXNMR, Bruker Analytische Messtechnik GmbH
##OWNER= root
$$ XWIN-NMR		Version 3.5
$$ Fri Mar 15 17:26:28 2019 Russian Standard Time (UT+4h)  she@DPX200
##.OBSERVE FREQUENCY= 200.1316
##.OBSERVE NUCLEUS= ^1H
##.DELAY= (6, 6)
##.ACQUISITION MODE= SIMULTANEOUS
##.ACQUISITION SCHEME= undefined
##.AVERAGES= 100
##.DIGITISER RES= 16
##SPECTROMETER/DATA SYSTEM= spect
##.PULSE SEQUENCE= zg30
##.SOLVENT NAME= CDCl3
##.SHIFT REFERENCE= (INTERNAL, CDCl3, 0, 15.7039)
##AUDIT TRAIL= $$ (NUMBER, WHEN, WHO, WHERE, WHAT)
$$ ##TITLE= Audit trail, XWIN-NMR		Version 3.5
$$ ##JCAMPDX= 5.01
$$ ##ORIGIN= Bruker BioSpin GmbH
$$ ##OWNER= she
$$ F:/spectra/data/she/nmr/H-F/1/audita.txt
$$ ##AUDIT TRAIL=  $$ (NUMBER, WHEN, WHO, WHERE, WHAT)
(   1,<2019-03-15 17:25:18.32 +0400>,<she>,<DPX200>,
      <created by zg, POWCHK disabled, PULCHK disabled
       configuration hash MD5:
       00 E9 B6 7A A2 85 ED C7 34 08 36 98 17 FE 4E 26
       data hash MD5: 16K
       73 CD A7 91 40 A4 B1 25 A3 AF 13 52 2C C6 60 02>)
$$ ##END=
$$ 
$$ hash MD5
$$ 7F BE 94 3E 7F F5 80 44 B6 10 CE 68 39 89 E1 8D
##$RELAX= 
##$RELAX= 
##$RELAX= 
##$RELAX= 
##$RELAX= 
##$RELAX= 
$$ Bruker specific parameters
$$ --------------------------
##$DU= <F:/spectra>
##$EXPNO= 1
##$NAME= <H-F>
##$PROCNO= 1
##$TYPE= <nmr>
##$USER= <she>
##$AMP= (0..31)
100 100 100 100 100 100 100 100 100 100 100 100 100 100 100 100 100 100 
100 100 100 100 100 100 100 100 100 100 100 100 100 100 
##$AQSEQ= 0
##$AQ_mod= 1
##$AUNM= <au_zg>
##$AUTOPOS= <>
##$BF1= 200.13
##$BF2= 200.13
##$BF3= 200.13
##$BF4= 200.13
##$BF5= 200.13
##$BF6= 200.13
##$BF7= 200.13
##$BF8= 200.13
##$BYTORDA= 1
##$CFDGTYP= 0
##$CFRGTYP= 5
##$CHEMSTR= <none>
##$CNST= (0..31)
1 1 145 1 1 1 1 1 1 1 1 1 1 1 1 1 1 1 1 1 1 1 1 1 1 1 1 1 1 1 1 1 
##$CPDPRG= <>
##$CPDPRG1= <>
##$CPDPRG2= <>
##$CPDPRG3= <>
##$CPDPRG4= <mlev>
##$CPDPRG5= <mlev>
##$CPDPRG6= <mlev>
##$CPDPRG7= <mlev>
##$CPDPRG8= <mlev>
##$CPDPRGB= <>
##$CPDPRGT= <>
##$D= (0..31)
0 1.2 0 0 0 0 0 0 0 0 0 0.03 0 0 0 0 0 0 0 0 0 0 0 0 0 0 0 0 0 0 0 0 
##$DATE= 1552656317
##$DBL= (0..7)
120 120 120 120 120 120 120 120 
##$DBP= (0..7)
150 150 150 150 150 150 150 150 
##$DBP07= 0
##$DBPNAM0= <>
##$DBPNAM1= <>
##$DBPNAM2= <>
##$DBPNAM3= <>
##$DBPNAM4= <>
##$DBPNAM5= <>
##$DBPNAM6= <>
##$DBPNAM7= <>
##$DBPOAL= (0..7)
0.5 0.5 0.5 0.5 0.5 0.5 0.5 0.5 
##$DBPOFFS= (0..7)
0 0 0 0 0 0 0 0 
##$DE= 6
##$DECBNUC= <off>
##$DECIM= 2
##$DECNUC= <off>
##$DECSTAT= 4
##$DIGMOD= 1
##$DIGTYP= 9
##$DL= (0..7)
0 120 120 120 120 120 120 120 
##$DP= (0..7)
150 150 150 150 150 150 150 150 
##$DP07= 0
##$DPNAME0= <>
##$DPNAME1= <>
##$DPNAME2= <>
##$DPNAME3= <>
##$DPNAME4= <>
##$DPNAME5= <>
##$DPNAME6= <>
##$DPNAME7= <>
##$DPOAL= (0..7)
0.5 0.5 0.5 0.5 0.5 0.5 0.5 0.5 
##$DPOFFS= (0..7)
0 0 0 0 0 0 0 0 
##$DQDMODE= 0
##$DR= 16
##$DS= 0
##$DSLIST= <SSSSSSSSSSSSSSS>
$$ [...]
##$SUBNAM2= <"">
##$SUBNAM3= <"">
##$SUBNAM4= <"">
##$SUBNAM5= <"">
##$SUBNAM6= <"">
##$SUBNAM7= <"">
##$SUBNAM8= <"">
##$SUBNAM9= <"">
##$SW= 359.47569520838
##$SWIBOX= (0..15)
0 0 2 0 0 0 0 0 0 0 0 0 0 0 0 0 
##$SW_h= 71942.4460431655
##$TD= 16384
##$TD0= 1
##$TE= 0
##$TE2= 300
##$TE3= 300
##$TEG= 300
##$TL= (0..7)
0 120 120 120 120 120 120 120 
##$TP= (0..7)
150 150 150 150 150 150 150 150 
##$TP07= 0
##$TPNAME0= <>
##$TPNAME1= <>
##$TPNAME2= <>
##$TPNAME3= <>
##$TPNAME4= <>
##$TPNAME5= <>
##$TPNAME6= <>
##$TPNAME7= <>
##$TPOAL= (0..7)
0.5 0.5 0.5 0.5 0.5 0.5 0.5 0.5 
##$TPOFFS= (0..7)
0 0 0 0 0 0 0 0 
##$TUNHIN= 0
##$TUNHOUT= 0
##$TUNXOUT= 0
##$USERA1= <user>
##$USERA2= <user>
##$USERA3= <user>
##$USERA4= <user>
##$USERA5= <user>
##$V9= 5
##$VALIST= <valist>
##$VCLIST= <CCCCCCCCCCCCCCC>
##$VD= 0
##$VDLIST= <DDDDDDDDDDDDDDD>
##$VPLIST= <PPPPPPPPPPPPPPP>
##$VTLIST= <TTTTTTTTTTTTTTT>
##$WBST= 1024
##$WBSW= 4
##$XGAIN= (0..3)
0 0 0 0 
##$XL= 0
##$YL= 0
##$YMAX_a= 472001
##$YMIN_a= -330644
##$ZGOPTNS= <>
##$ZL1= 120
##$ZL2= 120
##$ZL3= 120
##$ZL4= 120
##$ABSF1= 10
##$ABSF2= 0
##$ABSG= 5
##$ABSL= 3
##$ALPHA= 0
##$AQORDER= 0
##$ASSFAC= 0
##$ASSFACI= 0
##$ASSFACX= 0
##$ASSWID= 0
##$AUNMP= <proc_1d>
##$AZFE= 0.1
##$AZFW= 0.1
##$BCFW= 1
##$BC_mod= 2
##$BYTORDP= 1
##$COROFFS= 0
##$CY= 11.3945322036743
##$DATMOD= 1
##$DC= 2
##$DFILT= <>
##$DTYPP= 0
##$F1P= 18.9103706918063
##$F2P= -1.10871071338519
##$FCOR= 0.5
##$FTSIZE= 0
##$FT_mod= 4
##$GAMMA= 1
##$GB= 0.15
##$INTBC= 1
##$INTSCL= 1
##$ISEN= 128
##$LB= 0.24
##$LEV0= 0
##$LPBIN= 0
##$MAXI= 10000
##$MC2= 0
##$MEAN= 0
##$ME_mod= 0
##$MI= 1.114404
##$NCOEF= 0
##$NC_proc= 0
##$NLEV= 6
##$NOISF1= 3.799351
##$NOISF2= 2.8
##$NSP= 1
##$NTH_PI= 0
##$NZP= 0
##$OFFSET= 15.70392
##$PC= 1
##$PHC0= -9172.057
##$PHC1= 15.20026
##$PH_mod= 1
##$PKNL= yes
##$PPARMOD= 0
##$PSCAL= 0
##$PSIGN= 0
##$REVERSE= no
##$SF= 200.130013532006
##$SI= 16384
##$SIGF1= 3
##$SIGF2= 2
##$SINO= 400
##$SIOLD= 16384
##$SREGLST= <1H.CDCl3>
##$SSB= 0
##$STSI= 0
##$STSR= 0
##$SW_p= 3612.71676300578
##$SYMM= 0
##$S_DEV= 0
##$TDeff= 0
##$TDoff= 0
##$TI= <>
##$TILT= no
##$TM1= 0
##$TM2= 0
##$TOPLEV= 0
##$USERP1= <user>
##$USERP2= <user>
##$USERP3= <user>
##$USERP4= <user>
##$USERP5= <user>
##$WDW= 1
##$XDIM= 8192
##$YMAX_p= 0
##$YMIN_p= 0
$$ End of Bruker specific parameters
$$ ---------------------------------
##NTUPLES= NMR FID
##VAR_NAME=  TIME,          FID/REAL,        FID/IMAG
##SYMBOL=    X,             R,               I
##VAR_TYPE=  INDEPENDENT,   DEPENDENT,       DEPENDENT
##VAR_FORM=  AFFN,          ASDF,            ASDF
##VAR_DIM=   8192,          8192,            8192
##UNITS=     SECONDS,       ARBITRARY UNITS, ARBITRARY UNITS
##FACTOR=    1.39e-05,      1,               1
##FIRST=     0,             0,               0
##LAST=      0.1138549,     0,               0
##MIN=       0,             -330644,         0
##MAX=       0.1138549,     472001,          0
$$ Real data points
##PAGE= N=1
##DATA TABLE= (X++(R..R)), XYDATA
$$ [...]
2792B96M74O60r58O14o03o4k9j58m46r7J28m64N72l01P90p28k34n74J664j855
2812a313N93K80l38Qk02L8N52j09j282N55K59m20L04R75L48n61l94Q08o90M74
2832a15L76M58J88j880J840m2j76J029o98j57jj88j80j29N78k96j17m12L13P20
2852A111j151M13j85K3n69k22M81J90j35J56n37p79n14O90K68k97J81O05k95n70
2872a136L28L66o25L53J79k67J377q88P58q49Q20K68l85Q4q77J275k18p9p1q7
2892C26L35m72L29J221j526O8J133j311o59O24L70n42Q03k6O01j33m21m4r95q33
2912a152J917q66L11k03k34J02j44R94m02j023o12Q55l36R5L16l68rJ4M70l39
2932f14J34N65L24o72J245j189R91q47l54R25n32Q13K11P99j430L69L34l93m99
$$ plain form
2792 296 770 1430 472 1086 483 419 390 232 -214 -311 -183 -647 -75 -376 414 -314 -548 -1122 542 -1313
2812 -1313 -720 -440 -778 -770 -972 -934 -382 -491 -1773 -1218 -959 -1379 -1075 -100 248 -313 -707 101 -589 -115
2832 -115 261 719 907 -973 867 825 649 1678 980 823 822 634 454 325 903 607 490 78 391 1111
2852 1111 -40 373 188 211 -358 -580 -99 91 -44 112 -425 -1204 -1718 -1028 -760 -1057 -876 -271 -566 -1136
2872 -1136 -808 -442 -1067 -714 -535 -802 575 -313 445 -404 416 684 299 383 -494 781 563 484 413 326
2892 326 661 189 518 1739 213 281 1414 103 -556 68 438 -104 699 673 1274 1141 720 676 -319 -1152
2912 -1152 765 -101 210 7 -227 -125 -269 725 323 -700 -1312 -457 -793 -698 -382 -750 -759 -745 -275 -614
2932 -614 -480 85 409 -263 982 -207 784 -63 -417 508 -24 789 1000 1799 369 738 1072 679 180
2951A80k55K73M64L38p85O16m50P40j165M30k69m56L86P61j517O08p39L8J428
2970F26j193Q52j015o28Q33Kj4q9l0o10M90R65q04K73p3J16k26J136p21k63n01
2991h74L50J94M28M22L67k70q06J62O02p1k5o71J144J64n52J73K71j73j9r89J006
3012H33j72r02R93p24j95M09l44k33j36P55j276P10k0n21O9p2N36l19k84N55J87
3033a51m11q5l21K30Q10J7q8l88J074j92q30k31L11K91K19q97K68J211m66L57
3053G28L44p60K85p7J05J69J06j912J136l30R39j43m04n6o33P65l37n45N99O7
3073D6k57K4m07l53Q39j385J492m65n51J044l60n69L91k35J155L20m25l20j320
3092a336J299l50R67m72L54p67j23K16O52K62j093nJ320Q9j323J876o32k2k29
$$ plain form
2951 180 -75 198 662 1000 215 831 381 1121 -44 386 117 -339 47 808 -709 -101 -840 -802 626
2970 626 -567 285 -730 -1358 -525 -523 -537 -626 -656 -1266 -776 189 -615 -342 -415 -299 -525 611 -110 -373 -874
2991 -874 -524 -330 98 520 887 617 -189 -27 575 504 479 -192 952 1116 564 737 1008 835 816 -173 833
3012 833 661 -241 752 28 -167 242 -102 -335 -471 284 -992 -282 -302 -823 -754 -826 -290 -609 -893 -338 -151
3033 -151 -562 -647 -968 -738 72 89 1 -387 687 495 -335 -566 -255 36 255 -642 -374 837 371 728
3053 728 1072 312 597 520 625 794 900 -1012 124 -206 733 590 186 130 -503 262 -75 -620 -21 46
3073 46 -211 -187 -594 -947 -108 -1493 -1 -466 -1017 27 -333 -902 -511 -746 409 729 304 -16 -1336
3092 -1336 -37 -387 580 108 462 -305 -428 -212 440 702 -391 -396 924 1013 -310 1566 934 912 683
3111F83j046O60l0p6n23J70N8p88J011M95l96m7j22J61M63j543k58J832p81l43
3131d20Q7j20j15L81m88J230l83j295O99J83m5N55k08j8j08N03j202J261j495
3150i98P29M03J471l96j271R91o53N69L85L3m23l58p5L88l69j16P15r61j69J13
3170Hn6l28l65N88J00P6K59J30r63M96N98j11n67J8m63M31l63P47k67k28k03P61
3192B98p60kK75k3o63J261l88o1m91J179k31j460J411k49J085p06p43Q37J049
3211A618J9j065j146N85J004j286M77J3J13L53l04l11K91j202J173m58K40k94
3229a80j58j59P28n68J45M18l78j32j008J90K27P45O98n00L80r60J934j198o8
3248A56k73j094J339P6p1k39P90p44N25o21Q23q66M11K11o70J82j24N66J98o61
$$ plain form
3111 683 -363 297 267 191 -332 -162 -104 -892 119 614 218 171 49 210 673 -870 -1128 704 -77 -420
3131 -420 -333 -453 -568 -187 -675 555 172 -1123 -424 -241 -286 269 61 43 -65 438 -764 497 -998
3150 -998 -269 134 1605 1209 -62 929 276 845 1230 1263 840 482 407 795 426 310 1025 64 -105 8
3170 8 -48 -376 -741 -153 -53 23 282 412 -551 -55 543 432 -135 -117 -580 -149 -512 235 -32 -260 -463 298
3192 298 -462 -464 -189 -212 -875 386 -2 -63 -554 625 394 -1066 345 96 1181 475 -268 569 1618
3211 1618 1637 572 -574 11 1015 -271 206 219 332 685 381 70 361 -841 332 -126 114 -180
3229 -180 -338 -497 231 -337 -192 226 -152 -284 -1292 -1102 -875 -130 568 68 448 -512 1422 224 156
3248 156 -117 -1211 128 204 133 -106 684 -60 465 -156 667 -199 212 423 -247 -65 -189 377 575 -86
3268h6N80o58J51k28Q08r30K08M02N7M95j54j545N33m69J160r87o6N41O59j85
3288B86m60o5J04n40l11Q2N03o37O68P38J51m35n57j51P72k53L62j46k75j82O08
3309B62N98l83k56L28q73J38L28j9R75j905J296p34P83L86n34L25K16q29p32L90
3329b40M29o37P38j82n11KJ284j697Q11k96N0J7k36q8Q8k9J29r33J459l9r29J250
3351D40j451J133j024L28Q38r6p55Q51k91N67q07K32M48r40J182K28o19j7O54
3370I01o41m9J43j007R88k6Q77q40j014J525m20q12j4K80n19M00M12k53k84L29
3390b4p47P78m08k76R49J77j236P96M52p74m05P15Qo08R09q79K37m13J397p36
3410h8J47l54k71P65p12J009K86j318L02j98J633j24q7p46Q3o64J013m36m18J798
$$ plain form
3268 -86 494 -164 -13 -241 567 -363 -155 247 304 799 645 -900 -367 -836 324 -663 -729 -188 471 286
3288 286 -174 -239 -135 -675 -986 -904 -401 -1038 -370 368 519 84 -473 -624 148 -105 257 111 -164 -346 262
3309 262 860 477 221 549 -324 -186 142 123 1098 -807 489 -245 538 924 390 715 931 102 -630 -240
3329 -240 189 -448 290 108 -403 -401 883 -814 -3 -299 -249 -232 -468 -556 -468 -497 -368 -1301 158 119 -810 440
3351 440 -1011 122 -902 -574 264 168 -587 264 -27 540 -267 -35 413 -527 655 883 264 247 901
3370 901 260 211 354 -653 335 309 1186 346 -668 857 437 -375 -389 -109 -628 -228 184 -69 -353 -24
3390 -24 -771 7 -401 -677 272 449 -787 9 461 -313 -718 -3 5 -603 306 -573 -336 -749 648 -88
3410 -88 59 -295 -566 199 -513 496 782 -536 -234 -432 1201 1077 990 244 327 -337 676 240 -178 1620
3430A620j351m27l63J121p9j18p36O62M24j151O20n67j08P42m75J40q2n26J327
3449F73o44M67k61l27R44j321L57L90j025P91J71n24q0J24n0P40k88j63l57P95
3469D12J47J3p12P62L0j232J211p87J067k33j66p35k95k94O01P80r83P99m7K73
3489F11o74n06J677q13rn09Mj076L81j52R87j26K95k43L85L04r96k69J259j341
3509h11Q34M31p37o3J35j003J336K37q98P71j166Q87q6N43q7j272K223j374N27
3528D27p22J097k40l55k66k50J223j331J144n37j91L26o6p46J032q04Q46o88o90
3547g91N30J85k16O26n33M33m23J94Q97q71r8n05N08l15O37l47j89j35k3J365
3567I29l80j19k96m55m07n69J768n52L6L40m35J84L72j66o56J134q95J103o23
$$ plain form
3430 1620 269 -158 -521 600 521 403 -333 329 753 -398 222 -345 -453 289 -186 -46 -128 -654 673
3449 673 29 496 235 -92 852 -469 -112 278 -747 44 215 -309 -389 -265 -315 425 137 -26 -383 412
3469 412 559 572 -140 622 652 -580 631 -156 911 678 512 -223 -518 -812 -211 569 -414 385 338 611
3489 611 -63 -569 1108 295 286 -223 -219 -1295 -914 -1066 -79 -205 90 -153 232 536 -460 -729 530 -811
3509 -811 23 454 -283 -346 -211 -1214 122 359 -539 232 -934 -47 -133 410 323 -949 1274 -100 427
3528 427 -295 802 562 207 -59 -309 914 -417 727 190 -1 325 259 -487 545 -259 587 -101 -791
3547 -791 -261 -76 -292 334 -199 234 -189 5 902 31 -67 -572 -64 -379 258 -89 -278 -413 -436 929
3567 929 549 430 134 -321 -728 -1297 471 -81 -45 295 -140 44 416 250 -406 728 -167 936 313
3586C13K42j428j69K44K40O31Q11m01M88%k238J236m87J74L71p02K39M71M31j222
3606g56q3N89N5r35J6N64J141j390O4R33j428N31j81L94P88k33r9o1M70n93m02
3627f16J214Q91j123p92J618j27j691J360j061O52o43k18N54j08j37j71N31M41
3645E74j315J140m14M3J09n59l64K97Q38j036N33r38P71k03N96m63L81J25p52
3664f37l58P07P07m49J003j005K24M36J93j514N27J89J0k12l24M91o83J033R0
3683D28Q15q32O95j755N75J88M85j18K65P71j739J85M01L13o59q22K86M46l46
3702d18q70O97J397p04K35k60N40n71Q00m21q81L14Q40l64l99l35m40O19j025
3721a246O99L89k15k44O24J084n52l13o18L47Q91n19L44j513K57O13o56Q98j89
$$ plain form
3586 313 555 -873 -1042 -798 -558 73 884 483 971 971 -1267 -31 -518 -344 27 -675 -436 35 466 -756
3606 -756 -839 -250 -195 -1130 -1114 -550 591 -799 -735 198 -1230 -699 -880 -486 302 69 -30 -91 379 -214 -616
3627 -616 598 1489 366 -426 1192 1065 -626 734 -327 325 -318 -536 18 -90 -227 -398 133 574
3645 574 -741 399 -15 28 137 -422 -786 -489 349 -687 -154 -1092 -321 -524 72 -391 -10 115 -637
3664 -637 -995 -288 419 -30 973 -32 192 628 821 -693 -166 23 33 -179 -503 -12 -695 338 428
3683 428 1243 411 1106 -649 -74 114 599 481 746 1517 -222 -37 364 677 18 -804 -518 -72 -418
3702 -418 -1288 -591 806 102 337 77 617 46 846 425 -456 -142 698 334 -65 -400 -840 -221 -1246
3721 -1246 -547 -158 -373 -617 7 1091 539 226 -392 -45 846 327 671 -842 -585 28 -628 270 81
3740H1O5j030R44k36L11jo74N75j33O97j416M13N85m93J85J17N9j032J110J08
3760B35q96J784r82n82K92m75L73k57N30Op51N91M17q90M83Q46j266L09L80l77
3780b30l30r30J038P14K25k09k63k66M42l90P48k73m52n86M9N55M55q46N07k93
3800c35k77K39j57J479q28p8k87R9j54J36Q77k069Q96R4K63L46o92M32k85R20
3820F19j40N73r94m49L14k99L89j31J74N82r46J0l93N3P10O81l25K28r51p6K08
3841a63l0J004p18J74j225K16O02k63P63q36Q72p11K93j69M61J00j85r87J342
3860E40j28rm07j13m08RM02L25k96p66P84K46j62o94j80M77Q82j417J734q68L66
3881C17o57P03k6m5o54L64L80J24P14j747P95j108O13k65P54L66o25P68o09q24
$$ plain form
3740 81 146 -884 60 -176 135 134 -540 35 -98 599 -817 -404 181 -312 -127 -10 49 -983 127 235
3760 235 -661 1123 141 -441 -149 -624 -251 -508 22 28 -723 -132 285 -605 -122 724 -542 -233 147 -230
3780 -230 -560 -1490 -452 262 487 278 15 -251 191 -199 549 276 -176 -762 -713 -158 297 -549 -42 -335
3800 -335 -612 -373 -530 949 121 43 -244 -145 -299 -163 714 -1355 -459 -365 -102 244 -448 -16 -301 619
3820 619 479 1052 58 -391 -77 -376 13 -118 56 638 -308 -298 -691 -638 72 753 428 656 -295 -371 -163
3841 -163 -193 811 93 267 -958 -742 -140 -403 360 -476 396 -315 -22 -191 270 370 185 -802 540
3860 540 412 403 -4 -117 -525 -516 -114 211 -85 -851 -67 179 17 -677 -857 -380 502 -915 819 -49 317
3881 317 -340 363 337 292 -362 2 382 506 1220 -527 268 -840 -227 -492 262 628 3 771 162 -662
3901f62M38l87O86o20L79j91J27L4N02r4j321J432p42Q30r11M23J087r70k45P61
3921E56R3q74J42l40P98q46M11m75m5Q6l46Q48l54O02k69j20k1o94L38J517j401
3942c94P40L14k13O36j526J256q28L88k94P02l06K78L90r33r3k30l8J60o72M46
3962b17M8m52J076q78pk33J614j830N43N33l62K24J21o35q15Q37O07q40P8k27
3982h15K68J68O68q4J35J23p34J481q42q49N61R2l24O53O59q85p62N48l66P70
4002D65n71O69r49J067j522L26L51J40M94k2n50mO37j032M33j72j43J36M75j13
4022A15k92N58p28j23N8J173K76j695Q08J2n82Q68o35j65N07K5l50N42k92K84
4042C64p59J428j840O56q12L58l42M82O10J95l11J89N6N64o97Kk90J40K5k73n86
$$ plain form
3901 -662 -224 -611 75 -545 -166 -357 -230 -196 306 212 -1109 323 -419 411 -500 -77 1010 40 -205 556
3921 556 649 -225 -83 -423 375 -471 -60 -535 -580 -494 -840 8 -346 256 -13 -133 -154 -848 -510 1007 -394
3942 -394 346 660 447 1083 -443 813 -15 373 79 781 475 753 1143 210 117 -113 -151 9 -663 -217
3962 -217 -169 -621 455 -423 -430 -663 951 -879 -336 197 -165 59 180 -455 -1270 -433 174 -666 -588 -815
3982 -815 -547 -379 289 205 340 463 -271 1210 368 -481 80 172 -152 501 1160 275 -487 61 -305 465
4002 465 -106 563 -386 681 -841 -515 -164 -24 470 448 -102 -106 531 -501 -68 -240 -383 -247 228 115
4022 115 -177 381 -347 -470 -412 761 1037 -658 150 162 -420 448 -187 -352 155 180 -170 372 80 364
4042 364 -395 1033 -807 -151 -963 -605 -947 -465 145 340 29 218 274 838 141 143 -147 -7 18 -255 -841
4063h41J187n4n40J45N51n45q07K97P71j50K89m11jj62J21P90r60k90J70n11L66
4084e85K05l6K80P85p58M19j88P9q40J442r52k38L27O4O90j173M07mK40j63J297
4105A298j374M40n17M30l12j79j109J318K84r2J31q2J71l15J099n96P7n74P55
4124H53j144k06m65J557k50n93m81J190j406K74J30L13M27j18n9m38P91K00q43
4143b68O06N26j68K56m66k09L31l40j140R35N08r43L63Q61q34l27K38j9l6N43
4163D17n77l73J003k72P24k77j65j64k09N18o89R44r56P53Mm57k77L2n86m71k04
4184a282L74J301q49J192p50Q22r31q8n20P5M71p0n4N65P4k02J208j265N17q31
4204b43o5J236r87J5N5q34O57O0L46m65q35J117K8n40N21l61R4Q03n24k67q3J37
$$ plain form
4063 -841 346 292 -248 -103 448 -97 -904 -607 164 14 303 -108 -109 -271 -150 640 -320 -610 -440 -951 -585
4084 -585 -380 -416 -136 649 -109 310 122 201 -639 803 -149 -387 -60 4 694 -479 -72 -76 164 1 1298
4105 1298 -76 364 -153 277 -35 -214 -1323 -5 279 187 318 236 407 92 1191 595 672 98 853
4124 853 -291 -497 -962 595 345 -248 -729 461 -945 -671 -541 -228 199 81 22 -416 375 575 -268
4143 -268 338 864 696 952 486 277 608 268 -872 63 571 -372 -9 852 18 -309 -71 -90 -126 417
4163 417 -160 -533 470 198 922 645 480 316 107 625 -64 880 -76 677 681 224 -53 -21 -607 -1078 -1282
4184 -1282 -908 393 -456 736 -14 808 -123 -211 -731 -656 -185 -255 -309 256 330 128 1336 71 588 -243
4204 -243 -308 928 -59 -44 11 -823 -166 -106 240 -225 -1060 57 85 -455 66 -295 -201 602 78 -189 -272 -135
4226a35J74j87L2k10o31J677j370J094l90R96o78L89l06j284L66J460j478m78
4244i59L79R09M17n38m88m04J564j667K2N92n65M49N76l90n82R70j20l15j12j46
4264d08Q1J110j296R16k30M13L45j461P90l04J0k53R24p10J256j453q61J543k32
4283A80O66j149N21K15L25j044J028m42j023J362Qm22o37Q66n48Q3N4L60j138
4302g35N9M25k92j44J490J32j171J157l24m12L87q3p15Q69o36L63j373N09n48
4321a042J140J73K56j94r08R50m81k54P88n06k11Q60o78m1n14n89J199J214j598
4340d36N81J007o84p75O43q0m12J252p47L03j87l49j32J53J16l80L39q4kl58k47
4361d79P91q69R62j125Q20j21J11l09M52k91L88j112j64J591M08j719R46j80M28
$$ plain form
4226 -135 39 -148 -116 -326 -957 720 -650 444 54 1050 372 761 455 -829 -463 997 -481 -959
4244 -959 -580 329 746 208 -280 -684 880 -787 -765 -173 -738 -289 287 -103 -685 285 165 -150 -262 -408
4264 -408 -327 783 -513 403 173 586 931 -530 260 -44 -34 -287 637 -73 1183 -270 -1131 412 180
4283 180 846 -303 218 433 758 -286 742 300 -723 639 647 225 -412 454 -94 -11 43 403 -735
4302 -735 -676 -251 -543 -687 803 935 -236 921 597 185 572 489 -226 643 7 370 -1003 -494 -1042
4321 -1042 98 271 527 333 -575 375 -106 -360 428 -78 -289 571 -107 -148 -662 -1251 -52 1162 -436
4340 -436 145 1152 468 -307 336 256 -156 1096 349 652 465 116 -16 137 253 -127 212 128 126 -232 -479
4361 -479 312 -557 405 -720 100 -21 90 -219 233 -58 330 -782 -946 645 1053 -666 280 100 528
4380E28j113O4J169j495P92p2k52N43o69L08M53j87m15j90R41l70Q40j373R56
4399D58K90l42r41L36J1l22Q31p11P68p30n97O09J374n54p46j77J347j118l01
4418e15P0n03J429m5p73J61J45j60K81p03O07J59M57n55n57O81j03l13L10J12
4438A85l68P0q94J557j349J724j77l99M21K02j90o96L94N02j193j31Q4M48l0k52
4458i2R83q19l88M13K29M17j490L57k09J66o04J832j088N32P1l09O06j274J11
4477e56J73J051q86J1O39L34l99j090J238j778J545J61r78J089j58L7m01n8j19
4496a45p19N22j280Q33J069K2K28j268J481p28o74K05k75P97L9m61R59j033J16
4515c12M59R0q65M68j34R00p46J004q91m70L06k31M9M64K76m41q0o63J402n30
$$ plain form
4380 528 -585 -521 648 -847 -55 -127 -379 164 -505 -197 256 69 -346 -536 405 35 875 -498 458
4399 458 748 406 -535 -199 -188 -510 321 -390 378 -352 -949 -340 1034 480 -266 -443 904 -214 -515
4418 -515 -445 -948 481 436 -337 -176 -31 -191 90 -613 -6 153 610 55 -502 179 76 -237 73 185
4438 185 -183 -113 -1007 550 -799 925 748 349 770 972 782 86 480 982 -211 -342 -258 190 160 -92
4458 -92 891 72 -316 97 326 743 -747 -390 -599 -433 -1037 795 -293 239 310 1 607 -667 -556
4477 -556 -383 668 -218 -207 432 766 367 -723 515 -1263 282 443 -535 554 396 433 32 -26 -145
4496 -145 -864 -342 -1622 -789 280 302 530 -738 743 15 -659 -454 -729 68 107 -354 605 -428 -312
4515 -312 147 237 -628 -160 -294 606 -140 864 -27 -497 -191 -422 -373 91 367 -74 -154 -817 585 55
4535E5N89L30r06N48o61l41O54O84r01J43J017j920J167p61K49J185M1o14O77
4554A235k211J885j183M86P84l72j133Q73P00j349L89q50M98P44j290M59L07l2
4572f0N42r83J01J37Q86l65l17M99J11l49L67r44M19j184K815j100p52P85r70
4591c62N30L06l28o7K56o33Q19j552R36R8n43L29O40q80j59J880j766R86o98j7
4611b25J68o2k63P44n84m58N77j47N63j287J887j000l85o39J586j93k28N58r26
4630c14N63M65q27o56J122r30Q25q83J014n58L20p59R56q49J350q44j02J099j233
4649b41k89L74J82k73K46Q06m20j75k21P23j10o31M4n94P95m64Q98j076M28l76
4669c74k77J375j379R8P89K2p76N90p87J350j81l70M00j94n47k12K46M60o19K48
$$ plain form
4535 55 644 974 68 616 -45 -386 268 952 51 194 1211 -709 458 -303 -54 1131 1172 558 1235
4554 1235 -976 909 -274 212 996 624 -509 364 1064 -285 104 -746 -248 496 -794 -335 -28 -60
4572 -60 482 -501 -400 -263 623 258 -59 440 551 202 569 -375 44 -1140 1675 575 -177 608 -362
4591 -362 168 474 146 79 335 -298 521 -1031 -95 3 -540 -211 429 -451 -610 1270 -496 490 -208 -225
4611 -225 -57 -119 -382 362 -222 -680 -103 -250 313 -974 913 -87 -472 -1111 475 282 54 612 -314
4630 -314 249 714 -113 -769 353 -577 248 -635 379 -179 141 -618 338 -511 839 -5 -107 992 -241
4649 -241 -530 -156 26 -247 -1 805 385 210 -11 712 602 -29 15 -579 216 -248 650 -426 2 -374
4669 -374 -651 724 -655 -557 232 254 -522 68 -719 631 450 80 480 286 -261 -473 -227 233 -386 -138
4689a38J134r30J90k10O98p62R41p71j63k66J03p9l46J011q9J96l00N94o59j365
4709a211K71J250n47K80J137j122m59L45J41k35n33J012N77o76q85l53M04L69
4727b35o09Q11M11r93l54N18J593j243P32l40k83M51m7o9n50J607j377l77P40
4746C86l9k3N10j3j076J09K8P33o30P07n58K77q73J420L0j055k27J361j374N11
4766B04n73k8j95L29J84O46q71M12J13j102J223j026O94o9n98J427o51L79j26
4785C72o20J29J02l3q7J487q90r36R78J44j271J243m11o0o83M44M37j287J209
4804B67J047j593P35J01l82k55m6N06k82j067O02q9J228r41j00k00K90N88j293
4823h84P06R84p95J000p99k11l93P77m72N82L59j169N60m58R93j002Om35J514
$$ plain form
4689 -138 996 66 256 46 744 -18 923 152 -11 -277 -174 -253 -599 412 323 519 219 813 154 -1211
4709 -1211 -940 310 -237 43 1180 58 -401 -56 85 -150 -683 329 906 230 -655 -1008 -604 -235
4727 -235 -844 -33 378 -615 -969 -451 1142 -101 631 291 8 459 412 343 -207 1400 23 -354 386
4746 386 347 324 834 821 -255 -146 -118 615 -15 692 134 411 -462 958 988 -67 -294 1067 -307 204
4766 204 -369 -397 -592 -263 -79 567 -304 108 221 -881 342 -684 10 -59 -657 770 119 498 372
4785 372 -248 -119 -17 -50 -137 1350 460 -476 502 646 -625 618 207 147 -536 -92 345 -942 267
4804 267 1314 -279 456 557 175 -80 -126 380 98 -969 -367 -456 772 -169 -269 -469 -179 409 -884
4823 -884 -178 806 11 1011 212 1 -392 385 -87 495 854 -315 245 -213 780 -222 -216 -651 863
4842H63j421P82q07N82l36L34L53r81M88P97p37R36p60m55k68Q50q4l94K41n33
4862e50K10l53P18k9L50n29l33Q05m92J310m65J99m35k77L22j05P5O1n6n34J73
4883F5k72m53P51J05q5L54p59p40N15k11K63N63n89M42q06J877j266j60k06P78
4903A66l50J104p82J78l43J95k96l69J46k41K82N54o33O44R5j38j62k0M77l25
4923A82o03j74M66q41J527q75l22J468o61k02L77J27m07m23Q79j43l37k65J68
4942e9K91K02J08J92m82n13O92k52N40J49j357M51k42m14N46k00k05r0j27R78
4962B08P9n85N3P92p86N36k33k52P39j73n46j016J258m25J102r56k88K86q52R57
4982a02L35o08M89N84m99O23k096J738j08j300J125M20q85L64o79N60K46j47j175
$$ plain form
4842 863 -558 224 -583 -1 -337 -3 350 -631 -143 654 -83 853 93 -362 -630 220 136 -258 -17 -550
4862 -550 -340 -693 25 -4 346 -183 -516 289 -203 1107 642 841 406 129 451 346 421 482 426 -108 65
4883 65 -207 -660 91 196 111 465 -294 -1034 -519 -730 -467 96 -493 -51 -857 1020 -246 -406 -612 166
4903 166 -184 920 138 316 -27 168 -128 -497 -351 -592 -310 244 -389 255 350 212 50 30 507 182
4923 182 -421 -595 -129 -970 557 -318 -640 828 167 -35 342 469 62 -361 518 375 38 -227 -59
4942 -59 232 434 542 734 252 -261 431 179 719 868 -489 -38 -280 -694 -148 -348 -553 -643 -770 208
4962 208 287 -298 -245 547 -239 297 64 -188 551 378 -168 -1184 74 -351 751 -205 -493 -207 -1059 -102
4982 -102 233 -375 114 698 199 822 -1274 464 356 -944 181 601 -284 80 -599 -39 207 60 -1115
5001a115J492k47J87N55p37n01N13l22J010j414J234n23J6m98N55J35j279Q37
5019a02o25J602p29J226j155N50j480J448j409Q97j43M45m57O66j80p25J62O56
5037F47o08N11j59l28m53R17K63o93J45p52M78P07o89J50J73n64j75j45n21N6
5057a040K046j253m27K88K83J47k80l73P71K97J46Lj296P5J070j101J917j156
5075A17K63j118n57J268q72O82R51j81o95N4P85j124N24J64K7m41P41n12L94n20
5095e0J167r97k18N75j020P86M52q30NL72n69Q41m74K45k15J97l20j016J710p01
5115f0m11Q7J93O25m39J29L86j8j327J385l7L52n94o69L17M09n22n38O52q16J308
5136D12r33N14n38O57j047J183L65n94J54j501J067L73n38L47k26k77O70l08k61
$$ plain form
5001 -1115 377 130 317 872 135 -366 147 -175 835 -579 655 132 148 -350 205 340 -939 -102
5019 -102 -727 875 146 1372 217 767 -713 735 -674 223 80 525 68 734 554 -171 -9 647
5037 647 39 550 391 63 -390 527 790 97 242 -510 -32 675 -14 136 309 -255 -430 -575 -1096 -1040
5057 -1040 1006 -247 -674 -386 -103 44 -236 -609 162 459 605 608 -688 -613 457 -644 1273 117
5075 117 380 -738 -1295 -27 -899 -217 734 553 -142 -88 697 -427 97 261 288 -153 588 76 470 -50
5095 -50 1117 120 -98 477 -543 243 695 -135 -130 242 -327 514 40 285 70 267 -53 -1069 641 -60
5115 -60 -471 -384 -191 434 -5 124 510 492 -835 550 513 865 271 -398 -81 328 -194 -732 -80 -896 412
5136 412 -521 -7 -545 112 -935 248 613 19 173 -1328 -261 112 -426 -79 -305 -582 88 -220 -481
5155d81L94M86j71j61nl56k23P85j318J132k67m8P06q72k66Q6N90O9o28J043o17
5176a22L28M16p1j173J746j582M31k04k58J42l27Q70m00K77K39k25k52m58M87
5195a36N47j193R68l72Q82n40p69J74J674l65k86q65M97j05j72K46o39K3M85R49
5215A003j107L84Q5q19J06O00Q6o04J55K55j062K25O78P07m88m5p73J592p2r90
5235h4j156K385q23j55l46M55L31o21K34n11O9k42O21N01q18P2P37l03n14k62
5255d30M99m73j98K48J22k25Q39r49N77P20j260K87M75q99m66P18O3M66j036N66
5275c56O98l61k72L06P58j104L49J12j78j229J582l73k01j47L27m39O61J53q65
5294e79O61K37J95L06l48k67kK51O99j899J227o58J61l26J178n25m41n40K96J287
$$ plain form
5155 -481 -87 399 228 67 62 -294 -517 268 -1050 82 -185 -233 473 -399 -665 -579 11 80 -548 495 -122
5176 -122 206 622 551 -622 1124 -458 -27 -231 -489 -347 -674 196 -204 73 312 87 -165 -623 -136
5195 -136 411 -782 186 -186 696 156 -613 -439 1235 870 584 -281 216 111 -61 185 -454 -431 54 1003
5215 1003 -104 280 365 -454 -348 252 338 -266 -111 144 -918 -693 -15 692 204 159 -614 978 906 -84
5235 -84 -1240 1145 322 167 -179 276 607 -14 220 -291 -222 -464 157 658 -160 -88 649 346 -168 -430
5255 -430 69 -404 -602 -354 -232 -457 382 -567 10 730 -530 -243 232 -667 -1133 -415 -352 114 -922 -356
5275 -356 342 -19 -291 15 773 -331 18 130 -48 -1277 305 -68 -269 -416 -89 -528 133 286 -579
5294 -579 82 319 514 820 472 205 203 454 1153 -746 481 -177 -16 -342 836 311 -130 -670 -374 913
5314I13q67q83k83J017l11O71M17j91k16L36p64P32q43k07M96n91N35q16N09j3
5334c59J027k29o76q57J460o04n38R53j54K32lr35L54M0J693j758j13R03M99m34
5354E01l22J4n72L05k80N18p83K04K72J30R38k368J606P9o09M09R51r64m6j96
5374b13n41J981l25k97J78m20j31o78J380k12o94L79k97J46j23k83L49l61Q02
5393F40j18K98Q9m93P36j411o2M19P11q76L24k71q37J352o10P92j335L58l03K80
5413c17J44m34q0N65j83l52k06R70J04r99oJ046l75j54P95j9O37j604K97j60L15
5434a6O53k14j521J109J57L43J51j253k18Q06k40R39k13p38Q72k98p74J33N04
5453A82q08M31M15J54r20J412p39j66m45J70n12N20O77j43p06k36J79J462j810
$$ plain form
5314 913 46 -837 -1120 -103 -414 257 674 483 267 603 -161 571 -272 -479 17 -574 -39 -855 -346 -359
5334 -359 668 439 -237 -1094 366 -238 -776 177 23 255 252 -683 -329 -289 1404 -354 -467 436 935 501
5354 501 179 193 -379 -74 -354 164 -619 -415 -143 -13 925 -1443 163 242 -367 42 993 29 -17 -213
5374 -213 -754 1227 902 605 783 363 232 -446 934 722 28 407 110 256 133 -150 199 -162 640
5393 640 522 820 909 416 1152 -259 -321 98 809 -67 257 -14 -851 501 -109 683 -652 -294 -597 -317
5413 -317 -173 -607 -687 -122 -305 -657 -863 107 211 -788 -794 252 -123 -277 518 499 1136 -468 -171 -331 -16
5434 -16 637 423 -1098 11 168 511 662 -591 -809 -3 -243 696 483 -255 617 319 -455 -322 182
5453 182 -626 -195 220 374 -546 866 127 -39 -484 -314 -826 -306 371 228 -478 -714 -535 927 -883
5472h83P13J92m83J643k138P38m3P36n59K39Q2l77J134n26J19O36j081J66j19
5491A89r80K6M06N88K66m49j3o9n54L25O5M56p95J407o42O75j401k54J914j328
5511a68N30p9J02p33R91N1r92J646j345j20j302K012k34m92M3l22L82Q76j672
5530h26M19N1P63q12Q84R85k154L67M59p7r11P55m68J533j072j8m7J339o5j559
5550d54P82p16N07l57P8P91j060J34K11K13J239j228o16m08O84j179J499j162
5568a042M02J179m29K51n74N21k46p47L70J507j918l8P32J473j047K62k72o56
5586b72n31N11M24o02P37r23K73J105n49o57k71R78o58J655j322Q65j610J702
5604H55j466N51J16p4j59L23m12J35p23O86L38N94p28k37J48n94J246o67N20N25
$$ plain form
5472 -883 -170 22 -461 1182 -956 -218 -261 475 -84 155 237 -140 994 468 587 1223 142 308 189
5491 189 -791 -765 -359 229 495 46 33 -36 -590 -265 -200 256 -539 868 226 901 -500 -754 1160 -168
5511 -168 362 283 385 -348 643 694 -298 1348 3 -117 -1419 593 359 -133 -90 -412 -30 846 -826
5530 -826 -407 -356 407 -405 479 1464 -690 -323 136 59 -852 -97 -565 968 -104 -122 -169 1170 1105 -454
5550 -454 328 -388 119 -238 -160 631 -429 -295 -84 129 1368 140 -476 -884 -200 -1379 120 -1042
5568 -1042 -640 539 110 361 -213 308 62 -685 -315 1192 -726 -764 -32 1441 394 656 384 -272
5586 -272 -803 -292 132 -470 267 -656 -383 722 173 -484 -755 223 -435 1220 -102 763 -847 855
5604 855 -611 -60 56 -18 -177 146 -266 -131 -854 -168 170 764 36 -201 -53 -647 599 -68 452 977
5624I77j244R90j181J255p58j46o2k66J363j193P54j475M68M91M43r9n08J191
5642A000r28j80j94m41J001m25j073J194o78R39k73n3m13l25K86N17J011m38J05
5661F32q56O49l53L97M50m71O1nkp44N50o5j51o2k75K50R98o75n63K18j93J72
5683c8J52M25q31M30j94j002Q67p10Q42N67k29N43p21J270j263n82L04O94j082
5702e58J58N22j210Q32Q23p44N86j252J157k16K74o8R76j654J263q4j545J722
5720I82j606O02o94L01Q62l33k80M05m54M86o0J04q29L23j187J095j64P97j246
5739h96J892j279N27r7n82L94M32j069J72N8R64n45l1J12o46N37J29OK96k52n24
5760d02J9J201j030p93M79R92J41J14o68l34L37n3k96M64j79l59J497j021p42
$$ plain form
5624 977 -267 723 -458 797 39 -107 -169 -435 928 -265 489 -986 -518 -27 416 317 -191 1000
5642 1000 72 -108 -302 -743 258 -167 -1240 -46 -724 215 -58 -111 -524 -849 -563 -46 965 527 632
5661 632 -224 425 72 469 919 448 509 504 502 -242 308 243 92 30 -245 5 1003 328 -235 -17 -210 -38
5683 -38 114 539 -292 138 -56 -1058 -191 -901 -59 508 279 822 101 1371 108 -474 -170 524 -558
5702 -558 -400 122 -1088 -256 567 -177 409 -843 314 98 372 304 1280 -374 889 805 -740 982
5720 982 -624 -22 -716 -415 447 114 -166 239 -215 271 211 315 -514 -191 -1378 -283 -447 350 -896
5739 -896 996 -283 244 147 -435 -41 391 -678 -506 -448 516 -29 -60 52 -594 -57 72 78 374 122 -402
5760 -402 -383 818 -212 -1005 -526 466 607 721 53 -281 56 3 -293 171 -8 -367 1130 109 -633
5779f33o6P35k56N00j68O7l91L2n09P6R84l93R7l56R69m79j95j013N91N29j05
5800A6j1r46J316j45k079R57Q63q59l9J33J964j256n41O1k86K83O94n59L47p80
5820h67J335J42l60j122N85L59j039J123L79q61O72q80P98J47p67Q11J86j033
5838c92R19k46o41J284j121O98o18N5O14o20j56M06K1l22o60O23k27N11l32o08
5858h12k29P71M92l93M14q04P23O21j477M70j55J140Q86k160J43Q60O20j427L58
5877D1p1m66O78j054L83R55p10l31N69L42o13O61j405J851n32r55j27R14L42K
5897D74L20j128L33q29J043k67m84O69n79Q30n45M30Q54j129J56j465J787J167
5915A637j198j62K86n8o16J73n22Q64m18K02L7K66J7o2j142J087j29k02M69o51
$$ plain form
5779 -633 -699 36 -220 280 112 179 -212 -180 -689 -613 371 -22 75 -281 688 209 14 -999 -408 121 16
5800 16 5 -941 375 230 -1849 -892 -29 -888 -927 -794 1170 -86 -627 -566 -852 -569 125 -434 -87 -867
5820 -867 468 610 250 -872 -287 72 -967 156 535 -326 346 -534 264 411 -356 455 641 -392
5838 -392 527 281 -360 924 -197 501 -117 -62 552 -68 -224 182 203 -119 -779 -156 -383 128 -204 -812
5858 -812 -1041 -270 222 -171 243 -561 162 783 -694 -224 -379 761 1647 -513 -370 490 1110 -317 41
5877 41 -30 -496 182 -872 -489 466 -244 -575 -6 336 -277 384 -1021 830 298 -657 -784 130 472 474
5897 474 794 -334 -1 -830 213 -54 -538 131 -448 382 -163 267 1121 -8 148 -1317 470 1637
5915 1637 439 277 563 505 -111 62 -460 404 -14 188 225 491 508 446 -696 391 262 60 529 -122
5935a22j084J231K25r27J055m74l44Q37P09j687Q9K94j49M50J47P25l30J02nj481
5955g39M15L61r70K07J121j129O79J321j474n78J193r88J316o71o96J57J18N19
5973A62P1q24R67M92j645N22M60J325l008R96J313j365J068j073K47L48J92m32
5991a84R5O34j767J738k56j176J647p32n29j09Q30J44j303R13j78p9j18N38O24
6010G32r46O24P38j751K15N58M36m82J80N88m94m50N21o70j497R92n00Q19N25
6029A38J8r09J115P0j179L30J71j035R71J276k77o38j20l56L88k37J652j452N28
6048D54o75M77o88P54o48l69J522j174O43l64k78l81R21r8k34P61j188O28m92
6067d29J68M08J75j121J286p42j75L41M30k28J06o88K59K24P72n30j545R48M6
$$ plain form
5935 -122 -1206 25 250 -677 378 -96 -440 397 1106 -581 -492 -198 -347 103 250 975 645 747 742 -739
5955 -739 -324 37 -933 -726 395 -734 -55 1266 -208 -786 407 -581 735 64 -632 -475 -357 162
5973 162 233 -591 376 868 -777 -255 205 1530 -1478 -482 831 -534 534 -539 -292 56 248 -184
5991 -184 -89 545 -1222 516 260 -916 731 -1 -530 -639 191 335 -968 -55 -233 -312 -430 108 732
6010 732 -214 410 1148 -603 -388 170 606 124 304 892 398 -52 469 -201 -1698 -706 -1206 -387 138
6029 138 156 -753 362 432 -747 -417 -246 -1281 -310 966 689 51 -69 -425 -37 -274 1378 -74 454
6048 454 -221 256 -432 322 -326 -695 827 -347 296 -68 -346 -727 194 96 -138 623 -565 63 -429
6067 -429 -261 147 322 -799 487 -255 -430 -89 341 113 219 -469 -210 14 786 256 -1289 -341 -295
6086b95J21Q95j205NQ15J38r00J284m36R2p97R3R02o74M56o59l33L26N42m30k87
6107c47L53l25K45Q90j49j135L18J75m81N98l12o56L80L10j034K000m13j810J269
6126a24p9k12J83O48k98m46M7M27k96r4m4p03q0J074K0o4m29L14P64L68n78j074
6148f76N14n40J28P22L36j284M40O62l95L93J37K58J48l06p05n83O12L13j172
6167i98J519k0o22K35p52l2Q88L89q46m43J240Lj243P97O97m25n90O01q00J340
6187I38m03n52j209J764j83m23k61R89m91O58j578P25L17l53J03k31J6R94k49
6206E71o21Q99j201K71J389j467p94K497j040r86N57m71j33P07O90j9r53O29q37
6225c12N67l84Q75j048o87J129M3K66J75n55n19K50L58n67K77l63R43n54J194
$$ plain form
6086 -295 -174 721 -484 -479 336 474 -426 858 422 514 -283 -190 712 38 494 -165 -498 -172 370 -60 -347
6107 -347 6 -319 -74 816 667 -468 -150 25 -456 142 -170 -826 -446 -136 -1170 830 417 -1393 -124
6126 -124 -203 -415 -232 416 118 -328 -281 146 -150 -244 -288 -991 -1071 3 23 -41 -470 -156 608 976 398 -676
6148 -676 -162 -702 -574 148 484 -800 -360 302 -93 300 437 695 843 537 -168 -751 -139 174 -998
6167 -998 521 501 -121 114 -638 -670 218 607 -239 -682 558 561 -682 115 812 387 -203 398 -402 938
6187 938 535 -17 -1226 538 355 -68 -329 660 169 827 -751 -26 291 -62 41 -190 -174 820 571
6206 571 -50 849 -352 -81 1308 -159 -953 1544 504 -482 75 -396 -529 178 868 849 -104 525 -312
6225 -312 255 -129 746 -302 -989 140 183 449 624 69 -450 -200 158 -409 -132 -495 448 -106 1088
6244A088j111n87L63n06J315J50k86l18n33Q43o37n76P44O8r7l99N17j19l88J91
6264b78M24QJ04K33q6M7j128N17J41l32K60m63K15J90M97Q7j168J469j061M54
6284A30n45j21M05Q44j677J570k14j416L71P25K11q47K10J72O40q42R02n17J40
6303A41K47k34r30M95j46J33M30N26l68l0K21q87K18Q4K44j170K243j629M47K28
6323B63n08n66P19J245j265j6L38n73j90n92Q67J76J010l66k38k33L87r81P20
6342A97q94J39L82j217J652j63j44p1M17L56q79R5J84j044J949j676J163m90l40
6361c84L53k28j91K26Q16q29l42O53l52K71m60K76M3p4o59M9Q56O66m63Q13j137
6382i7N73r14p03K72J143k34k68Q28n47m24P25m69j088J959j145j20K91j09K97
$$ plain form
6244 1088 -23 -610 -247 -753 562 712 426 108 -425 418 -219 -795 -51 17 -80 -479 38 -81 -469 -278
6264 -278 146 154 258 491 405 452 -676 -159 -18 -350 -90 -553 -338 -148 349 436 -732 737 -324 130
6284 130 -415 -536 -131 713 -964 606 392 -1024 -653 72 283 -564 -354 -182 458 -384 518 1 141
6303 141 388 154 -776 -281 -427 -294 136 662 294 264 485 -402 -184 -100 144 -1026 1217 -412 35 263
6323 263 -245 -811 -92 1153 -112 -128 210 -363 -553 -1145 -278 -102 908 542 304 71 458 -523 197
6342 197 -697 -558 -176 -1393 259 96 -48 -119 298 654 -225 -130 54 -990 959 -717 446 -44 -384
6361 -384 -31 -259 -450 -224 592 -237 -579 74 -278 -7 -467 -191 -148 -222 -881 -832 24 690 227 1040 -97
6382 -97 476 -438 -1141 -869 274 40 -228 600 53 -371 354 -115 -1203 756 -389 -509 -218 -327 -30
6401c0M41j007J624q90L9m82P76n61K87k04j73R70n84M53q29K62r35N47L08K01
6421B13n99N68J10j91j684K487k52o80K60k32L6m63O41l30N84Q2l32l46j5j454
6441a597J770k3m18L06p14P91J24L06K46p77j84J226P84k158O85l74L1L37p18
6460c57j35J242j287J220r23L71q70J283r68J017J89k4j104j20J039j299K90P40
6478C04J55o44r36J479l75M81k86J48m74K17k16m20L14O28p35k95N26l41J577
6497A107n40K03l46m14N81q30J68p93J96O13P31J06k72o87Mj34L65N35m99L09
6517D03j69l40r4O76j454P63M18l1Q5m11m80N97l1O98o49PP5K15q4O28l68n8r99
6540f03Q40M14o82J278j911Q43N57l56o07Q59l27o62m02J006M47o25o3j72Q04
$$ plain form
6401 -30 411 -596 1028 138 177 -305 471 -90 197 -7 -180 790 206 659 -170 92 -843 -296 12 213
6421 213 -386 182 292 101 -1583 904 652 -28 232 0 36 -427 214 -116 468 550 218 -128 -143 -1597
6441 -1597 173 150 -268 38 -676 115 239 545 791 14 -170 1056 1840 -318 367 -7 24 361 -357
6460 -357 -492 750 -537 683 -240 131 -739 544 -424 593 782 758 -346 -466 573 -726 -436 304
6478 304 459 -185 -1121 358 -17 464 178 326 -148 69 -147 -567 -253 375 -360 -655 -129 -470 1107
6497 1107 567 770 424 10 591 -239 -71 -864 -668 -55 676 782 510 -177 -173 -307 58 593 94 403
6517 403 234 -106 -200 476 -978 -215 203 172 257 -154 -634 -37 -68 630 -19 -12 63 278 194 822 454 396 -603
6540 -603 237 651 -31 1247 -664 179 736 380 -227 632 305 -357 -759 247 694 69 6 -166 638
6559F38j174J47l7K65j584K117p80n86J942j220M27L6r74J064n03m92P88J273
6577A347n08p90p70J029q5k41R40n40n93l76R10j052O56R03p03K98l38l89k30
6596e32p1R43q48O73Q19n83k99q90J131j23O07L44j578L83N60p49q19O96j168
6615a504K823j544J237j307j28J90L9K5P40j554Q84M70l40L46K34k27j857Q11
6633f62L93L5j94O68p70L84j24J43J97O8m29L26P24q1j478M90N68q22J422j884
6653a026N83O11q20J417n84j03m99M40m16J90N26r33L51m0K39L39j07J113k198
6672i17R26P9o7L75j395N96R85p26l20J048j385l95J656k48Ll41j05j09J87m43
6692e96P85R25j196l58J905k244K16k78P60k79n98M47M5N75O84J48j361K64L14
$$ plain form
6559 638 -536 -389 -426 -161 -1745 372 -408 -994 948 -272 155 191 -783 281 -222 -714 74 1347
6577 1347 839 49 -721 308 223 -18 922 382 -211 -587 323 -729 -73 830 127 425 87 -302 -532
6596 -532 -603 340 -508 165 984 401 102 -788 343 220 827 1171 -407 -24 536 -213 -1032 -336 -1504
6615 -1504 1319 -225 1012 -295 -423 -233 -194 -169 571 -983 -99 371 31 377 611 384 -1473 -662
6633 -662 -269 -234 -428 240 -530 -146 -270 -127 70 138 -291 35 759 678 -800 -310 258 -564 858 -1026
6653 -1026 -443 168 -652 765 181 78 -421 19 -397 -207 319 -614 -263 -303 -64 275 168 1281 -917
6672 -917 9 88 21 396 -999 -403 582 -144 -464 584 -801 -1196 460 212 215 -126 -231 -340 -153 -596
6692 -596 189 1114 -82 -440 1465 -779 -563 -841 -81 -360 -958 -511 -466 109 793 941 -420 -156 158
6711A58K20j014J389o10N0j18l88O40K06p94n4n31N46k69M54M6J61m80P10k3p63
6732d64J04m6P52l43n58M82R0K26k87n70J33l11L13k53RM04M37j63l50N24J17
6753B46n06K75o26P57k69l5M09r59J018O74j193J049m17p99K34k68P2P63j135
6772g10N33m51J14J106q07j27J33J105k21k57k1L64q08J46p55O76N33j66q89N90
6792H8n04M39J060q39q48J35j53q9N88Q85j398N42M8K45r51J241l83L65p43r9
6812c71J37P17R2k18j97l68J151k106L73P86p46L49O86o53J36J229j017J195o49
6831E26L22n30q57M51J1r3n79N38l10j30l2P75p63O31J8J51J8r57J035O27K67
6852A119j029M27J79p15J57r02P88PK83j19L95K23j498J32k20J066m65n05k35
$$ plain form
6711 158 378 -636 753 143 193 75 -313 327 533 -261 -315 -846 -300 -569 -115 -69 92 -388 322 299 -464
6732 -464 -360 -406 346 3 -555 -73 17 243 -44 -614 -481 -792 -479 -732 -723 -319 118 -45 -395 129 246
6753 246 -260 15 -611 146 -123 -158 251 -708 310 984 -209 840 423 -376 -142 -410 -338 425 -710
6772 -710 -177 -628 -514 592 -215 -342 -209 896 675 418 397 761 -47 99 -656 20 553 387 -502 88
6792 88 -416 23 1083 244 -604 -469 -622 -711 -123 762 -636 -94 -46 199 -752 489 106 471 -272 -371
6812 -371 -234 483 575 357 160 -208 943 -1163 -790 -4 -750 -401 285 -368 -232 997 -20 1175 526
6831 526 848 318 -539 -88 -77 -170 -749 -211 -521 -651 -683 92 -671 -40 -22 129 147 -810 225 852 1119
6852 1119 90 517 696 -19 138 -764 24 31 314 195 590 813 -685 -553 -773 293 -172 -677 -912
6871i12J579Q1l89M3j04P03j080L34q33L19j41J255j339p5K32l67P21j56k21O70
6891C20k37k07k01M69R21m51j031R71l63Q26j70m92j528J270m75O84O9q38R17
6910D54m60j118P07Q17O5N70r03p70P11k96N16q34K03J296m28j272m15R58m3N34
6930B92o75k78P83k25k88P9J023j743R01R19n86K96p65M25k39q3K17J30M70q54
6950b01o39Q84m12O67l43L64j504J666q16p4J712k501J022Q60r29P84j193R08
6968B55J21j45p48l58J091l55N08N17j828Q54k43K28k98J589q09r48L11R3J74
6987IN7N7r7K12j31L50p50Q21j72q8J28o97P5K61J312l27n32Q64j39j574J16R31
7009F86n10j72q8R16j284k3O89k97J139j880J557p57N60K66l83n58n60J03K87
$$ plain form
6871 -912 667 748 359 402 298 1001 -79 255 -578 -259 -400 855 -484 -559 -327 -694 27 -129 -350 320
6891 320 83 -124 -325 144 1065 614 -417 554 191 1017 847 355 -1173 97 -378 306 375 -463 454
6910 454 -6 -1124 -417 400 465 1035 132 -638 73 -223 293 -541 -338 958 530 -742 -1157 -199 -242 292
6930 292 -383 -661 122 -103 -391 -312 711 -1032 -131 788 202 498 -267 158 -81 -164 53 183 653 -201
6950 -201 -840 44 -368 299 -44 320 -1184 482 -334 -408 1304 -1197 -175 685 -244 540 -653 255
6968 255 376 231 -517 -875 216 -139 369 886 -942 -88 -331 -103 -401 1188 379 -569 -258 -165 9
6987 9 66 123 26 238 107 457 -293 528 356 268 396 -301 -226 35 1347 1020 488 1352 1213 -361 -245 686
7009 686 176 4 -84 832 -452 -475 214 -83 1056 -824 733 -24 536 802 419 -139 -699 -596 -309
7028c09N67r58P69k17J70L55o96K06q67O93n4O46M84p00P94j103n28j87P68j59
7048c26j03n17J216M03j051P18O1k71r62P81J045q95j76J163j576J834r33o35
7066b24m58M79qK18J96q4m10m54J626n46ML74j128O4O99K0k52k01P39j281J363
7087G36J67o68P17j645J19J82o00J064j078Q43J177j080m68J111l14m58J32Q24
7105G61n53j371J326o88J361p54M3L61l19P00p83O92m47Q2K84k66J69n32n32m23
7125h89O91k32O70l93k01N89M31ql44n72P28k60q43J334j243J299j201L49l90
7144d85L12m50O36m66K6N75J92L86j502M42r1k62k16J537q28M00p77N54o01N16
7164a02J49K0L39m27o13M40N7R58j304P09J5m57J932j935P4k1J250q87q46L31
$$ plain form
7028 -309 258 -700 69 -148 22 377 -319 -113 -980 -287 -341 305 789 89 883 -220 -748 -935 -167 -326
7048 -326 -429 -946 270 673 -378 340 401 130 -832 -51 994 99 -77 1086 -490 1344 411 -224
7066 -224 -682 -203 -211 7 203 119 -291 -745 881 335 339 713 -415 -351 348 368 116 -85 654 -627 736
7087 736 903 235 952 -693 -574 -392 -992 72 -1006 -163 1014 -66 -534 577 263 -195 -63 761
7105 761 208 -1163 163 -525 836 82 125 486 167 867 84 776 329 411 695 429 598 66 -466 -889
7125 -889 -198 -430 240 -153 -354 235 666 658 314 -258 470 210 -633 701 -542 757 -444 -95 -485
7144 -485 -173 -623 13 -453 -427 148 340 726 -776 -334 -425 -687 -903 634 -194 206 -571 -17 -618 -102
7164 -102 47 67 406 -21 -634 -194 -137 821 -483 226 241 -216 1716 -219 -145 -166 1084 197 -649 -318
7184c18k66J49L6o38J052m58R54R61j115l02r68P74k12J001R70j189j38n84P7
7203b14k38R9J31J346l94j535N58p1k72L83m3l81K42O88o34R06n08n42J221j150
7223d08P47N36j373K39L67p95r2J26R99l45M02l27m04K39k78M08j62O29R1p39
7243a40j95J404q86n99J88l14N69n16O62l22k60l33P75M91N50p58N8q6j025L24
7263d13N12K18j184N07K92k43P10K98P50j683P75K59m55o77K97L91j589K314j144
7282f5k21k55L39L39M73q23K44K47M80n70m75O71l02n59N37K53o74O58j60n58
7302d21P49n48r5K4J04o86J033O16o1j152p56J256l21M58K00j835M55J068r43
7321h55J175J035o10n70R18n83j548J704k33n50O8O05o82k7J045j62n55p4P43
$$ plain form
7184 -318 -584 -435 -399 -1037 15 -443 511 1472 357 55 -913 -139 -351 650 1620 431 293 -291 -214
7203 -214 -452 -353 -222 1124 730 -805 -247 -318 -590 -207 -250 -631 -389 299 -335 571 63 -479 742 -408
7223 -408 339 875 -498 -259 108 -687 -779 -653 346 1 403 76 -328 -89 -367 41 -121 508 599 -140
7243 -140 -335 1069 183 -416 -228 -542 27 -489 173 -149 -409 -742 33 524 1074 316 374 288 -737 -413
7263 -413 99 317 -867 -360 -68 -311 399 697 1447 -236 539 798 343 -334 -37 354 -1235 1079 -65
7282 -65 -286 -541 -202 137 610 -213 31 278 758 188 -287 384 82 -477 60 313 -361 297 137 -421
7302 -421 328 -220 -315 -291 -187 -873 160 776 715 -437 -1193 63 -258 200 400 -1435 -980 88 -855
7321 -855 320 1355 745 175 1093 510 -1038 666 433 -117 -49 556 -126 -153 892 730 175 101 844
7340H44j073Q75p36l81N17q35J218p53M76N03j305N22K54l82P82k52m14j09j62
7359d11O71J48j74n04k27P41p40m57J153l78L9J014r60K92n7O18m90o9j060m45
7379a296J042J501n25r46O31J58m85r03R60n18P5P89p27N60j077J142m0n66J99
7398b6q89J194k8j32L16k09l70o2M48r37J065N9o10J166k89P62j754R94m81j229
7418a012P45M68l36J179o03n65l24P11M40j64l60r40O40q65Q97J31j18l60N38
7437A02l52J069p94m00J027m68N7j100K27J276o56m56q55J608k78N0p35P38j69
7456a09M60N5K38l82Q3J62r23R78r00r05J007K42m59Q22r0k6j723J794j59m82
7476c17O62j153R63M7j90k67l11J041M31o05m23L98j380J714q67K55O45j162M75
$$ plain form
7340 844 -229 646 -90 -471 46 -789 429 -324 152 655 -650 -128 126 -256 526 274 -140 -249 -411
7359 -411 260 408 234 -270 -497 244 -496 -953 200 -178 -139 875 -85 207 150 768 278 209 -851 -1296
7379 -1296 -254 1247 722 -224 407 565 80 -823 137 -381 -306 483 -244 316 -761 381 341 -225 -26
7398 -26 -915 279 251 119 435 226 -144 -206 242 -695 370 429 -181 985 696 1458 -296 698 217 -1012
7418 -1012 -267 201 -135 1044 441 -124 -448 263 703 539 179 -761 -121 -986 -89 42 -76 -436 102
7437 102 -250 819 25 -375 652 184 241 -859 -632 644 -12 -468 -1323 285 7 57 -678 60 -109
7456 -109 351 406 644 262 345 507 -416 562 -338 -1243 -236 6 -453 369 279 253 -1470 324 165 -317
7476 -317 345 -808 155 202 12 -255 -566 475 906 301 -122 276 -1104 610 -257 -2 643 -519 -44
7495d4n86M84J10L75L41n43N1L7j015J441q89k6M7M42m60N47j182J97P48j57M48
7516C66P11j754O85P13p46m5J08n56l67P24J306l81r28m48R74k68K38j153J43
7535f78J623p47Q3R18m5o07p41l69P69n00L68L15j292J124K71l20k2l68o38N75
7555b81K35J94j240N35J637n70j397J81m8M28N98p31Q41r08K74P03n89R6J31j090
7575a001P68O56k40j002J080l88O20m38j66O19o69P26j059l63J247N7j05L9k98
7594H3J78m64J015o55o22M61q4O36o31L59j416J692J26m80N91n99l79L49j82O87
7614F65Q88j689L98p34O28L78o55K82J099o76o39k37l71J691j202K14J2M53R3
7633E98n48N83rn48l2l89J60J078n43o17j29Q14j92J37k32o45P5K10o49J371j70
$$ plain form
7495 -44 -630 -146 -36 339 680 137 188 225 -790 651 -238 -264 -217 225 -235 312 -870 -673 75 -82 366
7516 366 1077 -677 8 721 -25 -70 38 -518 -885 -161 1145 764 -164 -612 362 94 332 -821 -678
7535 -678 945 198 281 1199 1154 547 -194 -563 206 -294 74 389 -903 221 492 172 150 -218 -856 -281
7555 -281 -46 148 -1092 -557 1080 510 -887 -706 -754 -326 272 -459 382 -526 -252 451 -138 -42 89 -1001
7575 -1001 -233 423 183 -819 261 -127 493 55 -111 508 -161 565 -494 -857 390 447 342 381 83
7594 83 261 -203 812 157 -465 -4 -88 548 -83 276 -1140 552 678 198 789 190 -189 160 -22 665
7614 665 1553 -136 262 -472 156 534 -121 161 1260 584 -55 -292 -663 1028 -174 40 52 505 598
7633 598 50 633 624 76 44 -345 -185 893 350 -267 -396 418 226 363 131 -514 -439 -229 -878 493 323
7654C23J69m84N15n06K67N53J93r17N80j528R71j346M34J404o51J178j487j35
7672d67J314j18l75J62p67J376j903N24q9J8M00K84q27L21o15M48L62P18n15J416
7692A667k177J346k046j02J387J96J49m90m78L44J63j29L1k79K9N97N59j508l94
7711a135J011k29p0j7J25p27J192M60o09K06r65J292O11j989j95J443m96n85J220
7730E43r32Q87p50o3J347j564L39P01m63M18j35l81J216j747N01J112j258P36
7748E07j01j20L85M7k67j774K57J423k84r83P17j57K50J022j003n28L43k82M02
7767a46O54p96j604J198Q72l22p62J695N0r68M97o73K84l51J39N7P89j177O96
7786A32j17K69j099N61J128p36M26j192N12K97j22J98n59q3N10r25M68L18L8J46
$$ plain form
7654 323 492 8 523 17 284 837 1030 113 693 -835 136 -1210 -776 628 -23 1155 -332 -467
7672 -467 847 729 354 516 -251 1125 -778 -254 -343 -325 75 359 -468 -147 -762 -314 48 766 251 1667
7692 1667 -510 836 -1210 -1312 75 271 420 -70 -548 -204 -41 -170 -139 -418 -389 208 767 -741 -1135
7711 -1135 -124 -353 -423 -440 -315 -1042 150 610 1 207 -758 534 1145 -844 -1039 404 -92 -677 543
7730 543 -389 498 -252 -315 1032 -532 -193 508 45 463 328 -53 1163 -584 -83 1029 -229 507
7748 507 406 286 671 718 451 -1323 -1066 357 73 -910 -193 -350 -100 922 -81 -609 -266 -548 -146
7767 -146 508 -288 -1892 -694 178 -144 -906 789 839 -129 368 -305 -21 -372 -233 -176 613 -564 132
7786 132 15 284 -815 -254 874 138 564 -628 -116 181 59 257 -302 -385 125 -800 -332 -14 24 170
7806A70l16k8J079r61m13M61R60m57l42L34R30j748j61Q12J49m85m02J162j295
7825e51l92N33J21k63O50o46K96K37r94J743j380J02J127l18O6l16M35P33q23
7844C60r29J219j017J640kj140r8m60j99J314j38o36P93j073k73R79l87Q86n99
7863B40o30J275j256J96N49M1O05j059M09j545J141L44n40J78j23K95L7p02Q28
7882B83l87k4J3O8j53j80q0J480m02q53P23m84k68J38p5Q56m27l83J77Q46j510
7903f42m1N70L70j483R97J236j374n97R70M19j678J114r85K20J304P77r56P20
7921I41j631Q9k47k71J840n89k46J07p48Q41O97k75k45n69q20P13J9N55M63r80
7941c56J14O08q45R65j082R21j87p69M21M9L76j198N64K32J497j379J373j042
$$ plain form
7806 170 -146 -174 905 -56 -469 -8 952 495 153 487 1417 -331 -492 320 469 -16 -418 744 -551
7825 -551 -943 -410 -289 -552 98 -548 -252 -15 -1009 734 -646 -544 583 265 331 15 450 1183 360
7844 360 -569 650 -367 1273 1271 131 33 -427 -626 688 550 -86 707 -366 -639 340 -47 839 240
7863 240 -390 885 -371 -175 374 415 1020 -39 370 -1175 -34 310 -230 -52 -175 120 157 -545 283
7882 283 -104 -128 -115 -47 -200 -380 -460 1020 618 -235 488 4 -264 -126 -201 655 228 -155 22 868 -642
7903 -642 -683 -113 257 -1226 -229 1007 -367 -964 6 425 -1253 -139 -1124 -904 400 1177 221 941
7921 941 -690 -601 -848 -1119 721 132 -114 -7 -755 86 783 508 263 -306 -1126 -413 -394 161 624 -356
7941 -356 -242 366 -479 486 -596 325 138 -631 -210 -161 215 -983 -419 -187 1310 -69 1304 262
7959B62p36L42n0R84m37K90q48j79J95K29o47O29l68j51O64K19K44n95L7M79l47
7980B16k86Q60k52j340P43M84r02R81l68j0N32j228J302j010J103n49n67M3l48
7999e96r8J047j02K13j003m9N46M57O2R59j187m2K29l17K7k81l35O57Q05j604
8019f12N43K76j099J275n10m93Q45j012J427j103N73L52j732k71R94K16O22l71
8037h0P93r10q04L39Ml74J321M4j205Q88K22L63q18J84J28o73K7J33N75M70j235
8058f08Q95m20N12j421M97P38O05j862Q39K4M52J16k57n76L57K79k72Q24o14m70
8078c62N54P97j377L2M16L54p73M55J90j014J558r3n87k89n22Q03k41L18l51J327
8098A195m06O07J007j714j059R58q53J36m27j8J097n91m28j43O84q6p3J55p98
$$ plain form
7959 262 -474 -132 -182 802 365 655 -193 -372 -177 52 -595 34 -334 -485 179 398 642 47 84 563 216
7980 216 -70 790 538 -802 -59 425 -477 504 136 126 658 -570 732 -278 825 276 -291 -248 -596
7999 -596 -694 353 251 464 -539 -588 -42 415 477 1436 249 207 436 119 146 -135 -470 187 992 -612
8019 -612 -69 207 -892 383 -127 -620 225 -787 640 -463 110 462 -1270 -1541 -547 -331 291 -80
8037 -80 713 -197 -1001 -662 -658 -1032 289 333 -872 16 238 601 -217 -33 95 -578 -551 -418 157 627 -608
8058 -608 287 -133 379 -1042 -545 193 798 -1064 -225 -201 251 367 110 -466 -109 170 -102 722 108 -362
8078 -362 192 989 -388 -356 60 414 -359 96 286 -728 830 737 150 -139 -661 142 -99 219 -132 1195
8098 1195 789 1396 2403 689 -370 588 -265 -129 -556 -574 523 -68 -496 -639 45 -41 -114 41 -757
8117g57R42j12L20p29K21Q88j407O94ol40O82L15q77O25j145N60L93o67M27m04
8137c77J94K67j349J240M01j81q99J588k147N59J076j002J600p91o80n97K073
8154I75j338O8R23j208j57K02J115n36m72Q23J21k24j80p84J021m5l05p47O01
8173a47N36j327Q45k07p50J551o96o85N07k9K02O21j067O33l01L99k56M8
$$ plain form
8117 -757 185 73 393 -336 -115 773 -634 60 54 -286 396 711 -166 459 -686 -126 267 -400 27 -377
8137 -377 -183 84 -1265 -25 376 195 -704 884 -1263 -704 372 -630 970 179 -501 -1098 975
8154 975 -363 -295 628 -580 -737 -535 580 44 -428 395 516 292 112 -672 349 304 -1 -748 -147
8173 -147 389 -938 -93 -300 -1050 501 -195 -880 -373 -402 -200 421 -646 -13 -314 85 -171 -123
8191a23
$$ Imaginary data points
##PAGE= N=2
##DATA TABLE= (X++(I..I)), XYDATA
0@%%LjJ0qJ5j2J6j9J9k9L6m4M5n2P5q9R6j25J36j49J71j94K14k43K72l14L46l91
30b16M40m89N38o01O70p40Q20r06R96j072J113j039N37J881k4547l08029M6612
47b84032J2264j5214J141p862N44k336N218K847R215Q934J2182J3861J7625J8140
61b07473K1189K0701K3153K2274K6148K3502K4028K4039K3576K1722K1850J9143
73F3852J8748J6128J3972J2071J0602Q393N111J936K234l060l246o267q157q645
87A23672j2399j1947j4752j5635j7552j6318j7136j7010j8339j7241j5531j6445
99f6633j5215j3934j2752j0438j0365p653o674m711k841q59J096J875M538N639
113a38927O899P676J0889J0101J1410J2443J2082J3358J3323J3551J1976J1576
$$ plain form
0 0 0 0 3 2 12 4 19 7 23 4 23 -6 30 -14 31 -21 54 -35 61 -64 72 -77 94 -100 114 -129 143 -171 175 -216
30 -216 224 -265 273 -328 342 -398 422 -484 512 -560 553 -486 51 1932 -22615 -330644 -284032
47 -284032 -271768 -286982 -285841 -293703 -293159 -295495 -290277 -287430 -278215 -269281 -257099 -243238 -225613 -207473
61 -207473 -186284 -165583 -142430 -120156 -94008 -70506 -46478 -22439 1137 22859 44709 63852
73 63852 82600 98728 112700 124771 135373 143766 148877 150813 153047 149987 146741 140474 132317 123672
87 123672 111273 99326 84574 68939 51387 35069 17933 923 -17416 -34657 -50188 -66633
99 -66633 -81848 -95782 -108534 -118972 -129337 -136990 -143664 -148375 -151216 -152075 -150979 -149104 -144566 -138927
113 -138927 -132028 -124352 -113463 -103362 -91952 -79509 -67427 -54069 -40746 -27195 -15219 -3643
125c643J1269J2331R993Q577P381P403O785L460L372K076j89q52k391l388n222
140E6962n177p929o236q182r748r079j0668r133r469r392r017r262r515p784n788
155f9417o687n564m041l614j269k969L9J610K274K444M379M871N650O670O392
170e9232P383Q391P913Q124R048Q118Q182O934P976P653M837O473N375K414M150
185D3739K527J407N6K57j301j915l131k556n207m807n848o058n326p635o797o775
201i370m820q093o541n795m364o389m607k702k985m101j447q57m39J08K065Q71
217e9466J475N483K522N572N145M296M850O836O143N295O551O006N215N058N239
232A6220M428M187L743L970L166J160K399p00P24j375J05k588q91m146k554m270
$$ plain form
125 -3643 7626 19957 29950 38527 45908 53311 60096 63556 66928 69004 68815 67963 65572 62184 56962
140 56962 51785 43856 37620 29438 19690 10611 -57 -9190 -18659 -28051 -37068 -46330 -55845 -63629 -69417
155 -69417 -76104 -81668 -85709 -89323 -90592 -93561 -93522 -91912 -89638 -87194 -82815 -77944 -72294 -65624 -59232
170 -59232 -51849 -43458 -35545 -27421 -18373 -10255 -2073 4861 12837 20490 25327 31800 37175 39589 43739
185 43739 46266 47673 47729 47986 46685 44770 41639 39083 33876 29069 23221 17163 11837 4202 -2595 -9370
201 -9370 -14190 -22283 -28824 -34619 -38983 -45372 -49979 -52681 -55666 -59767 -61214 -62071 -62510 -62402 -60337 -59466
217 -59466 -57991 -52508 -49986 -44414 -39269 -34973 -30123 -23287 -17144 -11849 -5298 708 5923 10981 16220
232 16220 20648 24835 28578 32548 35714 36874 39273 38573 39297 37922 38027 35439 34548 30402 27848 23578
248B3578l759m398m445m875m336m823n479l485l411n663l462k841l852j773k510
263c5534n57q45n22N9J563N62K328K476L103L280K971M071M153M516M229L912
279b35L797M890L957L318L432M554J181L431K157J252J385J913r38o35J24k470
295C1113j130k544j911l545l702k579n016l434k694m698m658l958l848l340l518
310a9462l451j715k500k011k303O62m41j299J602M35J330K388J932M001K995L607
326a4230K257L917L272M590M486L620M219M865K360L742L606K665K403K514K164
341C6450N58J837j571L29j78j433j587j528l246k199l401k806m299l932l289m817
357D888l949l607m383k687n247j940l638l433j845j408j037j519n12K20N99l73
$$ plain form
248 23578 19819 15421 10976 6101 1765 -3058 -8537 -12022 -15433 -21096 -24558 -27399 -31251 -33024 -35534
263 -35534 -36091 -36936 -37458 -37399 -35836 -35274 -32946 -30470 -27367 -24087 -21116 -17045 -12892 -8376 -4147 -235
279 -235 3562 8452 12409 15727 19159 23713 24894 28325 30482 31734 33119 35032 34094 33459 33583 31113
295 31113 29983 27439 25528 21983 18281 15702 10686 7252 4558 -140 -4798 -8756 -12604 -15944 -19462
310 -19462 -22913 -24628 -27128 -29139 -31442 -30780 -31221 -32520 -30918 -30483 -29153 -26765 -24833 -20832 -17837 -14230
326 -14230 -11973 -8056 -4784 -194 4292 7912 12131 16996 19356 23098 26704 29369 31772 34286 36450
341 36450 37008 38845 37274 37603 37425 35992 34405 32877 29631 27432 24031 21225 16926 12994 9705 4888
357 4888 939 -2668 -7051 -9738 -14985 -16925 -20563 -23996 -25841 -27249 -28286 -29805 -30317 -30097 -29498 -29871
373b9871P90K597K330J225L388L297J657M349M259L657L445L692L968K918L278
388A4979L990L331J270L959J393J526L113L00O33k79j003o19r74j505m46l622
404B6046k379k691l952k449k874l321m380k565l304k286l668k977l102m261n76
419a8739p70j331j144j057o14K92M20O53K046J58K537K639J345L182K963K078
435e342L807L582J220L588K806K254L215J718L345J370P04K681L18O98R4O25r44
452B5739k24j199r65k203j754k878j719j771k891l092k256k775j749m203r37l493
468h370j679k478q39j587k129K48m14j337O62J103l79K042P54J226J389J768L005
485g015J588K351K948K572K012K594K425K446J510K347K261N89J248J017K599
$$ plain form
373 -29871 -29081 -26484 -24154 -22929 -19541 -16244 -14587 -10238 -5979 -2322 1123 4815 8783 11701 14979
388 14979 18969 22300 23570 27529 28922 30448 33561 33861 34494 34215 33212 32593 31619 30114 29668 26046
404 26046 23667 20976 17024 14575 11701 8380 4000 1435 -1869 -4155 -7823 -10800 -13902 -18163 -18739
419 -18739 -19509 -20840 -21984 -23041 -23655 -23363 -22943 -22290 -20244 -20086 -17549 -14910 -13565 -10383 -7420 -5342
435 -5342 -1535 2047 3267 6855 9661 11915 15130 16848 20193 21563 22267 24948 25266 25964 26058 26683 25739
452 25739 25515 24316 23351 21148 19394 16516 14797 13026 10135 7043 4787 2012 263 -3940 -4877 -8370
468 -8370 -10049 -12527 -13366 -14953 -17082 -16834 -17248 -18585 -17923 -16820 -17199 -15157 -14403 -13177 -11788 -10020 -7015
485 -7015 -5427 -3076 -128 2444 4456 7050 9475 11921 13431 15778 18039 18628 19876 20893 23492
500B3492j378N83m90j18m56j156q04k342j797j559k226k834l039p12k626k557
516a9k702j654l041j288j233k709j236j902K56j256j189J555K19P19jJ047J303
533a3131K186J571J883J242L468K510J287M025J648K056K083J820K167J480L263
548A9558P55R72m7K021J72l40Qj497j216j571k35j968l351o7k483l169j926k207
566C409k342k852k680k781k569j242k895j052j708j552j05k065m83J308o26M87
582a9748K032J156O6J312K625K078J891L077J948K596J984M397K372K068J933
597A1787K352K535K775j02J858J027M94O04j29J506k263K97k325r85k159p94k257
614A4221k160j425k877k518k392k449l468k498k358k305k601q62l165p61j889
$$ plain form
500 23492 22114 22697 22207 22089 21633 20477 19673 17331 15534 13975 11749 8915 5876 5164 2538 -19
516 -19 -2721 -4375 -7416 -8704 -9937 -12646 -13882 -15784 -15528 -16784 -17973 -16418 -16199 -15480 -15481 -14434 -13131
533 -13131 -10945 -9374 -7491 -6249 -2781 -271 1016 5041 6689 8745 10828 12648 14815 16295 19558
548 19558 20313 21285 21238 23259 23431 23091 23099 21602 20386 18815 18580 16612 13261 13194 10711 7542 5616 3409
566 3409 1067 -1785 -4465 -7246 -9815 -11057 -13952 -15004 -16712 -18264 -18369 -20434 -20917 -19609 -20235 -19748
582 -19748 -17716 -16560 -16494 -15182 -12557 -10479 -8588 -5511 -3563 -967 1017 5414 7786 9854 11787
597 11787 14139 16674 19449 19347 21205 22232 22726 23330 23201 24707 22444 22741 20416 19431 17272 16478 14221
614 14221 12061 10636 7759 5241 2849 400 -3068 -5566 -7924 -10229 -12830 -13692 -16857 -17618 -19507
629a9507r40n88l80oj56O1P59K304J579P87K498P21K954K085J943L304K523J297
647A238K836K742K436K734K064J451Q18J834J228L44K94J044n33j43q46j353l56
664A7832k235j167k860j505k783q22k290l076j977l073k066j401j954l317k051
679a4745p5q71k383q27j123K53r05J468N78k76J383L87L406J038J867K114K471
696f240J740K808J823K303K303K623J279J740K359P60K076L04Q81j3P3J648k42
713A8225j302n44j758L73j762j193j645k231j347l145j987k575j616k664k724
728g895q39k917j555m73k085p39j084O82j126j71q5O09L41O80J355J345J984R04
746a1069R48K119L013R84L889J225J349K654K225K081P85J690J716J132O99K84
$$ plain form
629 -19507 -20447 -21035 -21415 -21421 -21577 -21516 -20757 -18453 -16874 -16087 -13589 -12868 -9914 -7829 -5886 -2582 -59 1238
647 1238 4074 6816 9252 11986 14050 15501 16319 18153 19381 19725 20019 21063 20530 20387 19541 18188 17832
664 17832 15597 14430 11570 10065 7282 6460 4170 1094 -883 -3956 -6022 -7423 -9377 -12694 -14745
679 -14745 -14820 -15691 -18074 -18901 -20024 -19771 -20676 -19208 -18630 -18906 -17523 -17136 -13730 -12692 -10825 -8711 -6240
696 -6240 -4500 -1692 131 2434 4737 7360 8639 10379 12738 13498 15574 15878 16759 16746 16819 18467 18225
713 18225 16923 16379 14621 14994 13232 12039 10394 8163 6816 3671 1684 -891 -2507 -5171 -7895
728 -7895 -8734 -11651 -13206 -13679 -15764 -16503 -17587 -16905 -18031 -18202 -18287 -17678 -17337 -16657 -15302 -13957 -11973 -11069
746 -11069 -10121 -8002 -4989 -4005 -116 1109 2458 5112 7337 9418 10203 11893 13609 14741 15440 15724
762A5724J010Q2Q84j092q83p93j655O01l595p14r52j892k094j824j408l023k035
779c659j350j780j548j089k210j404j945K42r24j146J242j243O08J176N15L23
795a4192J688L99K623J654J388J131K079J684J958K964N98R19L039O78K820J65
811A1595J736M34N15J555n71m75N25j189N3j367j849L78j219k239j265k486j396
828B735k112j398j411k345r45k799j047j382j082j156j478M84n82j95J653j662
844a4722Q71J462M0J490J859J051J344J954J198J913J419J568K665K319L78K275
860I084P92J020J328J719R45n32J916k65q4l73o95n94k467R85p63k506n13k271
878F726j507k919p16k377j710k288j729j160j889p4r91j850o83r25j456R37j405
$$ plain form
762 15724 16734 16816 17700 16608 15725 14932 13277 13878 10283 9569 8617 6725 4631 2807 1399 -1624 -3659
779 -3659 -5009 -6789 -8337 -9426 -11636 -13040 -14985 -14743 -15667 -16813 -15571 -16814 -16206 -15030 -14515 -14192
795 -14192 -12504 -12105 -9482 -7828 -6440 -5309 -3230 -1546 412 3376 3974 4893 7932 8610 11430 11595
811 11595 13331 13765 14280 15835 15264 14789 15314 14125 14178 12811 10962 11340 10121 7882 6617 4131 2735
828 2735 623 -775 -2186 -4531 -5476 -8275 -9322 -10704 -11786 -12942 -14420 -13936 -14518 -14713 -13060 -14722
844 -14722 -13851 -12389 -12349 -10859 -9000 -7949 -6605 -4651 -3453 -1540 -121 1447 4112 6431 6809 9084
860 9084 9876 10896 12224 13943 14888 14356 16272 16007 15923 15550 14855 14261 11794 12779 12016 9510 8997 6726
878 6726 5219 2300 1584 -793 -2503 -4791 -6520 -7680 -9569 -9643 -10634 -12484 -13167 -14092 -15548 -14611 -16016
895a6016L226j709L66J880M51J518O07K813P52J782J038K416K974J143J148K483
911F872Q85J576J657M14J164J525J264M3L9OR06k055J61m59j89j179k057m88q81
930I204k034j706j368k255j98l104j231k682j123j443j480k16j578j145r80Q83
946a2456j785J040n56K60J116K01Q56K125P86Q6K395J008J831J906J57J555K241
963B766J984K93K098J223J120J609n18M33J270o66P70q2N02M80j520n57k420K15
981I000j504j750J064k924j148p46k338r94j833q46j572j158q0j397m80j009m51
998a0166n61J51l42m3O94Q5J096O04M75L19P84J451J710J791Q24J405k64K129
1016B142J325J046J003K33R58J133N28L14K95r8P58j3j11j002K87j190j405K81
$$ plain form
895 -16016 -12790 -14499 -14133 -12253 -11802 -10284 -9677 -6864 -6112 -4330 -3292 -876 2098 3241 4389 6872
911 6872 7757 9333 10990 11404 12568 14093 15357 15400 15439 15445 16351 14296 14457 13998 13809 12630 10573 10085 9204
930 9204 7170 5464 4096 1841 1643 -1461 -2692 -5374 -6497 -7940 -9420 -9636 -11214 -12359 -13339 -12456
946 -12456 -14241 -13201 -13757 -13497 -12381 -12180 -11324 -9199 -8413 -8327 -5932 -4924 -3093 -1187 -1030 525 2766
963 2766 4750 5043 7141 8364 9484 11093 10575 11008 12278 11612 12382 12300 12802 13282 11762 11205 8785 9000
981 9000 7496 5746 6810 3886 2738 1992 -346 -1340 -3173 -4019 -5591 -6749 -6829 -8226 -8706 -9715 -10166
998 -10166 -10727 -10576 -10918 -10961 -10267 -10182 -9086 -8482 -8007 -7688 -6904 -5453 -3743 -1952 -1128 277 13 2142
1016 2142 3467 4513 5516 5749 6707 7840 8368 8682 8977 8879 9637 9624 9513 8511 8798 7608 6203 6484
1034F484j386p81m85j091j876m45j226q58r20k431n59o10k27j920L97j424N02
1051h856j189Q67J54j440N95J578o3m0J908k23J099m35J845J063J152J165J858
1068A038k19J194J52J521J235R22J64k27J38J271l36O23N86k35p29m53j39p64
1086E742j129r23j378P73o66k254L06j381j982N06k527J31p28o92n35m71m04l33
1104g945m51RM71j674J190J312r92J081N84m26J321Q18J060K57M61K012P32l67
1122e47J551O8J740J11L19J546j90j5P3Q39L85k13l39M56l72p99q3j052q76J67
1142B769o13j360Q9j826j284l93r17r65K69q1j170p17J38r94M92j337m79R01q98
1161h376J032n95J806j006Q74J895k65P09O73R39R02M43K72Q29N29n3J700J30
$$ plain form
1034 6484 5098 4317 3832 2741 865 420 -806 -1664 -2584 -5015 -5574 -6184 -6411 -8331 -7934 -9358 -8856
1051 -8856 -10045 -9178 -9024 -10464 -9869 -8291 -8354 -8394 -6486 -6709 -5610 -6045 -4200 -3137 -1985 -820 1038
1068 1038 819 2013 2165 3686 4921 5843 6007 5780 5918 7189 6853 7476 8062 7827 7098 6645 6506 5742
1086 5742 4613 3690 2312 3085 2419 165 471 -910 -2892 -2386 -4913 -4782 -5510 -6202 -6737 -7208 -7612 -7945
1104 -7945 -8396 -8387 -7916 -9590 -8400 -7088 -8080 -6999 -6415 -6841 -5520 -4702 -3642 -3385 -2924 -912 -180 -547
1122 -547 1004 1072 2812 2923 3242 4788 4598 4583 4656 5495 5880 5667 5328 5784 5412 4613 4530 3478 2602 2769
1142 2769 2156 796 885 -941 -2225 -2618 -3535 -4500 -4231 -4312 -5482 -6199 -6061 -7055 -6563 -7900 -8379 -7478 -8376
1161 -8376 -7344 -7939 -6133 -7139 -6265 -4370 -4635 -3926 -3253 -2314 -1412 -969 -697 132 661 608 2308 2438
1179B438N45N66L23O86k87k75P12o08Q89m64q25J377j246q97o03q17M04j397K12
1198G33k56j354j203p80j20j90j224j193o7k22O55j476m78k03J437l68k90k82
1216f881J129k62p3J589k99K02J596O13N6L22L56J718O97N29J009j63O30Q43Q74
1235D485n52L31O02o81Q20M31K54j75p25p38k33p0j667M33o97o59j83n41J51j456
1255h70l74p81j239J85p4q17j307M36j317K67n4L48k39n01J258J72o24J151N7
1274d323k25L3J744Q68R97J39J41J473o17J098Q88M00j06P72O4J132J985j530
1292D933O60L36L19q14o84O11J58p29P9j469P3j615j47n11p56o42K96l11j633
1311a846q44J59L22q81k25j05q56j196J162p18J198l37j44M14P49m73J392j068
$$ plain form
1179 2438 2983 3549 3872 4558 4271 3996 4708 4100 4989 4525 3700 5077 3831 2934 2331 1514 1918 521 733
1198 733 477 -877 -2080 -2860 -2980 -3170 -4394 -5587 -5654 -5876 -5221 -6697 -7175 -7378 -5941 -6309 -6599 -6881
1216 -6881 -5752 -6014 -6087 -4498 -4797 -4595 -2999 -2386 -2330 -2008 -1652 66 763 1292 2301 2138 2768 3611 4485
1235 4485 3933 4264 4866 4185 5005 5436 5690 5515 4790 4052 3819 3749 2082 2515 1818 1159 976 435 586 -870
1255 -870 -1244 -2025 -3264 -3079 -3153 -3970 -5277 -4841 -6158 -5891 -5945 -5597 -5836 -6337 -5079 -4907 -5531 -4380 -4323
1274 -4323 -4548 -4515 -2771 -1903 -906 -767 -626 847 230 1328 2216 2616 2510 3282 3346 4478 6463 4933
1292 4933 5593 5929 6248 5434 4750 5361 5519 4790 4869 3400 3473 1858 1711 1200 444 -198 98 -213 -1846
1311 -1846 -2690 -2531 -2209 -3090 -3315 -3420 -4276 -5472 -4310 -5028 -3830 -4167 -4311 -3897 -3148 -3621 -2229 -3297
1329c297J305J300n45L54J588n86J621o5O35O02j84J093Q8J392r4K54L21j015
1347D767M18n31R43j10o68p11O23m03l06l24j595M58j580J76n62L93j655o31m79
1366a777O40P8j114m37N57k383J497P04j058K70L47K28O81n1o29J588q72Q22K74
1385f35P34J23P19J376J71J6jK37R06K72j55K55M38m42J039j59o69R30j519J90
1405C826L62m4n38R2q55n35j45j122N90j232K97n26o92j93M3j006m65R04m32q72
1425b543k27n66R37L03m68O20K11m12J66P07J102k65K59n67N20J425J27Q1N57
1444A967K24R37q7N75K03Q01q37o19O16j56L32M51K30p31l0n08m07N48q08p43
1464A958j186k63m18r74J327k93j117m77K03j265R70j208N83n45J267q23r72J120
$$ plain form
1329 -3297 -1992 -692 -1237 -883 705 119 1740 1675 2310 2912 2728 3821 3909 5301 5207 5461 5782 4767
1347 4767 5185 4654 5597 5487 4819 4108 4731 4328 4022 3698 2103 2561 981 1157 595 988 -667 -1298 -1777
1366 -1777 -1137 -1059 -2173 -2610 -2053 -4436 -2939 -2235 -3293 -3023 -2676 -2448 -1767 -1818 -2447 -859 -1731 -909 -635
1385 -635 99 222 941 2317 2488 2504 2503 2740 3646 3918 3763 4018 4456 4014 5053 4894 4225 5155 3636 3826
1405 3826 4188 4144 3606 3698 2843 2308 2163 1041 1631 399 696 170 -522 -715 -672 -1678 -2143 -1239 -1671 -2543
1425 -2543 -2770 -3336 -2399 -2096 -2564 -1944 -1733 -2145 -1979 -1272 -170 -435 -176 -743 -223 1202 1329 1410 1967
1444 1967 2191 3128 3041 3616 3819 4620 3783 3164 3780 3624 3956 4407 4637 3906 3876 3368 2961 3509 2701 1958
1464 1958 772 509 91 -883 444 151 -966 -1443 -1240 -2505 -1535 -2743 -2160 -2705 -1438 -2261 -3233 -2113
1482b113q7r34J296M94j070J75L12J187OP57K70K73m75J596j121K040j80r3M81
1501B814O23n40M34j003J633q39p73N73L26p92O35j071J138n50p31j181k03OJ26
1520F25j252O36o27j43l15k214P38r77J610J38j027n59M4J019k02O56r50K87N98
1539a915o64n1J690k22Q20n41L60Q20j61J649p33n86QJ141K5n25R91J329j307
1558B128j02N77N44q84p4K15j267j09j391K72J672j503n73P61j055l2k04m10K60
1577a175r53l42n18R17p84J54R85q43o08J53N95q57J781j620J093l2P87q68Q27
1596a308J221l98M75O84j102L07K09L55J220j459J998r21q2k67L16M4M9m54Q52
1615A739m40L64k78j94M87j081K21N50l077J208N36j294m6l5M85q80Q29o18q84
$$ plain form
1482 -2113 -2200 -3134 -1838 -1344 -2414 -2239 -1927 -740 -734 23 293 566 91 1687 566 2606 2426 2333 2814
1501 2814 3437 2897 3331 2328 3961 3122 2349 2922 3248 2456 3091 2020 3158 2608 1877 696 493 499 625
1520 625 -627 9 -618 -761 -1076 -3290 -2552 -3529 -1919 -1781 -2808 -3367 -3323 -2304 -2506 -1850 -2800 -2513 -1915
1539 -1915 -2579 -2630 -940 -1162 -342 -883 -523 297 136 1785 1052 466 474 1615 1640 1115 2106 3435 2128
1558 2128 2026 2603 3147 2263 2189 2404 1137 1028 -363 -91 1581 78 -495 266 -789 -821 -1025 -1435 -1175
1577 -1175 -2128 -2470 -2988 -2071 -2855 -2701 -1716 -2559 -3167 -3014 -2419 -3276 -1495 -3115 -2022 -2054 -1267 -2135 -1308
1596 -1308 -87 -485 -10 674 -428 -121 88 443 1663 204 2202 1281 1199 932 1248 1292 1341 887 1739
1615 1739 1299 1663 1385 1191 1678 597 818 1368 -1709 -501 35 -1259 -1305 -1340 -855 -1735 -906 -1524 -2408
1634b408o5r17L62O09J45l51j3o5L56m11K03J222J13m05M43J10P76j969J230q
1654a043l19K151N32j148L73q8J06N98L07o11L1N8J140j242P66p16J051j731J170
1673A385n82N99j942M81K63N39j099r36O94k55N99r80j096J123k7m69l11m39N98
1692a855o98J020L25M63j441j54N96J60N5l49J16j08R49Q85j831K026J49k32l70
1711b94J613p28m59j40Q62M09p9J78p69R04m6k6p56O07l1k31q5L7o80N88n60o60
1733c46P15j321j6j90N66M59o85k87P19j013K06J1m8J01n73J530j400L35K17p76
1753a796M91K95N17r33N36J026q76J676n58n05l37J9K336m67r65n95J560q86J203
1772A741K06j91o01N71o5J23k41j123J385r54j004J323M9j828J569j063Q42j010
$$ plain form
1634 -2408 -2473 -3390 -3028 -2419 -2274 -2625 -2638 -2703 -2347 -2758 -2555 -1333 -1220 -1625 -1182 -1072 -296 -2265 -1035 -1043
1654 -1043 -1362 789 1321 173 546 458 564 1162 1469 858 889 947 2087 845 1611 895 1946 215 1385
1673 1385 803 1402 -540 -59 204 743 -356 -1292 -598 -853 -254 -1234 -2330 -1207 -1234 -1703 -2014 -2453 -1855
1692 -1855 -2553 -1533 -1208 -745 -2186 -2340 -1744 -1584 -1529 -1878 -1762 -1870 -921 -36 -1867 159 308 76 -294
1711 -294 1319 591 132 -8 854 1263 1184 1362 593 1497 1451 1425 669 1276 1245 1014 929 966 286 874 314 -346
1733 -346 369 -952 -968 -1158 -592 -133 -818 -1105 -386 -1399 -1193 -1182 -1230 -1129 -1702 -172 -1572 -1237 -1020 -1796
1753 -1796 -1305 -1010 -493 -1426 -890 136 -740 936 378 -127 -464 -445 1891 1424 459 -136 1424 538 1741
1772 1741 1947 1756 1155 1726 1661 1784 1543 420 1805 851 -153 1170 1219 -609 960 -103 739 -271
1790b71m15k49M18m96J113p14M64q80q66O0J087m18O3Q0j46j1R77m89q0p6K40
1811f09Q37j091M09p26J056l2N98Q46p69O51O95k92qq75J214lj76n30M31QL9M09
1833B082J28j152m54Q26k13N86l41o46j76on13o89o05L52k03Q2O34r48O1R94j153
1854a354L57l44J81m54J88m43O41K10m0L32o87J159J32L10o4Q08j05j58P91k93
1874A167l24Q89j359Q93J91P4L32n42J739p70j51j135R23q90J134j237l07N28
1892A155k47O24p02M83J1m71r05j074j75P14K58R3j261N12m50l95J80M32k85k5
1912a528J73O26r17K91M50K87K67k08L42M85k63l57J108r23J547r08J272o48J051
1931B147j213J07m00R37O67J96j247J20O65L47j34j91p4j735J067m45m05j70M30
$$ plain form
1790 -271 -686 -935 -517 -1013 100 -614 -150 -1030 -1896 -1836 -749 -1167 -1104 -1024 -1170 -1181 -204 -693 -773 -849 -609
1811 -609 228 -863 -454 -1180 -124 -156 442 1288 519 1170 1865 1573 1565 690 1904 1901 1725 1195 1626 1634 1673 2082
1833 2082 2210 1058 604 1430 1217 1803 1462 816 640 634 121 -568 -1173 -821 -1024 -942 -308 -1256 -1195 -201 -1354
1854 -1354 -997 -1341 -1160 -1614 -1426 -1869 -1228 -1018 -1058 -726 -1413 -254 -122 188 124 932 827 669 1460 1167
1874 1167 843 1732 373 1266 1457 1531 1863 1321 3060 2290 2139 1004 1927 1037 2171 934 627 1155
1892 1155 908 1532 830 1313 1324 853 -52 -1126 -1301 -587 -329 -236 -1497 -985 -1435 -1830 -1650 -1218 -1503 -1528
1912 -1528 -1355 -729 -1646 -1355 -905 -618 -351 -559 -217 268 5 -352 756 -167 1380 472 1744 1096 2147
1931 2147 934 1041 641 1578 2245 2441 1194 1314 1979 2326 2192 2001 1927 192 1259 814 409 239 669
1950F69m52k98N70j742O03n66K08P6N18q91N8j23KR85K77j086j28L1K81k94L5
1971a267J182r27m43J552k94O01m60J270R52o41j384P95Q45n2j057P61O95j86
1989A942J95Q08j221l74K34n01R30j217L92l18j16l70J68n53J53n20n95J276p01
2008c88j124R77o58q31J617j445m50K57k33J044P47p61l38o8J89K211j550Q47
2026D3j202N49J42J787o13o70J380j212J34J740r94J42J24M21P21j136M07p66
2044I97O85P13j786O77O2j96Q6o99L67j290J020m44o78J38R11j932j8Q11l99n81
2064a556r75J635r40n97P07k20N91n37P30L47j125J285k48l22J418l6o02P29J43
2083D27P03q1r55J660K53j111nR45l54n63Q10J11j233M18J046j06j012O69j554
$$ plain form
1950 669 217 -81 489 -1253 -650 -1216 -1008 -932 -414 -1305 -1247 -1370 -1368 -383 -106 -1192 -1320 -1289 -1008 -1302 -1267
1971 -1267 -85 -1012 -1455 97 -197 404 -56 1214 2166 1525 141 936 1781 1729 672 1433 2128 1942
1989 1942 2137 2945 1724 1350 1584 1083 2013 796 1188 870 754 384 552 -1 152 -368 -963 313 -388
2008 -388 -1512 -535 -1193 -2024 -407 -1852 -2302 -2045 -2278 -1234 -487 -1248 -1586 -1654 -1465 746 -804 43
2026 43 -1159 -610 -468 1319 706 36 1416 204 338 2078 1084 1226 1350 1771 2492 1356 1763 997
2044 997 1682 2395 609 1286 1348 1152 1238 539 906 -384 636 192 -486 -348 563 -1369 -1387 -576 -975 -1556
2064 -1556 -2531 -896 -1836 -2433 -1726 -1946 -1355 -1892 -1162 -815 -1940 -655 -903 -1225 193 157 -445 284 427
2083 427 1130 1049 94 1754 2007 896 891 1836 1482 919 1729 1840 607 1025 2071 1965 953 1622 68
2102F8M30L21k90o77m28N44j83l65P98J43p12j382pK09l23Q30q35n61O20J40P58
2123i02l68m24N40k78M4K59K08O65n98O84N15l18m9J60l33J176k40n71K013q62
2143A321K95j7L7L03m9j6k57J71j026N29q8J47j504Q66L10j071n62q31Q24n89
2163a207n5P58j83r37K72Q27l38K20j111k72j63N48L59k4j122J840q10J63P74
2182d61M56R10j411J93k37R83M60j15Q62l86J052j022N14q37m54J605l28K44m32
2201A596J91r69M4R40o12n81J73j182M16M26n05O18k76l23q91l57j14m78Q41K11
2221h32o13k20N22j232m9J965q44M85j94n91Q20l47r16K619j352O23O49j203R55
2240B45M33j83rJ76N31J246j290J16j135Q25K2Q31j00j118O51O29o32m08P19o19
$$ plain form
2102 68 498 819 529 -148 -576 -32 -215 -580 218 361 -351 -1733 -1740 -1531 -1854 -1024 -1859 -2420 -1800 -1660 -902
2123 -902 -1270 -1694 -1154 -1432 -1388 -1129 -921 -256 -854 -170 345 27 -22 138 -195 981 741 170 2183 1321
2143 1321 1616 1599 1636 1939 1890 1874 1617 1788 762 1291 1203 1350 -154 712 1022 -49 -611 -1442 -618 -1207
2163 -1207 -1262 -504 -687 -1624 -1352 -525 -863 -643 -1754 -2026 -2189 -1641 -1282 -1306 -2428 -588 -1398 -1235 -461
2182 -461 -5 905 -506 -313 -550 433 893 778 1640 1254 2306 1284 1798 961 507 2112 1784 2028 1596
2201 1596 1787 818 862 1802 1190 609 782 -400 16 442 -63 555 279 -44 -935 -1292 -1406 -1884 -1043 -832
2221 -832 -1445 -1665 -1143 -2375 -2424 -459 -1303 -818 -1012 -1603 -783 -1130 -2046 573 -779 -156 493 -710 245
2240 245 678 495 486 662 1193 2439 1149 1265 130 955 977 1808 1708 590 1241 1870 1238 830 1549 930
2260I30k0j047J518p02j375R85j64j070N94k17m56l59j87K06o3l67m10L39K77
2279a588J74n72O00J01j18Q21o63j61Q63J036j041K77Q81j010J079N45l79k63
2297E82J054o5Ro61P61m29l33N52m28N7k42N12j43k59k20n9m90P64l73j52j139
2318g02O45K7O69j499k67P86j053m30mR94j371K56J341r24j99p8o21J417o56N80
2338a089m77J796l03J66m00K41J120j647J262J95j483J078K92J614q04p6k60N5
2356A280K09r13J124j412P90j01j459J448N95j029q72J257M29j096q73l18R53
2373A2o63m38m1k00M31q14N70m35m85P15m0O66L66j240P6L61m7M81K99J5j53K77
2395b87k45O22L0p71O14J07J94M54L29k59N71n74O84P0k93R0l27P20L39q09m74
$$ plain form
2260 930 910 -137 1381 679 -696 289 125 -945 -351 -568 -1024 -1383 -1570 -1364 -1427 -1794 -2204 -1865 -1588
2279 -1588 -1414 -1986 -1386 -1285 -1403 -582 -1245 -1406 -543 493 -548 -271 610 -400 679 1224 845 582
2297 582 1636 1571 1580 919 1680 1251 918 1470 1042 1099 857 1369 1226 967 747 688 198 962 589 437 -702
2318 -702 -57 -30 639 -860 -1127 -341 -1394 -1824 -1828 -834 -2205 -1949 -608 -1532 -1731 -1809 -2430 -1013 -1669 -1089
2338 -1089 -1566 230 -73 93 -307 -66 1054 -593 669 864 -619 459 751 2365 1561 1485 1225 1280
2356 1280 1489 576 1700 288 1078 977 -482 966 1561 532 -340 917 1346 250 -623 -941 12
2373 12 -651 -1089 -1130 -1330 -899 -1713 -1143 -1578 -2063 -1348 -1388 -722 -356 -1596 -1520 -1159 -1206 -725 -426 -411 -564 -287
2395 -287 -532 90 120 -651 -37 70 264 718 1047 788 1359 785 1469 1539 1246 1336 1009 1729 2068 1259 785
2416G85m43L47N0j285J331m47k74J274j143p76K22P97q74n91m31o80P94p42R08
2435a178j71j25M11j90m97O87K58l38M8L59l68l42R35J80N87O9j51m39J231j114
2455a48N00O68j89J438r9l40n33P93j123K36m98K49M31k39m96R51r73k66m61L93
2475B94J9k76n09k62P0M22L28j2j384J90P0r40N92J86J97q84k71k79J632m1J055
2496A97j269L47J00o22Q09Q30p14R20r27R16L12n17j71L62R07p62j68M84m32J37
2516G39K74k35N09J12j18m35R4K89j859J621j168K045j068n95P1L0p34O15j132
2535i45M94j019O84j96J9k6o53J241o64p4r12M31N96m15J13N74L07k57K33n07
2555i76L98J049J84j392J358l82j58P9K78jj53J005L50m70P3q51R61m33j66M27
$$ plain form
2416 785 342 689 739 -546 785 338 64 1338 195 -581 -359 438 -436 -1027 -1458 -2138 -1344 -2086 -1178
2435 -1178 -1349 -1474 -1063 -1253 -1750 -1063 -805 -1143 -1095 -736 -1104 -1446 -511 -331 256 325 174 -265 966 -148
2455 -148 352 1020 831 2269 2170 1830 1297 2090 967 1203 705 954 1385 1146 650 1601 628 362 -99 294
2475 294 313 37 -472 -734 -664 -242 86 74 -1310 -1120 -1050 -1990 -1398 -1212 -1015 -1899 -2170 -2449 -817 -858 197
2496 197 -1072 -725 -625 -1247 -438 392 -322 598 -329 587 899 382 211 573 1480 718 550 1034 602 739
2516 739 1013 778 1287 1399 1281 846 940 1229 -630 991 -177 1868 800 205 276 306 -428 187 -945
2535 -945 -451 -1470 -786 -982 -963 -989 -1642 -401 -1065 -1139 -2051 -1620 -1024 -1439 -1326 -752 -445 -702 -469 -976
2555 -976 -578 471 655 -737 621 239 81 160 438 437 284 1289 1639 1169 1242 391 1352 919 753 1180
2575A180r57p41J395j74j52n43Q03n83r41N26l10k58n32K62o77J167j378Q62M54
2594e97K52n82p81RQ81l01M6L56K56m71N40r79J764j116N40n90O09R79p73L76
2614D18k02P87k39M15J310j303O99m09j141Q74p09N74J96j82q50M02K16l45j148
2633f37P06n53L13o74Q23K97j91j494L52Q84j044P90j156N06K65r27Q36l46J026
2652b24o57J383j369p91J404L15r24O43l54M38J080l27j298L62Q00j46R87k66
2670A056j01K43m04K15O90k83j276O37P56j376L42R6j262K44R28m43j19j290O74
2689f73p07J069K11q66J34l91j79K38q24J475n7p12n95P39M07o70J99O49k66M79
2709c40k66o98J238j017J82P36m61L51Q24p6o01J063n49j94J51K14Q47o30m36
$$ plain form
2575 1180 223 -518 877 703 551 8 811 228 -713 -187 -497 -755 -1287 -1025 -1702 -535 -1913 -1051 -597
2594 -597 -345 -927 -1708 -1699 -818 -1119 -1073 -717 -461 -932 -392 -1371 393 -723 -183 -773 -164 815 42 418
2614 418 216 1003 764 1179 2489 1186 1885 1476 335 1209 500 1074 1270 1088 238 640 856 511 -637
2633 -637 69 -484 -171 -845 -22 275 84 -1410 -1058 -174 -1218 -428 -1584 -1078 -813 -1740 -904 -1250 -224
2652 -224 -881 502 -867 -1658 -254 61 -863 -220 -574 -136 944 617 -681 -319 481 335 1322 1056
2670 1056 955 1198 794 1009 1699 1416 140 777 1533 157 499 595 -667 -423 505 62 -57 -1347 -673
2689 -673 -1380 -311 -100 -966 -832 -1223 -1402 -1164 -1988 -513 -570 -1282 -1877 -1138 -731 -1401 -1202 -553 -819 -340
2709 -340 -606 -1304 -66 -1083 -901 -165 -626 -275 549 473 -128 935 386 192 343 557 1404 774 338
2728C38m50J257p51J016j355M84j059N85O42K26j198j40J170l68k66m83N81r32
2746g03n75l01Q46N58j279k38J262J46q40K28m27L17P13q94k94J762q98J223j112
2765e06j08M92N24n60j50M32P57J87p52J510n73n10l6N16o07P88r60J017j126
2784C35J640r29n95J19j05r55J375n28m33K16k03L08j150M86l05K71p29J046p59
2803h95j16j006R14K34J238J52j145r10M17L68N63K47p3n0q93J790j530J432Q45
2822A582j090m04M29J118r00n50L42K67K36O74n59k04N94j133J014r36N07o39
2840C48m7n88p22K032q12J22n09J79p8o00N50p32N50O2K64M55j435l46R18n80
2860i69J528k13k134J761m9o91M97N55o92L67M21p6M21q47Q83J55k67J218j112
$$ plain form
2728 338 -112 1145 394 1410 55 539 -520 65 707 933 -265 -405 765 397 131 -352 229 -703
2746 -703 -1278 -1579 -733 -175 -1454 -1692 -430 -284 -1124 -896 -1323 -1006 -293 -1187 -1481 281 -617 606 -506
2765 -506 -614 -122 402 -158 -308 124 881 1068 316 1826 1253 743 707 1223 616 1404 444 1461 335
2784 335 1975 1046 451 570 465 -490 885 357 -76 140 -63 245 -905 -419 -724 -453 -1182 -136 -895
2803 -895 -1011 -2017 -1103 -869 369 521 -624 -1534 -1117 -749 -186 61 -12 -62 -955 835 -695 737 1582
2822 1582 492 88 517 1635 735 185 527 794 1030 1704 1145 941 1535 402 1416 480 987 348
2840 348 301 -287 -1009 1023 211 333 -176 3 -75 -675 -125 -857 -307 -245 19 474 -961 -1307 -389 -969
2860 -969 559 346 -1788 -27 -76 -767 -270 285 -407 -40 381 305 726 -121 762 917 650 1868 756
2879G56l47J64O06R54j018j309J592n66J678j014q14P4P40r89j107P25P2l27j36
2898b66l15J236o92k70kJ00l90q36J027m93P42K98j125N68N36p38N86o71o33J340
2918Bn1K41j14k32j43o59J811J86j296j92J413j101L46P57r44R21k03N21j261
2937BJ25Q56r3n57P8P75K0j467M52L85Q42j544M90p53J029j873J600j258Q25r45
2957a011L09J057j094N59j154J695j393N91K56m15M18o78K08m60J409k63Np60
2975g21P95N3J35J358q63J37m43K9l4l57l6J617q85j592K301j042q55K12j88P68
2995C89Q98j259p63M12n6p03K150j115m53K62O97q25l30k65Q15k7p85L14M43K75
3015G4l58m95kk67J380p55j085J864j155J011r16l38J063P1m27Q28r54J152O0
$$ plain form
2879 756 409 573 1179 2133 1115 -194 1398 832 2510 1496 682 756 1496 507 -600 125 197 -130 -266
2898 -266 -581 655 -37 -307 -309 -209 -599 -1435 -408 -901 -159 139 -986 -418 118 -620 -34 -705 -1338 2
2918 2 -49 192 78 -154 -297 -956 855 1041 -255 -447 966 -135 211 968 24 945 742 1263 2
2937 2 127 983 890 333 411 1186 1206 -261 191 576 1418 -126 364 -389 640 -1233 367 -891 -66 -1011
2957 -1011 -702 355 -739 -180 -1334 361 -1032 -441 -185 -600 -182 -860 -652 -1112 297 34 39 -721
2975 -721 74 127 262 1620 757 894 451 480 446 89 53 1670 785 -807 1494 452 -403 -191 -379 389
2995 389 1287 28 -735 -323 -379 -1082 1068 -47 -500 -238 459 -366 -696 -961 -146 -173 -958 -644 -201 74
3015 74 -284 -779 -781 -1048 332 -423 -1508 356 -799 212 -704 -1042 21 92 -335 493 -461 691 751
3034G51n25M41l80L78K2o10N18K12m42Q25m24l06J69j487J351j669J769q18K61
3053C6k63K58O38q98K18p99R59n22L99k86l31p99R13o3L72n10J3o36M73J053l17
3074i2r03J329o61Q57n21J13l67J252j377M00r0k87O75K44j078J727k57m98n02
3093c6J3J127p31j81j01K42L89m93R57q03k48K60j235O85o34J302j066O71P4j78
3113A4l4m97J433p37n85M53l3j483J767j124J90m52J879p62j516J450m74J69L93
3132E1j271M00J188jo72O71N40o09o4j82Q90M85j145L59m05K20o27N79k51n12
3152c56l81J645p40M88n07P86j672J213j20j13n49l9n65Q66j065J808j154n12
3170i67Q29p95N99J12k2o26k09M27N30L39r50Q76l46q3j18M19q42N24M16L1M21
$$ plain form
3034 751 226 667 287 665 687 77 595 807 365 1190 766 460 629 -858 493 -1176 593 -225 36
3053 36 -227 31 669 -229 -11 -810 149 -373 26 -260 -591 -1390 -477 -540 -168 -678 -665 -1301 -828 225 -92
3074 -92 -995 334 -327 530 9 122 -245 1007 -370 30 -60 -347 328 572 -506 1221 964 466 -36
3093 -36 -23 1104 373 192 91 333 722 229 1186 383 135 395 -840 -155 -789 513 -553 118 192 14
3113 14 -20 -517 916 179 -406 47 14 -1469 298 -826 -636 -1088 791 29 -1487 -37 -511 -342 51
3132 51 -1220 -820 368 367 -305 366 906 297 233 51 941 1426 281 640 235 455 -172 407 156 -356
3152 -356 -737 908 168 656 149 935 -737 476 356 243 -306 -345 -910 -44 -1109 699 -455 -967
3170 -967 -138 -933 -334 -222 -244 -870 -1079 -652 -122 217 -733 143 -203 -286 -404 15 -827 -303 113 144 565
3191E65l96J063n79m07l69j09l80R97l55Q19n55R6o95J364r2q07n64L45j029J295
3211B07n53K79R97j397L00m57M37K52n15j343J247m57J335j188j51J561j543O48
3229c41N55m48K65p09K13k64N54R78l95o0l13j54O34l56M06j420J333l89JP90
3249H80o66j54L59L48o6m67j247J403j223P36Q67q26n36O46j52k28K73M69q54
3268d38O53q90N92P62r39K37J25m34q41M54N03l76M53k6L88J92k017J904r88R14
3288B28p61K17n6M78L33m4p74J811p59m25J5M7Q6k91l84M91M06q01P27M10j279
3309c25O31N3N45O0p10q12R80J141j551K91j069L79K27j97l69ql81L68P19j87
3329b15p14O74j73J08l56Q00k05K06j34j253J033j26K20k50J77m64k7J757j321
$$ plain form
3191 565 169 1232 653 246 -123 -232 -612 385 30 849 294 390 -305 1059 967 160 -404 -59 -1088 207
3211 207 -346 -67 930 -467 -167 -624 -187 65 -450 -1793 -546 -1003 332 -856 -1007 554 -989 -341
3229 -341 214 -234 31 -678 -465 -729 -175 803 408 348 35 -119 515 159 565 -855 478 89 90 880
3249 880 214 60 419 767 701 234 -1013 390 -833 -97 770 -56 -592 54 -98 -326 -53 416 -438
3268 -438 215 -675 -83 679 -260 -23 102 -332 -1173 -719 -216 -592 -139 -165 223 415 -1602 302 -686 228
3288 228 -533 -316 -372 106 439 395 -379 1432 673 248 263 310 396 105 -279 212 618 -183 544 954 -325
3309 -325 306 359 904 964 254 -558 422 1563 12 303 -766 -387 -160 -357 -726 -734 -1115 -747 -28 -215
3329 -215 -929 -255 -428 -320 -676 124 -81 125 -9 -1262 -229 -355 -135 -385 -208 -672 -699 1058 -263
3348b63L65K87o6n16K46J081q16J44J95o80m13N94q5J29M41M06k71J90j096L90
3368B62k39n65J238n89k33R24j627J665j919K24Q16L01k19j172J166r31P12l04
3386d90M86m63R06o45o60N91r47J019K95m67O37p80n0O73m03L27P63n1p92j26
3406a77J460j054n82L12p58J275j7m8m55J53J036n44m10m01J51n1r9j91L8k69
3426f31o75J608q65L85J75k91K80p05j91J225l31r36J328n18n61M37N33n08m15
3445f56k90L6J139R94k225J416q00O9n23J337p55p27Q99R60k052J987k89k6k77
3464B17R3O36j555J452j429M52N41q68L88j51L33k73l03j076P18J439j057P91
3482C48qO34j207L7N88k47n90m96J010k76L99j90j76l51j67J121p42l67Q2Q22
$$ plain form
3348 -263 102 389 323 -193 53 1134 318 462 657 -23 -436 158 73 202 643 1049 778 968 -128 262
3368 262 23 -542 696 107 -126 798 -829 836 -1083 -859 -43 258 39 -1133 33 -898 -186 -490
3386 -490 -4 -467 439 -206 -866 -275 -1222 -203 92 -375 262 -518 -568 105 -298 29 792 741 -51 -177
3406 -177 1283 229 -353 -41 -799 476 459 411 -44 109 1145 601 191 -210 -59 -110 -209 -400 -362 -631
3426 -631 -1306 302 -563 -178 -3 -294 -14 -719 -910 315 -16 -952 376 -142 -703 -266 267 -241 -656
3445 -656 -946 -910 229 1223 -1002 414 -386 -317 -840 497 -258 -985 -86 874 -1178 809 520 494 217
3464 217 310 946 -609 843 -586 -134 407 -461 -73 -224 109 -164 -467 -1543 -825 614 -443 348
3482 348 340 974 -233 -196 392 145 -445 -941 69 -207 192 2 -174 -525 -692 429 -313 -680 -598 224
3502B24j023J092N89q93Q58J63j185K26K55R12j230q8o09M82J89N7j70P06n57
3521bn77M82k76O3N78J301j704J019j327J61M15k63K68o06k22M83N13j385K93
3540g86O02Q14n44kq08J201r53N50q05m88N92J013P40q91r81M41l12R10o45O29
3560B77K49o43Q89j372N66O98j442M46M26N62o32P0P44K77Mj113O09l11j388Q71
3580b13L32Q47j011L94j183M57P26n92o62O88P37r32j59N15j054J134Q89o24j56
3599A33q63J0O72n81J038M68j486Q85k12j60M78n05J360j263k07P07m28N44l97
3618A93L6M59m79K06n67o46R23K92k26O73p11N84j164j6J125o84p47M20k07P55
3638B19n78N14K9r2M24j93n82q74M94j9N83j60m3N94n25o35K25L81M33j002J585
$$ plain form
3502 224 -799 293 882 -11 847 1010 -175 51 306 1218 -12 -100 -709 -227 -38 19 -151 555 -2
3521 -2 -579 -97 -373 -310 268 1569 -135 884 -443 -282 133 -130 138 -468 -690 -207 306 -1079 -786
3540 -786 -184 630 86 84 -724 477 -476 74 -731 -1219 -627 386 1126 235 -746 -305 -617 293 -352 277
3560 277 526 -117 772 -600 -34 664 -778 -332 94 656 24 94 838 1115 1119 6 615 304 -1084 -213
3580 -213 119 966 -45 349 -834 -377 349 -243 -905 -217 520 -412 -571 -56 -1110 24 913 289 133
3599 133 -730 -720 -48 -629 409 877 -609 276 64 -96 382 -123 1237 -26 -233 474 46 590 193
3618 193 229 688 209 415 -152 -798 125 417 191 864 153 737 -427 -443 682 -2 -749 -329 -536 219
3638 219 -359 155 184 92 516 323 -259 -1133 -639 -658 -75 -235 -278 316 -209 -844 -619 -238 195 -807 778
3659G78p48O16J22m77N96j722J197L98m05p79R03p38L37J22r0J37M53o98M5L08
3679C55j94q86Q10o0J07P61j302J01l01P97m13m39N56N24j039O08m53J50K94k86
3699c10l59R52j192J17J503p71Q75j095J354j204R7L96J68j100K44N46m12n93
3717g84J004l86Q77J27j042L06O2M68j139J204k09n08J12l28k06J365j117J044
3735H50q51J263k012J151m35o40k38R73p53M37Q68p49M33n69j37M04p91P53k68
3754c11J12l91K88P29n22m93j5Q91N64p47J34O4M49q23m98N01j93R99m22m13r7
3775a94k92Q05M0r55M92k38J172j104k48M95L7K87n30j58K67P22m55o96N79l65
3795c39JL2N54P45j114l09K21O2N67l77R14j046Q28m84L19j205J307j272j9J303
$$ plain form
3659 778 30 646 768 291 887 -835 362 760 355 -424 479 -259 78 200 110 247 700 2 47 355
3679 355 161 -725 85 25 132 893 -409 -308 -609 188 -225 -664 -108 416 -623 -15 -468 -318 -24 -310
3699 -310 -669 283 -909 -792 711 -60 815 -280 1074 -130 -33 363 531 -569 -325 221 -191 -784
3717 -784 220 -166 711 838 -204 102 164 632 -507 697 488 -20 92 -236 -442 923 -194 850
3735 850 -1 1262 -750 401 -34 -674 -912 61 -692 -255 613 -136 297 -272 -409 -5 -796 -43 -311
3754 -311 -199 -590 -302 427 -95 -588 -603 288 852 105 239 303 752 -71 -569 -68 -261 738 316 -97 -194
3775 -194 -486 319 359 -596 -104 -342 830 -274 -522 -27 10 297 -233 -391 -124 598 143 -553 26 -339
3795 -339 -338 -306 248 993 -121 -430 -209 -147 420 43 957 -89 739 255 574 -631 676 -596 -615 688
3815F88l00p75M63O2j22L52n50p3R73j025l19J364o72N06n66m97L8O01k27o61
3835g40Q00k78N93j260J096P9r20Q6J477p47L60j272J351r80K43J1Q1m01j30Q16
3855B65l99K46k2J97j032M92R36o28m46Q17o21k36M50q8k99k91P57O3m82M26O08
3876G13l36j155K46N05k91J187j072j56P86j81J268j749M1K40p94R37j53k86n84
3895h34R71P31n66l05M04k69J404k279R56N6p04O79p1J565l035Q48P12n46q14
3914a097K58m13M17k03J975m31j462J197K64l21m59J184j798R19n85O27J72n53
3932c09O62k40n36L93K62R69j787P00R72r35l14K98R93j457o0o56L71J315j85
3951D56q10J05M63m91M23L84o01l56n60J686p26O0n5K11r68J011j070L52j01J183
$$ plain form
3815 688 388 -387 76 138 16 368 -182 -255 718 -307 -626 738 66 572 6 -491 -453 148 -79 -740
3835 -740 60 -218 375 -885 211 290 -630 -544 933 186 546 -726 625 -355 -112 -101 -20 -421 -551 265
3855 265 -134 112 90 287 -745 -253 683 55 -391 426 -195 -431 19 -69 -368 -659 98 161 -321 105 713
3876 713 377 -778 -532 -27 -318 869 -203 -359 427 246 1514 -235 -194 46 -748 189 36 -250 -834
3895 -834 137 868 302 -3 401 132 1536 -743 213 269 -435 244 173 1738 -1297 -449 263 -283 -1097
3914 -1097 -839 -1252 -835 -1038 937 506 -956 241 505 184 -275 909 -889 30 -555 72 244 -309
3932 -309 353 113 -423 -30 232 1201 -586 114 1086 151 -163 135 1128 -329 -389 -1045 -674 641 456
3951 456 -354 -249 214 -277 146 530 -71 -427 -987 699 -27 33 -22 189 -779 232 -838 -486 -587 596
3971E96q87J25r7J47K39M34k53j36L13m13J54M5j97L50O47j167M17k71p97R91
3991B40Q2j75L84j005P5R2R90m66l20m59J271j48o60L52M02o93O5J7R4j52J85
4012A71j1j57k86k7k27K9K73M52J68M52l44r07J159n42m65l90M93o04O11l6J79
4033iN57N9r6j18K21p08m50N63k32O25R69j890j05P21j39o72Q60l08L75J68q55
4054d64m99J384K47N65m28r84M76p11L1m84L09K2p33J210J137j262j95M05l33
4073c07R41l83l03k77J127n83j725J118O46k24J291L55j023P54j940P19k39M11
4091C58m09M24l01k33O7L59j394J622q25M13k61P13j7j129L86N42n91K41J058
4110A023j616P70j91R31j354J21k12m1M48P9N75N7n79l63k37P99J1r9L01k89J30
$$ plain form
3971 596 -291 -166 -263 -116 123 557 304 168 481 68 222 267 70 420 1067 -100 317 46 -751 240
3991 240 322 147 531 -474 -399 -307 683 217 -103 -562 709 561 -99 253 655 -38 27 44 138 -14 171
4012 171 160 3 -283 -310 -537 -508 -235 217 385 837 493 -414 745 203 -262 -652 -159 -763 -152 -188 -9
4033 -9 548 607 511 393 614 -94 -544 19 -213 412 1381 -509 -614 107 -32 -704 156 -152 223 391 -464
4054 -464 -963 421 668 1233 805 -179 297 -414 -383 -867 -558 -536 -1269 -59 1078 -184 -379 26 -307
4073 -307 634 251 -52 -329 798 215 -1510 -392 254 30 1321 1676 653 1407 -533 186 -53 358
4091 358 -51 373 72 -161 -94 265 -1129 493 -332 81 -180 533 516 -613 -227 315 -276 -35 1023
4110 1023 -593 177 -14 917 -437 -316 -528 -569 -121 -42 533 590 11 -352 -589 210 221 122 423 134 264
4131B64q67J071n87R96j008J0n38M06q88M03J203K46k57l2J98o40M2J27l64r81
4151a196J979o00j517J934m77N05K31j398L58L03J099k535O43P37j60l01l26R0
4169f31J466j177P36j03j302J413q90N8L46K50J90n79J011m26M07K21j703M07
4187c06N53l39O23n46L05q6j281K092j184N51n28N91j312M49J311j196J155j021
4205a69Q83m53O7k17p92O99m94p36O98M56O82k43O79j540L24J12l21k5O25M0O56
4226I31o71l25P18m20j30l9O98j563l29J593n36L48m51q07M07J49O67m48J80K54
4246B26p30O04k20l02k06k06K16N19K43n2m98J90k66J014m66k51J41k46L14k23
4266a99J519p08n28N56l97J99q61J52p26P78k13l2l53J229K2m83N20j004N07o80
$$ plain form
4131 264 -603 468 -119 877 -131 -121 -659 -253 -1141 -738 465 711 454 422 620 -20 22 149 -215 -1196
4151 -1196 783 183 -1334 600 123 628 859 -539 -181 122 1221 -1314 -671 66 -94 -395 -721 -631
4169 -631 835 -342 394 291 -1011 402 -488 -430 -84 166 356 -223 788 362 769 990 -713 -306
4187 -306 247 -92 531 -15 290 204 -1077 1015 -169 382 -146 445 -867 -418 893 -303 852 -169
4205 -169 714 261 328 111 -681 18 -476 -1212 -514 -58 624 381 1060 -480 -156 -44 -365 -390 235 275 931
4226 931 260 -65 653 233 103 64 762 -801 -1130 463 -73 275 -176 -983 -576 -427 240 -208 -28 226
4246 226 -504 100 -120 -422 -628 -834 -618 -99 144 92 -406 -216 -482 532 66 -185 -44 -290 24 -199
4266 -199 1320 612 84 640 243 442 -419 -267 -993 -215 -428 -460 -813 416 438 -45 475 -529 -22 -702
4286g02Q70q96J75Q87M48m40k95n31J234k57l40l00J34M81m78K09n14R4J647q25
4306F01r50J119j352n28K187j496J010q93Q53n02l6j63R41p61q25O28J27q39O10
4325b69O68k01m13J084r61N99j104j64J623j593P69Q0J123j591J393j263N45L89
4343G14p25p92M71O65K96r12o98R21j62N21m25K40k97L31m70O6J93M53n19l13
4363d42M69M20M06m05p76M44J11o43N72L1m01N07p6M57q9K15j408J6M46j262J778
4384C70n19N73o68j72O94m64M03J43l83n4j343K087q22q74K61M6K15j78L21J331
4404I67j060j062R28K08P31j83l3L1m94J070l52j360O73K28l13J458o90j091p7
4423d21J8J04o06J747o14j292J330J28r9j89o79P6R39q21O8O0j30J236o86O21
$$ plain form
4286 -702 168 -728 -553 334 782 342 47 -484 750 493 153 -147 -13 468 -10 199 -315 -221 1426 601
4306 601 -349 770 -582 -1110 1077 -419 591 -302 551 49 13 -150 791 30 -795 -167 -40 -879 -269
4325 -269 399 198 -215 869 -92 507 -597 -761 862 -731 38 118 1241 -350 1043 -220 325 714
4343 714 -11 -803 -332 333 629 -283 -981 -60 -222 299 -126 114 -183 148 -322 -256 -63 390 -129 -442
4363 -442 27 447 853 448 -328 116 227 -416 156 187 -214 293 217 674 585 800 -608 -592 -146 -1408 370
4384 370 -149 424 -244 -416 278 -186 217 360 -23 -77 -1420 667 -155 -1029 -768 -722 -507 -685 -364 967
4404 967 -93 -1155 -227 -19 712 529 496 527 33 1103 751 -609 64 292 -21 1437 747 -344 -421
4423 -421 -403 -299 -905 842 228 -1064 266 394 295 106 -573 -497 442 -379 -311 -251 -381 855 169 790
4443G90r23K8M98l15J085j841j034J348N5m44q7J052o7m40o0K77N06p68R62r42
4463c20O12m17J12l02L37k75m22K05Q62n51L99r19J488l32l85q31M09L98n09J225
4483G84j701P55P80r51Q35k41K98l51p40J133m92M15r02Q62n96R56o5n79l24M64
4503C40Q71p42M25j404P92j58M25r62M78Q34l71Q9r6p11K38k88K12k64M76m14
4523b30n52%J224p53l22M42Q77l10k67l77O11l83m16K74J55J68R49r41j194J016
4543b9N8J34j057J297o37K30j5j059J443k45J83m67j91n65Q28j529K360l13k72
4562A54O8j179K9J696j125J028j151O94j52l40K02j3q2J709j982L83J27O56j058
4581c36n04J565n51L22m02P15j211J67L64l8r23K72L0J180j509O39n41Q54J50
$$ plain form
4443 790 -133 -105 393 78 1163 -678 -1712 -364 -309 -753 -840 212 145 -295 -355 -78 428 -340 622 -320
4463 -320 292 -125 -13 -315 22 -253 -675 -470 392 -159 240 -679 809 477 92 -739 -330 68 -441 784
4483 784 -917 -162 618 -333 502 261 559 208 -532 601 109 524 -378 484 -112 844 779 200 -124 340
4503 340 1211 469 894 -510 282 124 549 -413 65 899 528 617 521 -190 48 -240 -28 -292 184 -230
4523 -230 -782 -782 442 -311 -633 -191 686 376 109 -268 343 -40 -456 -182 -27 141 1090 149 -1045 -29
4543 -29 29 163 -894 403 -234 -4 -19 -1078 365 120 303 -164 -355 -920 -92 -1621 739 426 154
4562 154 222 -957 -928 768 -357 671 -480 214 62 -278 -76 -89 -171 1538 -444 -61 66 722 -336
4581 -336 -840 725 174 496 94 809 -402 -235 129 91 -832 -560 -530 650 -859 -220 -761 93 243
4600B43L02m15m27j88J36M4K92N19j090L6N84l61N40j42J6K79n81J092l8p1m71
4621B99r67Q35p49J082k40k26j223J927k20k52M8j277J606o21m62O81r37Q73j385
4640a208P1J594m76K84M8n6j88j79k40l11M8P01J42m86l07N50l35O79p02K12R64
4661H05k83J41j557Q27L9N29j041J329j094J118j060L21K90j16K74k80l85M59
4679C16P16j629J697j077K62K67l09p54J207m17k90j50q51P20N85n91O87K38o55
4698b8j84P08R53o87j544J75P34m58m40J775j105K03J133j250n97Q00p3k15O30
4717E30P1r64M81l28K34O78m68L99q28j02o4O83J12m34m50j31J210j959J306q88
4737i12J080N8l1Q21n37j71p22R45p41Q7J48q83N89n6K65O00j74j017M12L89M39
$$ plain form
4600 243 545 130 -297 -485 -349 -305 -13 506 -584 -548 36 -325 215 73 89 368 -213 879 841 770 299
4621 299 -668 167 -582 500 260 34 -1189 738 518 266 314 -963 643 22 -440 241 -696 177 -1208
4640 -1208 -1137 457 -19 265 313 257 69 -110 -350 -661 -613 88 230 -256 -563 -13 -348 331 -371 -159 805
4661 805 522 663 -894 -67 -28 501 -540 789 -305 813 -247 74 364 248 522 242 -143 316
4679 316 1032 -597 1100 23 285 552 243 -511 696 279 -11 -161 -1012 -292 293 -298 389 627 -28
4698 -28 -212 496 1449 762 -782 -607 127 -331 -771 1004 -101 102 1235 -15 -612 188 115 -100 530
4717 530 601 -363 118 -210 24 702 234 633 -195 -297 -361 322 434 0 -450 -581 629 -1330 -24 -912
4737 -912 168 226 195 1016 479 308 -414 531 -210 -123 25 -858 -269 -325 -60 540 366 -651 -239 150 589
4758E89q97J211m66R35j594R36q56L22K73n09O89q50J97r50O41K51p05Q72r02
4777h13J221l05p33K32J105j171j25P63O06j063M67n8o10J225j577J560Jj587
4795h62N40J61k6J114l19K73j02p65j26R85o04m47M18J00l07n04O69N21j444J949
4815A224j016j167J80J709j291K8O56M56r48m3k07p1P76n14m96N58n49J059n21
4834a77P2J71q5K18R1n66R34l43j5m06J181j490M78L97j443J37J89J578m35p56
4854b70O84J47j863P95R1M52m79L0P70j63j1n06k18M52L46n07M94P1K24r39N37
4875A37N29q50l05J93Q9L50m45l97J465j358j20O40r60O07O15n3p01m37N83J90
4895b28j601K202q74R72l03p78L39O58r30O79j31Kp94R24J00j037J133n94m2j75
$$ plain form
4758 589 -308 903 437 1372 -222 714 -142 180 453 -56 633 -217 -20 -970 -329 -78 -783 89 -813
4777 -813 408 103 -630 -398 707 -464 -589 174 780 -283 184 126 -484 741 -836 724 725 -862
4795 -862 -322 -161 -187 927 608 881 779 14 -112 873 269 -178 240 340 33 -471 198 719 -725 1224
4815 1224 208 -959 -779 930 -361 -333 323 779 -169 -212 -419 -490 286 -228 -724 -166 -715 344 -177
4834 -177 -105 66 -19 199 290 -276 658 315 300 -106 1075 -415 63 460 -983 -846 -657 921 486 -270
4854 -270 414 561 -1302 -507 -416 36 -443 -413 357 194 183 -323 -541 -89 257 -250 244 315 539 -400 137
4875 137 666 -184 -489 -296 -207 143 -302 -699 766 -592 -712 -72 -1032 -425 190 137 -564 -1001 -418 -228
4895 -228 -1829 373 -501 471 168 -610 -271 387 -543 136 5 7 -787 137 237 -800 333 -261 -303 -478
4915d78N80L58j69m41O08n96M26K24l88q72M68O89o40M79r59n9K056j235n16O5
4935d00J167m17j271J299l68J68j181K368q99r37J141l79r28J441j381N18K48
4952A89q3l73M82j062R34J760j757L93M80j889P16L40n00L63k70J136j664J759
4970I54j465n87Q36l85J769j402n93J342L15p39K3M22p19j52k85K74R13j112N43
4989d8L2M74j689J741j646J653k81o37k71R2P89n3J23m08L05m71L55l83j44Q98
5009D31K43r53J36J68k73M00R82j17j570N44O64J72q50o13N81L04K3P28j088n8
5029a46k60P08J34L67L23n10j187l11J50Q77J4q1m02J142q87k44Q00l07k56L78
5049C02p20O84L61j8q18L5M24k39J45m01J24q89J316k61m22J047o32L96l25p40
$$ plain form
4915 -478 102 460 291 -150 458 -138 288 512 124 -748 -280 409 -231 248 -711 -770 1286 51 -465 -400
4935 -400 767 350 -921 378 10 178 -1003 1365 466 -471 670 291 -637 804 -577 -59 189
4952 189 106 -267 215 -847 87 1847 90 483 963 -926 -210 130 -370 -7 -277 859 -805 954
4970 954 -511 -1098 -262 -647 1122 -280 -873 469 784 45 68 490 -229 -381 -666 -392 521 -591 -48
4989 -48 -16 458 -1231 510 -1136 517 236 -401 -672 -580 209 156 279 -129 176 -295 60 -323 -467 431
5009 431 674 -279 -143 25 -248 152 1134 1017 -553 -9 655 827 -23 -636 -55 249 272 1000 -88 -146
5029 -146 -406 302 436 803 1126 616 -571 -882 -732 145 159 78 -324 818 -69 -313 487 180 -76 302
5049 302 -418 266 627 609 -209 -174 250 11 156 -245 -121 -1010 306 45 -377 670 38 434 109 -631
5069f31J769j071q34R05L77q55M83k68K8O76p78J811k323N57N5n67k16N74j35
5088d43J296o49j353J043L66K50j33m02j32K16J042j414P43j80n76Q53K18j42
5106F03j120Q09r84J028k88o74J376q44K28O56k72m95P58j678J174j382J820n72
5124A43J83k78n07J433j133J8N28r6Q59o59j073P3P19M8L46p53n09k22l21M00
5144h01N44R78j643M90Q4o0P20km82K93o49k37P77N6J41l34M5N13k66J62j48j604
5166a423J449M85j086L07N77n85J71M93k89L81j7m77k54J008N5o58M0k09Q0M82
5186E30p73N25m06k86R2n73l25J630l13m95L6J075r43m01N67K30K15p73K23L46
5206A81k2P9L09K42r36L87N05n83k04M66k92K63l97L01M69j187Q69J19j94M01
$$ plain form
5069 -631 1138 67 -767 138 515 -340 143 -125 -97 579 -199 1612 -711 -154 -99 -666 -882 -308 -443
5088 -443 853 204 -1149 -106 260 510 377 -25 -157 59 1101 -313 430 250 -326 527 745 603
5106 603 -517 292 -692 336 48 -626 750 -94 134 790 518 23 781 -897 277 -1105 715 143
5124 143 326 48 -459 974 -159 -141 387 291 1150 491 -582 -509 210 258 604 -149 -658 -880 -1201 -801
5144 -801 -257 721 -922 -432 -348 -408 312 310 -172 121 -528 -765 12 68 209 -125 -80 433 167 329 181 -1423
5166 -1423 26 511 -575 -268 309 -276 -105 388 99 480 463 -14 -268 740 795 137 177 -32 48 530
5186 530 -243 282 -124 -410 -318 -891 -1216 414 101 -394 -358 717 -226 -627 -60 170 385 -388 -165 181
5206 181 159 238 547 789 -147 240 745 162 -42 424 132 395 -2 299 768 -419 450 569 375 776
5226G76l85q13O05p88J190k99L51r53K29j90l82J02J609m79k64j270M76K52K96
5245F3M78l98l78Q26j180P06m06L00k42K34O94M01j331q4O9J296r55p87J051j087
5265g30Q20O2P05r37k72O12p69J30L4K55Q42o32q01k3Q73m69R00k34m78J87j79
5286a04M92n96J56o88O94J61K90n18M48n43N94j590J497l07J48j303Q71J86Q12
5305G00M6p34J102j002N23r96M29o14j12j15P00j31m59P4P28o83L87l92J174q74
$$ plain form
5226 776 391 -422 183 -605 585 286 637 -316 -87 -277 -659 -557 1052 573 309 -961 -485 -233 63
5245 63 541 143 -235 591 -589 117 -289 11 -231 3 697 1098 -233 -317 -248 1048 93 -694 357 -730
5265 -730 90 152 857 -80 -352 260 -509 -379 -345 -90 752 120 -681 -704 169 -300 600 366 -112 75 -104
5286 -104 388 -208 -52 -740 -46 115 405 -113 335 -208 386 -1204 293 -14 134 -1169 -298 -112 700
5305 700 746 12 1114 112 635 -361 68 -546 -658 -773 -73 -204 -663 -589 139 -544 -157 -549 625 -249
$$ [...]
8191F5
##END NTUPLES=NMR FID
##END=
