##TITLE=1H_KYU-15
 CDCl3, 108 sc, 
 15.1.2019
##JCAMPDX= 6.0         $$ Bruker NMR JCAMP-DX V2.0
##DATA TYPE= NMR FID
##DATA CLASS= NTUPLES
##ORIGIN= UXNMR, Bruker Analytische Messtechnik GmbH
##OWNER= root
$$ XWIN-NMR		Version 3.5
$$ Tue Jan 15 15:44:51 2019 Russian Standard Time (UT+4h)  she@DPX200
##.OBSERVE FREQUENCY= 200.115
##.OBSERVE NUCLEUS= ^1H
##.DELAY= (6, 6)
##.ACQUISITION MODE= SIMULTANEOUS
##.ACQUISITION SCHEME= undefined
##.AVERAGES= 108
##.DIGITISER RES= 16
##SPECTROMETER/DATA SYSTEM= spect
##.PULSE SEQUENCE= zg30
##.SOLVENT NAME= CDCl3
##.SHIFT REFERENCE= (INTERNAL, CDCl3, 0, 15.7039)
##AUDIT TRAIL= $$ (NUMBER, WHEN, WHO, WHERE, WHAT)
$$ ##TITLE= Audit trail, XWIN-NMR		Version 3.5
$$ ##JCAMPDX= 5.01
$$ ##ORIGIN= Bruker BioSpin GmbH
$$ ##OWNER= she
$$ F:/spectra/data/she/nmr/H-F/1/audita.txt
$$ ##AUDIT TRAIL=  $$ (NUMBER, WHEN, WHO, WHERE, WHAT)
(   1,<2019-01-15 15:43:29.31 +0400>,<she>,<DPX200>,
      <continue with go, POWCHK disabled, PULCHK disabled
       configuration hash MD5:
       00 E9 B6 7A A2 85 ED C7 34 08 36 98 17 FE 4E 26
       data hash MD5: 16K
       49 39 82 B8 61 2C 9D E2 47 A9 18 FE 01 15 87 9C>)
$$ ##END=
$$ 
$$ hash MD5
$$ 27 AE 1B 4C B5 7C C9 6D 8C C7 A2 9B E9 66 80 7D
##$RELAX= 
##$RELAX= 
##$RELAX= 
##$RELAX= 
##$RELAX= 
##$RELAX= 
$$ Bruker specific parameters
$$ --------------------------
##$DU= <F:/spectra>
##$EXPNO= 1
##$NAME= <H-F>
##$PROCNO= 1
##$TYPE= <nmr>
##$USER= <she>
##$AMP= (0..31)
100 100 100 100 100 100 100 100 100 100 100 100 100 100 100 100 100 100 
100 100 100 100 100 100 100 100 100 100 100 100 100 100 
##$AQSEQ= 0
##$AQ_mod= 1
##$AUNM= <au_zg>
##$AUTOPOS= <>
##$BF1= 200.13
##$BF2= 200.13
##$BF3= 200.13
##$BF4= 200.13
##$BF5= 200.13
##$BF6= 200.13
##$BF7= 200.13
##$BF8= 200.13
##$BYTORDA= 1
##$CFDGTYP= 0
##$CFRGTYP= 5
##$CHEMSTR= <none>
##$CNST= (0..31)
1 1 145 1 1 1 1 1 1 1 1 1 1 1 1 1 1 1 1 1 1 1 1 1 1 1 1 1 1 1 1 1 
##$CPDPRG= <>
##$CPDPRG1= <>
##$CPDPRG2= <>
##$CPDPRG3= <>
##$CPDPRG4= <mlev>
##$CPDPRG5= <mlev>
##$CPDPRG6= <mlev>
##$CPDPRG7= <mlev>
##$CPDPRG8= <mlev>
##$CPDPRGB= <>
##$CPDPRGT= <>
##$D= (0..31)
0 1.2 0 0 0 0 0 0 0 0 0 0.03 0 0 0 0 0 0 0 0 0 0 0 0 0 0 0 0 0 0 0 0 
##$DATE= 1547552404
##$DBL= (0..7)
120 120 120 120 120 120 120 120 
##$DBP= (0..7)
150 150 150 150 150 150 150 150 
##$DBP07= 0
##$DBPNAM0= <>
##$DBPNAM1= <>
##$DBPNAM2= <>
##$DBPNAM3= <>
##$DBPNAM4= <>
##$DBPNAM5= <>
##$DBPNAM6= <>
##$DBPNAM7= <>
##$DBPOAL= (0..7)
0.5 0.5 0.5 0.5 0.5 0.5 0.5 0.5 
##$DBPOFFS= (0..7)
0 0 0 0 0 0 0 0 
##$DE= 6
##$DECBNUC= <off>
##$DECIM= 3
##$DECNUC= <off>
##$DECSTAT= 4
##$DIGMOD= 1
##$DIGTYP= 9
##$DL= (0..7)
0 120 120 120 120 120 120 120 
##$DP= (0..7)
150 150 150 150 150 150 150 150 
##$DP07= 0
##$DPNAME0= <>
##$DPNAME1= <>
##$DPNAME2= <>
##$DPNAME3= <>
##$DPNAME4= <>
##$DPNAME5= <>
##$DPNAME6= <>
##$DPNAME7= <>
##$DPOAL= (0..7)
0.5 0.5 0.5 0.5 0.5 0.5 0.5 0.5 
##$DPOFFS= (0..7)
0 0 0 0 0 0 0 0 
##$DQDMODE= 0
##$DR= 16
##$DS= 0
##$DSLIST= <SSSSSSSSSSSSSSS>
##$DSPFIRM= 0
$$ [...]
##$SUBNAM2= <"">
##$SUBNAM3= <"">
##$SUBNAM4= <"">
##$SUBNAM5= <"">
##$SUBNAM6= <"">
##$SUBNAM7= <"">
##$SUBNAM8= <"">
##$SUBNAM9= <"">
##$SW= 210.849225830169
##$SWIBOX= (0..15)
0 0 2 0 0 0 0 0 0 0 0 0 0 0 0 0 
##$SW_h= 42194.0928270042
##$TD= 16384
##$TD0= 1
##$TE= 0
##$TE2= 300
##$TE3= 300
##$TEG= 300
##$TL= (0..7)
0 120 120 120 120 120 120 120 
##$TP= (0..7)
150 150 150 150 150 150 150 150 
##$TP07= 0
##$TPNAME0= <>
##$TPNAME1= <>
##$TPNAME2= <>
##$TPNAME3= <>
##$TPNAME4= <>
##$TPNAME5= <>
##$TPNAME6= <>
##$TPNAME7= <>
##$TPOAL= (0..7)
0.5 0.5 0.5 0.5 0.5 0.5 0.5 0.5 
##$TPOFFS= (0..7)
0 0 0 0 0 0 0 0 
##$TUNHIN= 0
##$TUNHOUT= 0
##$TUNXOUT= 0
##$USERA1= <user>
##$USERA2= <user>
##$USERA3= <user>
##$USERA4= <user>
##$USERA5= <user>
##$V9= 5
##$VALIST= <valist>
##$VCLIST= <CCCCCCCCCCCCCCC>
##$VD= 0
##$VDLIST= <DDDDDDDDDDDDDDD>
##$VPLIST= <PPPPPPPPPPPPPPP>
##$VTLIST= <TTTTTTTTTTTTTTT>
##$WBST= 1024
##$WBSW= 4
##$XGAIN= (0..3)
0 0 0 0 
##$XL= 0
##$YL= 0
##$YMAX_a= 616513
##$YMIN_a= -625495
##$ZGOPTNS= <>
##$ZL1= 120
##$ZL2= 120
##$ZL3= 120
##$ZL4= 120
##$ABSF1= 10
##$ABSF2= 0
##$ABSG= 5
##$ABSL= 3
##$ALPHA= 0
##$AQORDER= 0
##$ASSFAC= 0
##$ASSFACI= 0
##$ASSFACX= 0
##$ASSWID= 0
##$AUNMP= <proc_1d>
##$AZFE= 0.1
##$AZFW= 0.1
##$BCFW= 1
##$BC_mod= 2
##$BYTORDP= 1
##$COROFFS= 0
##$CY= 11.3945322036743
##$DATMOD= 1
##$DC= 2
##$DFILT= <>
##$DTYPP= 0
##$F1P= 18.9103706918063
##$F2P= -1.10871071338519
##$FCOR= 0.5
##$FTSIZE= 0
##$FT_mod= 4
##$GAMMA= 1
##$GB= 0.15
##$INTBC= 1
##$INTSCL= 1
##$ISEN= 128
##$LB= 0.24
##$LEV0= 0
##$LPBIN= 0
##$MAXI= 10000
##$MC2= 0
##$MEAN= 0
##$ME_mod= 0
##$MI= 1.114404
##$NCOEF= 0
##$NC_proc= 0
##$NLEV= 6
##$NOISF1= 3.799351
##$NOISF2= 2.8
##$NSP= 1
##$NTH_PI= 0
##$NZP= 0
##$OFFSET= 15.70392
##$PC= 1
##$PHC0= -8991.578
##$PHC1= 52.60005
##$PH_mod= 1
##$PKNL= yes
##$PPARMOD= 0
##$PSCAL= 0
##$PSIGN= 0
##$REVERSE= no
##$SF= 200.130013532006
##$SI= 65536
##$SIGF1= 3
##$SIGF2= 2
##$SINO= 400
##$SIOLD= 65536
##$SREGLST= <1H.CDCl3>
##$SSB= 0
##$STSI= 0
##$STSR= 0
##$SW_p= 3612.71676300578
##$SYMM= 0
##$S_DEV= 0
##$TDeff= 0
##$TDoff= 0
##$TI= <>
##$TILT= no
##$TM1= 0
##$TM2= 0
##$TOPLEV= 0
##$USERP1= <user>
##$USERP2= <user>
##$USERP3= <user>
##$USERP4= <user>
##$USERP5= <user>
##$WDW= 1
##$XDIM= 8192
##$YMAX_p= 0
##$YMIN_p= 0
$$ End of Bruker specific parameters
$$ ---------------------------------
##NTUPLES= NMR FID
##VAR_NAME=  TIME,          FID/REAL,        FID/IMAG
##SYMBOL=    X,             R,               I
##VAR_TYPE=  INDEPENDENT,   DEPENDENT,       DEPENDENT
##VAR_FORM=  AFFN,          ASDF,            ASDF
##VAR_DIM=   8192,          8192,            8192
##UNITS=     SECONDS,       ARBITRARY UNITS, ARBITRARY UNITS
##FACTOR=    2.37e-05,      1,               1
##FIRST=     0,             0,               0
##LAST=      0.1941267,     0,               0
##MIN=       0,             -625495,         0
##MAX=       0.1941267,     616513,          0
$$ Real data points
##PAGE= N=1
##DATA TABLE= (X++(R..R)), XYDATA
$$ [...]
$$ plain form
3273 -438 1097 -1320 833 414 -1086 1107 -1225 -379 684 -685 899 -1054 207 302 -909 1227
3289 1227 -1409 -456 1692 -1204 1117 1041 -868 2096 -1884 344 1230 -1669 1553 309 -587 672
3305 672 -981 1570 -196 -622 499 -613 97 187 -385 807 -906 1509 -429 -520 1401 -1196 794
3322 794 -31 -1226 1461 -902 -231 1732 -2068 1420 -406 -177 1538 -1473 -224 176 -1135 1163
3338 1163 -1094 338 789 -1324 1250 -1174 769 -191 -890 255 -365 544 982 -1606 1126 -292
3354 -292 -777 800 -1474 1111 561 -1668 1382 -1126 524 806 -2063 1741 -133 -972 1020 -469
3370 -469 96 -189 -531 825 -612 1029 -445 -104 404 -956 302 90 -1319 1598 -1281 673 1051
3387 1051 -1189 787 -584 -578 1630 -1603 449 671 -1528 1463 -1000 981 576 -1211 558 -238
$$ packed form
3273d38J535k417K153m19j500K193k332Q46J063j369J584j953J261R5j211K136
3289A227k636R53K148k896K321p6j909K964l980K228Q86k899L222j244q96J259
3305F72j653K551j766m26J121j112P10R0n72J192j713K415j938r1J921k597J990
3322G94q25j195K687k363O71J963l800L488j826K29J715l011J249M00j311K298
3338A163k257J432M51k113K574k424J943r60o99J145o20R09M38k588K732j418
3354b92m85J577k274K585n50k229L050k508J650K82k869L804j874q39J992j489
3370d69N65k85l42J356j437J641j474L41N08j360J258k12j409K917k879J954L78
3387A051k240J976j371OK208l233K052K22k199K991k463J981m05j787J769p96
$$ plain form
3403 -238 -435 1329 -1093 108 -226 120 -282 -1312 626 -979 1288 792 -1876 1200 128 -1420
3419 -1420 1755 -1624 351 1290 -1945 1146 -1202 -397 1758 -2097 1166 -708 -1217 849 -1019 407
3435 407 518 -423 1196 72 395 346 -152 817 -291 1025 -490 -310 1041 -1502 731 728 -1846 1724
3453 1724 -281 -1071 1522 -1138 -54 751 -1856 1176 -141 -270 694 -801 243 403 -1019 480
3469 480 -77 393 414 -474 -72 -1050 1190 -626 -305 997 -1353 1037 116 -1167 1701 -1396 113
3486 113 1401 -2445 1578 -630 -859 971 -1197 361 128 -1313 1003 -670 563 408 -1070 1016
3502 1016 -83 468 -9 -943 656 -667 459 504 -1766 1446 -1476 -285 660 -1139 1261 -283
3518 -283 -827 1345 -1281 -78 668 -1633 557 -626 436 1111 -1503 1098 -171 -1122 157 -897
$$ packed form
3403b38j97J764k422J201l34L46m02j030J938j605K267m96k668L076j072j548
3419a420L175l379J975R39l235L091k348Q05K155l855L263j874n09K066j868J426
3435D07J11r41J619j124L23m9m98R69j108J316j515J80J351k543K233lk574L570
3453A724k005p90K593k660J084Q05k607L032j317j29R64j495J044J60j422J499
3469D80n57M70K1q88M02r78K240j816L21J302k350K390r21j283K868l097J509
3486A13J288l846M023k208k29J830k168J558k33j441K316j673J233j55j478K086
3502A016j099N51m77r34J599j323J126M5k270L212k922J191R45j799K400j544
3518b83n44K172k626J203P46k301K190j183J062O75k614K601j269r51J279j054
$$ plain form
3534 -897 663 -611 700 593 -849 555 -652 -633 1089 -809 1240 290 -2097 1648 -1158 140
3550 140 1532 -1802 843 210 -1000 971 -1857 136 732 -1437 469 -51 -317 888 -259 307
3566 307 19 3 -172 16 11 -882 899 298 -554 1550 -404 -428 1540 -1568 1623 138 -1678 2466
3584 2466 -1401 -2 1143 -1595 1158 370 -886 1066 -756 -366 1059 -916 -74 -36 -277 209 291
3601 291 -502 37 758 -870 -262 955 -1916 487 268 -1484 1683 -687 -414 762 -1336 2166 209
3618 209 -1508 2162 -1221 625 377 -1470 1452 92 -714 906 -434 -129 -213 -405 -2 -136 1151
3635 1151 -195 55 394 -873 1774 -958 -445 1435 -1973 342 196 -899 2003 -763 745 850
3651 850 -827 348 -211 -986 662 -691 -262 714 -884 327 -414 33 -836 -449 269 -406 367 -548
$$ packed form
3534h97J560j274J311j07j442J404j207J9J722j898K049r50k387L745k806J298
3550A40J392l334K645o33j210J971k828J993N96k169J906n20k66J205j147N66
3566C07k88j6j75J88nq93J781o01q52K104j954k4J968l108L191j485j816M144
3584B466l867J399J145k738K753p88j256J952j822L90J425j975Q42L8k41M86Q2
3601B91p93N39P21j628O08J217k871K403k19j752L167k370K73J176k098L502j957
3618B09j717L670l383J846k48j847K922j360q06J620j340L05q4j92M03j34J287
3635A151j346K50L39j267K647k732N13J880l408K315j46j095K902k766J508J05
3651H50j677J175n59p75J648j353M29R76j598J211p41M47q69L87P18o75P73r15
$$ plain form
3669 -548 -320 1297 -1540 264 485 -1876 1412 -556 -811 1955 -1370 188 893 -1118 1926 -944
3685 -944 -514 1405 -830 502 680 -262 1189 -98 529 -162 -85 623 -231 825 -1322 -445 -169 -1585
3703 -1585 1691 -668 -584 1223 -1439 392 896 -1711 895 -855 -949 1419 -1455 -103 1164 -1701
3719 -1701 1567 -47 -684 1399 -878 1054 166 -397 162 234 177 -721 483 -282 -635 938 -713 335
3737 335 1221 -2112 1107 -483 -1212 1549 -1556 915 978 -1748 1728 -909 -1544 1787 -1548 375
3753 375 1372 -1350 926 -275 -10 -59 -310 -303 -450 386 -860 733 345 -1093 926 -77 -788 1063
3771 1063 -1127 929 1646 -1215 1922 -324 -1454 2172 -1542 754 439 -1686 672 -638 -587 232
3787 232 -800 533 -278 79 633 -95 491 -177 357 1027 -780 1481 41 369 1118 -837 1267 -205
$$ packed form
3669e48K28J617k837J804K21k361L288j968k55K766l325J558P05k011L044k870
3685i44M30J919k235J332J78r42J451j287O27o91P7P08q54J056k147Q77K76j416
3703a585L276k359Q4J807k662J831N04k607K606j750r4K368k874J352J267k865
3719a701L268j614o37K083k277J932q88n63N59P2n7q98J204p65l53J573j651J048
3737C35Q86l333L219j590p29K761l105K471O3k726L476k637o35L331l335J923
3753C75R97k722K276j201K65m9k51Pj47Q36j246J593l88j438K019j003p11J851
3771A063k190K056P17k861L137k246j130L626l714K296l15k125K358j310N1Q19
3787B32j032J333q11L57N54p28N86o68N34O70j807K261j440L28P49j955K104j472
$$ plain form
3805 -205 -1195 1609 -1188 396 1402 -1132 678 -110 -1063 1653 -308 -256 697 -939 587 392 52
3822 52 122 260 81 -206 919 -1275 3 1250 -929 876 -67 -1226 2178 -1522 -199 1803 -2282
3839 -2282 345 1115 -1777 2325 -941 -86 689 -1194 -291 612 -721 213 1009 -1360 677 -329 -843
3856 -843 314 -18 -1502 624 -414 -1625 696 -1663 -185 1647 -1839 1725 -201 -1554 1819
3871 1819 -1505 -1 1550 -2623 921 525 -1390 993 -88 -1262 1681 -801 -446 117 -1062 619
3887 619 826 -82 -660 1289 -840 443 1422 -995 1305 238 -1571 2714 -829 -570 1798 -2219
3903 -2219 716 -283 -1854 2094 -1478 -285 1696 -1691 450 278 -677 335 -176 -79 -205 -814 -422
3920 -422 430 -27 -215 313 -82 -705 1420 -633 -270 1459 -1794 1099 423 -1408 1635 -849 -654
$$ packed form
3805b05r90K804k797J584J006k534J810p88r53K716j961N2R53j636J526j95l40
3822E2P0J38j79k87J125k194J278J247k179J805r43j159L404l700J323K002m085
3839b282K627P70k892M102l266Q55P75j883R03R03j333R34P96k369K037j006n14
3856h43J157l32j484K126j038j211K321k359J478J832l486L564j926j353L373
3871A819l324J504J551m173L544l96j915K383j081j174K943k482L55N63j179J681
3887F19K07r08n78J949k129J283R79k417K300j067j809M285l543K59K368m017
3903b219K935r99j571L948l572J193J981l387K141j72r55J012n11R7j26o09L92
3920d22Q52m57j88N28l95o23K125k053L63J729l253K893o76j831L043k484J95
$$ plain form
3937 -654 1546 -1188 977 411 -1391 1679 -95 -499 557 -721 -257 220 224 -64 138 -869 -329 1029
3955 1029 -47 -521 813 -1648 -295 900 -1309 1843 -420 -1276 1948 -1849 -273 1602 -2157
3970 -2157 1056 56 -1263 1591 -202 -539 793 -695 284 994 -572 325 1241 -308 443 1647
3986 1647 -1856 826 129 -1746 2047 -900 -1000 1863 -1566 325 2330 -2478 1810 -212 -1992
4001 -1992 1829 -1625 600 2398 -2259 1080 1279 -1409 1280 482 -442 467 10 -1038 1200 -169
4017 -169 -1196 2359 -1476 -264 1921 -2066 305 1005 -997 1699 -341 -746 1793 -2049 1058 1057
4033 1057 -2600 1994 463 -1299 2053 -1211 180 1788 -1917 171 919 -862 125 390 421 793
4049 793 705 -546 -239 520 -1411 1291 -1247 -1331 1196 -1094 597 1061 -1892 1121 -354 -863 2206
$$ packed form
3937f54K200k734K165n66j802L070j774m04J056j278M64M77Mk88K02j007N40J358
3955A029j076m74J334k461J353J195k209L152k263q56L224l797J576J875l759
3970b157L213j000j319K854j793l37J332j488R79P10j566Q97R16j549P51J204
3986A647l503K682o97j875L793k947j00K863l429J891K005m808M288k022j780
4001a992L821l454K225J798m657L339J99k688K689p98r24R09m57j048K238j369
4017a69j027L555l835J212K185l987K371P00k002K696k040m05K539l842L107j
4033A057l657M594j531j762L352l264J391J608l705K088P48j781R87K65L1L72
4049G93q8j251L07P59j931K702k538q4K527k290J691M64k953L013j475n09L069
$$ plain form
4066 2206 -942 62 1275 -1484 1008 1325 -1242 463 -977 -177 281 52 127 322 191 -612 399
4083 399 -825 -864 1498 -506 -491 1316 -2325 1134 229 -2650 1928 -113 -1255 1260 -1998 453
4099 453 898 -2032 1139 -151 -1068 678 149 -452 551 118 -324 1419 -272 -1306 1502 -1256 -609
4116 -609 1336 -2466 1149 150 -2011 2158 -1470 -840 2965 -2220 685 1483 -3659 1094 315 -1420
4132 -1420 2423 -1657 -1318 1539 -1164 400 705 -1868 1119 885 -1507 533 -162 -1663 1038 -932
4148 -932 -715 2347 -2889 -2 1930 -3007 1756 691 -2800 2665 -836 -1177 2271 -2680 -503 1496
4164 1496 -2685 2101 152 -1266 2025 -1739 -777 1301 -866 -135 1073 -1053 -334 1397 -1312 751
4180 751 307 -1568 1986 -542 -1292 2330 -1009 -16 1237 -2585 1275 1014 -2535 2100 -921 -992 2104
$$ packed form
4066B206l148J004J213k759K492L17k567J705j440Q00M58k29P5J95j31q03J011
4083C99j224l9K362k004J5J807l641L459r05k879M578k041j142K515l258K451
4099D53M45k930L171j290r17J746n29o01J003m33m42J743j691j034K808k758O47
4116f09J945l802L615r99k161M169l628O30L805n185K905P98n142M753p79j735
4132a420L843m080L39K857k703J564L05k573K987k34k392K040o95j501K701j970
4148i32K17L062n236K887J932m937M763j065l491N465l501l41L448m951K177J999
4164A496m181M786j949j418L291l764R62K078k167P31J208k126P19J731k709K063
4180G51m44j875L554k528p50L622l339R93J253l822L860k61l549M635l021p1L096
$$ plain form
4197 2104 -1665 93 1035 -1574 1304 882 -996 566 298 348 645 434 -1129 491 587 -1031 673
4214 673 -551 -479 1723 -1950 577 438 -2239 1162 124 -1748 2073 -1704 -117 1303 -1393 486
4230 486 429 -526 114 336 -1150 447 550 -577 488 412 -1367 1516 133 -784 1916 -1865 942
4247 942 1865 -3096 2113 697 -1965 2829 -1159 -718 2454 -2946 967 2040 -1856 1362 27 -1374
4263 -1374 2006 -25 -994 1409 -904 -356 1635 -2516 190 849 -3678 2011 847 -2027 2491 -1136
4279 -1136 -1614 3119 -2601 -167 2805 -3553 2572 639 -2720 3534 -1217 -683 2799 -2679 532
4294 532 1757 -2979 1553 690 -2606 2242 -271 -1657 2192 -1218 -73 2636 -1633 505 1667
4309 1667 -2853 1547 605 -2671 2462 -952 -1411 3180 -2222 1037 2918 -2790 1490 521 -1486 2367
$$ packed form
4197B104l769J758R42k609K878m22j878J562k68N0K97k11j563J620R6j618J704
4214F73j224P2K202l673K527j39k677L401j038j872L821l777J587J420k696J879
4230D86n7r55O40K22j486J597J03j127J065p6j779K883j383r17K700l781K807
4247I42R23m961N209j416k662M794l988M41L172n400L913J073l896L218j335j401
4263a374L380k031r69K403k313N48J991m151K706O59m527N689j164k874M518l627
4279a136m78M733n720K434K972o358O125j933l359O254m751N34L482n478L211
4294E32J225m736M532q63l296M848k513j386L849l410J145K709m269K138J162
4309A667m520M400r42l276N133l414m59M591n402L259J881n708M280r69k007L853
$$ plain form
4325 2367 -1560 -752 2230 -1516 976 1460 -1440 972 1082 -806 253 435 -1977 142 424 -1122
4341 -1122 2163 -268 -1221 1715 -1698 -580 1838 -1830 1571 733 -2069 2209 -556 -918 1225 -1349
4357 -1349 665 1753 -816 111 724 -1217 -53 207 -1367 312 113 -1169 1090 -336 -652 1369
4373 1369 -644 -790 2268 -2613 954 1405 -2920 2070 -400 -1298 1387 -2104 54 1837 -2457 195
4389 195 1193 -2374 1823 710 -2064 2119 -160 -1137 2083 -909 -959 2451 -2819 15 2085 -3163
4405 -3163 2251 501 -2752 3830 -1472 -1935 3514 -3508 146 1682 -4171 2783 782 -2648 2890
4420 2890 -1869 -1186 2739 -3030 -1 2327 -2973 1142 1490 -2534 2631 292 -2016 3071 -1781
4435 -1781 -338 3061 -2909 923 2793 -3410 2375 986 -3638 3251 -1980 -1106 3772 -3578 524
$$ packed form
4325B367l927Q08K982l746K492M84k900K412J10j888J059J82k412K119K82j546
4341a122L285k431r53K936l413J118K418l668L401q38k802M278k765l62K143k574
4357a349K014J088k569R27O13j941J164K60j574J679j99j282K259j426l16K021
4373A369k013j46L058m881L567M51m325M990k470q98K685l491K158J783m294K652
4389A95R98l567M197j113k774M183k279r77L220k992n0L410n270K834K070n248
4405c163N414j750l253O582n302m63N449p022L654J536n853O954k001l430N538
4420B890m759O83L925n769L029K328n300M115L48m024N165k339k308N087m852
4435a781J443L399n970L832J870o203N785j389m624O889n231Q74M878p350M102
$$ plain form
4450 524 2412 -3622 1454 720 -1970 2345 -988 -531 3218 -1586 -514 1419 -1472 33 698 -2849
4466 -2849 642 203 -1909 2021 -221 -1717 2683 -1418 -694 2725 -2455 1003 853 -2062 2141 -869
4482 -869 -1726 2786 -1505 -545 1377 -739 660 1505 -1879 -219 806 -1011 1237 347 -628 695
4498 695 345 -1971 1604 -183 -1198 1598 -1784 29 2190 -2010 1087 1088 -1936 1839 -1420 -1287
4514 -1287 2204 -1655 -597 1895 -1412 1180 1099 -1366 1445 800 -1714 1384 -249 -1281 2502 -1526
4530 -1526 -915 1949 -2979 427 2521 -3643 2340 709 -2826 3778 -1704 -1255 3496 -3637 1100
4545 1100 2134 -3564 2959 856 -2937 2950 -1069 -1777 3580 -2751 -450 3086 -2957 883 1803
4560 1803 -3743 2598 -206 -2352 5108 -1730 -1215 3823 -3157 799 2963 -4443 3475 609 -4005
$$ packed form
4450E24J888o034N076p34k690M315l333M57L749m804J072J933k891J505O65l547
4466b849L491m39k112L930k242j496M400m101P24L419n180L458j50k915M203l010
4482h69q57M512m291R60J922k116J399Q45l384J660J025j817K248q90r75J323
4498F95l50k316L575j787j015K796l382J813K161m200L097Jl024L775l259J33
4514a287L491l859J058K492l307K592q1k465K811o45k514L098j633j032L783m028
4530a526O11K864m928L406K094o164N983j631l535O604n482M49M751p133M737
4545A100J034n698O523k103l793N887m019p08N357o331K301L536o043L840R20
4560A803n546O341k804k146P460o838N15N038o980L956K164p406P918k866m614
$$ plain form
4575 -4005 4784 -2178 -2107 4795 -3716 1546 2577 -3942 2095 69 -2416 2371 -1320 -1811 2798 -2512
4591 -2512 -1 2184 -2994 433 1663 -2948 2602 685 -3195 3420 -1309 -2099 2912 -3194 -185
4606 -185 1977 -2930 1951 313 -2297 3321 -416 -1212 2677 -1792 0 1340 -2112 874 1279 -2151
4622 -2151 230 198 -1167 596 118 -1550 1666 -132 -1487 2155 -2020 520 1845 -2033 1505 57
4638 57 -2257 1734 400 -1231 1559 -1292 -439 2074 -1879 523 1672 -1076 472 953 -1920 700
4654 700 892 -2260 2138 340 -1908 1683 -1781 -1077 3058 -3120 1543 1557 -3878 3104 -303 -2462
4670 -2462 4007 -2100 -615 3531 -3766 422 1574 -3075 2306 -92 -2645 3191 -1137 -1988 3568
4685 3568 -2743 -1121 3354 -4103 1101 2445 -4164 2683 64 -3782 3894 -1875 -1923 4459 -4376
$$ packed form
4575d005Q789o962P1O902q511N262J031o519O037k026k485M787l691m91M609n310
4591b512K511K185n178L427J230m611N550j917l880O615m729p90N011o106L009
4606a85K162m907M881j638k610N618l737p96L889m469J792J340l452K986M05l430
4622b151K381l2j365J763m78j668L216j798j355L642m175K540J325l878L538j448
4638E7k314L991j334j631K790k851Q53K513l953K402J149k748J548M81k873K620
4654G00J92l152M398j798k248L591l464P04M135o178M663J4n435O982l407k159
4670b462O469o107J485M146p297M188J152m649N381k398k553N836m328q51N556
4685C568o311J622M475p457N204J344o609O847k619l846P676n769m8O382q835
$$ plain form
4700 -4376 848 2459 -4684 4043 620 -3876 4775 -2001 -1571 3587 -3685 910 2600 -4101 2006
4715 2006 923 -3197 3424 -1043 -2744 3411 -2053 -919 3094 -3520 1187 2978 -4110 3191 522
4730 522 -3388 4405 -2332 -1620 3995 -4359 1003 2655 -3706 2782 589 -3375 3540 -2450 -1422
4745 -1422 3485 -2548 -79 2543 -2192 1424 828 -2062 1740 -221 -1807 2478 -885 -1390 2818
4760 2818 -1277 -860 1762 -2380 535 1284 -2361 2023 -610 -1869 2368 -1420 -687 1070 -1010 293
4776 293 1515 -805 181 1185 -1626 1098 -141 -2044 420 -127 -1830 2215 -778 -1904 2869 -2042
4792 -2042 -4 1872 -2885 1690 1058 -3007 3194 -122 -1690 2922 -1527 -398 3158 -3039 299
4807 299 2373 -2960 2302 762 -3166 3141 -736 -2049 3724 -2354 -895 3516 -4470 1634 2609
$$ packed form
4700d376N224J611p143Q727l423m496Q651o776M30N158p272M595J690o701O107
4715B006j083m120O621m467j701O155n464J134M013o614M707J791p088P301k669
4730E22l910P793o737P12N615q354N362J652o361O488k193l964O915n990J028
4745a422M907o033K469K622m735L616n96k890L802j961j586M285l363n05M208
4760B818m095M17K622m142K915P49l645M384k633j259M237l788P33J757k080J303
4776B93J222k320R86J004k811K724j239j903K464n47j703M045k993j126M773m911
4792b042K038J876m757M575o32m065O201l316j568M612m449J129L556o197L338
4807B99K074n333N262j540l928O307l877j313N773o078J459M411p986O104R75
$$ plain form
4822 2609 -3488 3822 -396 -3488 4692 -2087 -2203 4747 -4411 1162 3346 -4755 3352 50 -3337
4837 -3337 5034 -2508 -1695 4969 -3648 -122 2461 -4353 2380 1525 -4187 3595 -739 -3415 4433
4852 4433 -2686 -1332 4138 -4303 2144 2502 -4689 4218 -371 -4253 5110 -3271 -1410 3522 -4448
4867 -4448 1771 1847 -4150 3184 967 -1991 4302 -1691 -1577 3427 -2813 -792 2579 -2762 1050 1489
4883 1489 -3017 2078 621 -2464 3317 -1286 -1207 3814 -2737 603 2718 -4304 1847 711 -2650
4898 -2650 2619 -1041 -378 3161 -1564 406 1851 -1239 1269 590 -1588 1412 121 -1434 1434
4913 1434 864 -1608 1494 -318 -1466 2256 -1223 -81 2210 -2115 102 1016 -2858 1575 100
4928 100 -2281 2877 -1280 -1418 3002 -2249 -650 2358 -2422 919 1372 -2851 1718 468 -2716 2461
$$ packed form
4822B609o097P310m218l092Q180o779j16O950r158N573K184q101Q107l302l387
4837c337Q371p542Q13O664q617L526K583o814O733q55n712P782m334k676P848
4852D433p119J354N470q441O447L58p191Q907m589l882R363q381J861M932p970
4867d448O219P6n997P334k217k958O293n993J14N004o240K021L371n341L812M39
4883A489m506N095j457l085N781m603P9N021o551L340K115p022O151j136l361
4898b650N269l660O63L539m725J970J445l090K508o79k178L000j291j555K868
4913A434n70k472L102j812j148L722l479J142K291m325K217R14l874M433j475
4928A00k381N158m157j38M420n251J599L008m780L341M53m223M569j250l184N177
$$ plain form
4944 2461 -554 -2453 3043 -2042 -541 3113 -3983 1765 891 -3779 4265 -785 -3248 4163 -2453
4959 -2453 -792 3964 -4690 1903 2688 -4532 3866 551 -3730 4007 -1802 -1119 4129 -3412 120
4974 120 3211 -3676 2166 1682 -4971 4176 -302 -3168 4756 -3080 -1239 4227 -4439 1789 2788 -4870
4990 -4870 4503 -1266 -3887 5310 -3324 -593 3890 -4637 1074 2452 -4268 3299 159 -3516 3901
5005 3901 -1740 -1971 4089 -2581 8 3312 -3840 1752 1957 -4461 3315 -1039 -3379 3762 -1684
5020 -1684 -1056 2769 -3915 1415 1983 -4037 2558 -405 -3101 2735 -2117 -1027 2338 -2033 243
5035 243 1284 -2600 1094 728 -1564 1690 323 -1511 2224 -241 -1284 2075 -1012 -21 1779 -2597
5051 -2597 524 1226 -2062 1443 -80 -1806 2126 -736 -1354 2433 -1086 -290 557 -1309 942 974
$$ packed form
4944B461l015j899N496n085J501L654p096N748q74m670Q044n050k463P411o616
4959b453J661M756q654O593P85p220Q398l315m281P737n809O83N248p541L532
4974A20L091o887N842m84o653R147m478k866P924p836J841N466q666O228R99p658
4990d870R373n769k621R197q634K731M483q527N711J378o720P567l140l675P417
5005C901n641k31O060o670K589L304p152N592K05o418P776m354k340P141n446
5020a684O28L825o684N330N68o020O595k963k696N836m852J090L365m371K276
5035B43J041l884L694l66k292L254j367j834L735k465j043L359l087R91J800m376
5051b597L121P02l288L505j523j726L932k862o18L787l519P96Q47j866K251L2
$$ plain form
5067 974 -1583 292 1872 -1686 1007 601 -2395 2766 -867 -1135 3270 -2226 -836 3310 -2837 1899
5083 1899 1581 -3527 3151 -358 -2470 3967 -2671 -665 3308 -3504 1653 1915 -3504 2372 529
5098 529 -3288 2875 -1625 -1695 3885 -3515 -658 3075 -4036 1633 2092 -4670 4485 -641 -2808 5186
5114 5186 -3131 -529 4806 -4949 2389 2351 -4921 3614 -720 -4015 5231 -3103 -1381 4114 -4883
5129 -4883 1977 2840 -4486 2811 -384 -3644 3818 -1242 -2417 4690 -3452 -787 3762 -4530 1500
5144 1500 1927 -4954 4555 -345 -3321 5033 -3158 -1200 3730 -4052 1414 2086 -4556 3621 -51
5159 -51 -2751 3867 -1514 -945 3207 -3029 519 2161 -2529 2069 740 -2325 2291 -1 -1702 2847
5175 2847 -1604 -727 2603 -2592 531 1999 -2220 2049 1154 -1857 2224 -1169 -371 2253 -1238 502
$$ packed form
5067I74k557J875J580l558K693m06k996N161l633k68M405n496J390M146o147M736
5083A899l18n108O678l509k112O437o638K006L973o812N157K62n419N876j843
5098E29l817O163m500p0N580p400K857L733p111N669M59o762R155n126k167P994
5114E186q317K602N335r755P338l8p272Q535m334l295R246q334J722N495q997
5129d883O860Q63p326P297l195l260P462n060j175P107q142K665M549q292O030
5144A500M27o881R509m900k976Q354q191J958M930p782N466O72o642Q177l672
5159e1k700O618n381N69M152o236L548J642m690M598j329l065M616k292j701M549
5175B847m451Q77L330n195L123J468m219M269q95l011M081l393P98K624l491J740
$$ plain form
5191 502 1141 -1565 643 1303 -1162 112 970 -1708 303 340 -964 1676 246 -1689 2450 -1920
5207 -1920 -819 2010 -2024 922 1479 -2809 1486 41 -2836 2713 -838 -1324 2628 -2428 -418
5222 -418 3104 -2152 1848 1582 -3184 2219 351 -2662 3522 -335 -2762 3838 -2839 -290 3544
5237 3544 -4040 2448 1387 -4758 3876 -732 -3265 4762 -3206 -1113 4778 -3826 1379 1750 -4351
5252 -4351 4301 242 -3634 4755 -2810 -1446 3797 -4107 1957 2336 -4815 2453 1260 -4150 4541
5267 4541 -389 -3014 4485 -3057 -899 3956 -5228 2435 1872 -4770 3826 -1016 -2966 5140 -3117
5282 -3117 -614 3866 -3938 1954 2231 -4374 3627 -245 -2849 3773 -2357 -820 3287 -3215 745
5297 745 2087 -3381 1962 662 -3597 3123 -751 -2277 3175 -2311 -654 2954 -3134 1166 2000
$$ packed form
5191E02O39k706K208O60k465J274Q58k678K011L7j304K640j430j935M139m370
5207a920J101K829m034K946N57m288M295j445k877N549l551m86L952n056K010
5222d18L522n256M000k66m766N403j868l013O184l857k427O600o677K549L834
5237C544p584O488j061o145Q634m608k533Q027p968K093N891q604N205L71o101
5252d351Q652m059l876Q389p565J364N243p904O064L79p151P268j193n410Q691
5267D541m930k625P499p542K158M855r184P663n63o642Q596m842j950Q106q257
5282c117K503M480p804N892K77o605Q001l872k604O622o130J537M107o502L960
5297G45J342n468N343j300m259O720l874j526N452n486J657L608o088M300Q34
$$ plain form
5312 2000 -2365 2716 -432 -1992 3085 -1892 -1068 2561 -2003 267 1597 -2316 639 775 -1891
5327 -1891 1031 558 -1557 1078 153 -1174 2091 -963 -877 2189 -1113 498 2211 -2768 819 1111
5343 1111 -2118 1873 207 -2342 2814 -1138 -810 2185 -1239 273 1785 -2196 831 568 -2374
5358 -2374 1959 -186 -2248 2926 -59 -1685 3023 -2715 -561 3852 -3371 1561 1296 -3801 3404
5373 3404 -861 -2918 4933 -3150 -281 3901 -3347 2070 1820 -3614 3549 -533 -3227 4086 -1368
5388 -1368 -1427 4728 -3902 309 2100 -4520 2265 1361 -4022 3767 -1807 -3161 4764 -3553 -1022 4195
5404 4195 -5249 1876 1926 -4952 4302 -836 -2798 4889 -2904 -422 4329 -5041 2086 2611 -4613 3888
5420 3888 188 -3723 4301 -2236 -2153 4603 -3260 152 2745 -3336 1819 1412 -3403 3747 -206 -2813
$$ packed form
5312B000m365N081l148j560N077m977Q24L629m564K270J330l913K955J36k666
5327a891K922m73k115K635r25j327L265l054Q6L066l302J611J713m979L587K92
5343A111l229L991j666k549N156l952L28K995l424J512J512l981L027k63k942
5358b374M333k145k062N174k985j626M708n738K154M413p223M932k65n097P205
5373C404m265k057P851q083K869M182p248N417k50n434P163m082k694P313n454
5388a368n9O155q630M211J791o620O785r04n383P789n574j354P925q317K531N217
5404D195r444P125N0o878R254n138j962P687p793K482M751r370P127N25p224Q501
5420C888l700l911Q024o537Q3O756p863L412K593o081N155m07m815P150l953k607
$$ plain form
5436 -2813 4603 -2351 -371 3725 -3627 1552 1594 -3560 3431 -46 -2889 2855 -1807 -1093 2866 -2445
5452 -2445 -86 1827 -2412 1717 1495 -2033 2060 103 -2051 2607 -1068 -1212 2370 -1970 557
5467 557 1596 -2067 714 806 -2716 1816 193 -1123 2218 -1043 -298 2017 -2013 61 1481 -2212
5483 -2212 -66 1489 -1845 890 478 -2222 2201 -219 -2570 2485 -569 -1301 2912 -2434 327
5498 327 2055 -3834 1922 679 -2982 2946 -1286 -1423 4290 -2102 -79 2911 -3517 1277 1627 -3356
5514 -3356 2569 581 -2921 3918 -2258 -2910 3681 -4029 35 3271 -5078 3386 1169 -3696 5017
5529 5017 -2053 -2481 4604 -3292 539 3604 -5334 2283 1866 -5241 4159 -317 -2833 4739 -2068
5544 -2068 -735 4296 -5003 1964 1745 -4463 2688 -312 -3730 3395 -1601 -2285 3380 -3902 -258
$$ packed form
5436b813P416o954J980M096p352N179M2n154O991l477k843N744m662P14L959n311
5452b445K359J913m239M129k22l528M093j957k154M658l675j44L582m340K527
5467E57J039l663K781R2l522M532j623j316L341l261P45K315m030K074J420l693
5483b212K146J555l334K735m12k700M423k420k351N055l054p32M213n346K761
5498C27J728n889N756j243l661N928m232j37N713o392K023K990o428M794L50m983
5514c356N925j988l502O839o176o52O591p710M064L236q349Q464k217m865Q713
5529E017p070m28P085p896L831L065q938P617m17p107R400m476k516P572o807
5544b068J333N031r299O967k19o208P151l000l418P125m996o84N665p282L644
$$ plain form
5559 -258 3394 -4552 2270 842 -4545 4134 -1039 -2146 4301 -3606 -47 3050 -4057 2381 1217
5574 1217 -4221 2793 -1175 -2887 3562 -1890 -695 2755 -3350 528 2071 -1974 1860 182 -2511
5589 -2511 2590 -202 -1700 3080 -1624 -657 2996 -2151 133 1165 -2885 1911 -171 -2270 2327
5604 2327 -518 -1561 2249 -1546 277 1375 -1187 977 769 -1303 479 805 -912 1419 194
5619 194 -1829 1941 -603 -1859 2726 -1453 -5 1159 -2559 483 1261 -2368 2268 -13 -1651
5634 -1651 2388 -1269 -1513 1527 -1950 -222 2251 -2919 1460 781 -2293 2672 -109 -2629 3016
5649 3016 -1226 -1253 3618 -2449 644 3759 -4155 1513 1171 -4319 3992 -1534 -2514 3887 -3147 122
5665 122 3969 -4365 2464 1244 -3486 3714 -756 -2700 4098 -2379 -1568 4002 -3884 919 2211
$$ packed form
5559b58L652p946O822j428n387Q679n173j107O447p907L559L097p107O438j164
5574A217n438P014l968j712O449n452J195L450o105L878J543m045L834j678k693
5589b511N101k792j498M780m704R67L653n147K284J032m050M796k082k099M597
5604B327k845j043L810l795J823J098k562K164k08k072J782L26j717K331j225
5619A94k023L770k544j256M585m179J448J164l718L042P78l629M636k281j638
5634a651M039l657k44L040l477J728K473n170M379o79l074M965k781k520N645
5649C016m242k7M871o067L093L115p914N668l42n490Q311n526r80O401p034L269
5665A22L847q334O829j220m730P200m470j944O798o477Q11N570p886M803J292
$$ plain form
5680 2211 -4475 3000 912 -3692 4300 -2346 -2089 4321 -3743 359 3510 -5007 3231 1073 -3614
5695 -3614 4628 -1558 -2103 4719 -3531 -185 3721 -3942 2414 1793 -3587 3592 -349 -2224 4581
5710 4581 -2152 -206 2809 -3273 1079 1546 -2687 1956 559 -2837 2942 -1382 -1594 3803 -2523
5725 -2523 -104 2787 -3389 1592 2070 -2808 2704 -1103 -2201 2479 -1793 345 2377 -1913 439
5740 439 877 -756 1167 -186 -1471 1396 1138 -1578 1920 -1056 -1187 1611 -1322 -349 2164 -1364
5756 -1364 741 1165 -1742 848 275 -1141 1711 -785 -1196 1758 -1033 -1102 1734 -1847 -138 1572
5772 1572 -2220 562 1239 -1838 1388 -43 -1755 2224 -1034 -1201 3039 -2646 866 1646 -2899 2127
5788 2127 630 -3290 3411 -1544 -1799 3801 -3155 328 1962 -3700 1407 1038 -2392 2992 177
$$ packed form
5680B211o686P475k088m604P992o646K57O410q064M102L151q517Q238k158m687
5695c614Q242o186n45O822q250L346L906p663O356o21n380P179l941j875O805
5710D581o733J946L015o082M352M67m233M643j397l396N779m324k12N397o326
5725b523K419K891o176M981M78m878N512l807j098M680m272K138K032m290K352
5740D39M38j633J923j353j285K867k58k716L498k976j31K798k933R73K513l528
5756a364K105M24k907K590n73j416K852k496m11K954k791o9K836l581J709J710
5772A572l792K782O77l077L226j431j712L979l258j67M240n685L512P80m545N026
5788B127j497l920O701m955k55N600o956L483J634n662N107l69l430N384k815
$$ plain form
5803 177 -2667 3975 -2102 -794 3787 -2864 699 2451 -4305 3093 345 -3416 4193 -1939 -1658
5818 -1658 3799 -3376 774 3079 -4237 2582 1393 -3457 4304 -1810 -2701 3527 -2653 68 2795
5833 2795 -3564 1515 1288 -3893 2597 294 -2093 3384 -1740 -901 3012 -3122 596 2380 -3975
5848 -3975 2995 425 -2461 4268 -1440 -1586 3836 -2751 142 2035 -2795 2102 918 -2183 2187
5863 2187 -322 -1103 2611 -1727 -802 1742 -2056 732 882 -1891 859 446 -1560 1981 -704 -1908
5879 -1908 1715 -782 -5 2287 -1588 334 1968 -2132 1163 368 -1360 1264 -864 -641 1749 -1391
5895 -1391 397 1742 -1637 -223 389 -1048 -154 697 -1409 936 931 -1199 1446 -253 -1832 1719
5911 1719 -1006 -742 2045 -1739 1185 456 -2565 2136 93 -2234 2722 -1172 -1321 2515 -2207 679
$$ packed form
5803A77k844O642o077J308M581o651L563J752o756P398k748l761P609o132K81
5818a658N457p175M150K305p316O819j189m850P761o114q91O228o180K721K727
5833B795o359N079k27n181O490k303k387N477n124Q39L913o134L718J784o355
5848c975O970k570k886O729n708j46N422o587K893J893m830M897j184l101M370
5863B187k509p81L714m338R25K544l798K788J50k773K750m13k006L541k685j204
5879a908L623k497P77K292l875J922J634m100L295p95j728K624k128K23K390l140
5895a391J788J345l379J414O12j437Q94Q51k106K345nk130K645j699j579L551
5911A719k725K64K787l784K924p29l021M701k043k327M956l894j49L836m722K886
$$ plain form
5927 679 1918 -2821 975 1026 -2408 1988 241 -1987 3183 -2878 -1105 3276 -3197 417 1957 -3388
5943 -3388 3169 -303 -2507 3265 -1710 -2145 2740 -3327 323 1894 -4032 2308 515 -3233 3413
5958 3413 -914 -1272 3020 -2819 268 2934 -3731 1609 1381 -3309 2174 -399 -2674 4217 -2207
5973 -2207 -1445 3364 -3294 76 2444 -3621 2718 792 -2573 3126 -2462 -1163 3918 -3116 678
5988 678 2559 -2609 1657 486 -2336 2714 -779 -1849 2860 -2380 370 1700 -2189 756 1268
6003 1268 -2218 2280 -51 -1603 2407 -1231 -1532 2241 -1551 614 1988 -3007 1329 379 -2198
6018 -2198 2190 -924 -1100 1364 -775 -494 1472 -1095 50 533 -1255 194 726 -1283 1684 -499
6034 -499 -1019 844 47 -1253 1065 -996 -692 1095 -1025 825 1649 -1951 1729 -449 -1399 1440
$$ packed form
5927F79J239m739L796N1l434M396j747k228N170o061J773M381o473L614J540n345
5943c388O557l472k204N772m975m35M885o067L650J571n926O340j793l748O646
5958C413m327l58M292n839L087K666o665N340k28m690N483k573k275O891o424
5973b207P62M809o658L370K368o065O339j926l365N699n588J299N081p034L794
5988F78J881n168M266j171k822N050l493j070M709n240K750J330l889K945N12
6003A268l486M498k331j552M010l638l01L773l792K165J374m995M336r50k577
6018b198M388l114j76K464k139K81J966k567J145M83j788J449N32k009K967k183
6034d99n20J863p97j300K318k061L04J787k120J850Q24l600L680k178r50K839
$$ plain form
6050 1440 15 -641 2237 -1054 -948 966 -2162 807 1485 -1860 1146 730 -1518 2048 -315 -1068
6066 -1068 2123 -1882 -852 2343 -2442 992 1130 -2195 2126 253 -2662 2743 -2005 -1170 3060
6081 3060 -2493 371 1589 -3150 2084 455 -2266 3407 -1232 -1471 2862 -1577 384 2269 -2450
6096 -2450 1538 2113 -2372 1663 -47 -2661 3242 -1483 -871 3445 -3289 1132 1361 -3906 3006 -555
6112 -555 -2805 2834 -1944 -514 3219 -3021 71 1847 -2666 1654 854 -1647 2278 -1231 -2149 2511
6128 2511 -1622 -1053 1579 -2451 931 1069 -1793 1533 -73 -2259 2310 -192 -1027 1840 -1455 144
6144 144 1615 -2781 1238 547 -2494 2478 -585 -948 1756 -988 -502 1320 -943 597 702 -1528
6160 -1528 444 -100 -907 1974 -83 -1013 1431 -621 -102 1549 -1205 -152 733 -2074 570 1094
$$ packed form
6050A440j425o56K878l291J06J914l128K969O78l345L006m16k248L566k363p53
6066a068L191m005J030L195m785L434J38l325M321j873k915N405m748Q35M230
6081C060n553K864J218m739N234j629k721N673m639k39M333m439J961J885m719
6096b450L988N75m485M035j710k614N903m725O12M316o734M421K29n267O912l561
6112e55k250N639m778J430L733o240L092J776m513M320q00k501L925l509r18M660
6128B511m133N69K632m030L382J38k862L326j606k186M569k502q35K867l295J599
6144A44J471m396M019o91l041M972l063l63K704k744M86J822k263J540J05k230
6160a528J972n44q07K881k057r30K444k052N19J651k754J053Q85k807K644N24
$$ plain form
6176 1094 -2036 1147 -768 -756 1025 -538 -445 873 -545 195 883 -764 313 1167 -509 645 553
6193 553 -1342 1591 -505 -1482 2680 -916 -20 1587 -1395 -90 786 -2139 1177 -152 -1331 2691
6209 2691 -1753 -974 1461 -2078 484 1479 -2118 1830 -18 -2261 1258 -442 -1430 2239 -1260 201
6225 201 2039 -2759 894 999 -2064 2357 -554 -2308 2650 -1466 -899 2166 -2855 1074 2017 -3075
6241 -3075 1847 -424 -1596 2740 -1883 -1130 2290 -1935 1433 1964 -1811 976 98 -2151 1599 -372
6257 -372 -1467 2854 -2043 -201 1962 -2519 802 832 -2218 2216 -363 -2074 3561 -1294 13 2136
6273 2136 -3033 705 881 -1848 1685 92 -1727 2213 -899 -1140 1199 -1515 753 1499 -830 505
6289 505 328 -1438 710 -180 -841 189 -972 -666 1725 -697 -529 858 -1754 373 -141 -1396 1258
$$ packed form
6176A094l130L183j915J2J781j563R3J318j418P40O88j647J077Q54j676J154r2
6193E53j895K933k096r77M162l596Q96J607k982J305Q76k925L316j329j179M022
6209B691m444P79K435l539K562R95l597L948j848k243L519j700r88L669l499J461
6225B01J838m798L653J05l063M421k911j754M958m116N67L065n021L929R43n092
6241c075M922k271j172M336m623P53L420m225L368N31l775K787q78k249L750j971
6257c72j095M321m897J842K163m481L321L0l050M434k579j711N635m855J307K123
6273B136n169L738J76k729L533j593j819L940l112k41K339k714K268P46k329J335
6289E05j77j766K148q90o61J030j161L06K391k422J68J387k612K127n14j255K654
$$ plain form
6306 1258 -418 -1204 417 -894 -641 898 -930 655 460 -173 -63 839 -373 140 238 -581 416 190
6324 190 -915 1100 -683 -1774 462 -1102 262 725 -1227 1173 722 -1610 1264 317 -771 629
6340 629 -1078 150 1519 -2210 534 1147 -1033 1105 -551 -1982 1620 249 -1230 1672 -1375
6355 -1375 -281 1892 -1472 296 812 -1909 1058 418 -1534 1995 -1408 0 2096 -1835 879
6370 879 1990 -2207 1188 490 -1802 2684 -1463 -1176 1611 -1779 158 1955 -2107 1145 1062 -1273
6386 -1273 1234 97 -1918 1575 -1239 -1066 2853 -2818 129 1207 -1787 1391 160 -855 1869
6401 1869 -1093 -558 1863 -1755 739 1002 -2499 1779 390 -1457 1804 -539 -1607 1255 -1176
6416 -1176 -268 1508 -1921 136 729 -1898 1314 -53 -1255 1636 -393 -889 1305 -1244 -296 1059
$$ packed form
6306A258j676p86J621j311K53J539j828J585j95o33J10R02j212N13R8q19R97k26
6324A90j105K015j783j091K236j564J364M63j952K400m51k332K874r47j088J400
6340F29j707J228J369l729K744O13k180K138j656j431L602j371j479K902l047
6355a375J094K173l364J768N16k721K967o40j952L529l403J408K096l931K714
6370H79J111m197L395o98k292M486m147K87K787l390J937J797m062L252q3k335
6386a273K507j137k015L493k814J73L919n671K947J078k994L178j231j015K724
6401A869k962N35K421l618K494K63l501M278j389j847L261k343j068K862k431
6416a176R08J776l429K057N93k627L212j367j202K891k029m96K194k549R48J355
$$ plain form
6432 1059 -1340 1487 20 -1311 1189 -41 -796 863 -384 582 370 -38 262 652 -1526 532
6448 532 496 -1245 421 -580 -569 493 -30 64 1524 -311 -400 475 -1027 -359 427 -1126 887 -164
6466 -164 -517 1079 -360 -240 646 -504 81 983 -617 798 1464 -693 490 21 -818 770 370
6483 370 -378 1282 -806 -358 2009 -1589 922 688 -1304 1052 -669 -1906 2324 -1013 -451 1445
6499 1445 -1885 474 366 -1677 1003 212 -1553 1353 -39 -961 1204 -1663 502 1078 -1547 939
6515 939 909 -1200 1876 42 -1540 1948 -767 -645 1142 -1572 546 577 -2431 1493 74 -1538
6531 -1538 1792 -1717 -481 1984 -1640 763 1422 -1237 496 997 -1659 1621 -492 -655 1823 -1370
6547 -1370 -146 1346 -1426 595 374 -1653 1369 293 -903 1854 -74 -578 1638 -1196 -512 807
$$ packed form
6432A059k399K827j467j331K500j230p55J659j247R66k12m08L00L90k178K058
6448E32l6j741J666j001J1J062n23R4J460j835q9Q75j502O68P86j553K013j051
6466a64l53J596j439J20Q86j150N85R02j600J415O66k157J183m69q39J588m00
6483C70p48J660k088M48K367l598K511k34j992K356j721j237M230l337N62J896
6499A445l330K359j08k043K680p91j765K906j392r22K165k867K165N76k625K486
6515I39l0k109L076j834j582L488k715J22J787k714K118L1l008L924j419j612
6531a538L330l509J236K465l624K403O59k659J733N01k656L280k113j63K478l193
6547a370J224J492k772K021k21k027L022j076j196K757j928n04K216k834O84J319
$$ plain form
6563 807 -1739 615 -40 -1088 1193 -761 -308 951 -1094 -34 -112 -940 378 597 -1321 -58 919
6580 919 -1458 298 442 -1356 813 -535 -100 1059 -1293 491 -8 -1160 920 463 -249 1464
6596 1464 -146 620 258 -221 459 603 -1198 159 223 -924 231 373 -1065 1030 -65 -1285 1271
6613 1271 -715 -559 892 -1671 -356 1401 -1209 1098 793 -1595 1013 -343 -877 2083 -181 127
6629 127 1355 -1247 346 1057 -1711 467 -107 -1041 1034 37 -973 1690 -1014 -1112 1573 -2150 367
6646 367 802 -1682 1285 -52 -1311 1979 -151 -463 1273 -1975 86 329 -1407 1906 280 -877
6662 -877 1368 -460 -267 1047 -651 430 1413 -1272 847 823 -1442 1890 -41 -1509 1520 -586
6678 -586 -293 1170 -1492 423 1014 -1260 1190 369 -736 2159 -1238 -701 1540 -1597 498 224
$$ packed form
6563H07k546K354o55j048K281j954M53J259k045J060p8q28J318K19j918J263R77
6580I19k377J756J44j798K169j348M35J159k352J784m99j152K080m57p12J713
6596A464j610P66l62m79O80J44j801J357O4j147J155J42j438K095j095j220K556
6613A271j986J56J451k563J315J757k610K307l05k388K608j356n34K960k264L08
6629A27J228k602J593P11k768K178n74r34K075r97j010K663k704r8K685l723K517
6646C67M35k484K967j337j259L290k130l12J736l248K061K43j736L313j626j157
6662h77K245j828J93J314j698J081R83k685K119k4k265L332j931j468L029k106
6678e86K93J463k662J915N91k274K450q21j105K895l397N37K241l137K095k74
$$ plain form
6694 224 -998 453 75 -1130 1057 -383 -1087 811 -695 -963 1293 -502 366 30 -338 327 262
6711 262 -831 1125 -766 138 1760 -513 -396 627 -1086 661 131 -994 713 134 -444 547 -184
6728 -184 23 663 -893 -60 454 -486 357 157 -728 -144 -189 -671 -106 796 -756 991 -198 -64 1079
6747 1079 -209 448 221 -1289 507 -191 -1088 266 -668 -148 674 -514 136 890 -717 261 718 -1231
6765 -1231 282 232 -381 806 -681 84 1370 -1431 -236 809 -1804 194 543 -762 1310 -616
6781 -616 -641 2056 -862 -342 1136 -685 197 176 -811 1099 -150 -557 1267 -595 93 787 -373 921
6799 921 1009 -1705 281 204 -848 1493 -188 -955 1772 -1269 -374 1985 -1497 195 749 -1284 1333
6816 1333 -315 -898 1488 -495 -40 1055 -707 437 561 -438 524 69 -735 1732 128 -417 1098
$$ packed form
6694B24j222J451l78j205K187j440p04J898j506k68K256j795Q68l36l68O65o5
6711B62j093J956j891R04J622k273J17J023j713J747n30j125J707n79n78R91p31
6728a84K07O40j556Q33N14r40Q43k00q85N84m5m82N65R02j552J747j189J34J143
6747A079j288O57k27j510J796o98q97J354r34N20Q22j188O50P54j607R78M57j949
6765a231J513n0o13J187j487P65J286k801J195J045k613J998L49j305K072j926
6781f16k5K697k918N20J478j821Q82k1r87J910j249m07J824j862O88O94j160J294
6799I21Q8k714J986p7j052K341j681p67K727l041Q95K359l482J692N54k033K617
6816A333j648n83K386j983M55J095j762J144J24r99R62m55q04K467j604n45J515
$$ plain form
6833 1098 -34 -208 1111 -355 186 793 -713 1270 669 -856 1137 155 -231 143 -1158 366 434
6850 434 -276 817 -868 -295 470 -387 -822 645 -289 486 374 106 306 474 -204 511 187 -200 -19
6869 -19 21 -930 514 -1131 -43 510 -519 -254 927 -425 367 243 -1009 607 453 -480 326 -228
6887 -228 -356 519 -241 311 466 -637 548 481 -796 1100 740 -34 766 -11 -858 509 -1158 3
6905 3 -44 -1410 -325 -7 -230 1614 -184 -177 336 -628 57 708 -949 123 53 -166 -84 -508 -1098 177
6925 177 -635 -335 1007 -248 -384 716 -1231 519 680 -1375 321 373 -612 1077 -891 -190 629
6942 629 -1085 -85 1055 -1046 560 -257 104 1311 -1023 99 981 -1128 644 1403 -524 1189
6958 1189 843 -1222 774 -20 -436 703 -434 -287 891 -351 354 421 -908 427 124 -831 1119
$$ packed form
6833A098j132j74J319j466N41O07j506J983o01j525J993r82l86L74j301J524O8
6850D34p10J093j685N73P65q57m35J467r34P75j12k68K00J68o78P15l24l87J81
6869a9M0r51J444j645J088N53j029K65J181j352P92j24j252J616j54r33Q06n54
6887b28j28Q75p60N52J55j103J185o7j277J896l60p74Q00p77q47J367j667J161
6905Cm7j366J085L18k23J844j798PN13r64O85O51j657J072p0k19Q2m24n90J275
6925A77q12L00J342j255j36J100j947J750J61k055J696N2r85J689j968P01Q19
6942F29j714J000J140k101J606q17L61J207k334J122Q82k109J772P59j927J713
6958A189l46k065J996p94m16J139j137J47J178j242P05O7j329J335l03r55J950
$$ plain form
6975 1119 -344 -416 584 -1493 735 169 -419 205 -190 -400 704 -201 497 793 39 582 -171 -516
6993 -516 301 746 -497 135 -324 -876 864 257 35 519 -591 -211 27 -160 676 -157 -1310 550
7011 550 -27 -735 375 -195 266 341 639 403 384 -216 -318 116 -252 187 967 489 -443 785 -658 272
7031 272 -640 39 568 276 -483 -134 -508 -5 -95 -668 673 12 497 31 -198 -44 1025 -260 -379
7050 -379 -200 -426 674 -288 -312 -27 -192 -10 567 -49 312 945 -292 642 -29 -827 680 123 -170
7069 -170 598 4 -856 235 -782 -49 25 -1101 629 -589 -950 424 -469 -712 136 -201 -485 240
7087 240 -1141 547 -39 380 -15 -49 -301 652 -386 439 1063 -490 362 841 -335 720 606 -471
7105 -471 659 -304 196 147 -199 -73 -133 -798 757 672 -486 577 -4 -680 86 -456 -1077 449 -566
$$ packed form
6975A119j463p2J000k077K228n66n88O24l95k10J104r05O98K96p54N43p53l45
6993e16Q17M45j243O32m59n52J740o07k22M84j110L80K38j87Q36q33j153J860
7011E50n77p08J110n70M61P5K98k36j9o00j02M34l68M39P80m78r32J228j443R30
7031B72r12O79N29k92p59L49l74N03r0n73J341o61M85m66k29J54J069j285j19
7050c79J79k26J100r62k4K85j65J82N77o16L61O33j237R34o71p98J507n57k93
7069a70P68n94q60J091j017P33P4j126J730j218l61J374q93k43Q48l37k84P25
7087B40j381J688n86M19l95l4k52R53j038Q25O24j553Q52M79j176J055j14j077
7105d71J130r63N00m9l46J26o0o65J555q5j158J063n81o76P66n42o21J526j015
$$ plain form
7124 -566 472 40 -762 12 535 -282 1027 -261 -478 538 -1264 -142 -190 -572 -146 782 -196 683
7142 683 -74 -76 570 -613 110 343 101 -88 -456 -231 341 -75 -362 -221 478 -834 506 88 331 280
7162 280 398 -180 785 -484 -446 173 -942 -108 8 -69 292 -376 -184 -390 -45 30 -28 -699 -522 173 -650
7183 -650 -141 -157 -47 -34 -64 -949 195 -330 75 519 -232 -150 372 -680 -60 -374 -327 452 -678 -262 399
7204 399 -205 -72 -8 -679 322 166 -735 -506 37 -818 342 78 374 613 -578 362 164 -776 399
7223 399 432 -157 1093 -709 22 615 -798 -525 374 -964 762 304 -142 278 165 -263 566 140 210
7242 210 1067 217 261 -210 -36 170 245 -155 390 74 -263 371 -503 -229 285 -978 323 87 -265 1130
7262 1130 -429 -435 981 -423 -166 166 -293 297 182 -730 604 22 -116 -91 244 -303 209 -301 -297 958
$$ packed form
7124e66J038m32q02P74N23q17J309j288k17J016j802J122m8l82M26R28r78Q79
7142F83p57kO46j183P23K33k42j89l68K25N72m16k87J41O99j312J340m18K43n1
7162B80J18n78R65j269L8O19j115Q34J16p7L61o68J92k06L45P5n8o71J77O95q23
7183f50N09j6J10J3l0q85J144n25M05M44p51Q2N22j052O20l14M7P79j130M16O61
7204C99o04J33O4o71J001j56r01K29N43q55J160k64K96K39j191R40j98r40J175
7223C99L3n89J250j802P31N93j413K73Q99j338J726m58m46M20j13m28Q29m26P0
7242B10Q57q50M4m71J74K06P5m00N45l16l37O34q74K74N14j263J301k36l52J395
7262A130j559oJ416j404K57L32m59N90j15r12J334n82j38K5L35n47N12n10MJ255
$$ plain form
7282 958 381 -229 450 1029 201 -551 -535 436 -492 -465 -40 -185 -258 31 12 762 295 -250 562 859 -33
7303 -33 222 55 -251 -117 -863 295 434 465 -474 402 -707 -1 377 -563 842 486 -263 396 -140 180
7323 180 311 -684 -624 -145 -692 824 -260 10 546 195 407 303 -1200 32 270 -96 62 482 499
7342 499 541 -193 -157 -291 40 -315 689 -434 531 1069 -691 -296 29 -363 704 -559 -138 437 -224
7361 -224 439 61 -575 368 -107 -470 587 249 607 783 16 -44 734 -410 89 261 -411 2 686 -917
7381 -917 453 788 -26 934 -680 -284 -289 -716 359 -100 289 1053 105 -832 360 -297 193 -133 -642
7400 -642 2 -431 -643 375 -162 -209 -347 286 -252 -730 -244 142 239 -456 136 -93 -332 31 -782 -325
7420 -325 702 -449 -526 198 -292 16 167 2 145 -49 449 322 -217 -121 -527 -181 -130 -228 834 -715
$$ packed form
7282I58n77o10O79N79q28p52J6R71r28K7M25j45p3K89j9P50m67n45Q12K97q92
7303c3K55j67l06J34p46J158J39L1r39Q76j109P06L78r40J405l56p49O59n36L20
7323A80J31r95O0M79n47J516j084K70N36l51K12j04j503J232K38l66J58M20J7
7342D99M2p34L6j34L31l55J004j123R65N38j760L95L25l92J067j263M21N75o61
7361b24O63l78o36R43m75l63J057l38L58J76p67o0P78j144M99J72o72M13O84j603
7381i17J370L35q14R60j614L96nm27J075m59L89P64r48r37J192o57M90l26n09
7400f42O44m33k12J018n37m7j38O33n38m78M86L86R7o95N92k29k39L63q13M57
7420c25J027j151p7P24m90L08J51j65J43j94M98j27n39R6m06L46N1r8J062j549
$$ plain form
7440 -715 218 -93 603 242 85 418 159 -366 -333 -90 -193 634 -143 488 127 -678 -437 319 252 248 561
7461 561 -435 369 -400 -2 728 -123 51 453 -161 -217 549 -277 274 501 -210 458 494 -644 406 -343
7481 -343 -92 -218 -576 253 -528 289 425 -163 409 271 -377 283 -178 -719 -64 301 -116 -92 106 -362
7501 -362 -51 -140 -532 295 -239 350 204 -982 388 75 689 345 -256 -64 258 -456 -409 518 -456 191
7521 191 -47 -259 -157 -594 -635 -2 -150 -334 -233 -435 157 852 -145 -361 388 -88 26 870 -810 332
7541 332 177 401 453 -203 363 269 -250 193 -387 -1178 91 545 56 161 211 855 -182 -491 457 -405
7561 -405 -464 205 133 -962 236 -44 -101 -25 103 112 435 -336 150 187 -487 141 158 185 17 50 -111 817 -243
7584 -243 368 255 -106 563 -407 81 234 242 44 -46 -499 -426 298 -41 -29 163 -1238 -199 477 -768 -165
$$ packed form
7440g15R33l11O96l61j57L33k59n25L3K43j03Q27p77O31l61q05K41P56o7mL13
7461E61r96Q04p69L98P30q51J74M02o14n6P66q26N51K27p11O68L6j138J050p49
7481c43K51j26l58Q29p81Q17J36n88N72j38o48O60m61n41O55L65m17K4J98m68
7501c62L11q9l92Q27n34N89j46j186J370l13O14l44o01J92L22p14M7R27r74O47
7521A91k38k12J02m37m1O33j48j84J01k02N92O95r97k16P49m76J14Q44j680J142
7541C32j55K24N2o56N66r4n19M43n80p91J269M54m89J05N0O44j037l09R48q62
7561d05n9O69p2j095J198k80n7P6J28RL23p71M86L7o74O28J7K7j68L3j61R28j060
7584b43O11j13l61O69r70M88J53Qj98r0m53P3P24l39J2J92j401J039O76j245O03
$$ plain form
7605 -165 158 -199 282 -359 -286 209 -161 410 909 -1165 760 -507 -280 849 -700 7 43 -35 -26 539
7625 539 229 -73 173 501 408 266 -833 0 163 185 432 -328 -152 143 -526 -155 62 569 165 -203
7645 -203 -654 569 -443 697 46 -569 490 443 29 344 -368 -447 500 540 -379 842 -100 372 590
7664 590 -338 -454 567 -394 140 73 -31 -32 -698 334 640 252 -476 -32 -564 149 264 313 94 49 450
7685 450 124 710 501 -406 180 654 164 -621 -21 543 335 -305 -4 -655 -689 -387 -124 161 -804 283
7705 283 -589 -569 185 -362 -93 470 291 37 -60 124 492 -20 -315 307 -297 -304 -166 223 -261 -448 647
7726 647 -143 309 466 -680 97 57 104 671 616 -101 -399 87 268 730 -254 105 -603 -74 -19 77 -598
7747 -598 506 7 -470 387 368 151 -345 -321 13 -709 560 299 -18 -484 -226 291 102 -27 87 217
$$ packed form
7605a65L23l57M81o41P3M95l70N71M99k074J925j267K27J129j549P07L6p8RN65
7625E39l10l02K46L28r3j42j099Q33J63K2K47p60J76K95o69L71K17N07m04l68
7645b03m51J223j012J140o51o15J059m7m14L15p12p9R47M0r19J221r42M72K18
7664E90r28j16J021r61N34o7j04jo66J032L06l88p28M44n32P13J15M9k19m5M01
7685D50l26N86k09r07N86M74m90p85O00N64k08o40L01o51l4L02K63K85r65J087
7705B83q72K0P54n47K69N63j79k54r7J84L68n12k95O22o04pJ38L89m84j87J095
7726F47p90M52J57j146P77m0M7N67n5p17k98M86J81M62r84L59p08N29N5R6o75
7747e98J104m99m77Q57j9k17m96K4L34p22J269k61l17m66K58N17j89j29J14J30
$$ plain form
7767 217 -68 -477 352 -308 534 -380 25 621 71 425 -83 -283 236 374 -310 -614 332 -110 -141 386
7787 386 639 439 -97 -773 411 152 -35 -487 -665 -695 -306 649 -63 -883 133 1404 -595 747 -4
7806 -4 -166 -18 -644 -259 721 -282 -317 306 -675 78 691 326 -323 556 178 388 896 116 -601 -379 -653
7827 -653 597 46 106 -59 608 61 -115 -353 199 -213 -464 610 752 -307 614 -236 258 -418 302
7846 302 68 359 -17 658 -44 156 309 517 117 135 -315 -195 440 197 -164 478 291 -22 -237 -670
7866 -670 275 -277 339 608 645 134 -71 -434 536 437 773 -230 -555 352 -303 -377 370 -1238 -895 -94
7886 -94 -214 -310 -579 508 -556 614 749 -39 140 -543 318 58 -701 118 60 -229 24 172 -609 520
7906 520 179 -24 -124 705 -362 860 -563 243 76 -356 206 356 57 -733 160 -234 496 100 -357
$$ packed form
7767B17k85m09Q29o60Q42r14M05N96n50L54n08k00N19J38o84l04R46m42l1N27
7787C86K53k00n36o76J184k59j87m52j78l0L89R55p12q20J016J271j999J342p51
7806dj62J48o26L85R80j003l5O23r81P53O13l65o49Q79l78K10N08p80p17K22k74
7827f53J250n51O0j65O67n47j76k38N52m12k51J074J42j059R21q50M94o76P20
7846C02k34K91l76O75p02K00J53K08m00J8m50J20O35k43l61O42j87l13k15m33
7866f70R45n52O16K69L7n11k05l63R70r9L36j003l25R07o55p4P47j608L43Q01
7886i4j20r6k69J087j064J170J35p88J79o83Q61k60p59Q19n8k89K53J48p81J129
7906E20l41k03j00Q29j067J222j423Q06j67m32N62J50k99p90Q93l94P30l96m57
$$ plain form
7925 -357 293 644 -10 -38 -245 -303 251 -485 426 -475 421 -153 108 -147 -471 -388 481 88 129 798 -88
7946 -88 58 38 52 302 422 -534 78 364 -264 -468 -276 -313 -189 109 23 -113 -800 213 110 -770 335
7967 335 -452 -581 -449 -385 129 -148 -327 401 116 -653 144 444 110 542 381 -185 -215 -803 25 -250 373
7988 373 -637 23 -402 343 61 -608 -123 335 669 287 55 -531 -593 -166 -92 -167 422 456 -441 -628 -162
8009 -162 172 -228 -42 515 435 -330 -64 -130 -46 -18 -241 330 -354 168 -161 -504 712 -261 -217 185 -175
8030 -175 -321 -291 594 490 453 -133 -270 -1011 -258 -109 -26 -204 -139 479 -668 773 783 658 676 6 58 77
8052 77 147 4 120 -548 166 -326 340 579 -261 621 54 411 613 -156 209 384 -143 261 -168 -1084 -465
8073 -465 454 243 446 -770 -291 -59 -790 304 -33 154 -409 134 -305 652 87 -867 -353 22 -273
$$ packed form
7925c57O50L51o54k8k07n8N54p36R11r01Q96n74K61k55l24Q3Q69l93M1O69q86
7946h8J46k0J4K50J20r56O12K86o28k04J92l7J24K98q6j36o87J013j03q80J105
7967C35p87j29J32O4N14k77j79P28k85p69P97L00l34M32j61n66l0n88Q28k75O23
7988C73j010O60m25P45k82o69M85M58L34l82k32n86o2M27P4p5N89L4q97j87M66
8009a62L34m00J86N57q0p65K66o6Q4K8k23N71o84N22l29l43J216r73M4M02l60
8030a75j46L0Q85j04l7n86j37p41P53J49Q3j78O5O18j147J441J0j25J8o70N2J9
8052G7P0j43J16o68P14m92O66K39q40Q82n67L57K02p69L65J75n27M04m29r16O19
8073d65R19k11K03j216M79K32p31J094l37J87n63N43m39R57n65r54N14L75k95
$$ plain form
8092 -273 487 -157 623 -436 -407 798 43 204 459 196 409 -34 -205 87 -637 34 -128 -287 -17 225
8112 225 -252 37 -652 417 -253 418 189 -52 3 63 732 486 149 -45 59 440 -130 862 -171 -51
8132 -51 -398 -193 -395 82 202 -199 41 55 1104 -495 -45 -448 -353 -45 -444 -32 79 -241 493 693
8152 693 502 341 251 385 618 -711 -151 -8 -26 -254 -697 63 -121 -11 298 -263 582 215 175 154 -1032
8173 -1032 119 -108 -486 -94 41 83 -130 691 -158 -47 -346 171 -315 20 378 -496 509 613
$$ packed form
8092b73P60o44P80j059K9J205p55J61K55k63K13m43j71K92p24O71j62j59K70K42
8112B25m77K89o89J069o70O71k29k41N5O0O69k46l37j94J04L81n70R92j033J20
8132e1l47K05k02M77J20m01K40J4J049j599M50m03R5L08l99M12J11l20P34K00
8152F93j91j61r0J34K33j329N60J43j8k28m43P60j84J10L09n61Q45l67m0k1j186
8173a032J151k27l78L92J35M2k13Q21q49J11k99N17m86L35L58q74J005J04
8191F13
$$ Imaginary data points
##PAGE= N=2
##DATA TABLE= (X++(I..I)), XYDATA
$$ plain form
0 108 -216 0 108 -126 84 108 -202 164 -45 -95 176 -125 10 78 -81 -34 185 -287 285 -196 98 -79
22 -79 163 -279 340 -257 7 395 -984 1988 -4065 9151 -25035 143929 551374 -557551 225834
37 225834 273742 -625495 506663 -23375 -418858 575943 -331027 -164044 524980 -500546
47 -500546 144079 318456 -547667 368846 57034 -431105 509063 -214652 -233983 490155
57 490155 -401503 40117 357628 -492335 265815 131634 -426512 423655 -116723 -263913
67 -263913 440321 -308380 -32271 341397 -395571 169608 159379 -363054 303079 -30370
77 -30370 -245742 330046 -177966 -90109 279573 -254938 48275 177904 -262500 150148
87 150148 65088 -219503 204186 -37400 -148287 212033 -116193 -61758 184912 -164312
$$ packed form
0A08l24K16J08k34K10K4l10L66k09n0K71l01J35O8j59M7K19m72N72m81K94j77
22g9K42m42O19n97K64L88j379K972o053J3216l4186J68964M07445j108925P83385
37B25834M7908q99237J132158n30038l95483R94801r06970J66983O89024j025526
47e00546O44625J74377q66123R16513l11812m88139R40168p23715j9331P24138
57D90155q91658M41620L17511q49963P58150j34181n58146Q50167n40378j47190
67b63913P04234p48701K76109L73668p36968N65179j0229n22433O66133l33449
77c0370k15372N75788n08012Q7857L69682n34511L03213J29629m40404M12648
87A50148q5060k84591M23689k41586j10887L60320l28226N4435K46670l49224
$$ plain form
97 -164312 18884 131330 -174060 83339 67066 -157748 122359 7783 -127042 140977
107 140977 -38504 -92955 148668 -82164 -57661 154699 -127801 -7606 145451 -177729
117 -177729 66966 108224 -210495 157849 22791 -201076 237400 -94973 -128465 269175
127 269175 -217128 -498 227962 -296047 149631 113787 -302889 276076 -44723 -226755
137 -226755 339873 -206231 -83611 320234 -327496 94773 215974 -377683 266477 42544
147 42544 -330117 386050 -162702 -188333 410583 -343869 26455 317822 -441990 251133
157 251133 122018 -415746 418137 -122231 -263633 465588 -339806 -26705 376760 -459035
167 -459035 216538 178165 -446695 397776 -67186 -309966 464222 -288893 -92319 403858
$$ packed form
97a64312J83196J12446l05390K57399j6273k24814K80107j14576j34825K68019
107A40977j79481n4451K41623k30832K4503K12360k82500J20195J53057l23180
117a77729K44695M1258l18719L68344j35058k23867M38476l32373l3492L97640
127B69175m86303K16630K28460n24009M45678l5844m16676N78965l20799j82032
137b26755N66628n46104J22620M03845o47730M22269J21201n93657O44160k23933
147D2544l72661P16167n48752k5631N98916p54452L70324K91367p59812O93123
157B51133j29115n37764Q33883n40368j41402P29221q05394L13101M03465q35795
167d59035O75573l8373o24860Q44471m64962k42780P74188p53115J96574M96177
$$ plain form
177 403858 -426954 146772 237147 -449684 341112 10282 -350913 441389 -217534 -158406
187 -158406 420214 -381782 75973 281084 -434570 282040 65679 -361325 398749 -157254
197 -157254 -188317 393338 -317610 24067 276374 -372782 207277 97146 -320448 310807
207 310807 -84304 -191219 318616 -216386 -33284 247832 -276514 108094 128129 -261272
217 -261272 202577 -2475 -189225 236267 -113109 -83760 210410 -179651 24382 137583
227 137583 -191386 106664 47500 -154463 142877 -30009 -92333 136271 -74813 -34197
237 -34197 103997 -87344 4215 73354 -82738 21703 56357 -82610 33881 47750 -92675
248 -92675 59584 30261 -104096 98569 -9580 -95979 134440 -68863 -57349 149589 -132527
$$ packed form
177D03858q30812N73726R0375o86831P90796l30830l61195P92302o58923N9128
187a58406N78620q01996M57755K05111p15654P16610k16361m27004P60074n56003
197a57254l1063N81655p10948L41677K52307o49156N80059j10131m17594O31255
207C10807l95111j06915N09835n35002J83102K81116n24346L84608K0035l89401
217b61272M63849k05052j86750M25492l49376K9349K94170l90061K04033J13201
227A37583l28969K98050n9164k01963K97340j72886o2324K28604k11084M0616
237c4197J38194j91341R1559O9139j56092J04441L4654j38967J16491J3869j40425
248i2675J52259k9323j34357K02665j08149q6399K30419k03303J1514K06938k82116
$$ plain form
259 -132527 11928 126411 -177736 95147 64442 -185111 171268 -26506 -146400 218877
269 218877 -130195 -62359 218981 -220079 57426 158362 -267680 184607 40149 -244946
279 -244946 281419 -112959 -144782 308220 -255604 16130 242901 -336120 190924 95403
289 95403 -319767 320310 -92831 -204340 359728 -262732 -23260 295998 -358104 167180
299 167180 144694 -355515 313106 -48088 -254323 374761 -228757 -81664 336579 -351217
309 -351217 116361 204106 -379644 285973 11778 -301431 379624 -189005 -135338 363438
319 363438 -335472 71132 240871 -381076 254133 49744 -313681 355435 -147262 -158997
329 -158997 346996 -289504 30451 242770 -337974 194227 81837 -291014 289813 -84317
$$ packed form
259a32527J44455J14483l04147K72883l0705k49553L56379j97774j19894L65277
269B18877l49072O7836K81340m39060K77505J00936m26042M52287j44458k85095
279b44946N26365l94378l1823M53002n63824K71734K26771n79021N27044r5521
289I5403m15170O40077m13141j11509N64068o22460K39472L19258o54102N25284
299A67180k2486n00209O68621l61194k06235O29084o03518J47093M18243o87796
309c51217M67578Q7745n83750O65617k74195l13209O81055n68629N3667M98776
319C63438o98910M06604J69739o21947O35209k04389l63425O69116n02697j1735
329a58997N05993o36500L19955K12319n80744N32201j12390l72851N80827l74130
$$ plain form
339 -84317 -173601 301548 -211852 -23222 235146 -274324 118127 115826 -260291 216296 -22203
350 -22203 -181087 249928 -140532 -61751 212397 -207586 59238 122478 -208792 145419
360 145419 14292 -152680 174449 -73634 -68870 150793 -119465 7393 98690 -121687
370 -121687 54686 43278 -98835 73203 6127 -71576 74486 -16343 -50233 72201 -31976
381 -31976 -35710 71302 -46629 -18265 71128 -65332 3379 64705 -83107 32397 48457
392 48457 -96358 67495 19440 -97720 104500 -26771 -80189 133317 -85463 -34577 139304
403 139304 -146034 40738 103917 -182566 129773 24316 -172000 202066 -84862 -100861
413 -100861 224074 -189886 16765 175886 -249152 145581 65943 -236910 242025 -73806
$$ packed form
339h4317q9284M75149n13400J88630K58368n09470L92451k301l76117M76587k38499
350b2203j58884M31015l90460P8781K74148m19983K66824O3240l31270L54211
360A45419j31127j66972L27129k48083M764K19663k70258J26858R1297k20377
370a21687J76373j1408j42113J72038o7076p7703J46062r0829l3890J22434j04177
381c1976l734J07012j17931K8364Q9393j36460O8711O1326j47812J15504J6060
392D8457j44815J63853m8055j17160K02220j31271n3418K13506k18780N0886J73881
403A39304k85338J86772O3179k86483L12339j05457j96316L74066k86928j5999
413a00861L24935m13960K06651J59121m25038L94733p9638l02853M78935l15831
$$ plain form
423 -73806 -152231 273661 -200328 -18319 228580 -278137 127918 116921 -282059 247015
433 247015 -32640 -208732 304496 -183758 -73086 280854 -291678 93887 175157 -322725
443 -322725 243063 9797 -259005 327005 -165091 -115014 314595 -294247 66823 206478
453 206478 -333498 225498 39432 -274271 314493 -133531 -138378 309023 -259153 28559
463 28559 218752 -307168 176994 76011 -270767 270651 -79038 -165000 288024 -205968
473 -205968 -21795 228359 -271376 121798 110592 -260514 224412 -31976 -176990 257271
483 257271 -156026 -51006 214326 -224020 77109 115420 -219687 166444 -882 -155759
493 -155759 195593 -96734 -62477 167393 -148181 26365 103896 -151279 87061 34262
$$ packed form
423g3806p8425M25892m73989J82009K46899n06717M06055j0997l98980N29074
433B47015k79655j76092N13228m88254J10672L53940n72532L85565Q1270m97882
443c22725N65788k33266k68802N86010m92096N0077M29609o08842L61070J39655
453B06478n39976N58996j86066l13703N88764m48024m847M47401n68176K87712
463B8559J90193n25920M84162j00983l46778N41418l49689q5962M53024m93992
473b05968J84173K50154m99735L93174j1206l71106M84926k56388j45014M34261
483B57271m13297J05020K65332m38346L01129L8311l35107L86131j67326j54877
493a55759L51352k92327L4257K29870l15574J74546P7531k55175K38340n2799
$$ plain form
503 34262 -121877 115088 -25361 -74374 114179 -65293 -25707 92261 -85200 14786 60266
514 60266 -84986 43299 26676 -70319 55952 937 -52111 57684 -15053 -37872 55486
525 55486 -24013 -30703 60005 -36804 -21949 69082 -61256 -710 72116 -91823 40241 50403
537 50403 -112413 93625 -379 -102241 137025 -71197 -52462 146405 -136863 26226
547 26226 110042 -172470 110846 35473 -160862 174480 -59672 -102020 195938 -148192 -9788
558 -9788 165878 -206484 97200 87502 -215523 189860 -25437 -163969 240637 -145866 -57687
569 -57687 225820 -236512 78168 139953 -264476 202666 4004 -211427 271789 -140531
579 -140531 -90669 260283 -247321 59245 170571 -280246 192677 30762 -231609 267218
$$ packed form
503C4262j56139K36965j40449m9013J88553j79472L9586J17968j77461R9986M5480
514F0266j45252J28285j6623r6995J26271n5015n3048J09795p2737k2819R3358
525E5486p9499o690R0708r6809J4855R1031j30338O0546P2826j63939J32064J0162
537E0403j62816K06038r4004j01862K39266k08222J8735J98867k83268J63089
547B6226Q3816k82512K83316p5373j96335L35342k34152m2348K97958l44130J38404
558i788J75666l72362L03684r698l03025M05383k15297j38532M04606l86503Q8179
569e7687K83507m62332L14680O1785m04429M67142j98662k15431M83216m12320
579a40531M9862L50952n07604L06566J11326m50817M72923j61915k62371M98827
$$ plain form
589 267218 -113067 -119310 266441 -222835 21248 194439 -271722 154601 71493 -244928
599 -244928 243625 -69061 -153148 266518 -189671 -20031 214733 -256382 116384 102567
609 102567 -247193 217620 -36086 -166568 249044 -155948 -43107 206132 -219981 81265
619 81265 108723 -216006 168586 -5346 -153521 197920 -102322 -61509 173583 -157944
629 -157944 30484 111060 -167164 102169 32953 -137110 140337 -42093 -80902 139728
639 139728 -96921 -12502 106959 -119908 47324 53611 -110356 83804 -527 -76141 91565
650 91565 -39606 -34071 75272 -56430 -1733 51564 -55180 14395 34238 -49186 20752
661 20752 26731 -50775 28665 20452 -56472 47808 4584 -59010 70807 -24882 -44291 86742
$$ packed form
589B67218l80285o243L85751m89276K44083J73191m66161M26323q3108l16421
599b44928M88553l12686q4087M19666m56189J69640K34764m71115L72766j3817
609A02567l49760M64813k53706j30482M15612m04992J12841K49239m26113L01246
619H1265K7458l24729L84592j73932j48175L51441l00242M0813K35092l31527
629a57944J88428Q0576k78224K69333o9216j70063K77447j82430l8809K20630
639A39728k36649Q4419J19461k26867J67232O287j63967J94160q4331p5614J67706
650I1565j31171N535J09343j31702N4697N3297j06744O9575J9843q3424O9938
661B0752N979p7506P9440q213p6924J04280m3224o3594J29817r5689j9409J31033
$$ plain form
673 86742 -63870 -12256 82711 -95110 35212 55058 -109458 83164 7893 -97895 118707
684 118707 -50588 -61100 131739 -106662 -463 114822 -148681 73408 61373 -157934
694 -157934 144256 -22045 -122976 183294 -114892 -41188 174179 -186114 64561 107311
704 107311 -207039 161762 -548 -165685 215500 -113883 -70652 206755 -196351 47296
714 47296 138207 -225264 153139 30277 -191890 217982 -87077 -106108 224991 -181762
724 -181762 8878 172473 -230572 125977 70182 -218355 210687 -53526 -143015 238098
734 238098 -165341 -23760 196318 -230485 101526 96398 -226144 194926 -28619 -155144
744 -155144 227407 -139049 -44231 191669 -200893 69547 106690 -202982 153183 3069
$$ packed form
673H6742j50612N1614R4967j77821J30322J9846j64516J92622p5271j05788K16602
684A18707j69295j0512J92839k38401J06199J15285k63503K22089j2035k19307
694a57934L02190j66301j00931L06270k98186P3704K15367l60293K50675M2750
704A07311l14350L68801j62310j65137L81185l29383M3231K77407m03106K43647
714D7296R0911l63471L78403j22862k22167M09872l05059j9031L31099m06753
724a81762J90640J63595m03045L56549n5795k88537M29042k64213q9489L81113
734B38098m03439J41581K20078m26803L32011n128l22542M21070k23545j26525
744a55144L82551l66456R4818K35900l92562K70440L7143l09672L56165j50114
$$ plain form
754 3069 -151895 188538 -91778 -68824 174489 -152895 23827 119599 -173588 102529 38672
765 38672 -148048 149358 -45260 -88469 154000 -109914 -10428 117515 -138214 60741
775 60741 54198 -125164 104621 -12532 -82383 111856 -60307 -29465 89517 -81315 14141
786 14141 55699 -79066 40562 24445 -65390 52334 1413 -50523 57588 -17996 -36070
797 -36070 60371 -33951 -18820 57682 -50822 1799 48674 -62211 25781 32074 -66503 47610
809 47610 10119 -61172 65486 -16565 -47854 78501 -47599 -23153 81879 -79089 13735
820 13735 67877 -104293 61915 30169 -107089 108207 -29192 -78176 133334 -92903 -16548
831 -16548 120698 -141311 60004 67305 -150235 127036 -11817 -113885 160318 -92107
$$ packed form
754C069j54964L40433k80316K2954K43313l27384J76722R5772k93187K76117o3857
765C8672j86720K97406j94618m3209K42469k63914R9486J27943k55729J98955
775F0741o543j79362K29785j17153o9851J94239j72163L0842J18982j70832R5456
786A4141M1558j34765J19628j6117q9835J17724n0921n1936J08111p5584j8074
797c6070R6441r4322J5131P6502j08504N2621M6875j10885Q7992O293r8577J14113
809D7610l7491p1291J26658q2051l1289J26355j26100K4446J05032j60968R2824
820A3735N4142j72170J66208l1746j37258K15296j37399m8984K11510k26237P6355
831a6548J37246k62009K01315P301k17540K77271j38853j02068K74203k52425
$$ plain form
841 -92107 -44044 150217 -149930 40720 101043 -170538 117440 20286 -147292 168612 -67595
852 -67595 -83751 178779 -144705 6071 139926 -188499 100969 59741 -179853 174811
862 174811 -44202 -118677 199757 -139762 -19226 164377 -193957 86763 80149 -190912
872 -190912 165038 -24319 -131810 192790 -116869 -40412 166077 -172110 55118 98058
882 98058 -178907 130498 8990 -140596 169754 -76722 -69659 165216 -140882 16997
892 16997 117123 -165853 97575 40316 -145829 146589 -44759 -86749 153810 -112158
902 -112158 -6308 116258 -140822 65996 50292 -126510 110465 -16695 -81640 117815
912 117815 -68256 -26024 96616 -92720 22215 59935 -93327 56365 18659 -76212 74112
$$ packed form
841i2107M8063J94261l00147J90650O0323k71581K87978r7154j67578L15904k36207
852f7595j6156K62530l23484J50776J33855l28425K89468m1228k39594L54664
862A74811k19013p4475L18434l39519J20536J83603l58334K80720o614k71061
872a90912L55950j89357j07491L24600l09659P6457K06489l38187K27228M2940
882I8058k76965L09405j21508j49586L10350k46476P063K34875l06098J57879
892A6997J00126k82976K63428n7259j86145K92418j91348m1990K40559k65968
902a12158J05850J22566k57080K06818j5704j76802K36975j27160o4945J99455
912A17815j86071M2232J22640j89336J14935L7720j53262J49692l7706r4871J50324
$$ plain form
923 74112 -17015 -50260 77196 -45949 -18892 66577 -63130 12372 44333 -66390 37457
934 37457 18059 -56520 50831 -5996 -40866 52518 -23603 -24171 50495 -34769 -10028 46514
946 46514 -45867 5492 42713 -58261 25817 29369 -67406 54442 2817 -61788 79673 -36214
958 -36214 -36766 87574 -75146 5603 71167 -98995 54910 30865 -96519 93923 -21348
969 -21348 -68334 109974 -71540 -20467 100305 -107671 35347 65382 -120152 87964 10907
980 10907 -105387 125430 -54047 -58929 133837 -113293 8220 104345 -145280 83200 40241
991 40241 -137632 139108 -41173 -88073 155017 -113811 -8553 124999 -153408 73077
1001 73077 58379 -148606 131839 -21721 -102915 152840 -93467 -31755 134843 -139756
$$ packed form
923G4112r1127l3245J27456j23145K7057Q5469j29707P5502L1961j10723J03847
934C7457j9398p4579J07351n6827l4870R3384p6121n68P4666q5264K4741N6542
946D6514r2381N1359L7221j00974Q4078L552r6775J21848n1625o4605J41461j15887
958c6214n52J24340j62720Q0749O5564j70162J53905k4045j27384J90442j15271
969b1348m6986J78308j81514N1073J20772k07976J43018L0035j85534K08116p7057
980A0907j16294K30817j79477m882J92766k47130J21513R6125k49625K28480m2959
991D0241j77873K76740j80281m6900K43090k68828J05258J33552k78407K26485
1001G3077j4698k06985K80445j53560q1194K55755k46307O1712J66598k74599
$$ plain form
1011 -139756 44218 82144 -148830 109041 9733 -120461 145682 -65249 -60188 144552
1021 144552 -124488 15644 103118 -148083 88842 32338 -129532 134355 -45350 -73689
1031 -73689 138145 -104510 -258 102486 -130114 64746 42247 -115971 104154 -19729
1041 -19729 -75213 112628 -68138 -22607 93594 -94456 26694 57703 -97392 64997
1051 64997 13069 -78279 86140 -30845 -45774 86385 -63852 -2954 65668 -78553 35396
1062 35396 31259 -70937 59029 -5153 -48177 64325 -32008 -20629 53789 -44322 2347
1073 2347 37121 -45226 17278 23151 -44033 26767 12332 -41463 37051 -2096 -37074 47642
1085 47642 -21353 -24014 52292 -41970 -2380 46289 -57559 24260 28416 -60994 47551 1067
$$ packed form
1011a39756J83974L7926k30974K57871r9308j30194K66143k10931N061K04740
1021A44552k69040J40132Q7474k51201K36925n6504j61870K63887j79705k8339
1031g3689K11834k42655J04252J02744k32600J94860k2499j58218K20125j23883
1041a9729n5484J87841j80766M5531J16201j88050J21150L1009j55095J62389
1051F4997n1928r1348J64419j16985j4929J32159j50237O0898O8622j44221J13949
1062C5396m137j02196J29966o4182m3024J12502r6333J1379P4418r8111M6669
1073B347L4774q2347O2504N873o7184P0800j4435n3795P8514l9147l4978Q4716
1085D7642o8995k661P6306r4262L9590M8669j03848Q1819M156q9410J08545m6484
$$ plain form
1097 1067 -50334 63557 -27745 -29814 66679 -53333 -1804 58409 -71954 31625 35361 -78249
1109 -78249 64307 -372 -67811 87863 -44660 -34334 92012 -84574 15004 68774 -105060
1120 -105060 68026 19540 -95749 103588 -38829 -55938 110614 -87578 2034 85700
1130 85700 -112566 59484 36321 -106075 99658 -20043 -73120 113242 -72430 -21978
1140 -21978 100852 -106903 35341 62594 -116651 87403 5145 -95390 117940 -56201
1150 -56201 -45590 116900 -104805 18515 80681 -122327 78958 20460 -103451 114229
1160 114229 -43897 -54845 112712 -90099 6362 81629 -108034 57402 31622 -96348
1170 -96348 90624 -19819 -62858 97968 -62568 -17172 83143 -87701 29234 49520
$$ packed form
1097A067n1401J13891r1302k069R6493j20012N1529O0213j30363J03579L736j13610
1109g8249J42556o4679o7439J55674j32523J0326J26346j76586R9578N3770j73834
1120a05060J73086m8486j15289J99337j42417j7109J66552j98192Q9612Q3666
1130H5700j98266J72050k3163j42396K05733j19701n3077J86362j85672N0452
1140b1978J22830k07755J42244K7253j79245K04054q2258j00535K13330j74141
1150e6201J0611J62490k21705J23320O2166k03008K01285n8498j23911K17680
1160A14229j58126j0948J67557k02811R6461P5267j89663J65436k5780j27970
1170i6348J86972j10443m3039J60826j60536M5396J00315j70844J16935K0286
$$ plain form
1180 49520 -91274 66454 5874 -71856 86922 -39413 -34736 83044 -71010 10470 56027
1191 56027 -80501 47413 16706 -65527 66412 -21212 -37100 63538 -44454 -5328 47862
1202 47862 -51502 18065 25558 -48024 32192 7430 -39008 38992 -8667 -27423 42056 -23772
1214 -23772 -13369 39210 -34604 4505 30257 -40852 20999 14862 -39128 33193 -2308 -29027
1226 -29027 38043 -16856 -16277 36907 -27829 -4064 33298 -35841 9518 26138 -42273 25655
1238 25655 12754 -44577 43358 -9074 -36836 56875 -36180 -12967 56252 -58907 18983 36349
1250 36349 -67165 51011 3315 -55679 69626 -33022 -28050 69360 -60958 8188 52288
1261 52288 -74215 43420 20369 -68848 67091 -16424 -48145 78952 -51706 -14135 70733
$$ packed form
1180D9520j40794J57728o0580p7730J58778j26335M677J17780j54054Q1480M5557
1191E6027j36528J27914l0707q2233J31939q7624j5888J00638j07992L9126N3190
1202D7862r9364O9567P493p3582Q0216k4762m6438P8000m7659j8756O9479o5828
1214b3772J0403N2579p3814L9109K5752p1109O1851o137n3990P2321l5501k6719
1226b9027O7070n4899N79N3184o4736K3765L7362o9139M5359J6620o8411O7928
1238B5655j2901n7331Q7935n2432k7762R3711r3055K3213O9219j15159P7890J7366
1250C6349j03514J18176m7696n8994J25305j02648M972R7410j30318O9146M4100
1261E2288j26503J17635k3051q9217J35939q3515l1721J27097j30658L7571Q4868
$$ plain form
1272 70733 -77189 26872 43649 -85226 65783 942 -69516 88580 -46563 -30195 86430
1283 86430 -81735 19234 56474 -92725 63642 9755 -74213 86822 -37627 -37223 83905
1294 83905 -69913 6823 59992 -83198 45106 23515 -74484 71128 -16684 -51122 79553
1305 79553 -51478 -12941 68876 -75223 26960 40051 -77650 60853 -145 -59720 76457
1316 76457 -39854 -23780 69230 -65882 16289 43126 -69440 46877 6313 -53515 59804
1327 59804 -24711 -25972 55271 -42818 1599 38901 -49408 22528 19272 -44703 36007 -1291
1339 -1291 -33636 42423 -19364 -17372 40661 -33500 1932 31392 -39633 20370 12611 -35455
1351 -35455 31481 -5101 -23739 33135 -17987 -8932 26531 -23529 2991 18060 -24338 9555
$$ packed form
1272G0733j47922J04061J6777j28875J51009o4841p0458J58096j35143J6368J16625
1283H6430j68165J00969L7240j49199J56367n3887q3968J61035j24449M04J21128
1294H3905j53818P6736N3169j43190J28304k1591r7999J45612q7812l4438J30675
1305G9553j31031L8537Q1817j44099J02183J3091j17701J38503o0998n9575J36177
1316G6457j16311J6074R3010j35112Q2171K6837j12566J16317m0564n9828J13319
1327E9804q4515j261Q1243r8089M4417L7302q8309P1936l256o3975Q0710l7298
1339a291l2345P6059o1787J992N8033p4161L5432K9460p1025O0003p759m8066
1351c5455O6936l6582j8638N6874n1122R055L5463n0060K6520J5069m2398L3893
$$ plain form
1363 9555 12093 -23050 14157 6788 -22467 20578 -413 -21381 28917 -14423 -14277 32491 -27013
1376 -27013 1483 27468 -37485 19966 12936 -36799 33725 -6804 -27421 40527 -24303 -9886
1388 -9886 36584 -37174 8441 26818 -42083 26145 10404 -41257 41144 -9808 -30071 49205
1400 49205 -32992 -9071 46360 -51629 18993 28589 -58152 45639 -42 -44977 61049 -33465
1412 -33465 -17829 57449 -56071 16185 35824 -62108 43982 4806 -49364 58612 -25570
1423 -25570 -25252 57140 -47144 3009 42506 -56425 30913 18591 -54638 50337 -9712 -38817
1435 -38817 59808 -38048 -11417 53139 -57895 20719 30481 -60347 48147 -1988 -44925 59873
1447 59873 -33228 -15857 53164 -51513 15369 30260 -52726 37504 2911 -39499 46003 -18547
$$ packed form
1363I555K538l5143L7207p369k9255M3045k0991k0968N0298m3340J46M6768n9504
1376b7013K8496K5985o4953N7451p030m9735P0524m0529k0617O7948o4830J4417
1388i886M6470p3758M5615J8377o8901O8228j5741n1661Q2401n0952k0263P9276
1400D9205q2197K3921N5431r7989P0622R596q6741J03791m5681m4935J06026r4514
1412c3465J5636P5278j13520P2256J9639r7932J06090l9176n4170J07976q4182
1423b5570L18Q2392j04284N0153L9497r8931Q7338j2322p3229J04975o0049k9105
1435c8817R8625r7856K6631O4556j11034P8614R762r0828J08494n0135m2937J04798
1447E9873r3101J7371O9021j04677O6882J4891q2986R0230l4593m2410Q5502o4550
$$ plain form
1459 -18547 -19787 43379 -33696 220 32302 -40445 18537 16358 -39141 32533 -2613 -29229
1471 -29229 39477 -20665 -12593 36575 -34186 7502 22444 -36367 24782 3748 -27935 30747
1483 30747 -12128 -13204 27837 -20785 830 18550 -22157 9226 9652 -19178 12560 3281 -16113
1496 -16113 15194 -1711 -12905 18595 -8510 -8952 20761 -16515 -1330 18565 -22179 9647
1508 9647 10578 -22234 17845 -179 -17195 22404 -9881 -8873 20913 -16656 -104 17256 -20136
1521 -20136 6684 13432 -21961 14960 5105 -23561 25103 -6017 -18116 31081 -21114 -5018
1533 -5018 29045 -33097 14156 17731 -37108 30379 -3561 -26599 39106 -23319 -8570 34350
1545 34350 -35977 10992 20356 -37643 26716 2613 -30562 34532 -14583 -17737 36549 -28459
$$ packed form
1459a8547j240O3166p7075L3916L2082p2747N8982k179n5499P1674l5146k6616
1471b9229O8706o0142Q072M9168p0761M1688J4942n8811O1149k1034l1683N8682
1483C0747m2875j076M1041m8622K1615J7720m0707L1383M26k8830L1738r279j9394
1496a6113L1307j6905j1194L1500k7105m42K9713l7276J5185J9895m0744L1826
1508I647R31l2812M0079j8024j7016L9599l2285J008K9786l7569J6552J7360l7392
1521b0136K6820O748l5393L6921r855k8666M8664l1120j2099M9197n2195J6096
1533e018L4063o2142M7253L575n4839O7487l3940k3038O5705o2425J4749M2920
1545C4350p0327M6969R364n7999O4359k4103l3175O5094m9115l154N4286o5008
$$ plain form
1557 -28459 -756 29942 -37755 18212 15718 -39084 34662 -4183 -30241 43819 -26422 -10128
1569 -10128 40045 -41192 15341 22478 -43886 34616 -1868 -31585 42913 -24182 -10264 36869
1581 36869 -35202 10117 21579 -36871 24665 4224 -29146 32628 -10739 -17338 32808 -23557
1593 -23557 -3013 26866 -31347 12766 15442 -31942 26608 -823 -24559 32896 -18470 -8705
1605 -8705 29302 -29220 9327 17467 -29199 21435 416 -21688 25719 -11590 -8302 20810
1617 20810 -17429 2031 13216 -17058 7483 7177 -16088 10703 2530 -14238 14886 -3808
1629 -3808 -10136 16705 -10270 -3940 15728 -16641 5031 10247 -17503 11730 1662 -13716 14516
1642 14516 -5778 -6602 13946 -9781 -1024 10450 -9965 1153 8606 -11585 4809 6733 -13867
$$ packed form
1557b8459K7703L0698o7697N5967k494n4802P3746l8845k6058P4060p0241J6294
1569a0128N0173q1237N6533P137o6364P8502l6484k9717P4498o7095J3918M7133
1581C6869p2071M5319J1462n8450O1536k0441l3370O1774m3367o599N0146n6365
1593b3557K0544K9879n8213M4113K676m7384N8550k7431k3736N7455n1366R765
1605h705L8007n8522L8547Q140m6666N0634k1019k2104M7407l7309L288K9112
1617B0810l8239J9460J1185l0274K4541l06k3265K6791q173j6768K9124j8694
1629c808o328K6841k6975O330J9668l2369K1672N216k7750K9233j0068j5378K8232
1642A4516k0294q24K0548k3727Q757J1474k0415J1118P453k0191J6394J924k0600
$$ plain form
1655 -13867 8957 2836 -15213 16321 -4791 -11051 19617 -15363 -1294 18108 -22199 11029
1667 11029 8717 -22259 21162 -4775 -15554 23482 -15082 -4094 19196 -21101 6696 11360
1679 11360 -21668 15151 3386 -18552 20649 -6203 -12714 23740 -16498 -3469 21821 -25356
1691 -25356 9478 13565 -28158 23196 -891 -22062 30654 -17639 -7568 27591 -29164 10027
1703 10027 14603 -29745 23560 -1016 -21753 27786 -14893 -8291 24310 -22701 3630 16036
1715 16036 -24728 14640 6813 -22591 20802 -4765 -16472 24714 -15389 -5147 23904 -24629
1727 -24629 7995 14783 -26392 21680 -354 -20208 26747 -15126 -6468 23102 -23245 7022
1739 7022 12079 -22036 16430 879 -15023 17742 -8462 -7764 15298 -12801 -226 12451 -13966
$$ packed form
1655a3867K2824o121j8049L1534k1112o260L0668l4980J4069J9402m0307L3228
1667A1029k312l0976M3421k5937j0779L9036l8564J0988K3290m0297K7797M664
1679A1360l3028L6819j1765k1938L9201k6852o511L6454m0238J3029K5290m7177
1691b5356L4834M087m1723N1354k4087k1171N2716m8293J0071L5159n6755L9191
1703A0027M576m4348N3305k4576k0737M9539m2679O602L2601m7011K6331J2406
1715A6036m0764L9368p827k9404M3393k5567j1707M1186m0103J0242K9051m8533
1727b4629L2624O788m1175M8072k2034j9854M6955m1873Q658K9570m6347L0267
1739G022N057l4115L8466j5551j5902L2765k6204O98K3062k8099J2575J2677k6417
$$ plain form
1752 -13966 5379 8510 -14325 9973 2804 -13412 14394 -5006 -8130 15764 -11937 -271
1764 -271 11506 -16152 7304 5405 -12860 12032 -2398 -8079 11886 -6498 -1769 8281 -7707
1777 -7707 1350 6535 -6746 1260 4960 -7821 3826 4170 -10072 7687 633 -9940 12450
1790 12450 -5643 -6408 13645 -12065 2231 10272 -15735 10236 2996 -12987 13675 -5295 -7073
1803 -7073 13709 -9550 -1180 11068 -10763 3258 7880 -12656 8352 3993 -13833 13429 -1935
1816 -1935 -10813 17585 -10835 -3935 17155 -18772 6990 10115 -21081 16862 -1756 -15126 21804
1829 21804 -12830 -3926 17761 -19491 6984 9775 -19294 14532 -449 -13667 17201 -8032
1841 -8032 -7417 15994 -12348 -569 13719 -16687 7177 8561 -19194 15497 -463 -15013 19985
$$ packed form
1752a3966J9345L131k2835K4298p169j6216K7806j9400l124K3894k7701J1666
1764b71J1777k7658K3456j899j8265K4892j4430n681J9965j8384M729J0050j5988
1777g707R057N185j3281Q006L700j2781J1647L44j4242J7759p054j0573K2390
1790A2450j8093p65K0053k5710J4296Q041k6007K5971p240j5983K6662j8970j778
1803g073K0782k3259Q370J2248k1831J4021M622k0536K1008m359j7826K7262j5364
1816a935q878K8398k8420O900K1090l5927K5762L125l1196L7943j8618j3370L6930
1829B1804l4634Q904K1687l7252K6475K791k9069L3826j4981j3218L0868k5233
1841h032O15K3411k8342J1779J4288l0406K3864J384k7755L4691j5960j4550L4998
$$ plain form
1854 19985 -11929 -5893 18982 -19872 5763 11551 -22197 15963 -733 -15769 19930 -11947
1866 -11947 -4604 16770 -17276 4469 8939 -16408 11621 2054 -11965 12864 -3284 -7851 13991
1879 13991 -7811 -3704 12116 -11646 2877 9303 -13947 8979 3158 -12252 14477 -5666
1891 -5666 -7134 14138 -12566 2222 9716 -14010 7998 2330 -10175 11052 -4397 -5066 8688
1904 8688 -6389 -1330 6366 -5973 587 4397 -6421 2078 4114 -7685 5401 2400 -9011
1917 -9011 8655 -2150 -7107 10749 -7226 -927 8359 -10468 4638 4032 -9802 8966 -1569
1930 -1569 -6579 9890 -5259 -2411 7143 -5959 -588 5764 -5945 2052 5083 -8575 4750
1943 4750 3148 -9945 10176 -2126 -8042 13122 -8816 -1718 12685 -14177 7150 5629 -14183
$$ packed form
1854A9985l1914O036K4875l8854K5635N788l3748L8160j6696j5036L5699l1877
1866a1947P343K1374l4046K1745M470k5347K8029r567j4019K4829j6148m567K1842
1879A3991k1802M107J5820k3762J4523O426k3250K2926n821j5410K6729k0143
1891e666j468K1272k6704J4788P494k3726K2008n668j2505K1227j5449o69J3754
1904H688j5077N059P696j2339O560L810j0818Q499K036j1799J3086l001j1411
1917i011J7666j0805m957J7856j7975O299R286j8827J5106o06j3834J8768j0535
1930a569n010J6469j5149K848R554j3102N371O352j1709P997L031j3658J3325
1943D750j602j3093K0121j2302n916K1164k1938P098J4403k6862K1327j521j9812
$$ plain form
1956 -14183 12688 -3360 -9323 13930 -9851 -884 10981 -12846 5439 5164 -11617 8289 597
1969 597 -9463 11226 -3364 -6236 12324 -7533 -2238 11380 -13013 4109 7491 -14793 11606
1982 11606 188 -12002 16496 -9780 -3955 14638 -15994 5212 7630 -15479 12959 -1638
1994 -1638 -9929 14128 -8164 -3270 10424 -10383 2457 7030 -10417 6120 2540 -9859 8438
2007 8438 -1208 -7340 11383 -4973 -4661 11490 -10225 2292 8101 -12920 8656 2548 -10833
2020 -10833 12969 -6457 -4820 12519 -10427 2618 6531 -10704 7169 225 -6956 8404 -2415
2033 -2415 -3659 6889 -4090 -1387 5305 -4851 257 5112 -6430 2139 3822 -7149 6045
2046 6045 698 -7033 9210 -4967 -2664 8843 -8571 2122 5012 -8961 7414 -256 -5498
$$ packed form
1956a4183K6871j6048n963K3253k3781Q967J1865k3827J8285k75j6781J9906p692
1969E97j0060K0689j4590k872J8560j9857N295J3618k4393J7122L382k2284K6399
1982A1606j1418j2190K8498k6276N825J8593l0632K1206K418k3109K8438j4597
1994a638q291K4057k2292M894J3694k0807J2840M573j7447J6537l580j2399J8297
2007H438r646o132J8723j6356L12J6151k1715J2517N809k1021K1576o108j3381
2020a0833K3802j9426J637J7339k2946J3045L913j7235J7873o944p181J5360j0819
2033b415j244J0548j0979K703O692j0156N108M855j1542Q569J683j0971J3194
2046F045n347p731J6243j4177K303J1507j7414J0693K890j3973J6375p670n242
$$ plain form
2059 -5498 7195 -4858 -1389 5309 -3790 -70 3788 -4028 546 3284 -5148 1278 2879 -6226
2073 -6226 4351 1346 -6588 8023 -3459 -4140 8932 -8223 1954 6341 -10544 6578 118
2086 118 -7067 9351 -4575 -3321 8175 -7239 1685 4682 -6464 3254 2270 -5897 4757 1061
2100 1061 -5873 5693 -2015 -4572 8026 -5687 -1673 7975 -9520 3424 5051 -10866 9201
2113 9201 -1814 -7673 11931 -8346 -603 9860 -10460 4754 3007 -9318 9428 -1798 -5429
2126 -5429 8088 -5301 -1518 6153 -6252 1528 5231 -6967 3557 3204 -8296 5856 -74
2139 -74 -6348 8376 -4016 -2743 9075 -8796 2249 5392 -11357 7654 -661 -6546 10096
2152 10096 -6497 -1921 7732 -8691 3293 3285 -6260 4857 95 -4392 5425 -1488 -2339 4930 -2857
$$ packed form
2059e498J2693j2053L469O698r099L720L858p816M574K738q432O426J601r105
2073f226J0577l005p934J4611j1482o81J3072j7155J0177M387j6885J7122o460
2086A18p185J6418j3926J254J1496j5414Q924K997j1146R718r84q167J0654l696
2100A061o934J1566p708k557J2598j3713M014R648j7495J2944J627j5917K0067
2113I201j1015n859J9604k0277P743J0463k0320J5214j747j2325J8746j1226l631
2126e429J3517j3389L783P671j2405P780L703j2198J0524l53j1500J4152n930
2139g4o274J4724j2392J273J1818j7871J1045L143j6749J9011q315n885J6642
2152A0096j6593M576R653j6423J1984qr545J1117m762m487R817o913q51P269p787
$$ plain form
2167 -2857 -1697 5178 -3671 -416 4988 -6739 2816 3108 -7670 6765 -2214 -4577 8196 -6146
2181 -6146 209 5878 -6290 4480 1979 -5802 5785 -2470 -1967 4952 -2803 -29 2944 -3038
2195 -3038 -214 1990 -2896 -173 1958 -3644 1584 2821 -4948 3675 -246 -4474 6874 -3775
2209 -3775 -951 5835 -6308 3481 1595 -5689 5820 -2197 -2819 5345 -3635 -93 3095 -4309 1504
2224 1504 2440 -2865 1596 1287 -2826 2118 821 -4068 4004 -854 -3414 6467 -4287 -445 5907
2239 5907 -7387 4188 2071 -6380 7244 -2670 -2501 7170 -5441 1817 3567 -5862 4083 107
2253 107 -3538 4717 -2343 -1752 3706 -2428 -1163 3851 -2288 -795 3495 -4370 1419 3086 -5650
2268 -5650 4918 331 -5291 7749 -4536 -2525 6687 -7658 3155 2383 -6621 6667 -2255 -3346
$$ packed form
2167b857J160O875q849L255N404j1727R555K92j0778J4435q979k363J2773j4342
2181f146O355N669j2168J0770k501p781J1587q255N03O919p755K774K973n982
2195c038K824K204m886K723K131n602N228J237p769Q623l921m228J1348j0649
2209c775K824O786j2143R789j886p284J1509q017o22Q164q980L542L188p404N813
2224A504R36n305M461l09m113M944j297m889Q072m858k560R881j0754L842O352
2239E907j3294J1575k117q451J3624r914J69R671j2611P258J750r429R945l976
2253A07l645Q255p060N91N458o134J265N014o139J493M290p865N789J667q736
2268e650J0568m587n622J3040j2285K011R212j4345J0813p72r004J3288q922j091
$$ plain form
2282 -3346 6616 -4573 785 3625 -5020 2311 856 -3048 2421 -1054 -1511 1966 -501 -2480 4019
2297 4019 -1012 -1932 4408 -4055 -711 3736 -5473 3470 1161 -5563 6153 -2138 -2299 5125 -5791
2312 -5791 1798 2418 -4701 4660 -1497 -2705 3239 -2067 -379 1957 -1879 313 781 -620 -130 2182
2328 2182 -1798 -880 2260 -3291 2131 849 -3623 4117 -2675 -1985 4089 -4297 1612 2138 -5200 4101
2344 4101 -1139 -2115 4739 -3424 91 2612 -2816 1492 435 -1225 1606 277 -477 -424 1053 -1607
2360 -1607 1022 475 -3342 3051 -962 -1600 4586 -3551 484 2753 -4609 3352 -486 -3241 4002
2375 4002 -4021 -41 2671 -4379 2412 218 -2425 2404 -994 -69 713 -529 215 1024 389 -1302
2391 -1302 1116 -677 -1527 3029 -2850 1151 2265 -4503 3861 -498 -3670 5056 -4083 391 3822
$$ packed form
2282c346R962j1189N358K840q645P331j455l904N469l475m57L477k467j979O499
2297D019n031r20O340q463L344M447r209Q943k309o724J1716q291j61P424j0916
2312e791P589O20p119R361o157j208N944n306J688K336l836K192M68j401M90K312
2328B182l980R18L140n551N422j282m472P740o792O90O074q386N909N26p338R301
2344D101n240r76O854q163L515K521n428M308j057j660K831j329p54N3J477k660
2360a607K629n47l817O393m013o38O186q137M035K269p362P961l838k755P243
2375D002q023L980K712p050O791k194k643M829l398R25P82j242P44Q09o35j691
2391a302K418j793q50M556n879M001J114o768Q364m359l172Q726r139M474L431
$$ plain form
2406 3822 -5392 3749 -258 -3115 3589 -2858 -492 2704 -2961 1700 805 -1753 463 -313 -879 -102
2422 -102 975 -1054 1199 1634 -2613 2583 -1210 -2057 3846 -3532 113 2462 -4302 3502 -780 -2625
2438 -2625 4795 -3145 -405 3077 -4015 2691 -274 -2832 2472 -1514 117 937 -1536 525 597 -602
2454 -602 -719 1090 184 -388 1728 -1404 -23 1853 -3178 2205 64 -2250 4089 -2269 252 2497
2470 2497 -3803 3031 268 -2362 2774 -1604 -559 1783 -2302 1325 -264 -1213 1294 -859 145
2485 145 -394 888 -503 -507 1520 -692 1659 439 -1813 2626 -1408 -690 2625 -3443 1707 419
2501 419 -2461 3337 -2162 -221 2362 -2713 1582 -291 -1274 2186 -1910 497 379 -1009 12 -203
2517 -203 714 -1343 281 531 -1493 2404 -478 -817 2576 -3463 1518 1187 -2750 3511 -2303 -828
$$ packed form
2406C822r214R141m007k857O704o447K366L196n665M661q95k558K216p76n66P77
2422a02J077k029K253M35m247N196l793q47N903p378L645K349o764P804m282j845
2438b625P420p940K740L482p092O706k965k558N304l986J631Q20k473K061P2j199
2454f02j17J809r06n72K116l132J381J876n031N383k141k314O339o358K521K245
2470B497o300O834k763k630N136m378J045K342m085L627j589r49K507k153J004
2485A45n39J282j391mK027k212K351j220k252M439m034P18L315o068N150j288
2501D19k880N798n499J941K583n075M295j873r83L460m096K407j18j388J021k15
2517b03R17k057J624K50k024L897k882l39L393o039M981l31l937O261n814J475
$$ plain form
2533 -828 3825 -2860 1870 -93 -2599 2536 -1859 -32 1217 -2222 1562 -429 -810 559 93 597
2549 597 -650 573 255 -763 1154 -1410 958 1136 -2763 2851 -1261 -1186 2888 -2020 1623 1125
2565 1125 -2926 2526 -1550 -971 2336 -2499 1530 38 -1976 2375 -2175 -142 888 -782 857
2580 857 -678 311 -577 -766 930 -1910 1040 -51 -1081 1693 -2469 665 1379 -2430 2406 -591
2596 -591 -392 2927 -3193 1363 242 -2494 2700 -1177 523 1657 -1486 1006 -793 -821 1338 -933
2612 -933 861 -635 204 1083 -739 980 -301 -928 968 -1808 1161 -230 -1948 1620 -1872 170
2628 170 605 -2548 2362 -1370 -838 2081 -2215 771 496 -1136 1815 -1494 827 334 -501 1584
2644 1584 -856 433 86 -866 1424 -598 6 1703 -1278 2335 -1060 -447 2132 -2236 2125 -176
$$ packed form
2533h28M653o685M730j963k506N135m395J827J249l439L784j991l81J369m66N04
2549E97j247J223l18j018J917k564K368J78l899N614m112P5M074m908L643m98
2565A125m051N452m076N79L307m835M029j492k014M351m550K033J030j670J639
2580H57j535R89q88j89J696k840K950j091j030K774m162L134P14l809M836k997
2596e91J99L319o120M556j121k736N194l877J700J134l143K492j799k8K159k271
2612i33J794j496Q39Q79j822J719j281o27J896k776K969j391j718L568l492K042
2628A70M35l153M910l732N32K919m296K986k75j632K951l309K321m93q35K085
2644A584k440J289l47r52K290k022O04J697k981L613l395O13K579m368M361k301
$$ plain form
2660 -176 -1377 2385 -1677 127 638 -1945 2455 -646 -778 2423 -1790 664 -390 -1249 773 -1436
2676 -1436 1324 -437 -396 1607 -1240 785 -488 -499 1848 -1813 751 -18 -1645 2334 -1668 -620
2692 -620 1666 -2044 1388 -1228 -1514 1290 -1838 1044 -66 -1701 1745 -1189 -303 714 -1476 1873
2708 1873 -1822 -77 429 -869 1982 -469 733 1087 -1279 995 -745 -1227 1480 -1885 2042 -208
2724 -208 -1356 2236 -1879 776 1206 -1765 1534 -1258 -25 1632 -2176 1640 -493 -900 1460 -1936
2740 -1936 964 -21 -1123 1781 -687 -56 -57 -1782 757 -1323 47 473 -1803 1654 -1497 -1025 1689
2757 1689 -1376 1767 -1049 -1273 2042 -1051 262 348 -1315 2282 -1137 154 1273 -1836 1107 -788
2773 -788 -34 1311 -1334 804 -891 -1411 1412 -1574 842 -29 -1914 1278 -1146 363 1264 -845
$$ packed form
2660a76j201L762m062J804N11k583M400l101j32L201m213K454j054q59K022k209
2676a436K760j761M1K003k847K025j273j1K347l661K564p69j627L979m002J048
2692f20K286l710L432k616k86K804l128K882j110j635L446k934Q86J017k190L349
2708A873l695J745N06j298K851k451J202L54k366K274j740m82K707l365L927k250
2724b08j148L592m115K655M30k971L299k792J233J657l808L816k133m07K360l396
2740a936K900r85j102K904k468O31jj725K539k080J370M26k276L457l151M72K714
2757A689l065L143k816k24L315l093J313Q6j663L597l419J291J119l109K943j895
2773g88P54J345k645K138j695n20K823k986K416q71j885L192k424J509R01k109
$$ plain form
2789 -845 1308 -850 1 777 -1369 1791 -380 -206 1182 -1652 794 254 -1000 1328 -1579 159
2805 159 153 -1253 1281 -1124 -189 1017 -2010 1625 -943 -484 585 -748 1307 -935 -801 1719 -1765
2822 -1765 1130 704 -1438 1762 -1080 880 946 -887 2152 -1488 -176 1704 -1695 795 -921 -977
2838 -977 1849 -1833 470 -357 -836 1141 -371 786 22 -1504 1944 -1490 -132 332 -1004 1604
2854 1604 -1111 -438 1116 -1867 1069 35 -133 1019 -1201 929 -351 -1542 1216 -967 609
2869 609 537 -1501 1630 -1242 -912 930 -1519 994 119 -493 1070 -1356 1272 -527 -511 1706 -1374
2886 -1374 774 -38 -1233 1330 -1137 509 703 -1784 1809 -616 -747 1430 -1581 1337 -146 -885
2902 -885 1173 -748 1508 -66 -1708 1489 -1160 613 561 -1207 1780 -728 313 734 -1153 1927
$$ packed form
2789h45K153k158Q51P76k146L160k171J74J388k834K446n40j254K328k907J738
2805A59oj406K534k405R35J206l027L635k568M59J069j333K055k242J34K520l484
2822a765K895m26k142L200k842J960O6j833L039l640J312J880l399K490j716n6
2838i77K826l682K303q27m79J977j512J157p64j526L448l434J358M64j336K608
2854A604k715O73J554k983K936j034j68J152k220K130j280j191K758k183J576
2869F09p2k038L131k872L30J842k449K513q75o12J563k426K628j799J6K217l080
2886a374K148q12j195K563k467J646J94k487L593k425j31K177l011K918j483p39
2902h85K058j921K256j574j642L197k649J773n2j768K987k508J041M21j887L080
$$ plain form
2918 1927 -799 -214 1270 -1403 1172 -663 -197 1547 -1097 399 154 -1022 2251 -1209 -773 1413
2934 1413 -1782 2017 -599 -589 688 -1358 522 -114 -890 991 -873 962 -394 -1268 1454 -1492
2950 -1492 582 570 -1485 1120 -618 -566 972 -1304 2216 -1210 -534 2005 -1579 707 -30 -973 1846
2967 1846 -1747 339 832 -1638 1128 -357 -354 704 -1860 1056 -286 -546 688 -1375 1044 -424
2983 -424 -568 1306 -2169 136 -28 -780 1171 -733 373 118 -1935 1184 -1042 -493 1988 -2414
2999 -2414 1482 -236 -154 1912 -1326 1188 310 -1277 1587 -368 340 130 -1254 914 -605 44
3015 44 4 -1234 1729 -436 -31 1120 -1010 654 -475 -742 2267 -1842 751 520 -1129 1385 -868
3032 -868 118 324 -1501 1504 -677 -339 1615 -1191 1139 -568 -1391 873 -2049 1240 -72 -1029
$$ packed form
2918A927k726N85J484k673K575j835M66J744k644J496k45j176L273l460M36K186
2934A413l195L799k616J0J277k046J880o36p76J881j864J835j356q74K722k946
2950a492K074j2k055K605j738N2J538k276L520l426O76K539l584K286p37r43K819
2967A846l593K086M93k470K766j485LJ058k564K916j342k60J234k063K419j468
2983d24j44J874l475K305j64p52J951j904J106k55k053L119k226N49K481m402
2999b414L896j718Q2K066l238K514q78j587K864j955P08k10j384K168j519O49
3015D4m0j238K963k165M05J151k130J664j129k67L009m109K593k31j649K514k253
3032h68R86K06j825L005k181L38J954k806K330j707q23K264k922L289j312r57
$$ plain form
3048 -1029 1079 -1601 301 43 -1219 1583 -895 -77 811 -1606 862 -694 -104 1400 -1670 1314
3064 1314 94 -131 995 -1765 199 -102 -1771 1448 -1043 -311 538 -1183 1179 -1040 203 225
3080 225 -2279 861 612 -1090 1177 -1011 1394 -623 -129 1682 -1531 896 422 -1827 1922 -1287
3096 -1287 -76 1034 -2241 716 -733 -1057 1870 -1329 1712 676 -287 853 -1589 424 558 -912
3112 -912 756 -1114 371 892 -676 609 -408 236 519 -1386 1231 -656 -300 896 -1513 1114
3128 1114 404 -1143 1366 -875 -9 1135 -904 1857 -6 68 548 -913 781 -454 -562 1170
3144 1170 -1317 678 588 -876 714 -760 505 -85 -172 1261 -454 396 771 -1565 1471 -1455 -9
3161 -9 1941 -1032 1325 -723 -405 1496 -862 977 468 -822 191 -664 -60 668 -419 548 83
$$ packed form
3048a029K108k680J902k58j262K802k478Q18Q88k417K468j556N90J504l070K984
3064A314j220k25J126k760J964l01j669L219k491P32Q49j721K362k219J243K2
3080B25k504L140k49j702K267k188K405k017M94J811l213K427m74k249L749l209
3096a287J211J110l275K957j449l24K927l199L041j036r63J140k442K013J34j470
3112i12J668j870J485N21j568J285j017O44K83j905K617j887L56J196k409K627
3128A114p10j547K509k241Q66J144k039K761j863P4M80j461J694j235j08J732
3144A170k487J995r0j464J590j474J265n90q7J433j715Q50L75k336L036k926J446
3161iJ950k973K357k048L18J901k358J839n09j290J013q55O04P28j087R67m65
$$ plain form
3178 83 -927 764 -1435 1154 -496 -162 1485 -1395 1389 -358 -783 1443 -1204 104 -183 -1467
3194 -1467 1549 -1083 311 1411 -2325 1021 -37 -1059 578 -1862 1366 -528 -672 1720 -375
3209 -375 970 629 -465 944 -234 466 580 -1063 1098 -1437 58 710 -869 880 -472 -906
3225 -906 951 -475 543 -225 -697 1327 -1239 540 833 -1398 1184 -486 404 861 -993 1149
3241 1149 -288 179 1621 -806 620 67 -517 819 -965 1299 -319 -760 2022 -941 -36 605
3257 605 -1774 1915 -1454 -76 1292 -1604 1445 227 -543 1468 -1129 469 546 -911 1873 -585
3273 -585 178 631 -816 1068 -1005 -35 877 -1083 944 -550 -283 865 -867 785 -153 -872 1698
3290 1698 -1354 680 639 -1133 1571 -1141 109 1018 -1312 1140 247 -538 1291 -778 661 -377
$$ packed form
3178H3j010J691k199K589j650L34J647k880K784j747m25K226k647J308k87j284
3194a467L016k632J394J100l736L346j058j022J637k440L228j894j44K392k095
3209c75J345l41j094J409j178P00J14j643K161k535J495O52j579J749j352m34
3225i06J857j426J018p68m72K024k566J779K93k231K582j670Q90M57j854K142
3241A149j437M67J442k427J426n53n84J336j784K264j618m41K782k963R05O41
3257F05k379L689l369J378J368k896L049j218p70K011k597J598P7j457K784k458
3273e85P63M53j447J884k073R70R12j960K027j494K67J148j732J652r38p19K570
3290A698l052K034m1j772K704k712J250R09k330K452q93p85J829k069J439j038
$$ plain form
3306 -377 -598 778 -1891 806 217 -452 1262 -1005 143 476 -661 625 -617 731 883 -1415
3322 -1415 1537 -958 -445 1510 -1917 1179 108 -497 2367 -751 216 926 -1728 1014 -196 -313
3338 -313 782 -1154 1904 -520 -102 1244 -1094 655 -220 -465 1559 -804 578 -318 -643 1373
3354 1373 -1545 453 637 -1854 639 -999 -426 1434 -1666 1016 -539 -374 911 -657 177 -562
3370 -562 -814 1035 -304 934 179 -354 571 -679 374 212 -879 870 -561 -186 618 -795 1435
3387 1435 -216 -197 1728 -868 638 610 -1674 1791 -1118 -554 675 -852 651 -63 -831 1182 -1256
3404 -1256 445 -73 -32 480 -786 1231 -927 16 1075 -1235 1678 -236 -260 1740 -1628 1206 901
3421 901 -2095 1602 -553 -233 1210 -2003 1219 431 -1348 1657 -566 -323 528 -1089 234 246 931
$$ packed form
3306c77k21J376k669K697n89o69J714k267J148L33j137J286j242J348J52k298
3322a415K952k495N13J955l427L096j071o05K864l118R67P10k654K742j210j17
3338c13J095j936L058k424M18J346k338J749q75k45K024k363J382q96l25K016
3354A373k918J998J84k491K493j638N73J860l100K682j555J65J285j568Q34p39
3370e62k52J849j339J238p55n33R25j250J053j62j091J749j431L75Q04j413K230
3387A435j651J9J925k596J506k8k284L465k909N64J229j527J503p14p68K013k438
3404a256J701n18M1N12j266K017k158R43J059k310K913j914k4K000l368K834l05
3421I01k996L697k155L20J443l213L222p88j779L005k223K43Q51j617J323J2O85
$$ plain form
3438 931 931 89 784 -521 1026 -368 -228 1576 -138 103 1233 -1827 1313 -645 -409 1852 -1319
3455 -1319 693 721 -1908 1757 -1238 -912 1857 -1817 1372 501 -553 932 -1008 181 -121 -553
3471 -553 479 -300 767 21 -416 1082 -856 699 445 -802 1595 -540 389 1067 -2114 1752 -305
3488 -305 -835 1830 -560 1025 -416 -1276 899 -635 -116 408 84 960 -52 -39 733 -554 129 -678
3506 -678 625 170 -803 672 -157 -150 868 -2210 522 -408 -559 866 -1330 512 432 -1177 858 578
3524 578 -1136 1481 -1361 560 864 -206 769 745 120 -542 -525 -129 -509 600 383 -757 656 -822
3542 -822 -80 42 -1018 1950 -578 -455 1116 -1455 2133 -527 -1249 1938 -815 181 843 -725 1676
3559 1676 81 -753 981 -508 705 -23 11 650 -471 613 -513 189 572 -1162 819 -800 137
$$ packed form
3438I31%q42O95j305J547j394J40J804j714K41J130l060L140j958K36K261l171
3455a319K012K8k629L665k995L26K769l674L189q71j054J485j940J189l02m32
3471e53J032p79J067p46m37J498j938J555k54j247K397k135R29O78l181L866k057
3488c05n30K665k390J585j441q60K175j534N19N24l24Q76j012J3P72j287O83q07
3506f78J303m55r73J475q29PJ018l078K732r30j51J425k196J842q0j609K035k80
3524E78j714K617k842J921L04j070R75k4o25o62J7L96l80J109k17j140J413j478
3542h22P42J22j060K968k528J23J571k571L588k660p22L187k753R96O62j568K401
3559A676j595q34J734j489J213p28L4O39j121J084j126P02L83j734J981j619R37
$$ plain form
3576 137 1597 -1875 1661 -276 -1043 1648 -2082 281 761 -1627 764 -770 -845 1930 -1560 157
3592 157 314 -831 731 500 101 616 -758 982 264 43 -435 -161 731 -542 842 256 -1710 1490
3610 1490 -1463 -276 1917 -2090 867 170 -967 2201 -1049 205 2125 -1382 997 403 -956
3625 -956 1112 -688 -28 -27 -419 203 -546 489 -89 -678 162 -727 812 -621 -60 1217 -648 695
3643 695 553 -934 1788 -1012 -247 1123 -1181 1211 -42 -719 1212 -499 253 685 -875 1316
3659 1316 -269 -272 254 -764 547 -942 -14 -622 -91 638 -949 50 722 -1174 1577 -1285 -823 1093
3677 1093 -2010 -4 474 -1819 1983 -711 -651 1200 -1270 942 -15 -927 479 80 244 -97 -595
3694 -595 213 75 -201 -108 -459 566 -852 1598 -163 -1487 1725 -1262 266 915 -2740 1178 -982
$$ packed form
3576A37J460l472L536j937p67K691l730K363M80k388K391j534p5K775l490J717
3592A57J57j145J562k31l99N15j374J740p18k21m78K74Q92j273J384n86j966L200
3610A490k953J187K193m007K957o97j137L168l250J254J920l507K379n94j359
3625i56K068j800O60Jl92O22p49J035n78n89Q40q89J539j433N61J277j865J343
3643F95j42j487K722k800P65J370k304K392j253o77J931j711P52M32j560K191
3659A316j585lN26j018J311j489R28o08N31P29j587R99O72j896K751k862M62J916
3677A093l103K006M78k293L802k694O0J851k470K212r57r12J406l99J64l41m98
3694e95Q08j38k76R3l51J025j418K450j761j324L212k987J528O49l655L918k160
$$ plain form
3711 -982 -749 2174 -1841 419 1090 -1547 1415 -988 -424 1403 -1079 -100 27 -977 139 553 -100
3728 -100 -185 1050 -380 -683 561 -1290 630 627 -1435 1415 -879 -226 1152 -2019 -106 1490 -1962
3745 -1962 1435 -828 -1053 1867 -1336 254 983 -1686 1015 -294 -103 376 -333 27 245 -260 -476
3762 -476 198 310 -1287 1007 -538 -835 1631 -1623 339 615 -1554 1430 -1173 -956 2648 -881
3778 -881 154 762 -1506 1394 -1047 -387 1482 -914 228 196 55 -374 -124 301 -69 748 83 -503
3796 -503 344 -216 145 792 -1617 1691 492 -1763 1462 -1201 1089 946 -1892 1361 -556 -1395 1606
3813 1606 -1294 -225 68 -1563 417 -298 -734 -153 -339 329 -882 23 -495 381 739 -1431 439
3830 439 465 -961 1993 -1068 -73 1651 -1610 1492 692 -1853 2218 -195 -374 836 -1395 929
$$ packed form
3711i82K33K923m015K260O71k637K962k403N64J827k482R79J27j004J116M14o53
3728a00q5J235j430l03J244j851J920lk062K850k294O53J378l171J913J596l452
3745a962L397k263k25K920l203J590P29k669K701j309J91M79p09L60K18n05k16
3762d76O74J12j597K294j545k97K466l254J962K76k169K984k603K17L604l529
3778h81J035O08k268K900k441O60J869k396J142l2j41m29K50M25l70Q17o65n86
3796e03Q47n60L61O47k409L308j199k255L225k663K290j43k838L253j917q39L001
3813A606k900J069K93j631J980p15m36N81j86O68j211R05n18Q76L58k170J870
3830D39K6j426K954l061R95J724l261L102q00k545M071k413j79J210k231K324
$$ plain form
3846 929 382 -446 1457 -560 40 915 -197 -997 74 248 -595 246 -745 -518 947 -1065 562 1207
3864 1207 -1750 1275 643 -2165 2160 -1476 -885 1820 -1459 889 488 -1156 1827 -681 -871 1442
3880 1442 -1710 250 938 -1318 816 66 -544 118 732 -1036 543 209 -1510 1574 -136 -420 1451
3897 1451 -1407 -478 1612 -2198 1201 504 -1353 1950 -1059 -732 1659 -1497 593 655 -1080 1347
3913 1347 -203 -151 1083 29 409 21 253 -158 966 -259 -126 914 103 59 1467 -1050 950
3930 950 1057 -1344 1615 -357 -52 986 -1367 327 552 -1298 2058 -1292 -629 1400 -473 21
3946 21 -32 -79 -83 -251 -397 44 1108 376 109 1053 -1195 643 231 -1801 1373 -337 -1096 1811 -1621
3965 -1621 -74 1277 -1861 355 -229 -1509 1722 -770 -600 903 -961 617 471 -531 366 619
$$ packed form
3846I29n47q28J903k017O00Q75j112q00J071J74q43Q41r91K27J465k012J627O45
3864A207k957L025o32k808M325l636N91K705l279K348m01j644K983k508j90K313
3880A442l152J960O88k256K134p50o10O62O14j768J579l34j719L084j710k84J871
3897A451k858R29K090l810L399o97j857L303l009L27K391l156K090O2j735K427
3913A347j550N2J234j054L80l88K32m11J124j225J33J040q11m4J408k517K000
3930I50J07k401K959j972L05J038k353J694K25j850L356l350O63K029j873M94
3946B1n3m7mj68j46M41J064p32k67R44k248J838m12k032L174j710p59K907l432
3965a621J547J351l138K216n84j280L231k492J70J503j864J578j46j002Q97K53
$$ [...]
8191D97
##END NTUPLES=NMR FID
##END=
