##TITLE=1H_K-482/1.2.4
 CDCl3
 8 sc, 
 6.10.2023
##JCAMPDX= 6.0         $$ Bruker NMR JCAMP-DX V2.0
##DATA TYPE= NMR FID
##DATA CLASS= NTUPLES
##ORIGIN= UXNMR, Bruker Analytische Messtechnik GmbH
##OWNER= root
$$ XWIN-NMR		Version 3.5
$$ Fri Oct  6 13:48:15 2023 Russian Standard Time (UT+4h)  she@DPX200
##.OBSERVE FREQUENCY= 200.13135
##.OBSERVE NUCLEUS= ^1H
##.DELAY= (6, 6)
##.ACQUISITION MODE= SIMULTANEOUS
##.ACQUISITION SCHEME= undefined
##.AVERAGES= 8
##.DIGITISER RES= 18
##SPECTROMETER/DATA SYSTEM= spect
##.PULSE SEQUENCE= zg30
##.SOLVENT NAME= DMF
##.SHIFT REFERENCE= (INTERNAL, DMF, 0, 15.7039)
##AUDIT TRAIL= $$ (NUMBER, WHEN, WHO, WHERE, WHAT)
$$ ##TITLE= Audit trail, XWIN-NMR		Version 3.5
$$ ##JCAMPDX= 5.01
$$ ##ORIGIN= Bruker BioSpin GmbH
$$ ##OWNER= she
$$ F:/spectra/data/she/nmr/H-F/1/audita.txt
$$ ##AUDIT TRAIL=  $$ (NUMBER, WHEN, WHO, WHERE, WHAT)
(   1,<2023-10-06 13:46:31.93 +0400>,<she>,<DPX200>,
      <created by zg, POWCHK disabled, PULCHK disabled
       configuration hash MD5:
       00 E9 B6 7A A2 85 ED C7 34 08 36 98 17 FE 4E 26
       data hash MD5: 16K
       73 36 2E B3 CB F9 AC D3 30 F3 24 2F A8 F8 70 F3>)
$$ ##END=
$$ 
$$ hash MD5
$$ F9 57 37 13 59 86 18 54 19 40 77 5F E2 B1 6E 04
##$RELAX= 
##$RELAX= 
##$RELAX= 
##$RELAX= 
##$RELAX= 
##$RELAX= 
$$ Bruker specific parameters
$$ --------------------------
##$DU= <F:/spectra>
##$EXPNO= 1
##$NAME= <H-F>
##$PROCNO= 1
##$TYPE= <nmr>
##$USER= <she>
##$AMP= (0..31)
100 100 100 100 100 100 100 100 100 100 100 100 100 100 100 100 100 100 
100 100 100 100 100 100 100 100 100 100 100 100 100 100 
##$AQSEQ= 0
##$AQ_mod= 1
##$AUNM= <au_zg>
##$AUTOPOS= <>
##$BF1= 200.13
##$BF2= 200.13
##$BF3= 200.13
##$BF4= 200.13
##$BF5= 200.13
##$BF6= 200.13
##$BF7= 200.13
##$BF8= 200.13
##$BYTORDA= 1
##$CFDGTYP= 0
##$CFRGTYP= 5
##$CHEMSTR= <none>
##$CNST= (0..31)
1 1 145 1 1 1 1 1 1 1 1 1 1 1 1 1 1 1 1 1 1 1 1 1 1 1 1 1 1 1 1 1 
##$CPDPRG= <>
##$CPDPRG1= <>
##$CPDPRG2= <>
##$CPDPRG3= <>
##$CPDPRG4= <mlev>
##$CPDPRG5= <mlev>
##$CPDPRG6= <mlev>
##$CPDPRG7= <mlev>
##$CPDPRG8= <mlev>
##$CPDPRGB= <>
##$CPDPRGT= <>
##$D= (0..31)
0 1.2 0 0 0 0 0 0 0 0.06 0 0.03 0 0 0 0 0.0002 0 0 0 0 0 0 0 0 0 0 0 0 
0 0 0 
##$DATE= 1696585591
##$DBL= (0..7)
120 120 120 120 120 120 120 120 
##$DBP= (0..7)
150 150 150 150 150 150 150 150 
##$DBP07= 0
##$DBPNAM0= <>
##$DBPNAM1= <>
##$DBPNAM2= <>
##$DBPNAM3= <>
##$DBPNAM4= <>
##$DBPNAM5= <>
##$DBPNAM6= <>
##$DBPNAM7= <>
##$DBPOAL= (0..7)
0.5 0.5 0.5 0.5 0.5 0.5 0.5 0.5 
##$DBPOFFS= (0..7)
0 0 0 0 0 0 0 0 
##$DE= 6
##$DECBNUC= <off>
##$DECIM= 32
##$DECNUC= <off>
##$DECSTAT= 4
##$DIGMOD= 1
##$DIGTYP= 9
##$DL= (0..7)
0 120 120 120 120 120 120 120 
##$DP= (0..7)
150 150 150 150 150 150 150 150 
##$DP07= 0
##$DPNAME0= <>
##$DPNAME1= <>
##$DPNAME2= <>
##$DPNAME3= <>
##$DPNAME4= <>
##$DPNAME5= <>
##$DPNAME6= <>
##$DPNAME7= <>
##$DPOAL= (0..7)
0.5 0.5 0.5 0.5 0.5 0.5 0.5 0.5 
##$DPOFFS= (0..7)
0 0 0 0 0 0 0 0 
##$DQDMODE= 0
##$DR= 18
##$DS= 0
##$DSLIST= <SSSSSSSSSSSSSSS>
$$ [...]
##$SUBNAM2= <"">
##$SUBNAM3= <"">
##$SUBNAM4= <"">
##$SUBNAM5= <"">
##$SUBNAM6= <"">
##$SUBNAM7= <"">
##$SUBNAM8= <"">
##$SUBNAM9= <"">
##$SW= 18.05172834244
##$SWIBOX= (0..15)
0 0 2 0 0 0 0 0 0 0 0 0 0 0 0 0 
##$SW_h= 3612.71676300578
##$TD= 16384
##$TD0= 1
##$TE= 0
##$TE2= 300
##$TE3= 300
##$TEG= 300
##$TL= (0..7)
0 120 120 120 120 120 120 120 
##$TP= (0..7)
150 150 150 150 150 150 150 150 
##$TP07= 0
##$TPNAME0= <>
##$TPNAME1= <>
##$TPNAME2= <>
##$TPNAME3= <>
##$TPNAME4= <>
##$TPNAME5= <>
##$TPNAME6= <>
##$TPNAME7= <>
##$TPOAL= (0..7)
0.5 0.5 0.5 0.5 0.5 0.5 0.5 0.5 
##$TPOFFS= (0..7)
0 0 0 0 0 0 0 0 
##$TUNHIN= 0
##$TUNHOUT= 0
##$TUNXOUT= 0
##$USERA1= <user>
##$USERA2= <user>
##$USERA3= <user>
##$USERA4= <user>
##$USERA5= <user>
##$V9= 5
##$VALIST= <valist>
##$VCLIST= <CCCCCCCCCCCCCCC>
##$VD= 0
##$VDLIST= <DDDDDDDDDDDDDDD>
##$VPLIST= <PPPPPPPPPPPPPPP>
##$VTLIST= <TTTTTTTTTTTTTTT>
##$WBST= 1024
##$WBSW= 4
##$XGAIN= (0..3)
0 0 0 0 
##$XL= 0
##$YL= 0
##$YMAX_a= 68383
##$YMIN_a= -76918
##$ZGOPTNS= <>
##$ZL1= 120
##$ZL2= 120
##$ZL3= 120
##$ZL4= 120
##$ABSF1= 10
##$ABSF2= 0
##$ABSG= 5
##$ABSL= 3
##$ALPHA= 0
##$AQORDER= 0
##$ASSFAC= 0
##$ASSFACI= 0
##$ASSFACX= 0
##$ASSWID= 0
##$AUNMP= <proc_1d>
##$AZFE= 0.1
##$AZFW= 0.1
##$BCFW= 1
##$BC_mod= 2
##$BYTORDP= 1
##$COROFFS= 0
##$CY= 11.3945322036743
##$DATMOD= 1
##$DC= 2
##$DFILT= <>
##$DTYPP= 0
##$F1P= 15.7292609196834
##$F2P= 12.9074282941183
##$FCOR= 0.5
##$FTSIZE= 0
##$FT_mod= 4
##$GAMMA= 1
##$GB= 0.15
##$INTBC= 1
##$INTSCL= 1
##$ISEN= 128
##$LB= 0.24
##$LEV0= 0
##$LPBIN= 0
##$MAXI= 10000
##$MC2= 0
##$MEAN= 0
##$ME_mod= 0
##$MI= 1.114404
##$NCOEF= 0
##$NC_proc= 0
##$NLEV= 6
##$NOISF1= 3.799351
##$NOISF2= 2.8
##$NSP= 1
##$NTH_PI= 0
##$NZP= 0
##$OFFSET= 15.70392
##$PC= 1
##$PHC0= -22440.97
##$PHC1= 36.05271
##$PH_mod= 1
##$PKNL= yes
##$PPARMOD= 0
##$PSCAL= 0
##$PSIGN= 0
##$REVERSE= no
##$SF= 200.130013532006
##$SI= 16384
##$SIGF1= 3
##$SIGF2= 2
##$SINO= 400
##$SIOLD= 16384
##$SREGLST= <1H.CDCl3>
##$SSB= 0
##$STSI= 0
##$STSR= 0
##$SW_p= 3612.71676300578
##$SYMM= 0
##$S_DEV= 0
##$TDeff= 0
##$TDoff= 0
##$TI= <>
##$TILT= no
##$TM1= 0
##$TM2= 0
##$TOPLEV= 0
##$USERP1= <user>
##$USERP2= <user>
##$USERP3= <user>
##$USERP4= <user>
##$USERP5= <user>
##$WDW= 1
##$XDIM= 8192
##$YMAX_p= 0
##$YMIN_p= 0
$$ End of Bruker specific parameters
$$ ---------------------------------
##NTUPLES= NMR FID
##VAR_NAME=  TIME,          FID/REAL,        FID/IMAG
##SYMBOL=    X,             R,               I
##VAR_TYPE=  INDEPENDENT,   DEPENDENT,       DEPENDENT
##VAR_FORM=  AFFN,          ASDF,            ASDF
##VAR_DIM=   8192,          8192,            8192
##UNITS=     SECONDS,       ARBITRARY UNITS, ARBITRARY UNITS
##FACTOR=    0.0002768,     1,               1
##FIRST=     0,             0,               0
##LAST=      2.2672688,     0,               0
##MIN=       0,             -76918,          0
##MAX=       2.2672688,     68383,           0
$$ Real data points
##PAGE= N=1
##DATA TABLE= (X++(R..R)), XYDATA
$$ [...]
1816C1l12M79J34m34O31j55j90M14j61l05K46r3P1Q9m62K28k53j73jM2J1J75l05
1839b93K16J1j75J46m16J89K05j6K47l25K99L47k03j01L23m69L21j81j74N51l64
1860A38J3K16j81j60j12r2J21j16l9R0l26J49L51k87j31j1J23J78k36M18q6M7
1882F7K36k63J27R1Lj25K59n2l8k39J86K4j54q9k5O3k9k84l26M09k50J63k1l82
1906f49M89Q0j04M28o39M48Rl54K10L93m9J9k0k13M93n50J71J26j67K73J07n45
1928d4K24k71j1K19n33K47q2l18L04p3r8Q5O1r8K98K7J32m8j30L39l9O5K25m42
1952C9M06l13R0K08n01J84K85k52J62m16j59L32k67l42K95P2p7jLj44K4K16L03
1975A47n47M01Q2j05J13J98p2O5k07M44n7k25K21j99o0J8k73K61O6m43K0J19l50
$$ y = [31, -281, 198, 332, -102, 529, 374, 184, 598, 437, 132, 378, 285, 356, 445, -17, 211, -42, -215, -216, -174, -163, 12, -293, -77, -66, -241, -95, -511, -322, -117, -133, 114, -211, 88, 435, 232, 131, 454, -15, 306, 125, -49, 502, 138, 151, 367, 186, 26, -86, -178, -57, -173, -212, -122, -448, -299, 52, -235, -366, -377, -254, -76, -312, 106, 20, 67, 303, 40, 167, 258, 261, 136, 395, 343, 305, 66, 252, 276, 122, 33, 8, 71, 42, -242, -568, -159, -409, -246, -267, -649, -160, -80, -184, 244, -395, 53, 62, -292, -82, 311, 262, 281, 261, 48, 541, -9, 162, 288, 121, 394, 501, -44, 180, -91, -102, 117, -416, -169, -251, -569, -265, -338, -436, -351, -290, -388, -90, -63, 69, 21, -109, 230, 191, 256, 481, 39, 445, 132, 222, 430, -71, 113, 398, 146, 308, -108, -267, 65, -202, -544, -249, -177, -254, -255, -252, -396, -372, -156, 147, -400, 1, 83, -22, 91, 289, 217, 282, 75, 519, 462, 237, 458, 259, 199, 217, -56, 205, 271, -172, -152, -33, -383]
1998c83L45j84q7J47l34L67j33K5J13q4O5J81J18J20k49l4N12l19M2J80l86M80
2020E02q5j53O9k05P1j53l76M65p2k98J9j00M0L63n12J44J15l4lK2p7M82j79l36
2044b91N24l87M73l19J05L06j37k78N69o56L49j98r7L91l96Q1J9l02L3M0m50M47
2066a74K3l41K05LK53k32p1M25k69M8K62K31j73K71k46j8K86k99J39j81R3K55
2088D90o42K13J13k53L8Nk02Oq1M8m0k66L89k14j24M50m2On8O4K08p0k62L36O0
2113A72K6J44l52M26l07J71k29k6j64J87k28L27m06J40j84K2k00L81j30j2L21
2134G9l87N01m30o4M42k50K82K42m23L93j91K4J27M1j9m8k15K41j94m14N09j80
2156F6k37Q9j56K23n0l84K88j43OK93m95M57J67l09J44j71m6N46l28L44J29r9
$$ y = [-383, -38, -222, -309, -162, -496, -129, -262, -237, -124, -208, -143, 38, 156, 276, 27, -7, 505, 186, 228, 408, 22, 502, 417, 264, 333, 128, 199, 46, -330, 135, 63, -235, -216, -316, -276, 87, -425, -281, -166, -200, -203, -181, -258, 224, 45, -291, 233, -154, 319, 0, 105, 411, 274, -4, 565, -91, 258, 60, -37, 354, -42, 39, 58, -244, -211, -171, -621, -174, -151, -492, -287, -284, -31, -263, -334, 91, -178, -130, 132, 363, 190, 461, 215, 197, 483, 184, 323, 142, 235, 490, -152, 61, 174, -79, -41, -36, -238, -232, -313, -265, -305, -571, -182, -396, -520, -70, -112, -106, -164, -100, 108, 38, -224, 112, 172, 198, 342, -10, 416, 109, 280, 51, 25, -139, 48, -180, 147, -259, -119, -303, -281, -481, -100, -230, -242, 79, -308, 193, -237, -301, 141, -109, 173, 415, -8, 385, 194, 218, 345, 386, 367, 319, 104, 345, 151, -263, 246, 66, -171, -82, -238, -15, -65, -449, -161, -304, -298, -5, -500, -43, 124, -185, -41, -212, -258, 288, -40, 304, 433, 334]
2178C34pn0j06J82r2l10R1k8M0j06J41K4j90r2K26n61K54O2r3K25k90J70J74o4
2202f6P4K37l16M60l45J39K16l32J83K9J26o5j00m53O40m11o5J73j80R3Qm88L78
2225f5j96MM4n5p0M0J35J62j36M5K98k61K87J39j94J81l43R7K38k62J03k7j47
2248A7J90K30m59K64j54j25k23O7Q2l46K32O3l93M38o1l3k5K55J0K58j42j15K07
2271B37l66K95rJ58J69k15j43J28p5k12L78l80O1J3j59N6k10m3J65n8Q0j36j08
2294c74J15K8j23L95j99L08j42k20K55J04Q5J19j67J09n6L6Pj31p0J45j05J66
2316B85m05M5K78k88J69j40l13L50l93L4K15o6j30K78k01J64J01OQ3J35j25O0
2338A42K1N4Q8k40J83j67L38j72k70J00M8k39k5J99l91J83J15j80p9j66J67J91
$$ y = [334, 327, 277, 171, 353, 261, -49, 42, 14, 54, -52, 89, 113, -77, -169, 57, -504, -250, -188, -281, -56, -346, -176, -2, -66, 8, 245, -71, 389, 44, 183, 399, 67, 250, 279, 405, 340, 240, -213, 427, 16, -49, 124, -56, 37, 45, -443, -65, -261, -257, -213, -268, -338, -298, -163, -1, -137, -92, 206, -55, 232, 371, 177, 358, 15, 112, 350, 88, 191, 164, 17, 207, 437, -22, 242, 88, -37, -260, -193, -111, -457, -225, -162, -555, -117, -178, -211, -236, 19, 29, 287, 145, 30, 237, -129, 166, 157, 315, 484, 269, 126, 254, 179, -33, 345, -35, 26, 39, -120, -64, -274, -317, -152, -210, -130, -266, -374, -259, -231, -354, 41, -158, 150, 8, -212, 43, 147, 232, 351, 184, 293, 237, 273, 280, 149, 79, 224, 119, 285, -120, -75, 203, -85, 84, -56, -369, -19, -412, -378, -163, -229, -359, -81, -282, -118, -17, -11, 72, 207, 82, 142, 163, 217, 305, 65, 248, 81, 419, 247, -23, 77, 125, -114, -139, 60, -331, -148, -33, -213, -292, -458, -291, -100]
2360a00Q2n0j83K15K10l31J85n4J10K71k2j47J84l48L40o7n68M35k5J04k35O3
2382F9l9k67l36L45J07k55K87l3k08K95k9R2k00O3q1N7K43l03M62j3Pj8j6J2j04
2407A37J50j11m27M08J00J60k67l78K93k53k67O06k07M3j59J76l0l73J43R2J03
2428f1J84l81K52K19j86J48M5j59K28n7m5K42k92K70l83j10k68L80k14L0R7k74
2450c35L88K10m51M0K6P9K49n93M0M88k44Q7j32o7L09k2J36o1kK23j92j8L8k71
2474g5P9P7L7k65P8J71p7k03J13j61J74j3m4l9j8N3j19k9J13J21j10J05K76J3
2498B57j67K92l96J82j32k56N59q3j18P7pj9p6m3N5l38J09R0k34J34q1J53k23
2521b65k6J31J78k91L14k67J19J07K15r0j13Q3k0J02l08L59k17J0K97k45k50L54
$$ y = [-100, -18, -68, -251, -36, 174, -157, 28, -26, 84, 355, 333, 186, 370, 22, 362, 295, -273, 162, 137, 241, 6, 69, 30, -237, -573, -228, -121, -376, -89, -122, -330, -35, -64, 28, -172, -109, -190, -133, 110, -193, 269, 256, 263, 245, 229, 241, 137, 287, 176, -251, 157, 257, 417, 150, -228, 65, -188, -455, 151, -56, -13, -172, 4, -26, -399, -256, -164, -61, 123, -258, -6, 213, 27, 175, 220, 61, 289, 232, 187, 429, 137, 407, 24, -86, -354, 26, -188, -158, -61, -335, 53, 263, -188, -148, -122, -43, 206, -387, -347, 141, -103, -16, -148, -215, 94, 72, 208, 147, 145, 368, 176, 158, 196, -75, 4, 81, 118, -147, -69, 102, 25, -178, -65, -226, -52, -65, -109, -148, -166, -113, -232, -261, -148, -27, -137, -32, 244, 257, 90, 382, -14, 168, 36, -220, 339, 256, 138, 215, 208, 189, 113, 70, 125, -213, -104, -14, -248, -114, -195, -42, -265, -291, -160, 18, -273, 41, -226, -107, 0, 215, 125, 12, 95, 75, 177, -131, 228, 11, 21, 318, 73, -177, 177]
2543A77j80jl77K85N7Pl31J22j15N3K03n0J62j18Q4n6r9K42J04l71M91p6k14J70
2567A69k51J60J6L9j18m1OJ26j67j66M58k12q9j03j37J73j9j17J12j65K33lJ33
2590C7J74l83%N29k16K2j01L8J79j15p7N9Jj43l8j76M11k97J90j07j18J0k62J98
2614a85L64l12Q3k04R8N1J45q9Q3l8M30n10J57oj00R8j5J41j37J65r6p9J90j90
2638D4M2m9j57k0N6P3k9j20k07L50j51K25j23j21L4O4j82N56j96M8J45j92K22
2661C12k68K15K3M4o2oj43o9K24k90n7J11k35K74m00M57l78k5J58k41J88K74k13
2684a07LK00k89J34J01L3o0K60K1j21p6lK3K09k52q3J16k26k2J8K48j55m9j3j90
2709b80N5L4K06m2l23M75l74J08Q1j06N9N6N1J32j37K17k54p8K63k1R6j03j8J32
$$ y = [177, -3, -4, -381, -96, -39, -32, -363, -241, -356, -303, -100, -150, 12, -106, -22, -78, -177, 65, 169, -202, 289, 213, -1, 169, -82, 78, 94, 133, 15, -26, -20, 106, -61, -227, 231, 19, -70, -173, -310, -137, -156, -273, -161, -326, -93, -96, 37, 211, -172, -172, 357, 141, 163, 62, 100, 279, 164, 87, 146, 147, 4, -34, -210, 201, -96, 94, -13, -131, -121, -383, -185, 179, -133, -50, -254, -156, -105, 40, -49, 34, -4, 426, -84, 73, 67, -33, 65, 50, 191, 54, 219, 123, 44, 234, 44, 86, 37, -120, -140, -84, -11, -40, -160, -367, -17, -168, 57, -66, -187, -153, -89, -271, 285, 89, 137, 282, 90, 312, 44, 259, 282, 326, 264, 258, 115, 46, 270, -20, -77, 34, -201, 73, -327, 130, -248, -273, -115, -356, -168, 106, -107, -104, 96, -193, -59, 42, 75, 15, 275, 296, 175, 99, 96, 119, 328, 76, -7, 109, -117, -139, -121, 127, -28, -77, -90, -280, -225, -191, 15, -27, -350, 125, -249, -141, -60, -166, -107, -51, 0, 132, -5, 212, -42, -120, 143, 122, 218, 115, 97, 229]
2733B29K8k42M8J02m7j41n8J38l61k0J65J63j49J27o4m7r9K35J39l50M36K4k3
2756B33l87K64m00L32m0K66p6K27m3k50N9k42K67l91K56K4o4l9j88N3P1n2o5R8
2780h7J73k7j80L4J33k03L7K64J2J8o0j79M86k26o9J79j62ro4j99J95k80L15r0
2804A1k66J44J40j63P9Lj70L00r6k2n2j65M0J81j86L71L1k37Q7m0J86q4N7K2K
2829A73l28L30l80N03l29O4nn4K16n37L09r7J39k79L28l06J91O1r6J62o2k59J58
2852i8J93j33K38j87P6J28mP1k85O4M6M5O3j55j34pQ7r7P9L7j12PO8qk68J89o4
2879a61J48O3j28pK99k13R2lN7j91J57j39J33O2l76M33n8j27K7o2O6J15l05j79
2903b97J69j45L17k61R9J53k18L17k27K31j14k67P2l3J94k6J47J82k51J43m17
$$ y = [229, 257, 15, 63, 165, 118, -23, -81, 57, -304, -324, -159, 4, -145, -18, -82, -129, -228, 7, 146, -204, 232, 256, 233, -154, 110, -290, 42, 2, 268, 192, 419, 376, 126, 185, -57, 210, -181, 75, 99, 35, -4, -192, -139, -68, -120, -185, -87, 86, 59, -121, -87, 46, -157, -120, 144, 156, 174, 114, -65, 421, 195, 126, 305, 143, 134, 70, -129, 66, -214, 101, 11, -255, -111, 29, -134, -55, -52, -222, 78, -18, -40, -92, -257, -217, -36, -222, 149, 180, -57, 30, -10, 176, 92, 149, 171, 173, -155, 175, -205, 298, -31, 33, 28, -26, 190, -347, -38, -135, 4, -275, 53, -253, -62, -1, -97, 65, 3, -256, -98, 95, -38, 200, 13, 89, 217, 213, 284, -1, 63, 109, 154, 217, 62, -72, -79, 8, -89, -10, 27, -85, -78, -10, -18, -286, -97, -161, -13, 50, -78, -85, 214, 1, 93, 90, 147, -44, 113, -26, 107, 169, -207, 226, 168, 41, 68, 6, 72, 187, -118, -297, -128, -273, 44, -217, -118, 35, -183, 134, -93, 138, 24, -243, -171, -204, -10, -36, 111, 293, 42, 185, -232]
2924b32L79J02l1j99K36L7l81K81l76L40j63n3j49J31J0j01M6M1K4J89l07L64
2946A88l54M3K67j34r7J3L87j71nj57M52o67L50j29K65l65Q2j5pL4J8j53mj19
2970b78K46k15K54J76m17J73j81K62m5j8J22Q9k37J69J86O7j79n3j0Q1j54L16
2992C54k87k13L98l4j23n9j61k09K84K6Q2k58K92j52n7L7K49j22j46L5J88n5j95
3015a26J41K50j16p7J33l3J32k49K04j63n8J80l50m9J41O4R0k46r3L7N5j35k0
3038b88J64O6K67k56L28k47k29L39j69J15o3j9O9J61o0n0k1mj18P9O2QM1j47Q
3063C6J5l8l37L08m2l7Q0k41k8L32k93J71j93j01L96KJ40j14K26j99J44j01L7
3086A63j03J19j94M4Q1M4o0m8l18K55L2l02L06j9N2j03J2m8q3K3J20Q6j55J07
$$ y = [-232, 147, 249, 218, 19, 255, 292, -89, 192, -184, 156, -7, -60, -209, -78, -68, -169, -123, -82, -58, 131, -176, 188, -166, -123, 144, 10, -87, -74, 313, 142, 137, -20, 432, -235, 115, -14, 251, -114, -32, -47, -54, -20, -2, -155, -159, -278, -32, -247, 7, 183, -234, -61, -242, 20, -25, -43, 79, 168, -69, 100, 286, 353, 174, 121, 111, 192, 38, 354, 67, -146, 252, 218, 95, 36, -125, -334, -50, -24, 58, -200, 92, -60, -117, -80, 169, 47, -99, -64, 124, 69, -126, 15, 265, 149, 72, 205, 172, 304, 55, 259, 96, 38, 218, -132, -181, -40, 24, 114, -132, -225, -188, -133, -268, -288, -124, -58, 209, -47, 281, 34, -195, 144, -25, 90, 27, 8, 77, 238, 178, 128, 107, 103, -15, 64, 126, 134, 175, 28, 36, 51, 13, -324, -16, -58, -95, -15, -256, -284, 48, -245, -74, -267, -368, 28, 30, 170, 56, 282, 83, 227, 126, 163, 60, 179, -15, 29, 110, 154, 94, 46, -272, -17, 15, -287, 19, 0, 52, -51, -39, -87, -170, -147, -27, 59, -96, 11]
3110A1m0j94M47j40L7Rj51l3K03j60P7k13K36m7p9Q5o4N3k49K26l22K52m4j36
3134b36L61l77J33q6OK72r8P8k22K50j00J58r9N42m36k62R8L53l51K60k82J39
3156A01k97J24O8l57M70k45o2J87J5MJ27m84K67k4J15k1l2j63K09j15J90j18K62
3179B21J92r1j76k40K47j52J10L7pp2k63O2M1j78J95N6n9J34j57J91l67J6MP5
3203a81J96n3q6J77j04K75k59J66jM8l6J35j42j5q0p1j04L7P0j1L23m47J54j16
3227a25J57m6j19J70k27j10L09j58MJ6J06j81K1j82N79k06J83j05j10Q3P5j83
3249d9N3O7Q1j30m6k9J29o1k88N3q2L54l85K77J62l15J83k16K7J64J2O5l9j43
3273a56K45L10n08J29J27N5P1l86J11M5j02K49n1j92l61K39P4j21K46n65K06J21
$$ y = [11, -29, -223, 224, 84, 121, 130, -21, -54, 149, -11, 66, -147, 89, 42, -37, 48, -16, 37, -212, 14, -308, -56, -100, -236, 125, -252, -119, -205, -199, 73, -25, 53, -169, 81, -19, 139, 40, 582, 146, -116, -18, 335, -16, 244, -38, 101, -196, -72, -4, -361, 109, -136, -198, -11, 4, 8, 135, -349, -82, -106, 9, -12, -44, -207, 2, -113, 77, -41, 221, 413, 322, 146, -94, 153, 1, 111, 148, 141, 69, -194, -132, -91, -269, -74, -18, -77, 57, -100, 91, -276, -260, -256, -181, 15, -38, -124, 53, -51, 224, -35, 131, 130, 178, 142, 277, 135, 120, 40, -31, -135, -98, -28, -39, 284, -163, -9, -125, 32, -14, -133, 37, -190, -300, 9, -149, -145, -129, -23, -204, -183, -365, 214, 8, 191, 86, -24, 59, 134, -49, 4, 71, 152, 22, -24, -53, 76, 15, -273, -220, -302, 52, -333, -56, 106, -209, -26, -242, -215, -51, -39, 26, -13, -156, 89, 399, -109, 20, 147, 202, 273, -113, -2, 43, -59, 190, 139, -53, -414, -175, -101, -222, 24, -541, -335, -214]
3295b14L18n9l01L08k42M01k19Q6l5qJ01J0J8J52j51j22P2k12OK68n5p9o6m0N5
3320hJ75p0r4m0O9n0m11M96Qj89N5k4RJ9K7J96R6l91L43l25KJ75%j46K75j50K39
3347B86l69K10k5k60J07N0n4K9j28l7K6J54o1K74o07K42mJ53j10P3O3J46k58J8
3371h2M49l02K2L3P1m7l39K32P5j88J30J50K0j80k01P9l2J21k66L07p3l6p4K36
3395A05k44K9L20j02j07K29k72O3m4K30Q3l49J15K11n1j52j2O5J04j67K65k55
3417F4Q5j84m1L6K20J70o59J22K11j34n9J85k5L1n2M6R3p9j10J43j34o1j13K01
3441d4l7K39L20m84j8J07R6j48o1j03J85k57L09l61K40J09j88j08J34J55l02L9
3463a78J17m2K08q4R0k61m6L99l4k32K32k4j69P6M8L8J55k25j24L7j89J00N9O8
$$ y = [-214, 104, 45, -256, 52, -190, 211, -8, 78, 43, 35, 136, 146, 164, 316, 165, 43, 115, -97, -91, 177, 122, 43, -23, -63, -8, 167, 97, 3, -37, 32, -18, -429, 67, 75, -114, -59, -83, -74, -55, -28, 168, 264, -127, 216, -109, -107, 68, 68, -78, 197, 47, 286, -83, 127, 102, -158, -51, -1, -55, -26, -154, -191, -165, -11, -72, 202, -405, -163, -167, -14, -124, -51, 12, 158, -100, -82, 367, 65, 87, 120, 191, 144, -195, 37, 112, -76, 54, 204, 224, 44, -157, -78, -110, 11, -255, 52, -21, -57, -131, 105, -139, -110, 210, 108, 1, 230, -42, 21, -23, 207, 290, -59, 56, 267, 216, 64, 52, 117, 221, 54, 319, 64, 149, -35, -76, -40, 180, 350, -309, -187, 24, -110, -169, 16, -9, 22, -30, 16, 109, 30, -80, 63, -71, -132, -245, -44, -81, 158, 478, -6, -24, 83, 179, 31, -30, -133, 52, -205, 104, -257, -17, 92, -96, -204, -70, 85, -217, -178, -61, -103, 105, 21, 111, -150, -196, 203, 169, -63, 169, 145, -24, 52, 100, 138, 293, 68, -56, -19, -208, -108, -49, 19]
3487A9k21J85Q7m62K27L40k41P5K94p01N82k3k58J25j61J55n9K59J1k59K92Pj75
3510I8k21J21j54J21J31j11m7ln0j06J66J84k33m5L01l22l3J64k53M99l1k17M0
3533aj52J36Q1j46K4N6J29j64L4O3O9l14J88k54J64J1okl4J41ml18K98j64j38
3558c03K11O7J02k30M8p5K48j08J58Q7m2k8n0k16J20R6l03J91L7K50m66J77p9
3581a08o0J26r8J68m64N90k67J0J57p4MP3k74M23k80J93L1k44J15K4J01r6O8n9
3605E9J0r0J83p6j09r0Mk69M67k18n2K07n7j61K34r1J81l23L42k72q1J08L42k47
3629Ak1M2M10o65J76J95j91J85N2p2j65j47L07K76m39j06O5J02pL5k44L36q3k99
3653b57K15p9R1J39P0k61J53n8K6m6j24K52j82J74P5k15J02K04k70L6J08k59J65
$$ y = [19, -202, -17, 70, -392, -165, 175, -66, 9, 303, -398, 184, 161, -97, 28, -133, 22, -37, 222, 233, -26, 266, 273, 98, -123, -2, -156, -35, 96, -15, -62, -65, -115, -221, -55, 129, -104, -149, 152, -170, -203, -39, -292, 207, 176, -41, -1, -153, -17, 64, -82, -58, -2, 127, -37, -3, 60, 129, -185, 3, -251, -87, -76, -82, -84, -118, 23, 19, -299, -1, -165, -303, -92, -25, 77, -153, -105, -180, 68, -40, 118, 205, 163, 135, 85, -131, -11, 85, -218, -27, 10, 260, -206, -29, -108, -168, -42, -140, 28, -436, 154, -113, -103, 54, -20, -16, 57, -217, 206, -74, 119, 150, -94, 21, 45, 146, 50, 118, 59, 69, -21, 162, 86, -23, -113, -109, -378, 89, -129, -181, 26, -31, -192, 42, -49, 132, -191, 151, -121, -202, -94, 248, 1, -20, 22, 432, -233, -57, 138, -53, 132, 184, 112, -53, -200, 107, 383, -56, -162, -97, 5, -2, 33, -211, 125, 42, -257, -42, -121, -30, 109, 179, -82, 71, 13, 39, -7, -131, 121, -61, 113, 188, -27, 75, 279, 9, 45, 153, -106, 59]
3676E9l6j88K1J3R3j10K22j79m9J38N7M6J86n24J36J44j35J2k0J93K01O8j29j21
3700I8j70K79k48J00j38J92p2Q1l40O4J28j94J30Kj87N7J48j31K02l6j94K39j45
3723a35Q9J13J90l30j82M23rj39K9J20M8k23K5J61j67l9L1J45k54J47o3p9l0K18
3747H9J20k59m8Q8l91P20l30o1j04K61j54J4M4l0L04k52J03j36%M9J15J8j53j6
3771iJ10Pj31j24n0K26P0k41R2j0N1j32J10O5l16L10l05M38r4J5K7P9n5r8K77
3796C12l3l04Q2Q8j92M6L8k77L54l61L87l1k01K02j4l85R7o5R8K27j91j35M08
3819A50M4k18n7K58r5k44J90K2k48K32Q2q4j3j78J45K78l11M0j30J87p6j83L26
3842A17j77J16K75l37J70p9j65R9O9N3m0j47R3j16j06L10k25K10O1k51K75r7j77
$$ y = [59, 23, -165, -144, -131, -38, -148, 74, -105, -154, -16, 41, 87, 273, -251, -115, 29, -106, -94, -114, 79, 280, 348, 219, 98, -72, 207, -41, 59, -79, 113, 41, 122, -218, -154, -26, -220, -90, -88, -275, -218, -70, -201, 1, -35, -229, 10, -135, -46, 67, 257, -73, -255, 168, 159, 20, 49, 169, 217, -6, 19, 180, 13, -26, 5, 150, -104, 43, -20, -99, -129, 89, 209, -50, -98, -10, -401, 319, -11, -72, -176, 85, -69, -55, -11, -41, 263, 11, 114, -22, -22, 27, 142, 160, 7, -9, 101, 108, -23, -147, -197, 29, 99, -142, -50, -60, -9, -141, -31, 34, -282, 28, -277, 161, 67, 82, 109, 188, 133, 35, 312, 279, -25, 57, 145, -47, -1, 37, -240, 114, -247, 140, 109, -92, 110, 96, -289, -192, -257, -159, 68, -123, -258, 150, 194, -24, -81, 177, 82, -162, 28, 50, -198, 34, 116, 32, 19, -159, -14, 264, -47, -7, -137, 50, -26, -209, 117, -60, 56, 331, -6, 164, 85, -80, 19, 88, 141, 101, -46, 47, -69, -175, 135, -90, 120, 181, -70, 205, 108, -69]
3865f9J06l07jM69q1j12j06j04n1J57k7L47k53j60K51r6j40J84j75Q6J69j02K05
3888A90n7k14K25J58n5j67M5J18j46N8k25R1j77J13l14L44j77J04P4n0J23l52
3910b91J27M57K9k49j98K47l07K07J23j73j80K20R6k78M32l50J70r0K66k53J54
3931A59k32J10j56nM9J67j61K20j60m5p9q9L56j54Rqn7J8J52j48M7J04p0j4K47
3956B60l53K95k36j16K67p0k52L93l10J2J60k90L28k69K54M2k71K55j28q2J73
3977F2l34K20P4n7j9K17l69K01R9k5j7o1JJ4k73M40j15Q4k18N9k29K06J27Mj61
4002g0Q9k1k58J58K01k21K15l3l30K88j68K98l07J66L6J60k48K05k06OJ67j87
4024f0M23l18k09R0J9J8n1J28o2K70k84K28m65K02J00j87J18j51J08K23j78j9
$$ y = [-69, 37, -270, -271, 198, 117, 5, -101, -205, -256, -99, -126, 221, -32, -192, 59, -37, -177, 7, -168, -82, 87, -15, 190, 133, -81, 144, 302, 247, 80, 125, 243, 97, 155, -70, 21, -156, -43, -357, -13, -190, -86, -12, -62, 61, -291, -164, 293, 322, 73, -125, 122, -185, 22, 145, -28, -208, 12, 108, -170, 262, -88, 82, -8, 258, 5, 159, -73, 37, -119, -124, -75, 92, -69, 151, -9, -54, -133, -222, 134, -20, -11, -19, -76, -58, 94, -54, -7, 97, 27, 13, 260, -93, 202, -34, -150, 117, 47, -205, 188, -122, -110, 50, -240, 88, -181, 73, 115, -156, 99, -29, -111, 62, -272, -52, 22, -35, -54, 163, -206, -5, 94, 69, 52, -9, -8, 6, -267, 173, 58, 142, -76, -17, -246, -40, 87, 91, -70, 19, -2, -260, -102, 99, -122, 93, 60, -270, 18, -150, 148, -159, 7, 43, 203, -45, 160, -46, -40, 127, -60, 363, 45, -164, -74, -55, -37, -88, 40, -22, 248, -36, 192, -273, -71, 29, -158, -40, -191, -83, 140, -38, -57]
4046e7j29p1L33j07n2J86k6l40N85k97N13m29l15J49k51M84k26j04j87L05K3p2
4068h5L6L2j4k32J72j22J78m7J56j29k8Q9r3K38l17L35r6P5PM2j26lj83J31p4
4093e8QK03k16lJ44j06J86j22j72j4Q9P7O0J17n0k45L8n9K25q1jj09K60m5l40
4118b14L58J04k58O3n1m1K63k31j08L9J68m3q7l35K29J04K48l80L4K63J03p4k00
4141d6M7O5j62Q2K08k14p8Q3L29l74J91lj80j3j1K51o6K19m11J97j2n2J46j52
4165D4j01j56J84Q3k36J44J62j85P9j7L77k19Q1nk74m0k19L78p5o9r4L04QJ30
4189B84n1j78O5k04N5l24K36N0j1M5j18j54L01J54k17r5j2K43J17j66J61j32j49
4212a00P3L4j12J0J99o0m6K81o7J79k72j23n5l1q5K6J38k39J69kk1j7J5J73R6
$$ y = [-57, -186, -257, 76, -31, -83, 103, 77, -263, 322, 25, 538, 109, -206, -57, -308, 176, -50, -154, -341, -36, -13, -85, -49, -17, -31, -263, -91, -213, -35, -82, 74, -55, -83, 6, -87, 151, -166, 169, 73, 148, 155, 197, 71, 68, -115, 16, -58, -50, 153, -63, -66, 78, -28, 158, 36, -136, -150, -61, 16, 76, 193, 143, -102, -64, -123, 102, 21, 20, -89, 171, 126, -214, 144, 248, -10, 53, 2, -39, 224, -7, -115, -76, 92, 49, -38, -373, -144, -40, 208, -172, -138, 125, 228, 154, -46, 1, 66, -96, -14, 194, -20, -98, -15, 314, -60, 131, 128, -52, -65, -76, 175, 109, 328, -83, 114, 102, 50, 196, 44, -57, -213, -29, 54, -182, -38, 124, -61, 18, 1, 378, 159, 240, 235, -39, -79, -298, 80, 5, -64, -158, 146, 154, 284, 233, 55, 120, -84, -29, -353, -117, -67, -78, -33, -151, -305, -4, 150, -67, -162, -174, 69, 186, 20, 181, 49, -100, -27, 7, -105, -95, 104, 44, -2, 279, 212, 391, 119, -4, -59, -90, -175, -149, -11, -250, -81, -83, -104, -121, -106, 67, 163]
4237A63k30J43k24l3K62O3k34K70q9m1k7j99k06M44L7L6o4J06j69m9j15J16J29
4260H9J91k83j68L58K4l56N2j85J94k7L02j6J2j17k1N7M2k49J46J30k60J35J53
4283B03k1k23o9J64q9N0P3j22J30k30L06o7k31J61o2j93K76J90l64m9n6L43J38
4306B58j25k62J84L6N3Kj54p1J65k94R3J23J12r0j00k6M84l48Rk92P0N9P1J2j23
4331a54K3J0J63Ln2J35O8l18J95J14l66K49M9Q1k08R7J56m13R1k5J3K3j02N8K45
4356A35p6j41M2K08J74n75K37r8Q0m4J02r9Q6J58R4k0k45m7o2j80M43j88o9p9
4380a64J64J42l30K45k13L89k83Q5k11K37R6k37k28K70m9L4Q1o1L1R4j98n7J89
4403B6j99K12j09kK51k25k9J02L04m70Q8K65p8k99P8K18j21M3o8j19K54m62O43
$$ y = [163, -67, 76, -148, -181, 81, 144, -90, 180, 91, 50, 23, -176, -382, 62, 99, 135, 71, 177, 8, -41, -156, -40, 89, 280, -3, -171, 187, 211, -145, -93, -278, -84, -111, 191, 175, 187, 70, 49, 106, 148, -101, 45, 175, -85, 50, 203, 182, -41, -110, 54, -35, 15, 88, -34, 96, -134, 172, 105, -126, 35, -27, -220, 56, 246, -118, -167, -223, 120, 258, 133, -129, 55, 91, 144, 146, -8, -79, 86, -208, -115, 8, 120, 30, -70, -96, 388, 40, 49, -243, -173, -114, -43, -31, -154, -131, -121, 42, 45, -7, 128, 196, -122, 73, 187, -179, 70, 119, 200, -8, 89, 245, -168, -77, -102, -89, -66, -168, -110, 135, 59, -82, -40, 168, 342, -233, 4, -94, -14, -58, 44, -55, 31, 189, 283, 263, 18, -29, -91, -271, 172, -16, -85, -164, 0, 142, -188, 57, -156, 233, -50, 35, -176, 61, 157, -80, -308, -38, -87, -53, 28, -33, -2, 92, -106, -163, 26, -173, 39, -70, -72, 179, -46, -75, 27, 331, -139, -51, 214, 136, -163, -85, 133, 12, 55, -13, -132, 122, -340, 303]
4426C03k66j74R3K03j21p5kj90O5K78r8j14P6J6K38k74n5K68j61p0J24J09o8O6
4450A71m7j04l7J23K7l37R8l6J79J4j33n7J47Q6k78L83k77J0L46m11K11j28J9
4473c1J00L7k32K36j08J13l2K7j96R1Q1p4K02l19K53k15L6K4j05o5L66Jj39M4
4497I5j36L50m04L9L8M6j70Q4J06J91j20k81J04K8J2mL57j99k03p5K62j44J08
4520H4J43m45j22J88J02j50J94O0J00k63N5K05j91jJ96Lj01k16R5P8l06N10j2
4543B06q2nj53j31K82k23J5K62J08m80L33k65J70l73R4K03m9R1J84k36J87r7k57
4566b16J25o8J75L8j22J9m5J21j04K04M0k00m4j9J29J27k31K51P1k10J1pj96K14
4590F3j56K24k91K72p4J01r2O8m5k35K77k1k27J30k53M32j68j60K14j1J45j52
$$ y = [303, 37, -137, -44, 159, 38, -37, -39, -229, -164, 114, 16, -98, -22, -6, 232, -42, -97, 171, 10, -60, 64, 173, 105, 171, 124, 20, -17, 106, 133, -204, -106, -142, 37, 51, -82, -139, 8, 94, -184, 199, -78, -68, 278, -133, 78, -50, -31, 69, 106, -126, 110, 2, 115, 83, 110, -86, 5, 86, 12, 214, -105, 148, -67, -31, -7, -112, -177, 189, 190, 51, 95, -41, 309, -95, -56, -18, 28, -142, -58, 48, 239, 119, -162, -58, -30, -18, -22, 335, 136, -67, -142, 120, -24, 84, 227, -218, -340, -152, -50, -200, -6, 54, 154, -109, -54, 151, -40, -41, 155, 158, 57, -159, -64, 14, -292, 218, 206, 124, 119, -34, -165, 117, -106, -91, 171, 279, -201, 132, -133, 37, -336, -242, -39, -88, 3, 187, -49, 138, 41, -216, -91, -159, 16, 54, -68, -49, -94, 27, -77, 127, 167, -33, -77, -96, 33, 160, -71, 180, 251, 41, 52, 45, -151, 63, -93, 131, -160, 112, 38, 139, 47, 115, 70, -165, 112, 91, -136, -6, -259, 173, 5, -155, 59, 48, 193, 41]
4612D1J05j94J41j12j44K87l00J57k11K19K4J8k26L03j05k4m23M42pj12K50L3
4634A62j28q8K20l5l30L51k97J44J78k25q5J68K0Q4l34NJ02K9j5k42K55p1j6J22
4658b6M4K5j24p4J44n5M1P9j05k8mk82N23P7k90kq4K29O3O3q5J1j72P5Q2j10j58
4685a43J94q3J32k64l9J22J0m4J74j59J30j21J04l6J50J1l2J91l61J18k68J78
4707c6J5P9J11R0k37j2l7j98L63J09l05o5L92k21l08M9J64m6J24%l7JK8j28O8
4732c7L4j45K93j16J95l83J55r9J67r5k38N49l46L85l81K75j38n2l3j24K05K2
4754I3j07k21K96r5j73K78l16J23L73k81j64J95J31N0q5P1Q7k06Jj36L09j30j99
4777a06l1J84K48l90K09k44K68k52L18k17j36L82m19K54k08J95L4J19j15j68N3
$$ y = [41, 146, -48, 93, -19, -163, 124, -176, -19, -230, -11, 13, 31, -195, 108, 3, -21, -444, -2, -9, -121, 129, 162, 34, -54, 166, 131, -199, 152, -145, -1, 177, -48, -133, 35, 55, 139, -195, -190, -88, -59, -74, -316, -61, -132, -148, -26, 18, 43, -81, -155, -11, -66, -25, 54, -51, -79, -83, -365, 158, 235, -55, -57, -141, 88, 151, 214, 129, 140, -32, 43, 125, 15, -143, 51, -32, 100, -164, -203, -81, -71, -115, 59, -100, 30, -91, 13, -23, 127, 138, 106, 297, -64, 54, -214, -36, -21, 58, 169, 259, 22, 10, -27, -225, 138, 247, -58, -123, 269, 48, -260, -211, -47, -93, 31, 31, -6, -5, 23, -105, -37, -3, -148, 145, 29, 224, -159, -4, -103, 64, -31, -269, 280, -66, 319, -62, 213, 75, 23, -10, -134, 71, 93, -14, -235, 61, -34, -207, 71, -245, -122, 251, -30, -194, 1, 132, 182, 97, 168, 255, 49, 50, -86, 223, 93, -106, -137, 47, 295, -95, 114, -130, 138, -114, 204, -13, -149, 233, -186, 68, -140, 55, 89, 208, 93, -75, -22]
4798b2J40l37K21J97p8r6M3j46L81n49o9j9L69K67o21L11j1J55j31j07K95m17
4820b24J58K1L1L9l9k12K80J77k1J08l25r6J65j12J46R1n6k5n8N5m9lK7Q9l4k99
4846a66R8J52j79k48L35m5K4j39J71k35Q0L56j07P0l43K15nM4j83J61N0k48K65
4869A23j55j67J23J47k1K24m73N0L32l90J13L2l8M8j50M38L6l46J70l4j22J53
4891I3J03m40L75j72o3L55l66R9K32k14J4J73r4L4j20k3j96J13J39N5k61J69N9
4914F4nj11J05q9R7L7j86J54k38K39N0m8Q7j05q5P8o6N7m1J04k14J66j80R7kO
4940b9J08k29j00L99j26j36j31L01q3Q8j7l28K12L4j63J73q3J88k99M77j7L7k31
4963D5J13J8p9q1k43L71l25J06J16j04J16j18q7J42r6J30l01J81J34Nn9M9k08
$$ y = [-22, 118, -219, 2, 199, 121, 25, 68, -78, 303, -246, -315, -334, 35, 302, -319, -8, -19, 136, 5, -102, 193, -224, -66, -45, -14, 25, -14, -226, 54, 231, 210, 318, -7, -103, 62, -50, 96, 187, 131, 106, 48, 103, 54, 51, 78, 167, 133, -166, -68, 84, -95, -343, -8, -53, -29, -168, 3, -232, -152, 204, 97, 167, -176, 39, 34, 78, -105, 56, 106, -142, 123, -32, -199, -76, 71, 50, 274, -199, -149, 183, -207, -94, -62, -100, -52, -202, 236, 272, -74, 96, 62, -60, 93, 196, -244, 131, -41, -104, 251, -115, -16, 216, 2, 16, 189, 95, 129, 9, -14, -210, -97, 42, 97, -164, 5, 64, 59, -52, 53, -36, 61, 98, -88, 66, -172, 67, 117, 69, 156, 51, -34, 44, -22, 35, -6, 98, -116, 50, -130, -33, -35, -29, 79, -150, -250, 149, 23, -113, -244, 57, -26, 62, 45, -283, -71, -37, -200, -27, -110, 78, -221, 256, 239, 276, 45, 158, 176, 97, 16, -227, 144, -181, -75, 41, -63, 53, -65, -152, -10, -106, 24, -277, -96, 38, 43, -16, 33, -175]
4986a75QK96k76Q0R4M6j37J86o2L0j13L7R2p6K34j08j40L6j06R6M9j16r5J52J6
5011D8R5j00m7K4kN5l0K20l41K09j18Q3m9L39n44K76qp8j09mJ52Q1k98J01j03
5036a48K06j84K20n9k28N1K2K64j26J55j04Qj83J1M5J38k21L19Mk92O9N5J35k39
5060h2O3k15L53j36k1L9n6rr2J0Q6l2J76M9j21j20J91l77K77n6J60PK5j64J76
5085A31J38K2j42k46K01q8P1k31J49p0J55L4j74J04O5j92L2mL0k2j12mj1J40O1
5110C7j64J13k8j98J29J11J4L7j12Q3j54J56K49m03J8L75o2l11P1Q1j22K01j14
5133GL8K45l26j12N3K60p4pk74K06M0P2l91L85j10k14M65k78L8Q9k10m0K92j28
5157B6P4N5N0j82O5r2j43J48j60R5qL9J48l50L96m34RN32l52J16j1r2J16O2k32
$$ y = [-175, -167, 129, -147, -67, 27, 73, -64, 122, 60, 90, -23, 14, 106, 30, 264, 156, 16, 52, -54, 42, 91, -25, -120, 32, 48, 143, 43, -4, 20, 18, 73, 43, 263, -78, 131, 13, 96, 47, 386, -158, 118, 110, 32, -77, -81, 71, 152, -146, -45, -148, 58, -126, 94, 35, -193, -142, -120, 144, 18, 173, 69, 77, -106, -95, -50, 88, -133, 186, 190, -102, -33, 22, 157, -82, -19, -234, 119, -17, -38, 1, -55, -64, -156, -146, -60, -92, 84, 133, 12, -108, 83, -294, -17, -73, 87, 94, 119, -45, 131, 269, 291, 149, -97, 104, 16, 87, -144, 5, -65, 90, 124, -50, 54, 119, -73, -41, -45, -15, -37, -149, -153, -164, -24, 37, -127, -14, -42, -240, -111, 0, 14, 51, -61, 22, -132, 24, 273, -130, -112, 263, 201, -110, -39, 42, -80, 121, 7, 45, 290, -36, -148, -95, 165, 91, 84, -190, 16, 56, 128, -263, 122, 12, -202, 263, -15, 23, 112, -98, -138, 154, 26, 100, 155, 205, 23, 88, -4, -147, 1, -159, -64, -72, -33, 115, -235, 161, -273, -264, 268, -84, 32, 21, -71, 45, 107, -125]
5182a25p8L86r9k91J98k47N8J16J43j70j1k53N68q6j95J11k7j7j66K11p2K2O8
5205D4R4r3k11R9P4r6K0J34Lk72J00J96L3m54J80K62N5k93K04m3M9k14J42j60
5229a47K68P3m91M91k58K7R5q8K1L24k84j27K3K88k56Jj3j05l8Q8L3J38j39J59
5253H3j59P1J48qp5j74K13mJ8L5Lk76J76j76K47q3m95K89K08l40K91n2J35k64
5277a89O1J90m10L69J97k36j83M15l66M2J86J49p9j25N6J35j07k36K74j24j29
5298a10j5Q9jJ15k43J01N0N7l30j42L35K13k65L6j2O3K81k03P4m6k48PJ86O5K17
5323B74k95J79j24J18j81j00Q9J40k91K72O2j83j93K43j37J4J59r5K72l75J85
5344C3R5j02Oj39L23k06J99j99j89K44m9l9r7M6o6K30j09n1K84l34k88L18k6p8
$$ y = [-125, -203, 183, 84, -207, -9, -256, -198, -82, 61, -109, -120, -373, 195, 109, -86, 25, -2, -19, -185, 26, -46, -24, 44, 138, 45, -166, -67, 7, -89, -69, 65, 68, -204, -104, 92, 125, -329, -149, 113, 168, -125, 79, 36, 85, -129, 13, -147, 121, 194, -297, 194, -64, -37, 58, -30, -9, 315, 31, -96, -73, 215, -41, -40, -53, -158, -196, -108, -75, 63, -76, 83, -76, -5, 143, 135, 60, -114, 99, 95, 113, 148, 151, -125, 51, -125, 122, 39, -456, -167, 41, -299, -8, -60, 75, -189, -128, 62, -348, 21, 218, -18, -201, 214, -152, -110, 76, 225, 146, 21, 77, 212, 105, -131, 143, 19, -110, -125, -36, -37, 78, -165, -64, -14, 43, -287, -429, -94, 119, -146, -110, -122, -59, 222, 19, 93, 47, -201, -194, -8, 57, 274, -21, 158, 34, 152, -29, -129, -40, 100, -191, 81, 143, -40, -233, 10, -127, -113, 46, -49, 223, -152, 33, 128, 26, 32, -107, 216, 10, 209, 10, -179, 65, 16, -23, -120, -74, -140, 90, -19, -70, 214, -120, -408, -90, -116, -194]
5368a94J81j96j8K93j66P6J9j32L98l24OJ07K30k86l9j2K02k02L15k46q1Q5k37
5391b21L93J38j91p6k43k5K52k43J65R6nj64L30k72N6k3q7l5L58L9j64j67P1j14
5415a32M9K92j44k75M26l37J4r3M89n1o13O06j85l20L17J55k32R4J06lk36R2K12
5438B31n9l2J4j42K98jl07n4N7j61J7K31ok11N3M4J49j0R3k81K30l80J61K96k91
5463f1j88J51K6L2O3j87J52J14q2K7j4m9K47m15P0J84l94L28J05r0j15J14k22
5486b04n4J95J76j49L7m0J52k81J18J87j42J45l51J85r6M0O6K12j41J10%J63m91
5509a63M7K43N4k88j1K32o8j53O2N5L8j46k2K21k05K14l07L7J44P9j06L9j85K15
5533B6p6K60j56k57M34k74P8j67Q8l6Q4K12l03K02k96M24j90j64O6j0K9p7N2K16
$$ y = [-194, -13, -209, -227, 66, -100, -24, -5, -137, 261, -63, -57, 50, 280, -6, -45, -57, 145, -57, 258, 12, -69, 16, -221, 172, 310, 119, 43, -200, -225, 27, -216, -51, 45, 40, -124, 206, -66, -10, -33, -120, -155, 203, 242, 78, -89, -18, -132, -83, 209, 65, -210, 216, -121, -107, -200, 289, 238, -375, 231, 46, -274, 43, 198, -34, 60, 166, 163, -73, 19, 231, 172, 140, 154, 12, 310, 309, 2, -52, 5, -156, -139, 92, 86, -125, -72, -28, 121, 111, 204, -77, 153, -227, -66, 230, -61, -249, -98, -72, -40, 23, -164, -12, 102, 20, 47, 33, -16, 231, -184, -114, 70, -324, 4, 109, 19, -96, 18, -204, -258, -63, 113, -36, 1, -39, 113, -168, -50, 137, -5, 140, -211, -26, -122, -82, -16, 196, 55, 165, 165, 328, -163, -116, 127, 181, -107, -118, 114, 46, -107, -45, 10, 48, -98, -120, 101, -104, 110, -197, -160, -16, 63, -43, -4, -189, 26, -50, 210, 54, -203, 231, -43, 35, -132, -44, -80, 4, 216, -87, 115, -181, 243, 53, -111, -45, -55, -26, -103, -51, 165]
5557A65j8M6j95q8K10l21p1K52j03k38M17O0l29L47j8j00p1j02L06j73K0m1M7
5580BR5k17K3J45j31J01k77Q6K10K7n6n5j06L29j27r9L1J16k7Q9j63N8j07N1%
5605bM5j70K86n0P9J50l56L7j27J5m6J23o9K8N9P6M7j86j32J41L71m08J89j49
5629d9J70j57j45J29O1L76m50P8p3j2n6K41j79K14j34j04m5K32J08l34L25k88
5651i2K1J88k71J95j77j0J43K51l37K79J42l30K1q6J25J84l22l1M48k88j8J82
5673B17k27MJ91k14R5r8J73l60P3k0Q9j01j15K22j26K27j0P1Lj19k14J98k54K31
5697f4N6Q1k06J69l1m5L1j4J36k07mJ78l4J77j75J7j07J26J50m25K69j61o1J83
5721C9Q7j58k2m4M0k41M35j05%K11j45j20J28J4p1K2j01J3j6l2Q7N0q4j72P2K02
$$ y = [165, 147, 193, -2, -90, 120, -201, -272, -20, -123, -361, 56, 116, -213, 134, 116, 16, -55, -157, 149, -24, -4, -45, 2, 97, -120, -97, 48, -83, 18, -259, -173, 37, 64, 8, -47, -153, 176, 49, -50, -19, 97, 70, 159, -4, 54, -53, -2, -2, 43, -127, 159, 109, 188, 338, -18, 19, -108, -93, -139, -16, -85, -57, 2, 78, 125, -61, -193, -52, 319, -89, 100, -49, 121, -36, -181, -52, 9, 385, -65, 13, -60, -72, -128, 113, -66, 148, 14, -90, -135, 97, 205, -129, 196, -92, -71, 117, -154, 41, -136, -146, -3, 248, -89, 190, 332, 2, 23, -63, 62, 246, -76, -107, 341, 53, 35, 217, -10, -6, 185, -29, 66, -32, 141, -219, -146, -166, -77, -178, -293, -71, -197, 30, 20, 91, 94, -25, -239, -41, -295, -64, -8, 73, -133, 36, 5, -40, -9, -23, 113, -94, -98, 80, 46, 223, 48, 65, -42, 84, 234, -191, 78, -83, -144, 39, 126, -32, -54, -98, -58, -299, 136, 31, 31, 242, 97, -23, 105, 119, 48, 70, -31, -18, -34, -66, 21, 71, -13, -185, -113, 89]
5747H9J28l90L9K76J6p3k28K17J42l90J15J58l85N47k68j9J94j87j12M3l6L39
5769B15k23J72O8k77p7J65j55N9j69K55m2j82K51L0r2qQ0k02l6nk7p2JL02r5K9
5795c5J13R2k01J64j18J04j59K2R9J1J03l28J35n0J3m5k4K02m8L5j53O8N4n1l3
5820c0p0N5K49l23R6J19j18l8J61j38R4J69k24P1o2Jq7J53O2m5j18rK37k65Q5
5845B5n5J69l66K59J44p7j54r0lK46J3j46n5j2j05J2J06R9j38P5P4K40l15J40
5869H6j16k9j61n3M0J58J96j5j32o3j24M15o7m32K17j55P5K8R3k94L43J21j38
5892gO1J7k32J87oM2m8k8K83r1j35L7QJ29k89J03J2j45K6K4K05l55L24j67n7J16
5918A4J51m39K38J77l5r0j42q1M47k37j00K14n5K5l1M3k64J48j37K55k89K16J58
$$ y = [89, 217, -173, -134, 142, 158, 85, -143, 74, 216, -174, -59, 99, -286, 261, -7, -26, 168, -19, -131, -88, -124, 215, -8, 164, 232, -45, -122, 43, -112, -53, -222, 33, -9, -191, 60, 90, -2, -10, 70, -132, -168, -173, -200, -272, -271, 31, -64, -35, 78, 170, -31, 133, 15, 119, -40, -18, 81, 92, 195, -133, 2, -48, -35, -80, -104, 98, 50, 85, -68, 0, 54, 3, -30, -100, -45, 204, -119, -23, 96, -22, -60, 101, -37, 57, 226, 2, 73, 11, 12, -75, 78, 140, 95, -23, -32, 205, -60, 25, -30, 139, -227, 32, 176, 99, -55, -145, -148, 98, 111, -35, -90, -102, -207, -195, -89, 10, -128, -53, 21, 261, -54, 86, -30, -59, -220, -273, -233, -75, 121, 106, -26, -89, -213, 202, 135, -297, -80, -235, -160, -132, -39, -333, 10, 131, -7, 54, 71, -161, 26, 20, 62, 14, -14, 269, 178, 43, 80, 88, 217, -72, 31, 43, -102, -76, -52, 153, -202, 122, -45, -102, 14, 165, -274, -36, 141, 106, 16, -126, -207, 240, 3, -97, 117, 62, 87, 56, 99, -165, -17, -154, 101, -188, 28, 186]
5941A86j84oO4P0k72J09j03K39o9k21N5K07l41j40L23k6Q6L4O6M5l28K12P0j39
5965f3J46Q3l05m0J74L6n1N5j38o4J44j12J20nK2j87N2N34l52J31j88N7o9j5J49
5990A14oN1j86J82J8p3l00J67K2L91m88q4L49l74L35k32J07P7k2k42L73l09K59
6013A29K4l31J06M4l1J31l10J07lK26j00k92N34j40J43k40r6J04K15j52J53k71
6035e0J7J84j86R1m2K25j03j16J47j71p9J03j55J93Q1j88P2j20J46n8q2R7j28
6058a22K28o5p1J12l43J49M68k26j96K19R5l30J63L0R1k93j01L99l85J21j8J20
6080D5j26K5J09k23J55K55k75L8kK26J4Ro4K7j5m4n7K3L4l17J26J98l13K76j07
6105A7PK8J99k70k78K99j26J58j42J73J13k98K46n3Q4j47l8R0q8j23L3J52q6L69
$$ y = [186, 2, -4, 60, 130, -142, -33, -136, 103, 34, -187, -132, 75, -266, -406, -83, -109, -23, 11, 77, 122, -206, 6, 76, -63, 83, 166, -139, -179, -5, 31, -20, 35, -103, -167, -23, -135, -15, -20, 2, -185, -133, 401, 49, 180, -8, 49, -20, -35, 114, 108, 159, -27, 155, 173, 100, -200, -33, -11, 380, -108, -192, 157, -217, 118, -114, -7, 70, 48, -194, 179, -130, 129, 153, -178, -72, -28, -59, 72, -238, -131, -134, 92, -8, -300, 234, 94, 237, -3, -99, 5, 220, 68, 221, -50, -33, 151, -35, 56, 14, 239, 136, 20, 167, -4, -83, 20, -135, 58, 139, -49, 23, -97, 49, -9, -91, 6, -122, 106, 41, -30, 82, -261, -112, 356, 130, -66, 153, 248, -82, 81, 111, 202, -91, -192, 207, -178, -57, -75, 45, -81, -56, 53, -170, -15, 240, -35, 3, 1, 227, 241, 250, 186, 213, 198, 154, 97, 120, 154, -163, -37, 161, -152, 124, 17, 24, 52, 251, -19, -297, 2, -124, 34, -108, 65, 178, -120, 126, 73, 157, 10, -28, 62, -26, -149, -116, 36, -50, 319]
6129C19k94o3o1J77J5r8k9K67l54Q4K52j93J31l23K45k24K39o2j26j6J02o3p9
6152a54K39l22J34K16j28J5l5K36j20j10J13k23K15k95L07j16K31j40j9l3j93
6173a82L85j01k07J52k34K97k16K11j81N1p7Q5J47j09k50p3K32j8L61l47J4J24
6195F4J60q2m0M0j29O9k37L58j52j72J74j46K9J85l16J71jR5j41j22N4qlj09K21
6220c8oK06k98J35j4p3J13qM6j15kJ13j89Q2K9l2Q4j62o7q7L99kj54K5j56N3q
6247a26l1L05j85J7j8n0j8J01O7j94j2O2L27k44J30j49K42j87j25L0J44J77k53
6270A0j31J65r3J04k23J51r9m9J59k01j2L07J40l68K6L56j52l64L7M08r2k00j12
6293b33L31m9mk96n4M61k19K35j44m6q4J44r7Po4K22k17K35k76K06P1J38l08J47
$$ y = [319, 25, -38, -99, 78, 93, -5, -34, 233, -121, -37, 215, 22, 153, -170, 75, -149, 90, 28, -98, -114, -12, -75, -154, 85, -237, -103, 113, -15, 0, -35, 201, 81, -29, 84, -139, 76, -219, 88, -28, 203, 63, 44, 11, -182, 203, 102, -105, 47, -187, 110, -106, 105, -76, -25, -102, -17, 130, 21, -229, -302, -70, -88, 273, -74, -60, 64, 224, 142, 102, 142, 13, 82, -155, 203, 51, -121, 53, -93, -64, 121, -195, -24, -25, 70, -71, -193, -139, -147, -150, -259, -38, -44, 162, -136, -1, -15, -88, 25, 17, 63, -52, -54, 59, -130, -48, -19, -51, 33, -129, -196, -283, 116, 114, -40, -15, -171, -118, -126, -157, 148, -37, -20, -38, -88, -106, -5, 62, -132, -144, -82, 245, 1, 131, -18, 224, 37, -88, -58, 86, 263, 10, -121, 44, -49, 55, -168, -17, -116, -165, -6, -207, -219, 88, 228, -140, -114, 242, 90, -274, -237, 171, 79, -121, -233, 98, 49, 45, -251, -305, 156, -63, 172, 28, -18, -102, 42, -55, -48, -112, 110, -107, 128, -148, 58, 129, 267, -41, 106]
6317A06j87K38L6m42L62j79K22j27K32l21N0k23J79k28L03j25J23rk05m1L73k0
6339A17k97n0N80q4m32N44o9k80J36n6j25K18j62k63K15L3j87K26K6Q6k15r2J57
6362B6k37K75L5j18J51m2n5M9j50p4J01p4K5P0N0O1j79p5K31O7k26k2K27q1j45
6387a10l8J6K00j16Nj4K63j0k52j48P6K77l29R6K21j52J63R0k65n2J4J4p2k21
6411c44N20j98L3K01k14j82J26O4LQ2lr5M3k78M04l23J77N2j59j39K20n3j69K36
6435DP9J8j6J30k83n2P1j53O5J16j06J0J7P4n9M8j35J7K16j2L8q3j72K5L14j72
6461aj12L5Q0l1K3K13q0m3j01J67p4j39L7n2N9J11J1k48J86m9J07q1Q0n5j95J72
6487B0N5j76J98j77L61j66j93R7l1J69pq6j6l9k42K72q1J73%k08J50k31j6J38
$$ y = [106, -81, 157, 193, -249, 113, -66, 156, 29, 261, -60, -10, -233, -54, -282, 21, -104, 19, 10, -195, -236, 137, 117, -180, -230, 350, 266, -166, 378, 309, 29, 165, 109, -16, 202, 40, -223, -8, 25, -162, 64, 90, 176, -39, -131, 26, -211, 64, 99, -19, 132, 90, 35, 84, -66, -140, -39, -113, -88, -18, 32, 93, -86, -161, 70, 137, -89, -111, 116, 35, -110, -148, -132, 68, -48, -43, -57, 206, 196, -56, -204, -128, 149, -180, -84, 137, -15, 148, 238, -27, -79, -65, -51, -123, -344, 176, -22, 11, 212, -2, -184, -58, 6, 9, 91, 88, -7, 36, -242, 162, -161, 16, 68, -91, -230, -10, -63, -232, 4, 83, 101, 85, 215, -68, -120, -49, -202, -137, -21, -127, -117, -100, -26, -85, -37, -172, -155, 61, 49, 87, 4, -168, -143, 171, -1, -113, -78, 2, -29, -6, 207, 127, 84, -17, 150, 76, -63, -26, -78, -19, 92, 103, -145, 41, -8, 99, 18, 98, 43, -152, 20, 75, -101, 97, -80, 281, 115, -78, 19, -12, 157, 150, 64, 48, 9, -233, 39, -42, 131, 131, -77, 73, -158, -174, -36]
6511c6PR6K13k39l31M37j01j13M6J69j88J48j62j69L21k40J87k43K75o7j18j80
6533b88J80P9J03o9j81R5K58j57M6q0j1j11K56j59Q7oO6j49o1L3Q0n7j27K22J37
6558A86j80J90l83L4Q8J02j40Q8l77L41O7o0N5Q6j59n9K57j87K78j2l56J26o0
6581g5k7L35j43k39K19j67J07K48k37m7k25L63j41J31j38o7J4L13l44J35j59J08
6603c6k6J42J09k37Q3J2j24J45j92J65j06qM5o6L07k42K44k29l4J93j3k24j62
6626b54k1K03K8j39J09p1J77k38K14k64J24J43Nk17L46j6j79K92q8j06r9J24r8
6649b5J30N5j50K09q8j95J81J3k38P2j35N5j02L33l34K19j32J1J23k57M53k7l15
6672a44RK42j52p0J43%Q2j32M1J49k86R1J52k73K06j05K37k50J01j55j03K28j76
$$ y = [-36, -29, 67, 280, 41, -290, 147, 46, -67, -21, 148, -40, 108, -54, -223, 98, -142, 45, -198, 77, 10, -108, -288, -108, -29, 74, 5, -176, -81, 177, 20, 66, -14, -25, -136, 120, -39, 48, 42, 108, -41, -102, -69, 11, -46, -173, 49, 186, 6, 196, -187, -153, -65, 37, -103, -15, -392, -51, 16, -44, 11, 97, -62, -121, 136, -51, 227, 215, -141, -15, -75, -102, 233, 90, -149, 70, -97, 10, 258, 21, -26, -251, 112, -29, 102, -36, -103, -89, 224, -120, 15, -144, -36, -62, 80, 189, -48, 35, 47, -77, 68, -124, 41, -65, -73, -28, -94, 213, -29, 215, -14, -48, 145, 132, -92, -254, -275, -72, -44, -183, -74, -145, 32, -206, 8, -256, -132, 11, 16, -201, 145, 129, -50, 242, 154, 48, -51, 73, -25, 105, 160, 10, 219, 131, -64, 117, 130, -108, -36, -171, -116, -218, 115, -219, 0, -132, -121, 2, -255, 198, 171, -144, -135, 107, -45, -115, 28, 28, 110, -22, 19, 168, -118, -27, 125, -148, 58, -47, 190, -60, 41, -114, -217, 11, -165]
6695a65Q9J37j63j05J25j06K78J16k50J34r4J16k69L30o4j33j79M9K97j43J93
6716A93k12n1k2J8K34l28J17q8J67J06j94pK91k31P6K76m79qK75m6p9r1l4J00
6740a7J37j22J22j76J17j00J08k41P7K16o5n4l4K5k02o0L74k81O13n06j94L02
6762C9j56L33l64K43l08K95J62j45o6o8K94m05K26p2J80k03j95KJ73R0o7J65r
6785A44k27m4J56K17k17J50j31Rr1QN6O1M1q2p0r4J82j70L44j58K8l05j57L11
6809c9J24m1n9J09j08J9M7J53K8l65lL70k66m7n5K70j03K40k70m8L2k37L60J71
6833B82j72j08j12J99j7k32K04n7j55J98JK1o5o5M12j74l18J65J45q1m5K9j3j65
6857a23P4p7J12OR6m6r1N2j01L42l24J23q4L6k3N4k16K65q0k38N05J0k41j54q0
$$ y = [-165, -76, 61, -102, -207, -82, -188, 90, 206, -44, 90, -4, 112, -157, 173, 109, -24, -203, -154, 143, 0, 193, -19, -70, -92, -74, 160, -168, -51, -139, 28, 134, -60, -67, 224, -7, 69, 345, -134, -142, 133, 87, 8, -83, -117, -17, 120, -2, 120, -56, 61, -39, 69, -172, -95, 121, 56, 2, -32, -7, -209, -269, 105, -176, 437, -69, -263, 39, -117, 216, -148, 95, -213, 82, 244, 99, 33, -35, 259, -146, 80, 8, 188, -15, -210, -208, -35, 55, -12, 153, 144, -83, -127, 29, 246, 29, 179, 48, 57, -34, -26, 30, 91, 132, 50, -20, -114, 68, -102, 242, 84, 112, -193, -350, -39, 85, 44, -15, 94, -14, 5, 52, 205, 233, -132, -135, 235, -31, -78, -133, 137, 34, 274, 4, -44, -12, -249, 111, 282, 110, 2, -110, 89, 72, -160, 44, -13, -168, 30, 31, 52, -13, -78, 334, 160, -158, 7, 152, 71, 26, 55, 42, -123, -49, -126, -14, -8, 88, 42, -49, 3, -98, 244, -80, 43, -41, -5, -28, 26, -190, 75, -5, -243, 262, 272, 31, -123, -203]
6882b03L19P6j78j86J0J15J16l85L74J76j11j06J71j53k13J19m2k8J35O9j57J09
6904B7l10M68o1j29K08k77Q1k5j66K64Pj08Q0k2J4m74N01j30p5N3K35n8m88K70
6928a15J04N5Lj51K05k90j32L75J78l31J49j07J17j17R8J42Kj56J78j85P0P1k06
6951d3N5l9j12J78r8J30q6m9l0N9l19L53ooK24p4j02k3QpMP3j25q4L18k57P6k64
6979b46M5K28Q4oj9p9lJ01k85K4J49mk5r4J45L1n3r5r1J16P7J34K34j51l35K48
7005A30j25q8R2j73J22Q0j83Q7k2j02J13J80j27j59K13k79L43j11q4L18l14L7
7027e2Q6r1J49R8j08P1J05k80j1L0l9lM4k4j59P6m4O8K64k16L5l8j29K34j08O1
7053A9m8K91j77j89O2j40J2J29L63j67l05J7L46k47M9K39l69j69K58K54Rl60J02
$$ y = [-203, 116, 192, 14, -172, -162, -47, 69, -316, 58, 234, 123, 17, 188, 35, -178, -59, -101, -129, 6, 75, -82, 27, -283, 185, 124, -5, 203, -74, 7, -18, -184, 80, 87, -21, 59, 37, 51, -423, 78, -52, -127, -74, 161, 103, -385, -115, -11, 44, 47, -104, 101, -189, -321, 54, 232, -99, 50, -57, 60, -57, 41, 183, 185, 29, 207, 22, 92, 163, -43, 12, -27, -139, 39, -59, 71, -15, -64, -94, -35, -354, -1, -7, -13, 211, 137, 35, 12, 20, 13, 17, 90, -35, -119, 199, -58, 18, -246, -201, 27, 111, 105, 86, 7, 4, 105, -180, -156, -7, -11, -36, -130, 15, 46, -7, -102, -193, -77, 0, 134, 368, 217, -118, 130, 5, -83, 9, -164, -42, 38, -145, -58, -80, -182, -69, 111, -16, -175, 38, -241, 102, -9, -93, 225, -89, -52, 34, -57, 92, 190, 82, 153, 258, -22, -33, -3, -42, -45, -1, -25, -184, -108, -152, -84, 180, -36, -1, -39, -168, 66, -42, 19, -29, 262, 85, -104, -42, -182, -170, -41, 322, 155, -150, -133, 213, -34, 15, 254, -115, -284, -26, 228, 237, -123, -21]
7076b1O5r8j44J47J41Oj85k79K13K16M9j74J63j41kM5J69l13J95q2K04l19L19
7099A74q7j94J49r6J12j00L2J9k87J44L13l96O7k9M14k93L16j05M9j84l0qlj33
7123a56k02N43j48j15L77k40J76k89J41p7k75K88J63J28k54j15L3k21j53J99J87
7144a0J13k2l39p8K29j16K49M8L2k67K94k28L5n8K00p1l3j12Q0M9J52m0n22M62
7168D7p3m6L77k84L5Kj51j01R1K23j80l7J16R6j96J65j58P6M3r2K43n0rj58l3
7193e4R4q0N1l4l3Q0P0j13pq2J67P3q2j74K97l6k20K13k05j51K05j67K63q7J10
7218I8n8R3k77L82o6k52J50j06K78l23K05j70O7K08l61J55J0k5M6j28K53k43J25
7241F1J76k56j6NJ73j19ql9m2K35j91p1J08k05K42l3R2k04j9J22R6Q6P9l86k6
$$ y = [-21, 44, -54, -198, -51, 90, 96, -89, -368, -155, 61, 110, -64, 99, -42, -44, 1, 170, -143, 52, -30, 174, -145, 174, 87, -107, 42, -54, 58, -42, -10, 9, -278, -134, 179, -217, -150, -179, 235, -58, 258, 153, 202, 18, -12, -20, -23, -156, -358, 185, 37, -78, 299, 59, 235, -54, 87, 10, -265, 23, 186, 314, 60, -55, -22, -243, -396, -197, -10, 103, 81, -258, -336, -107, -223, 26, 74, 106, -161, 133, -95, -60, -118, 82, 11, -22, -134, -54, -5, 147, 107, -415, 47, -26, -72, 305, 21, 56, 58, -93, -194, -103, 120, -60, -97, 19, 115, -81, 84, -74, 2, 45, -47, 196, 146, 137, -21, -54, 40, -40, 11, -23, -56, 24, 94, -19, -26, -108, 59, 132, 50, -124, 173, 137, -83, 130, -75, -226, -21, -188, 75, -12, 98, 40, 133, -144, 238, 172, -80, 70, -36, 242, -81, 124, -46, 21, 229, -132, 23, 33, 8, 54, -74, 179, -64, 61, 237, -19, -35, -30, 143, 24, 16, -23, -65, 170, -21, -92, 16, -189, 53, 20, 112, -92, -111, 11, 107, 193, 272, -114, -140]
7266a40J32K5o7M1O9j95K50o7k46L12q4k1p7j23K14k98K33J89Q9l06J65q7k81
7289b73K87q3J44K87k50J09l05K14j58k44M99n55N45j93j04Q4K6j19K1K1K21m87
7311c13L56L3q0J95j76M4r6K8J23p4j31L79r9m41M29l24Q1N6k6k27M10j18K0j20
7335g1j1J81k95K73j11L3k23K10r7J18j68J71l05L09J4j8K18l66L9l2K59l37M83
7358B74k19j12R2J74j39O5j62K5j25K25j15k08L58M11n96l0K3q2K56q0Qk35J97
7381EJ20o7k89L13j52R9q9J26mj07j2L6K91k99J45l38L81J66r3j77q1N3j3j75
7405a61J58j37K27j22J38L0j59Q2J36j11k15L86p5k49j02J02l5J44l0M1J42r8
7427I2k65L72l10L9p9J38k23J63K24k89r8R1K16k23K21j25j08K7J74J75j4l3m6
$$ y = [-140, -8, 17, -50, -9, 60, -135, 115, 48, -198, 114, 30, 9, -68, -191, 23, -275, -42, 147, 236, -70, 95, 8, -273, 14, -69, 75, 362, 112, 221, -84, 130, -28, -272, 227, -328, 217, 24, -80, 4, 30, -89, -68, -47, 174, -313, 43, 76, -4, 191, 15, 59, -37, -9, 114, 40, -91, 288, 189, -252, 177, -147, -66, -10, -36, -263, 147, 29, 49, -71, -82, 99, -196, 77, -34, -1, -224, -14, -111, 7, -161, 10, -295, 14, 28, 10, 228, -138, -99, -131, 128, -209, 274, 55, -57, 35, 209, 70, 135, -27, -2, -127, 98, -17, -225, 133, 544, -52, -82, -59, -141, 115, 35, 43, -192, 5, 125, 58, -231, 82, -70, 29, -60, 66, 62, -45, -57, -21, 270, -29, 116, -222, 159, 325, 232, 55, -26, 27, 14, -161, -3, -140, 87, -35, 103, 133, -26, 56, 192, 81, -134, 252, 177, -72, -174, -72, -107, 37, 7, 48, 190, 92, -173, 199, -111, -72, -151, -13, -236, -73, 151, -138, -236, -145, 71, -152, 69, -56, -164, -137, 37, 212, 198, 165, 119]
7450A19l11M23l33P4n1K22j78k49J96n2Q0j10L17Rk7j26p4K2j0N6J30l4L3j09
7474A7j35J23k7J36j99J12Pj60J49L3k7K2p4K46q1j66q7K76l74M20m28K58q4K42
7498A99J83l62J85l89J22m4j06M05j14k52L35k48K73j48jk5J09j01Q2k08K95o4
7520A26j78J96p8p1M7j40L1Q5j32J75P3j71N1k86m0L91k1r4O6j07J36k55N9R1
7544d6N1j5Q9l8J7l8J36p8J40j31p5j16j60M18l9q4j92J21O8K13k98j05K92j34
7568dK1l9M1k4L4n6rM8J33l32L03j19K53l99O2J53j49o8J24k65Q1J99k09K83J01
7593A63p4Rok99L82p3k13O1L1J53r9j60L03j95J93q5J60j01j81J43J7l46J74J39
7617I6j38j3o7J89r6o3j58L35j17R9O9j75J19L2L7j93k03L00N2j39p1M5j10J73
$$ y = [119, -192, 231, -102, -28, -79, 143, -35, -284, -88, -140, -60, -170, 147, 156, 129, 3, -71, -49, -59, -3, 127, 93, 126, 17, -118, 5, -22, 114, -85, 27, 34, -126, 23, 56, 29, 51, -23, 223, 142, -24, -111, 165, -209, 211, -217, 41, -43, 199, 382, 20, 205, -184, -62, -106, -212, 193, 79, -173, 162, -86, 187, 39, 38, 13, 122, 21, 103, -105, 190, 126, -52, 144, 66, -5, 42, -98, -67, 18, -114, 61, 134, -37, 14, -272, -312, 79, 58, -36, 30, -77, 59, -196, -137, -46, 5, -10, 79, 41, 58, 20, 156, 78, 218, 87, 12, -104, -264, 154, 115, 31, -161, -40, 28, 241, -57, -162, 130, -4, 17, -22, 19, -5, 29, -27, -36, 12, 145, -187, 116, -3, 250, -149, -87, 66, -83, -151, -27, -292, -211, -12, -221, 62, 163, 89, 98, 92, -207, 175, 102, -111, -50, -19, 134, 35, -125, 178, -17, 176, 91, 251, 150, -31, 112, 129, -217, -43, 96, -42, -55, -122, 67, -29, -92, -250, 85, -32, 67, 136, -39, 80, 112, 149, -44, -247, 53, 105, -34, -105, -60, -170, 3]
7641CJ91l13J31j79L53k46J8J94J11q2k61Q4Q0l7j52L05j03l08l4J11N3j1J16
7664B4J14j87J06l2j8J07l2l5k6j67J16J20rk59J12O0J2Q6l5k0m0j49J86n6K03
7689A81m08K21j47J71Q5k67K68o5o0K20k06J57N3p4k00J45j1k7j15J14j28p5O9
7712i9J36j87K13n9qq0J84k54L66j72J12l03k1O0J26p7n6K2KJ32K25k35K6j64
7736a11k7q0J09lJ16Jo3KJ87m8k03J83M0n5r4J99j63L54r4l69r0K83j48j38K16
7761DJ82j69l4J34J77n50K39p3rj39K16J8j5N8j8R4k3j11K5O6j1k3o3N3j06O7
7787a1J33n4J30o6k72J90M3p6j0l8m5J31k8o2j24K32o4J88k45J64m07M58j65j88
7811a86N0R4l0P6p6J13PP3m25J45J10k39M80R0l04k51J02K09K01J28l92J7K91
$$ y = [3, 194, -119, 12, -167, 186, -60, -42, 152, 263, 181, -80, 4, 84, 47, -105, 200, 97, -211, -245, -134, -81, -92, 24, 138, -49, 57, 25, 7, 114, 82, 47, 21, -146, -30, 90, 81, -178, -66, -6, 6, 92, 57, 37, -3, -152, 34, -22, 181, -227, -6, -153, 18, 103, -164, 104, 39, -21, 199, -7, 150, 203, 129, -71, 74, 63, 36, -79, 35, -93, -168, -99, 37, -150, 63, 4, -4, -84, 100, -154, 212, 40, 152, -151, -172, -112, 14, -63, -119, -97, -95, 37, 262, 27, 53, -111, -138, -218, -109, -112, 4, 5, -58, -56, 131, 83, -120, 63, 103, 48, -46, 153, -10, 344, 250, -119, -209, 74, -74, -212, 4, 186, 17, -17, 117, 294, -256, -17, -90, -99, -238, -22, -4, -19, 39, 21, 115, 92, -19, 6, 72, 61, 38, -25, 28, -78, -11, 122, 68, 198, 132, -140, 50, 93, 17, 7, -31, -76, 55, 27, -35, -159, 73, 9, 197, -48, 116, -291, 167, 2, -186, -136, -42, -72, 4, -72, 41, 48, 121, -304, -159, -49, -288, 192, 282, -22, -273, -171, 38, 239, 367, -25, -8, 283]
7834B83k86k3K27k50Q1K71l22j3k9J7M1k2K50k12K6j76J97j44QJ40J10j58R0j70
7858f4o6K29k90J2L30j08j51K97l65J53R4J14o5P7k51K3O2J24j38p1J16k38j3
7881a89J32M2M0P2K5j39K34r3o7J41k68n9L1K22ok51J76pj12rL5J54k4P9k31K10
7907A38mj69J31m01L79L9k8j65j86K04K8p1J53j15L6j18J26M6j20q8P6M25n11
7930a95L51j09l17L23m7J83l41j57Q4L11j35N9j0k64J31K24j21m4J8P4O8j81l3
7953a28J60k5k8k47L31o3q7R1M5k51L16r2J3JJ52j61j16Q4k10K24l7P9k57n2K94
7978C6n9j29Q0%p6L13r5k20K44j41K01k54o3K56j21L7l6L6l07J71J29k47M26j4
8002A67j69J71j2J42m1j45l8Q6J1k99K02l0l7o0N3j4J05Oj21J28k13J44J20k88
$$ y = [283, -3, -26, 201, -49, 32, 303, -19, -32, -61, -44, -3, -25, 225, 13, 39, -137, 60, -84, -76, 64, 174, 16, 106, -64, -130, 99, -191, -179, 151, 43, -108, 189, -176, -23, 71, 185, 120, 197, -54, -31, 31, 155, 17, -54, 62, -176, -189, -57, -15, 25, 97, 122, -17, 217, 124, 57, 198, -70, -129, -98, 124, 118, -133, 43, 36, -76, -85, -50, 104, 80, 159, -72, 138, 134, -35, 96, -305, 74, 113, 85, -80, -266, -62, -34, -105, 48, -67, -31, -149, -23, 23, -97, -185, -109, 316, -195, 156, 47, -270, 53, 6, 189, -152, -309, -225, 86, -49, 10, 0, -264, -133, 91, -30, -74, -56, 18, 86, -95, -128, 32, 7, -21, -268, 63, 0, -87, 4, 49, -202, 114, 22, 35, 36, 188, 27, -89, -5, -215, 9, -28, 51, -206, -258, 36, -23, -152, -72, -72, -148, 165, 70, -150, 94, -47, 154, -100, -163, 93, -28, 9, -27, 9, -298, -127, 2, -245, 181, 167, -2, 169, 157, 299, 258, 113, 75, 161, 172, -127, 75, 45, 8, -52, 1, -13, 92, 98, -23, 105, -108, 36, 156, -132]
8026a32J50J10m19L29j59lJ58NJ50j81J33j83J86o9q1j7L28k90J87M5m22K45N6
8049A26k17L8J37j2k95l4K83J90m02K26J00j10J45j39J39M7k08m6K68j90K80j10
8071B16k57q0M0j18NL32l03K50r9N7J04j74m2P6nj38K82k74N4J26l19L70p8j67
8095a42L8L18L3k54J16j79K09k72K64J02l66K86j89O9r1K09J6j43O6k31J18l1
8117e4NJ4K63m01K12N1p4J4j24R9m8N9j1m4J52J95l42j3J77j34J78l00J18J75
8141A67n0j36N3J71O7o18K2K93k1p9J09j44L0O0j9J16j97K61N9k85J95K0j86J03
8165in4N0n6P0Q6m29L93j72L9J18Q4j6l37M08j88R7j25r3K7j86K93j07K3J06j26
8190a04L93
$$ y = [-132, 18, 128, -291, 38, -121, -124, 34, 39, 189, 8, 141, -42, 144, 75, -6, -23, 305, 15, 202, 247, -175, 70, 126, -91, -53, 84, 72, -223, -257, 26, 216, -186, 40, 140, 30, 175, 36, 175, 222, 14, -32, 236, 46, 326, 216, -41, -121, -81, -199, -194, 138, -165, 85, -14, 43, 147, -27, -69, 7, 2, -136, 146, -128, -74, 52, -267, 103, 25, -142, -104, 214, 247, -7, 109, -70, 139, -133, 131, 233, -133, 153, -36, 33, -58, 151, 167, 24, 90, -141, -23, -54, -49, -35, 228, -173, 39, 90, 16, 30, -94, 5, -43, 16, 5, -39, 113, 308, -34, -47, 130, -4, 174, -126, -8, 167, 117, -19, 34, 205, 272, -346, -324, -31, -52, -131, -22, -166, -136, -76, -95, 21, -176, 85, 144, -141, 54, 74, -112, -9, -63, -13, -69, 1, 87, -342, 51, -121, -82, 36, 120, 104, -233, 175, -13, 84, -41, -134, -107, -293, 0, -107, -84, 22, -104, 289]
8191B89
$$ Imaginary data points
##PAGE= N=2
##DATA TABLE= (X++(I..I)), XYDATA
0@%%%%%%%%%%%%%%Qj6J6j6J6k1K9l2L9m7N3o1P2q5R5j08J25j44J65j86K10k37
36a25K66k99L35l75M18m65N16n71O31o97P70q49R37j032J135j253J382j523J682
55H83j860K063k293K559k871L241l695M258m980N947p316R423j3121K1534q0178
70f6406j0512O1204n3620L4191M1862R76p029K4005q410q17J1784r985j8879K4700
84B3064q68l1842J554J8615j2670q418N277Q462m746k711Q373J634n863N498n496
99a37o761J0378r11j5532L933J1318q541p422J5695o47j3211J3689M254j5764
113i659J2310Q565j7756P144J6785j0714o852J1538o14j2684N012L086j2319M274
127a884N602j2120K442Q346q432l072O151L147k000j449O315O90m230K790j049
$$ y = [0, 0, 0, 0, 0, 0, 0, 0, 0, 0, 0, 0, 0, 0, 0, 8, -8, 8, -8, 8, -13, 16, -16, 23, -24, 29, -32, 40, -45, 50, -58, 67, -77, 88, -98, 112, -125, 141, -158, 177, -198, 220, -245, 271, -300, 331, -366, 404, -445, 492, -540, 595, -658, 724, -799, 883, -977, 1086, -1207, 1352, -1519, 1722, -1973, 2285, -2695, 3252, -4064, 5359, -7762, 13772, -66406, -76918, -15714, -69334, -35143, 6719, 7695, 666, 24671, 16261, 15444, 27228, 17243, -1636, 23064, 22196, -9646, -8092, 10523, -2147, -10565, -5288, 3174, -1572, -4283, 4090, 5724, -139, 5359, -137, -6898, 3480, 2569, -12963, -9030, 2288, -6253, -13675, 2020, 1373, -11838, 1851, 6105, -9659, 2651, 11216, -6540, 604, 17389, 6675, -177, 11361, 10747, -1937, 3075, 6161, -6158, -1884, 3718, -8402, -5960, 2386, -6046, -9118, -2967, 180, -1820, -3269, 3046, 3736, -494, 2296, 1247]
142A247k205L288j431k372K509L418k141m997O290M186j0133L189O797q235J80
157d10N387o024o05M520m566l666N892M45q889L160P394q447J55R163n512j147
173c150O544k563j462K504J46k000Q8L468j859j862M435k114k690M862k347m364
189b364J849J266j443l029L165K947o111J206M938m562p64K266k970J661K288
204C43k292r74L546K160m943J633O902n654k946O919j571k456K500j019m23J134
220B859n52k161m88J922l529k324N462j606m587M138O16k738J628p8j01o28J186
237i81J161k137K038J739l296K596K236l002P15J730j083k78N60J460k481j290
253c13L305k286k244L231k326j312J836j755j95N81n37o20k17K665j037k631M324
$$ y = [1247, -958, 2330, 899, -1473, 1036, 4454, 2313, -2684, 3606, 7792, -2341, 848, 7645, -590, -410, 4977, -1047, -1652, 2868, -1698, -5364, 528, 973, -7916, -4756, 2638, -5809, -5654, 3509, -2003, -3150, 3394, 831, -631, 1873, 2019, 19, 107, 3575, 1716, -146, 4289, 2175, -515, 4347, 2000, -2364, -515, 751, -692, -3721, -556, 2391, -3720, -2514, 2424, -2138, -2902, -636, -3606, -1945, 343, -1949, -2923, 623, 2783, -2160, -527, 6375, 721, -2225, 4694, 3123, 667, 3167, 2148, 1725, 2859, 2307, 146, -342, 1580, -1949, -4273, 1189, -417, -5004, -866, -250, -2988, -1360, -1438, -1539, -2167, -981, 180, -1957, 81, 1820, -1476, 1120, 3356, 354, 1069, 2799, 1716, 1438, 1998, 3458, 977, -313, 2992, 706, -1538, 1693, -633, -1945, -109, -1864, -2059, -1478, -2015, -2635, -2852, -187, -1224, -3855, 469]
270D69j26k984L806M36j986J997k93M4O42J6L06k004J860Q36l925K072J410l783
288a207L59J564j447q34o52J277n53r55J766j213n87K520j920L74K404j829JJ783
306H51O69l24r95K101N95k749J966O86k355J382l18j455J714j298j080J26O94
323B10n43k619J727J510l811Q10K649k158K08J114n47J018j02q2P13K35J387r24
341G95l65K777k057j132K967j258o95J4lj07q86J03N09k165J326m43j972K141
359d51p15j718K150J9j048N97L91N24j313J150J928k386R43K400k302J094Q87
376B150j273N38O00n40k30JQ22k029j012K504k015j657K130j311k89L53o35P62
394a131k55m36P97m23J813m38j766L146J40k431J751J209o75j55L36R00j363j06
$$ y = [469, 343, -2641, 1165, 1601, -385, 1612, 1319, 1363, 2005, 2021, 2327, 323, 2183, 3019, -906, 1166, 2576, -1207, -848, 716, -731, -1565, -2217, -940, -1493, -2448, -682, -1895, -2482, 38, -1882, -1508, 896, -933, -932, 851, 1520, 1196, 201, 2302, 2897, 148, 2114, 2800, 445, 1827, 1509, 54, 1768, 470, -610, -484, 210, -333, -2952, -1225, 285, -3526, -2716, -67, -2225, -2017, -903, -1450, -432, -534, -616, 97, 332, 1719, 795, 430, 3207, 1150, 18, 2985, 1727, 1032, 1046, 1043, 936, 50, 153, 662, -1503, -177, -620, -2592, -451, -1166, -2884, -734, -715, -1763, -1166, -775, -251, -1564, -414, 1514, -872, 71, 2471, 169, 1263, 2150, 877, 1415, 2015, 1475, 1245, 1246, 2068, 39, -973, 1531, -484, -2141, -11, -1322, -1611, -1258, -1893, -1131, -1386, -1822, -1025, -1448, 365, -73, -1839, 1307, 1447, -984, 767, 1976, 1301, 1146, 1482, 2382, 1019, 913]
412I13J018k188J046J043k526N39J572k256k69O75m29q41n28J482o68j036K138
429c15j171n02K104j037K3J611m50L85N72M63L5r12J463k84k084K147k70k319
447e41R55L16n46p44j51K76p97k61J359j785L82J380k522J004K260j781l18J230
465b84P48o74n42J941l01r53K259m25q34J889k104o82J878j110p15K61N45n13
483C84j731J197R6k207J312K80j200R89k45k78R51k76q6l10Q39J118j552R35J953
502B169k086j05J751q22m28K85O91k86p51Q17L5j826J709j344q14K076j787j530
520b246J595k05j642M27Q94M66j390J468P11j109J244M27j020J669R5j210J110
537A284J94k44j040K52J308j448q94K034j007n88P25j050J69o02n19L03n80Q39
$$ y = [913, 1931, -257, 789, 1832, -694, -155, 1417, -839, -1108, -433, -862, -1703, -2231, -749, -1417, -2453, -315, -1486, -1988, 116, -921, -898, 713, 263, 648, 1220, 1683, 1718, 806, 2269, 1985, -99, 2048, 1778, -541, 414, 730, 184, -560, -711, -435, -1232, -1493, -134, -1919, -1537, -157, -2679, -1675, 585, -1196, -1514, -284, 464, -210, -752, 1189, 888, -65, 2194, 1769, 935, 2824, 720, 38, 1916, 806, 91, 352, 897, 384, -1347, -150, -54, -2261, -949, -669, -1869, -880, -1125, -1403, -452, -728, -814, -1124, -285, 833, -719, 216, 2169, 83, -22, 1729, 907, 479, 764, 1455, 1169, 418, 1235, 1270, -556, 1153, -191, -1005, 1071, -716, -2246, -651, -856, -2498, -2071, -1177, -711, -2101, -633, 78, -1031, 213, 640, -380, 1289, 1384, 174, 1284, 1478, 1234, 194, 446, 1754, 306, -588, 1446, 439, -149, 576, -474, -305, -907, -1426, -1123, -1703, -864]
555h64k33j040K096o89j560K484j58j259J239Q54m03J99N72L71q27R29J97j729
573A79J499L82k251J238L47k160R5P43q78n33J79P44j049m41J644j218R8J201
591a81q73M05O52j44J93k75R66J4j091K190K33j846J683J56j126K94j9m17k39
610E75q3m7j144L41L14k032M46J413k362R49J324j349J72N18M41l44J25J292m30
629A19l47J458q08q9J507q64O6J095o70m28k84N66m26j508O55R6k044J480j16
648e42j030O05n60R7O38l37K75l39P59P86j768O65J562j226L08J055k89M29k7
667A061M20M19q51K10n43p55J538j308r44J771j089r28Q29l65L2q18j37N67r03
686a794R42J34j035J781n20m15J600j73m81M40K10N53m96N4Q54j165J38R42j172
$$ y = [-864, -1097, -2137, -41, -730, -2290, 194, 36, -1223, 16, 870, 467, 666, 1238, 1609, 782, 1711, 1908, 179, 1678, 2060, -191, 1047, 1394, -766, -671, 72, -806, -1339, -1160, -416, -1465, -1906, -262, -1480, -1382, -181, -1054, -649, 3, -141, 52, -223, 743, 757, -334, 1856, 2089, 243, 1926, 2082, 956, 1250, 1231, 814, 575, 492, 445, -699, -358, -44, -2076, -1630, -217, -2579, -1630, -306, -1655, -1483, -965, -524, -868, -743, 549, 119, -228, 1230, 422, 333, 1840, 976, 1042, 2137, 1467, 1039, 755, 1321, 895, -613, 42, 138, -1906, -426, -542, -1572, -967, -1527, -1430, -792, -1129, -854, -1193, -434, 352, -1416, -751, 811, -415, -107, 948, 659, 1088, 1061, 1481, 1900, 1049, 1259, 716, -39, 1499, 191, -753, 1018, -71, -999, -170, -535, -503, -1321, -1458, -891, -1794, -852, -718, -1753, 28, -492, -907, 693, 520, 39, 479, 689, 1242, 746, 800, 1654, 489, 627, 1569, 397]
705C97Q1L6r43Q03o26l95L26m32M53n16r01J584r40n45J264l54P5J49J83M90j25
726F4L63P48p05N15K51q54R09%j390J282J8o94j95Jo1o82k16Q09j190P1P42j128
748a342K44O60p51N14m0l38P78l79O97n8n74J472J5j181J578%n19K44q6K67m69
769G32m07N46q68N48l37j395J026K51j778J113O6m11k93N3P53j89n64Q66l95N90
789i3P57j151O66J036j173M38P41k32k51n54Q77J77j548J070n56o70Q68r14J01
808d11J29m13j84O0K06K81j294P14Q63j370O95Q90q77P80K19j35N09j42N37j18
828I39m53J063q94j54Q45j032J69Q52j012l59M0k72L3j019P66m8r42R94j25k76
848h85M47l04n4J042n08L1M32K94M21o19P5Q05o39P2L49n76N88m12n65R11m44
$$ y = [397, 478, 514, -429, 374, -252, -647, -321, -753, -300, -816, -1717, -133, -1073, -1618, -354, -708, -633, -484, -301, 189, 64, 427, 1175, 470, 985, 1236, 382, 1291, 1291, -99, 1183, 1201, 507, 312, 313, 252, -430, -646, 163, -1027, -956, -214, -1342, -1098, -438, -1189, -675, -715, -1053, -275, -654, 43, -15, -589, 883, 898, -283, 1295, 1295, 776, 1020, 934, 1201, 732, 325, 871, 3, 551, 214, -1181, -155, 96, -1682, -569, -503, -914, -1207, -1154, -401, -590, -1154, -288, -683, -93, 664, -487, 179, 1215, 42, 480, 1221, 989, 738, 184, 1061, 1238, -310, 760, 204, -466, 402, -512, -411, -282, -695, -879, -819, -613, -332, -1626, -912, -49, -1419, -724, 166, -711, 69, 288, 153, 662, 520, 1057, 939, 486, 1549, 655, 501, 1346, 314, 483, 1335, 323, -36, 4, -268, -235, -1254, -488, -536, -1478, -484, -609, -885, -438, -742, -796, 246, -262, -231, 201, 495, 916, 297, 372, 1177, 538, 610, 959, 383, 971, 559, -6, 905, 461]
869D61k89j8o46O55o77l41J313j472j00P20q55N12J58l79O83k5R6M09l20R53m3
890G95n08J035o35q9N64o82J40P8j20K11o93j33M55j081L0L32n11M70l66o12P74
911e46k15nL46n11J030l37j69R14k36k60O33l61K79J35k62L71j16Q2p9p25O73
932F41R8r59Q09p78k35L83m73m60M64m83M30k52j01N04n43O58M39p88O12K47l62
953a49Q64l56M38J72o41N71q4q39J081o74m3L7j70l19K87n62K9q4j30K83r30Q98
975c21M6j245J048o2m35P59m13N37K80N2L11J73l18M40l74K50N19r41M15J17q08
996C0P20n28j01L08q78K64j47p23Q39p91j63P85n36r3N03k11M56j83K52N49m30
1017g8O34J72o55R65k72n28N82j07j76N5j37J74j46m08M39j110M49L67j235M83
$$ y = [461, 172, 154, -492, 163, -514, -855, 458, -1014, -1114, -394, -1249, -737, -579, -958, -275, -300, -204, 205, -115, 838, 795, 287, 1322, 687, 598, 1162, 480, 620, 698, 578, 789, 96, -37, 418, -663, -633, -301, -812, -342, -708, -1320, -546, -761, -766, -420, -931, 99, -238, -407, 507, 271, 11, 644, 283, 562, 697, 435, 806, 690, 772, 693, -32, 641, 739, -220, 589, -189, -424, -41, -514, -974, -510, -993, -563, -815, -916, -412, -955, -297, 142, -646, -34, 213, -149, 715, 359, 797, 969, 328, 899, 815, -24, 1057, 383, 340, 377, 207, -112, 175, -387, -358, -442, -572, -289, -1219, -321, -275, -1520, -472, -534, -969, -210, -623, -86, 194, 246, 557, 730, 412, 852, 478, 728, 1247, 306, 721, 838, 30, 750, 222, 121, 429, -449, -185, -332, -1055, -216, -1007, -1170, -385, -921, -1014, -511, -722, -266, -449, -197, 352, -78, 556, 728, 73, 1038, 766, 238, 820, 713, 537, 592, 455, 629, 483, 75, 514, -596, -147, 220, -1015, -532]
1037e32J81m34L14l98J89L64n61M88J75j26P40o23R6J223p26j16O51m18Q1O7m2
1058E93P1l28k26N88n84J96k24p93M78l49j35K03l2Jk45p4O36m56J01O09k94j22
1080c86O90p71O86K12j04L25n26P85l49l02Q46o72l32O44q13MJ86k10j22j23m80
1101h12K94j58Q4J76o46P21j7l07L89L41m05M99O5K93q4j91M69j12j77N21n78
1122C65k03O34p70K36J83l22O5l8J8l20o80Q28k88p06N80k44m21Q94n63L09K05
1143b38J35J38j7K15L49j84L62J0n43P39j37n52L26k41J45p6o73M71l30m72P54
1164A81n92j63K97o54R1M38l23L40j31K23J53m81P48J00k27N61q8m36J002k73
1184G66j20J53j65J14n13K77J90p92K53n0p36O00k78l54L71k04l64M70n00M89
$$ y = [-532, -351, -785, -471, -869, -680, -316, -877, -389, -214, -340, 400, -223, -127, 1096, 370, 254, 905, 487, 568, 635, 593, 664, 336, 110, 698, 114, 310, 86, -707, -229, -578, -713, -510, -542, -541, -786, -860, -224, -680, -579, 30, -264, -386, 304, -467, 219, 431, 327, 652, 126, 911, 562, 260, 1106, 434, 102, 746, -67, -63, 123, -87, -209, -332, -812, -518, -676, -592, -416, -1062, -341, -358, -665, -276, 65, -340, 159, 224, 517, 433, 242, 711, 599, 422, 943, 365, 162, 796, 26, 262, 445, 123, 188, 150, 168, -152, -832, -4, -292, -998, -418, -662, -1083, -189, -752, -443, -238, -103, 35, 18, 233, 582, 398, 760, 770, 227, 966, 829, 277, 603, 362, 507, 431, -242, 229, -101, -573, 181, -411, -574, -277, -931, -840, -402, -725, -385, -516, -293, -140, -621, 127, 227, 0, 561, 473, 37, 1039, 766, 646, 799, 634, 748, 235, 512, 702, -90, 163, 113, -623, -23, -301, -655, -284, -488, -852, -382, -882, -393]
1204c93k88J17M26l55K61P06n85J69L63k62K83J37l0L86o45M35N9p98N42k35n12
1225b19L74m43O3k6m1J22n20j90N57m75J20N24o59O61j29o4M81j69N1K59J84K00
1247F61j19q4M72n83M5K86m21J45j23n46K24q1j82J08p06O15R4n94L61J13m20
1268g35M21K81m52R4j25O47m8qL17m81N39L85l74Q6L9o8J03j89j08O4l33L79n64
1291a30l25N95p14j09N80o78J91J30n79P37m1k7L07o56P03K25m08O96N8k33O09
1312I31m11n5r3k28K50J07k69M94q69j8L37o40L06L65n05l0l1J2j76k89L1J98
1334e83o5L58L9l32R96l16J16L37l39M67k98Q0K61l23J65M97p75J56r4j80n3m08
1356b94M4M17q52L58j33k49N81m12J31K03k43K81M0l14L19N2K37J66j04L00j18
$$ y = [-393, -681, -564, -138, -493, -232, 474, -111, 58, 421, 159, 442, 579, 549, 935, 290, 725, 784, -14, 528, 293, -219, 155, -288, -225, -251, -292, -170, -690, -880, -323, -798, -678, -154, -813, -152, -281, -345, 136, -33, 18, 277, 461, 661, 542, 458, 930, 347, 392, 678, 257, 402, 279, -267, -43, -124, -306, -198, -904, -289, -195, -789, -428, -315, -735, -314, -33, -485, -391, -516, 131, 83, 75, 392, -89, 450, 835, 461, 547, 586, 518, 621, 432, 324, 388, 55, 434, -130, -455, 140, -574, -683, -103, -781, -590, -460, -1039, -302, -343, -370, -63, -719, -16, 209, -199, 497, 555, 322, 931, 520, 465, 372, 144, 394, 501, 232, 726, -143, -161, 176, -464, -158, 207, -298, -328, -359, -347, -523, -812, -781, -583, -648, -290, -251, -583, 413, 97, 213, 550, 211, 678, 380, 460, 721, 398, 563, 1060, 285, 441, 347, 167, 114, -294, -250, 167, -685, -327, -460, -709, -128, -540, -409, -206, -449, -168, -128, -442, -123, -71, 166, 332, 228, 528, 410]
1377D10j89L56j18N0L46n14K5n4l16Q8m7m46J32n8J16M1l23j19J58k15M36k04
1399d45r2N99k77K55J52l09N61j97J0J99P0j82L67m54L20P5l91L2k43J16J3l93
1421b14L61n36m7K61k78j92K40PoL38j91J38j58n5L37j02M47J51n58P44k24j31
1443C32L15J4k74K1k71L84m10m0R3l57K9j13R4N5j5n16L42j34K30q2m16N66K10
1466E7l86M01p0k8O39m73M2J88j42K16o2N2K25m95M05j73o13J68J88p74N59j44
1488b20j53J11n15O57l50m54O96m90K54N16k83L68J82j84Q1j55N8M39m00K14J79
1509E51l68L44j46j83K51l63J18Q5n57J68m09J06J56k15O0j00l50P82j81J13K7
1530a11j94L32j5l02P86m47l6M50m83L65L15k85J50J38m87L44l27k91M72n08J01
$$ y = [410, 221, 577, 459, 509, 855, 341, 366, 312, -4, 84, 37, -409, -277, -335, -219, -178, -501, -620, -462, -677, -241, -445, -537, 62, -215, 40, 192, -117, 444, 247, 257, 456, 526, 344, 711, 257, 577, 652, 261, 293, 50, 166, 179, -214, 147, -389, -436, -175, -453, -645, -405, -398, -404, -66, -257, -119, -277, -332, 5, -97, 350, 501, -57, 687, 463, 332, 647, 661, 387, 408, 137, 521, 111, 71, 164, -193, -164, -277, -183, -128, -143, -659, -317, -451, -221, -303, -719, -153, 57, -329, 72, 2, -26, 613, 140, 182, 370, 228, 444, 382, 434, 659, 164, 569, 396, -217, -49, 139, -635, -76, -220, -373, -262, -777, -120, -470, -924, -228, -718, -464, 52, -231, 137, 319, 135, 216, 61, 119, 558, 158, 372, 551, 183, 527, 381, 198, 449, 86, 204, 289, -268, -100, -509, -403, -247, -462, -402, -502, -852, -70, -251, -138, -111, -305, 27, 12, -290, 496, 49, 13, 463, -20, 345, 660, 375, 525, 663, 176, 520, 193, -98, 374, -134, -33]
1551c3m2m91L85j91QK29l12J22J84k27K62j19o9N46n49M59J5j7J3L24k57N05k51
1574D94k0Pk62K97j23k70K04o85K76J33l40j32J92m70M29p7o1J55Q6l2K47n91
1596e43N89Lk89N97o0j25J87J73j05K27l07L72m94j77N12n69K17k4m06K29l68
1617c61j93J63n0L15k65k55M89k72J81J81m36K80K05r0M90J6j72L34k04Q2J26
1638E64l03K27Q2m27M69l14k05k1k44m0K7j72Q0P7k43K76k63K76j78N8K16r9l80
1661e37M99J83l4M1k1M15k60J22J01q3J55K8l14j05k07o3M56m32r5k7k75K41j74
1684c86j89K69J19j11J79l12K45k1N2J66k40L99l2k03M63N5k00k20N34k30K84
1705F21m70j3Q9j89rj68J09K05l53j75K70n67L76mj87N62n12P4K05l71K66K55
$$ y = [-33, -75, -566, -181, -372, -364, -135, -447, -325, -141, -368, -106, -225, -294, 252, -297, 162, 177, 160, 173, 497, 240, 745, 494, 474, 481, 219, 516, 393, 123, 327, -358, -82, 51, -289, -421, -229, -699, -270, -347, -408, -253, -167, -199, 48, -543, 46, 49, -240, 357, 297, 172, 359, 532, 427, 654, 347, 719, 225, 48, 560, -9, 208, 184, -222, 7, -361, -554, -391, -441, -126, -391, -646, -157, -429, -248, -67, -503, -223, -18, -108, 382, 398, 226, 560, 356, 438, 564, 261, 488, 570, 143, 612, 298, 93, 72, -172, -212, -185, -357, -277, -200, -443, -167, -430, -154, -332, -274, -58, -157, -537, -38, 145, 111, 152, 131, 546, 286, 408, 509, 426, 581, 609, 295, 190, -17, -80, 376, -56, -151, -178, -453, -212, -386, -575, -306, -187, -298, -119, -431, -186, -207, -155, 11, -229, 170, 138, -65, 398, 453, 253, 33, 567, 337, 621, 151, 138, 227, 38, 29, -139, -30, 175, -178, -353, -83, -650, -274, -278, -465, 97, -415, -341, -136, -507, -241, 14]
1727A4k78O53j32j18N95n41K56o6j23L9j09J7J49n12K47kj57K45l62R6j5k33q4
1750d21K11k49J87j2k78L05l5M2K77j60K07R8o9K65j47P9K77k38K99k42k94K82
1772C84j10k39O7j41j34J68n79N21j67n74P69m73j85M99J3n2J34m9M8P1%N1J09
1795A31K57r6n5K41m0l7k13K63j28r0j69K01l76j20r6K00j38j84J01J5k01L12
1817b22K3j78P6N01n28L86j80K1M27k60K22K13l60J90l7j66M72l21J16j90o6J97
1839C36j10k60J2L1k51J78k75J7K16l46K70j80L8K86k00J48J96j39n2L81j76K03
1861C23k4k56M14p1N6r6l27L99k74k4k5l82J55J36l42K52J8l10K75l42J87p0k07
1884e35N46n4l45L29P9J1J75k24M25k07N4L96l38L1p7j05J72J64m67L46m80l4
$$ y = [14, -264, 389, 257, 139, 734, 193, 449, 383, 260, 299, 190, 207, 356, -156, 91, 89, -68, 177, -185, -89, -104, -337, -421, -210, -459, -272, -284, -562, -257, -292, -250, 27, -133, 74, 172, 103, 368, 221, 300, 577, 339, 638, 396, 102, 384, 274, 35, 102, -39, -173, -5, -584, -63, -230, -804, -35, -508, -693, -194, -181, -233, -99, -148, -100, -29, -29, 22, 131, 388, 292, 237, 478, 438, 401, 188, 451, 323, 233, 64, 265, -111, -231, -327, -127, -265, -449, -348, -333, -534, -222, -199, -377, -301, 200, -328, 58, -122, -101, 326, 66, 288, 501, 141, 331, 294, 128, 600, 279, 395, 205, 139, 336, 226, -34, -22, 9, -242, -64, -339, -322, -106, -452, -182, -362, -324, -38, -238, -90, 106, -33, -85, 296, 120, 323, 299, 43, 457, 386, 442, 346, 19, 418, 144, 120, 95, -287, -132, 4, -338, -86, -68, -378, -103, -445, -258, -328, -535, 11, -43, -388, -59, 20, 31, 206, -18, 407, 200, 254, 650, 312, 343, 266, 161, 333, 497, 30, 376, -104, -138]
1906a38N5p4n6j78j03L32l08J51K74k18J04q3K05j33J98j13J77K90l21L71k24
1927B08K29L9m52M49j34j60P8l81%J17j91M90k94j81R3k03K30q1k93L21k16j3
1949c45L16o7L30j79m2K46r6k03L45J57l2J93l90L43m12p1L11m09M6L45n13N2
1971g5N8k60M16l24k54K68j91M0o7O4K28j65J60O9J15K42j46j46J90L9j80L40
1993D21j62j68J85k12L0J17k37K94m52J32K7l20K78P1m22K24L1k33K78l74L89
2014a03k83Q4K12j51K89K22m61M99j2J40j9l28J79J34k03j24K72j87k65J0j4n0
2036a59J3J9j42k88L43k03J00M1j7k46J94N1J00J17n8J46j8J15J93j36J30Mq6
2059B13o5j3j52M81o43L34j20l25N55n15K23j72l23K63J87j44K52k10l81L50j68
$$ y = [-138, -83, -157, -213, -391, -494, -162, -470, -319, -45, -263, -159, -242, -37, -170, 28, -85, 92, 382, 61, 432, 208, 437, 476, 24, 473, 339, 179, 257, -124, -124, -7, -198, 292, -2, -183, -90, -293, -63, -144, -437, -116, -332, -345, -29, -96, 234, 55, 13, 259, 163, -40, 305, 462, 430, 623, 233, 576, 164, 93, 404, -5, 41, 386, -127, -75, -17, -277, 139, -185, -439, -171, -362, -322, -389, -325, -97, -262, -102, -33, 82, 324, 178, 32, 222, 261, 81, 421, 259, 91, 276, 64, 94, 211, -26, 268, -184, -52, -25, -345, -67, 4, -418, -194, -163, -396, -118, -492, -103, -386, -302, -90, -241, 48, 270, -191, 308, 296, 436, 417, 89, 268, 402, 199, 75, 347, 160, -105, -95, -109, -159, -146, -127, -269, -557, -214, -417, -317, -276, -293, -539, -345, -294, -194, -77, -135, 11, -7, 108, 301, 165, 295, 299, 213, 148, 135, -17, 464, -179, 155, 35, -290, 265, -250, -27, -199, -522, -259, -72, -216, 36, -174, -555, -205, -373]
2080c73P4L80m04L31K9J4L00P1l20K28j65P9L75m69K42m14K90j98k83J01O0m08
2102d60L40j06k41O93q28J43J83N4J06l2J27K32j58p7Q3j93M12k27J59O9k17P4
2124A36K62k69O0P4l51J25o2k37K00j94J64n6j66r6L5p4N34l47K89k49K49j2L
2147A8j05N17j49k13K08k39J99K72m77O07k23j69L3l12l0R6r1j11J86j93Q2j85
2169b79K34k40l44M05j68J16M1j17K55J77n0J63k07J63O9j76N1M54n41L74r8j81
2191A01L29k65k51K19j13o0J2m22K17n5J19j04j82J05J38QJ07k16K14P6j39K06
2213D4Mj83N19m20J65J19r9r8J99k24K73r4k12P7l56J90N3l29R5K39o87O95k40
2236b70m9O1q7P8K10j1K59l88J32L19l47J67k7K89j17J84k03L9k0j00O7k59M37
$$ y = [-373, -299, 81, -323, 8, 37, 51, 351, 422, 102, 330, 165, 244, 619, 150, 392, -22, 268, 70, -213, -112, -52, -460, -120, -226, -467, 226, -602, -459, -276, -222, -116, -148, -21, 211, 53, -24, 59, -134, 278, 51, 210, 279, 62, 136, 398, 129, 189, 263, -88, 37, -25, -262, -62, -256, -92, -148, -314, -410, -375, -449, 85, -262, 27, -222, 27, 15, 18, -87, 430, 281, 68, 276, 37, 236, 508, 31, 638, 415, 246, 279, -33, -63, 33, -58, -169, 17, -176, -94, -279, -45, -285, -629, -224, -392, -276, -235, -352, -97, 80, 30, 193, -14, 149, 218, 42, 93, 547, 6, 380, 282, 101, 430, 165, -86, 133, 20, -40, -28, -450, -233, -288, -169, -273, -455, -350, -212, -204, -97, -313, -99, -23, -162, 44, 48, -135, 384, -36, 129, 248, 149, 51, 250, 26, 299, 205, -7, 70, -286, -96, -43, -372, -277, -38, -725, -30, -270, -319, -258, -345, -267, -57, -68, 191, -197, -65, 254, -93, 74, 47, 336, 219, 403, 200, 239, 219, 119, 186, -73, 364]
2259C64k77j48K29m42J91P2k24nj7n8l1J68Oj9j37J28O0l8K65j88p9L79l8J54
2283C15K4l12K80m5j8J0j10j39M05m11J47o3k60Lj15R5Q9l47L96j99k1J36p4J52
2307f2n9K87p4K71k99K2J37O1l8n1J08n2N1j09m0k62K96k26k63N04o05L82l9l24
2331c84K97j90J00J65k58L10k34l1K10M0p3K27l55L73J42k5L7o3j84j26J24o3
2353C9K70k93Q1kj90J35m0n0Lk16p3J34j81L93n46L01L08m16N15j34j27K08k26
2376a07Q7L29M1j02k4o1K28j56n2j60K7m5L9o0J19K3m70K15n0R1k82J69K48k04
2400a57j21K42k32q6L96k47Q7K68j49N4R0k48L62N3l2k71m5K89j25k4j26J44n1
2423G1Rj69J06l00M1J30L5L1J98l64R5J32j77N0J96n2R9k7r2M64m07Q6J79K2j89
$$ y = [364, 87, -61, 168, -274, -83, -11, -235, -240, -257, -315, -346, -178, -172, -191, -328, -200, -140, -178, 87, -101, -180, 199, 161, 315, 339, 27, 307, 262, 244, 254, 144, 5, 410, -1, 146, 83, -177, -174, -289, -194, -105, -452, -56, -255, -276, -140, -214, -62, -121, 166, 92, 363, 64, 86, 223, 284, 246, 195, 303, 251, 302, 193, 153, -109, 187, -39, -302, 202, -403, -21, -60, -384, -87, -277, -177, -12, -270, 40, -194, -225, -15, 25, -48, 179, -176, 197, 339, 314, 351, 288, 104, -22, 102, 39, 309, 16, 97, 95, -95, 40, 0, -50, -47, -263, -336, -202, -383, 10, -536, -235, 73, -343, 172, 38, -89, 119, -107, -20, 309, 350, 248, 224, 163, 391, 235, 183, 23, 50, 5, 44, -16, 103, 126, -344, -129, -179, -88, -370, -201, 47, -157, -278, -36, -268, -354, 42, -205, -118, 150, 1, 55, 145, -103, 259, 312, 280, 9, -36, 253, 128, 104, -22, 122, 71, 80, -89, 17, -283, -242, -112, -77, -46, 152, -212, -117, 15, -162, -112, 84, 32, 131, 104, 12, 476, 69, 155, 334, 356, 167]
2448A67m2K39k41l63L93l3k49M17l55N8j17n29N00k76J09L89q1j32PK9J00k30
2470b40K04J44l2J08K11j61q6L12l93J86o7J79k83j21K6l4l7J79k09N9p5q9J07
2493a12m4j12L22k89R2O7j34J11P3k18L90o1j10M1PR3K15j64K15m17J84J25k33
2516D1l6K24m19K80J79o41M17l76K12K16j83j4L9j32N4k17M91l27K29Lm5K23n2
2539A66o9Mj16K18l9J8k07J40J33l82J23k7L03j78j39k5R9k28j09J71k14K12J3
2562a33J92j03j99L14j17J6j1P0L20j59k54M01k7k78K69k73J13J10j96J32j30
2583E7l76N05j53m9q5O8j00k46m1K07j36j3K84L2K04l31j01K12K65j70J10m70
2605c27O40k94P5K15l23J17J43k89j27K08j14o1J9J15M8j81K34m62J64O9Rn5O2
$$ y = [167, 125, 364, 123, -240, 153, 120, -129, 288, -67, -9, -126, -655, -155, -431, -322, 67, -14, -146, -139, -110, -10, -240, -36, 108, 76, 184, 395, 234, 148, 460, 67, 253, 186, 365, 82, -39, -13, -47, -84, 95, -114, -55, -130, -219, -112, -156, -268, 54, -235, -143, -76, -210, -99, -26, -244, 146, 85, -25, 16, 23, 116, 331, 167, 382, -35, 149, 274, 41, 5, 229, -190, 90, 269, -372, 45, -331, -119, 97, -86, -100, -61, -193, -139, -356, 135, -192, 37, 40, -5, 218, 166, 97, 101, -15, 203, 164, 182, -25, 115, 248, -134, -11, -38, 265, 87, -52, -77, 22, -206, -315, -144, -358, -146, -133, 59, -44, -243, 71, -46, -30, -41, 29, 349, 190, -64, 337, 310, 32, 301, 28, 141, 251, 55, 187, 57, -319, 186, 33, -16, -101, -33, -133, -379, -420, -213, -349, -362, -78, -46, 158, -173, -274, -62, 203, 33, 143, -327, 313, 19, 94, 309, -14, 103, 246, -43, -170, 38, -76, -137, -118, -3, 45, -136, 98, -364, -200, -131, -122, -177, -115]
2628a15p2J30J7k05L76k32O0J87J8J00p3j75J32k37K97k03J33J35nl52j31J47
2650f8l04L00N9l53J89k5K02J33k07Jm2m6K22m3j44M9J51K46l00j52O71k22j59
2673A58Ll05K49k22M4L20k79N0J26l51K00k55j92K68J6O5m6o6J61j92L12M7j98
2696h7J91M4k02K09J04k26K85j07QP4r1j95J17M0jKj83o9o0Q4J01k66J88m2l23
2721d05K34p5P9K14m88Q3L87K2P0ok6J75j98j74M05L9k15J61q6M3j27M5j62r1
2745i6L75n1m93K28j59j84K92J08q4J01j87J7J85k85J74l08L83J09p7N3L16j43
2767B74K4j27j32K19j94P9P8j22J60j19k69m3l7Q3j5j18M03l57J62J14r5O3j31
2790a00l1L82l94K85J32l77K80R6k68k1J69j90J46k4j25PJ36R4m45M77n9J7o6
$$ y = [-115, -187, -57, -40, -245, 131, -101, -41, 146, 164, 264, 191, 16, 148, -89, 208, 5, 138, 273, 268, -84, -215, -68, -372, -72, -13, -366, -177, -202, 0, 133, -74, -73, -115, -161, 61, 18, -126, -77, 74, 320, 20, -132, 539, 317, 158, 161, -144, 105, -117, -73, 247, -32, 18, 144, -207, -7, -262, -454, -186, -170, -105, -151, -217, -56, -248, 64, 111, -87, 104, 148, -54, 155, 259, 33, 318, 211, 219, 293, 202, 7, 124, 164, 163, 165, -18, -87, -147, -63, 38, -228, -40, -82, -405, -171, -246, -167, 47, -441, -358, 29, 51, 121, 115, 89, 264, 66, -108, 297, 336, 121, 282, 196, 239, 112, 157, -5, -96, 279, 228, -265, -37, -196, -380, -88, 20, -64, 37, -150, -133, 52, -233, -59, -367, 16, 125, 48, 101, 417, 274, 298, 171, 39, 258, 64, 143, 221, 99, 259, 140, -129, -172, -209, -126, -141, -259, 144, -213, -51, 63, -32, 31, -100, -131, 251, -143, 142, 274, -103, 177, 273, 5, -16, 153, -37, 109, 85, -40, -33, 103, 197, -248, 229, 170, 187, 121]
2813A21l9k43J8M8K1o1k86K22J99m9R4r8Q5J5q9j3L12k30K51q1J63l41J82l06
2837a05K95k9o4k27O4R6P0l88J65P5l24L78k92J82Jk9L4j29K8J74m5m2K37j9J24
2862B30L7j86L8k7q7J23K64l48P0Q5L9k79J67j88P1j38J07j6j74O9M8J4k30K89
2886b2k20J60K10r8rJ3l6J08R3o9J23o0j01L37j10j15p7o6q8J04k59K60j37K6
2910c3p8oL9L8r2K9l8p0J68r8K22j06J36n0l0J94l59K20j04L20j16J21l26R4J78
2935B53k23K20j32k10J2J29l30K6m2K9J19k26L59L7o8j83J94j85J55M3r3L52q8
2958A48l08O4K90L5j68r0K40k23N8qk51J54J08l3K69k10j58J05l91L48k23J55
2980h9N4j61J32j03P0R3j07K49R6l40P7J86Nl7N5j6J52k65j5J89K3k3l99J71k24
$$ y = [121, 82, -161, -143, -95, -74, -135, -421, -199, 0, -49, 45, -53, 32, 47, -42, -55, 257, 27, 278, 197, 360, 19, 201, -105, 190, 161, 97, -130, -66, 30, 100, -288, -123, -48, -372, 6, -286, -104, -103, -132, -98, -227, -199, -25, -70, -112, 125, 106, 230, 267, 81, 119, 92, 5, 128, 392, 44, 114, 199, 238, -41, 126, -62, 9, -129, -22, -38, -212, -143, -95, -81, -311, -22, -242, -82, 128, 30, 21, 34, -2, 106, 199, 130, 253, 193, 92, 429, 319, 204, 127, 61, -27, 77, -182, 78, -59, -33, -111, -117, -78, -40, -132, -103, -141, -211, -43, -141, 81, -25, 111, 61, 31, 225, -134, 86, -18, 302, 186, 307, -19, 75, 253, 30, 250, 118, -92, -80, 49, -281, -255, -297, -268, -149, -375, -16, 21, -47, -230, -36, -221, -66, -23, -116, 236, 148, -160, -96, 194, 229, 61, -29, 211, -12, 46, 38, -213, -59, 49, 16, 285, 75, -83, 22, -369, -21, -244, -89, -35, -196, -64, -167, -97, -4, -111, 138, 234, -106, -29, 157, 162, 125, 180, 164, 316, 51, 36, 225, 248, 225, -174, -3, -227]
3005b27K45q7j69J6K55K5L8j54j19M0J53k48J61J85j66j32L07R1j03J86k57j25
3027h5M28j87j72K20n5k00j7J78j73k2R0J18j55r8j51J76j13Q5J98o8K6j82jJ60
3051@n2J00n8j54K16j42M33j23j13J15J7m72N87l25j21L23k49R6j85M8J44j70
3073h5r3K69m9j2K1L7r9R5j67p8J31K77q2k45O3N1J16P3j77Q0l16k4K46j88M96
3098C40k31k4j82J0j0j97L51j67N5k21O0J93Ln2M5%J29k36K13o8L22N8l55o2J74
3123A48M8j36J89l78K06j58j7K75l84J39P9j44J59p2J1L4J99m24j20L07j43N8
3145a24j62L70k23n0K51K55j45J2j91MJ71k01J58q5K02j31j29J32j90J24J74k03
3167A9j06R7j58J05J13k16K0j8O5K59r8k68J57P1l7j13J09J05K04k85j00J62p1
$$ y = [-227, 18, -69, -238, -222, 33, 58, 96, -58, -177, -137, 16, -232, -71, 114, -52, -184, 123, 214, 111, 297, 40, -85, 343, 156, -16, 204, 149, -51, -68, 110, -63, -85, 5, 123, -32, -130, -281, -105, -218, -133, 65, -3, 23, -159, -160, 0, -52, 48, -10, -164, 52, -90, 343, 220, 107, 222, 239, -233, 354, 29, -92, 231, -18, 78, -107, -59, 85, -85, -178, 91, 42, 30, 51, 88, -11, 84, -83, -161, -30, 247, 165, -80, -17, 34, 150, 223, 46, 126, -190, -214, 32, -156, 340, 109, 85, -97, -87, -97, -294, 57, -110, -55, -276, -216, -23, -20, -72, -27, -27, 102, -134, 79, 11, 333, 391, 36, -26, 148, 196, 60, 249, -129, 77, -81, -98, 177, -207, -68, 11, -133, 26, -46, -35, -1, 198, -226, -346, -39, -182, -124, -286, 84, -139, -189, 62, 317, 172, 184, -7, -3, 168, -33, 125, 40, 242, 111, -18, 114, -76, 48, 222, 19, -87, 10, -148, -43, 70, -146, -126, -144, -79, 180, 82, -186, -29, 42, 5, -108, 1, 106, 310, 25, -75, 87, 16]
3190A6L06j60j51L18m39K70n29K18K68j99J32q5k10J46j86K40J76k50K78j99j
3211d1J72k05J05J71j72O5l5k20K71j34K28M9l26P7K16j3l00L01l85L14o7k68
3233a97K77j20r6L9j84K66j30K32k01j27L52l0r1J15o4j19M09m33L11j70L1J93
3255B63m12J48M23k51j03k6k8q6J07j15J35o1n2j92K7J38m7J84l24J81L09l81
3277a63K45Q1k30J53j91J64O1O2o4N5j49l5K08J89k55K5k14ML1L3j50Mj90K32
3301i4L3K5L0k82K53O3j49p0J24j63K53j25J29P2Km3J61j88J26K3K57j70k97j13
3325a43J74M7L0l37j03K12m7K11L9l28L09L8j12r5m8j89K44K63n0j7j22O2kJ1
3349D7N1j79l0L42k59l7M6o8jM3J3P2n2J87o8p6q9J12pj0p1lJ55j85k80L66p4
$$ y = [16, 322, 162, 11, 329, -110, 160, -369, -151, 117, -82, 50, -35, -245, -99, -285, -45, 131, -119, 159, -40, -41, 131, -74, 31, 202, 30, 95, 60, -160, 111, -23, 205, 254, -72, 5, 221, 208, -92, 209, -176, 138, 71, -197, 80, -40, -136, -97, -281, -15, -145, 87, -114, -241, 111, 81, -10, 105, 41, -78, 331, -102, 209, 39, 70, 263, -149, -1, 422, 171, 68, 42, 14, -72, 35, -80, 55, -6, -58, -250, -223, -85, -132, 52, -272, -91, 218, -163, 82, 163, -67, 86, -105, 59, 120, 182, 118, 173, 24, -11, 197, 386, 131, 156, -58, -54, -23, 10, -140, -136, -326, -94, -61, -36, -6, -288, -35, 28, -121, -191, -67, -230, 23, -102, 27, 99, 101, 58, 219, 31, 157, 180, 437, 267, -30, -143, 31, 78, 108, -229, -332, -120, -167, 44, 83, -245, 64, 102, -10, -105, -153, -342, -98, 165, 115, 98, -24, 38, 36, 47, 98, -81, -111, 231, -28, -65, -19, -87, -88, -45, -32, 40, -12, 175, 107, 31, -58, 54, 47, 37, -34, -37, 118, -67, -347, 19, -55]
3376e5K35q5m7k62L3L09k13L22q1k02K74j13l2K27k37o3N4k40K92l06J50K1q7
3399a06K6N2m45L84J12l17M21j26q4K1L9R0k06K97k71J96O7J35k67J70J19k77
3421C0q1N9j14P6J05J2j13k52K65j61K4j44L05Q0m3l31K62P0k26L32n69N68j16
3444C8oJ57l86K63J32k13M6Q9l29L43j4Q7j45q8lJ33j72M7m11L27n7R2p1j46L92
3469A05m12J78L02k16J10o0K78l69J7K08j60j0j7K74n2j83J50o7j63J27p4j55
3491a89J71j17j30Q2M8k45L77n6L7K8j95K63j71p1j4J69Q1P9P3k50K06lj31J59
3515B01Oj44j10K69j70K7K4j52K60j16l22K42j40Lo7Q0M9j57K2M60r8k17L48k71
3539B7Q6o0r6m4J46O0O1j72K7J72r7J20k05R1k06j32K91j56P1J56m91K68J89j82
$$ y = [-55, 180, 95, 48, -214, -181, 128, -85, 237, 156, -46, 228, 115, 83, 310, 73, 10, 64, -176, 116, -190, -40, -19, -106, -80, -28, -473, -89, 23, -294, 127, 1, -83, -62, -23, 67, -139, 158, -113, 83, 150, 285, 18, 188, 307, 30, -51, 8, -106, -30, 75, 87, -26, -278, -13, -174, -150, -294, 11, 91, 48, -283, -21, 49, -177, 155, -414, 154, 38, 32, 189, -197, 66, 198, -15, 31, 120, -209, 134, 120, 207, 62, -26, -29, 104, -68, -21, -432, -105, -162, -70, -141, -287, 105, -307, -129, 173, -43, 67, 7, 285, -84, -67, 141, -19, -29, -46, 228, 176, -7, 143, 76, -87, 40, -34, -189, -18, -135, -265, -183, -135, -380, -3, -59, -22, 6, -189, 74, -97, -168, -182, -13, 68, 147, 220, -30, 176, 173, 42, 201, 207, 63, -47, 222, 52, 79, 103, -49, 211, 95, -227, 15, -125, -122, -189, -109, -60, -217, -195, 265, 167, -50, 298, 27, 113, 53, -43, -87, 59, 119, 180, 8, 35, 207, 110, 230, 25, 116, -90, -222, 69, -87, -16, 140, -351, -83, 106, -76]
3563g6j67K25Jj12Qp5K91k10L83k03j60J62J34j76K24l4k09N7j29J85j6j93L60
3586B70jn54L52l6j51R0k61O2J07l4k9M67n14L13j85q9K29J05j31p9N7J16J25
3609B29k9q2O3j33J2J76j29j73M1J31p4J43m27J87J22o4k68L82j72N8k35J34J18
3632A0m46N03k77K30J25K26l03M2k3K22m23J83J92j36l30J66q9L7K16j46M7q0
3654e4mk60K60o9L7j66N5J1R9J5k23L05m5Ol5J79l8n3L3P2k05J83j26K55j15o3
3680E4j15J6K36o0m1j56K68k42j43m4K07j93J65P6j8o1K98k67j9J12k06J06R3
3703F6j16j03K10k14M21k37L41m88J23J40n86L28J66j89J44j24K46n4Lj03k2k0
3725f8k89L80LK82l16l7J0O4M9J22l47J00j66J76K29l52K74J45j53K6n34O25m29
$$ y = [-76, -243, -18, -17, -129, -121, -196, 95, -115, 268, 65, -95, 67, 201, 25, 249, 215, 6, 63, -66, 119, 103, -90, 270, 269, -285, 67, 31, -120, -30, -291, -229, -122, -156, -185, 282, -232, 81, -104, -193, 36, 141, 10, -69, -12, 104, 229, 200, 118, 181, 48, 60, 236, 107, -66, -25, 106, 32, 175, -252, -65, 57, -7, -275, 107, -65, -7, -242, -108, 10, -436, 67, -210, 20, 145, 371, 68, 110, 87, 309, -114, 69, 261, 125, -205, -39, -128, -91, 125, -21, 26, -54, -58, -318, -58, -127, -90, -256, -201, -190, -91, -76, -299, 6, -39, -33, -68, 111, 73, 20, 53, 125, -80, 103, -23, 232, 117, 54, -61, -45, 191, 131, 90, -66, 202, -40, -183, -227, -20, -213, -48, 28, 10, -51, 247, -20, -39, 73, -133, -27, 66, -50, -153, 57, -157, 264, 27, 368, -120, 3, 143, -443, -115, 51, -138, 6, -118, 128, 74, 77, -26, -48, -68, -357, 23, 26, 308, -8, -45, -35, 29, 78, 200, -147, -47, -213, -37, 192, -160, 114, 259, 106, 132, -402, 223, -206]
3748b06K70o3K7j22k5j1J50J03k03k6m2M1J19K03k54K70M3j09r4K0J02j75q0J95
3772A33m4P1m1q3N6l6k62L88k66P6R6j94P6k24M24j70j39L4J03n3j9o6J52j21
3796a09l4J95k0J71j26K5j06J95j93K9l2k46N09k61J85r1k13K67k63j00L5K71
3818H8r6K1Nk77QL26p5k50J22J68l6r5L74l81L09j36J26n3K2j71J05n1j03M2J09
3843A01j17K38k92j53L21l81K15l36L89J52l03j55J88P6j22m2J0J34j11N40l56
3864dn8J25j27K01M6P5k34j02J14J64l42Q8K88j76j08l5J94q7o1q8L2J5K09j20
3888Ij39J86q9k9K44k50l2L00j74J95j39K15j80k69L23K35j33l81K57k37j9m0
3910a47j23L57n0o1k69K89j57J96P2j56J6j1K04O6j87Pj64O3J78k74J50M2M2K07
$$ y = [-206, 64, 1, 28, -94, -119, -130, 20, 123, -80, -106, -148, -107, 12, 215, -39, 231, 274, 165, 71, 91, 193, 18, -62, 133, 89, 160, 119, 36, 92, 56, -206, 182, -84, -8, 88, -106, -30, -254, 170, 0, -139, -105, -2, -55, -74, -140, 12, -109, -143, 52, 32, 203, 77, 102, -4, 191, -2, 27, -5, -251, 258, -3, 182, 91, -122, 145, -118, -218, -183, 88, -8, 13, 18, -259, -251, 75, 0, -250, -128, 40, 4, -91, 283, -98, 211, 75, 201, 148, 170, -1, 104, 53, -50, -8, 101, -16, 222, -70, -223, 98, -283, -68, -404, -15, 137, -166, -321, -133, -57, -179, -221, -211, -77, -188, 352, -4, -62, 63, -64, 137, 183, 258, 24, -78, 36, 200, -142, -54, 234, 58, -50, -85, 109, 22, -39, -127, -95, -80, 129, 9, -130, 56, -33, -62, 182, -68, -100, 200, 26, 221, 82, 297, 117, -152, 171, 406, 273, -108, 149, -88, -107, -147, -270, 87, 37, -24, -293, -4, -161, 35, 107, -49, -33, -44, 160, 226, 39, 46, -118, -55, 123, -151, -1, 41, 83, 290]
3934B90m4j15j14N2N2j32%q5J43j64K72j79K4P8m5j70K12k62K65k34R3p0R3J90
3958A50j03O4n4l2j55K60m8N3J88l60K07M6j85J02k16J24N6M8k10J17l1j97P1
3981a05K10r0r7P0m5n1mK60J48l85J76K23k02m6j73K58j49O7j56J31J20j30j38
4004a08r0L85j26O6m08K24L8J22Q9k72j24K49K27l04N9j94R1Pn4K24n0ok28K01
4028A8k27R7K50l26J30j5J32k07J50L7k27K91K09m93J64J15k72j30J92o4K02R9
4050A25j34j52K4J15j41K73q7L9J88l73L14k56OK13k34R3l4J18r7P0j95O4rj30
4074b00R8O4K03j43j39O1K55m12L62R4j27l9M5n9J03j83k4J38q8n0J56J33j61
4097H7L1j5l91K37j18L39j19j21j0K1j5p5K00pQ3N7n08M12j79M8j43J2R0J3J98
$$ y = [290, 246, 131, 17, 69, 121, -11, -11, -96, 47, -117, 155, -24, 0, 78, 33, -137, 75, -187, 78, -156, -63, -133, -40, 150, 47, 111, 57, 25, -130, 130, 82, 135, 323, -37, 170, 216, 31, 133, -83, 41, 97, 145, -65, 52, 21, -176, -105, 105, 15, -82, -12, -57, -108, -112, 148, 296, -89, 87, 310, 108, 62, -111, 147, -2, 65, -91, 40, 160, 30, -108, -198, 187, 61, 127, -281, -57, -19, 103, 192, -80, -204, 45, 272, -32, 27, -167, -76, -69, -123, 101, 51, 45, -183, 18, -209, -112, 138, -188, -58, -73, 59, -148, 2, 39, -188, 103, 312, -181, -17, 98, -174, -304, -112, -176, 26, 125, -9, -161, -137, -22, -163, 110, 23, 62, 250, -123, 191, -65, -59, 154, -80, 13, -21, 97, 0, 70, -125, -61, -70, -200, -102, -38, 165, 22, -117, -56, 199, -213, 149, 243, 116, 77, 122, 63, 166, -17, -41, 97, 9, -41, 115, 248, 87, 118, 103, -288, -51, -169, 170, 51, -70, -80, -59, -74, -149, 51, 44, 127, 184, -324, 88, -91, -43, -186, -174, -84, -71, 127]
4122A27k8qQ1j61J3K03l49J81j58J05M1j57K35j64n7j94N60q6k4j85j11m8Q6P7
4146b1o0j75N81n19L9Q5j2K55j09j29K30k5l12L51l43K54m7o9K41n42K25L15l20
4169a07J94k27J54Op1l0K22m57O5J71K03om3l1r5P9lJ54m2p4J45k33K3rk6M06
4195C68m19J50k14J02J81q1j19K23k95J11l7L7L3j07J7j80L9K69j12J39kl00K17
4218B0mj89M22k82j19K87j50J23K9k53K13j25K30j39p1L2Ln2j6m0J0l7r6M2K18
4243E6j33J72j20o0K1J8q4J14J25j73j22L20K24k46R5l62L31j16l17K81j44J21
4265Aj5j29L14o9j1k1o6k32J93K9j8J8J35n9j63L95m35K56j26o9M5J07p5K04P2
4290B81j66qr9L4L9k7J87k78r1L4P9j13j36K20k69L81K56j96l17l3L11k04K74
$$ y = [127, 99, 91, 172, 11, 24, 227, -122, 59, -99, 6, 47, -110, 125, -39, -96, -290, 270, 184, 160, -25, -136, -184, -98, -21, -81, -256, 325, -194, -155, -70, -82, 173, 64, -65, 165, 140, -172, 179, -164, 90, 43, -26, 215, -327, -102, 213, -107, 87, -140, 14, 20, -51, -81, 141, -316, -251, -80, 123, 117, 74, 43, -52, 27, 24, 178, 136, 62, 207, -26, -3, -12, -38, 368, -51, 99, -115, -13, 168, 87, -32, 191, -104, 7, -30, 7, 40, -67, -50, -230, -191, 78, -34, 105, 103, -197, 20, 16, -173, 249, -33, -152, 135, -15, 108, 137, -116, 97, -28, 202, 63, -8, 24, 27, -25, -41, -81, -71, -108, -204, -162, 56, -77, 95, -25, -85, -64, -46, -130, -16, 109, -64, -186, 134, 358, 112, 207, -155, 176, 60, -257, 24, -120, 1, -14, -143, 171, 102, 91, 70, 4, -228, -35, -6, -24, -6, 129, 70, -93, 302, -133, 123, -3, -72, -27, 80, 5, 209, 281, 115, 107, 8, 42, 81, 54, 241, -37, -128, -94, -15, -128, -264, -44, -313, 68, 324, 128, -189, -222, 89, -115, 159]
4313A59j42j49R8j36K1K2K09j72J83k32%M2K29j11j65L71k22J39p8r6J20j05K
4336a3p2J54j27J30J4k3o9J01j63q8k11J93M3L3l2J52J45j75J83k8N0j16k35N3
4360a01L11l20NJ93k07J12O2J36k07N4q2J26n2n7O4m1J29k99K47j62R4J7L3J3
4384F8N5j84n0l9K35j20l2O5k11K94j41mp6N32m59k76L04M6L0k74L78l49J15J80
4408H7Rj71K77k58J8K29j1L3k20J26J80l03K25l28J72l93K87K10LQo4l96K81M8
4432D9j95N8J6J70k85J94r9K6K33l9j79M1k14K68JJ13M4k1k77M59k33l21K03k17
4456b05L53j31j45J6J33J2Q4j74k36K19j54M56k31j33Q9K88l26j34P5L12k00q
4478d0J36K1o7J17n9m46L48j55L45j15l5j79r7K42k0o2n1l0k0L0P7j67J98p6J52
$$ y = [159, 17, -132, -34, -170, -149, -127, 82, -90, 93, -139, -139, -97, 132, 21, -144, 227, 5, 144, 66, -30, 90, -15, -13, -85, 69, -58, 72, 86, 63, -6, 95, -68, -156, -367, -174, -131, -98, -130, 22, 167, -8, 175, 147, 197, 81, -154, -101, 210, -110, -105, 88, -119, -7, 55, 191, -16, 38, -44, 82, 30, -27, 37, -4, 125, -174, 73, -89, 5, 22, 55, 68, 123, -61, -111, -150, 85, -35, -67, -2, -213, 81, -60, -64, -140, 392, -67, -343, -39, 7, 37, -237, 141, -208, -93, 87, 96, -75, 202, -56, -38, 191, 180, 213, -7, 119, 299, -4, 221, -107, 65, -328, -41, 169, 172, 180, 116, -280, 1, 49, -146, -88, -72, 98, -187, 7, -92, -66, 167, 128, -51, -10, -224, 44, 45, 158, 202, 181, -96, 363, 130, -191, 12, -205, 148, 17, -128, -112, 21, 33, 117, -57, -293, -74, -228, 228, -3, -136, -47, 241, -85, -219, -144, 168, -32, -40, 96, 117, 50, 167, 108, -338, 10, -145, 200, 85, 50, -129, -226, 16, -4, -66, -117, -147, -167, -137, -60, -227, -29, -105, 47]
4503D7k88L7M33l45K17q7J02o5O0k74K66N7k86r4K31Q3Q2l76L12j62K5n9K25k89
4527a48o6M37k37j72n9J26K2P2K19l47J5Q5J8q3K06m12L77L22m46L52l10k46K95
4550B0K06j33k72L57ooR9j09Q6k93j7L1L09l67J17J02l42K53K1n5L8K16k82k04
4574b31J69O9J30k24J42J42k90LJ04q8J6O6L0j04J01p5r2L11l27J95p5j33k9K0
4598a70J30l8K6j67J42K97l62Q8m11N32j07J44j66L11l52p1K60j30L69l44R1L8
4620A10n8L2K6j64J79j02l81L68j36p6J50k1jn6J93o2J04l4q3J27J8j00jj46J7
4645i7K51j72J94k25r6M3M69k95J97m04l6M18k95J9j6k64M18j55l6K43j13M8p8
4668A8p5o2J58J55n5j27J37j90L5J58r0j66J89p3j3J7J24r9p8K04r9ML2j44j94
$$ y = [47, -241, -204, 229, -116, 101, 14, 116, 51, 111, -163, 103, 160, -126, -220, 11, 94, 176, -200, 112, -50, -25, -84, 141, -148, -214, 223, -14, -186, -245, -119, -97, -25, 194, -153, -138, -53, -35, -118, 88, -324, 53, 375, -71, 281, -29, -275, 20, 226, 93, -179, 178, 172, 166, 265, 156, 242, -51, -68, -37, 272, -95, 22, 124, -218, 35, 56, 1, 39, 255, -27, -231, -62, 7, 137, -87, 55, 197, -93, -90, 14, -74, -58, 8, 38, -66, 35, -40, -132, 179, -148, 47, -28, -161, -190, -170, -40, -78, -52, -219, -77, 220, -142, -54, -465, 67, -40, 104, -62, 249, -103, -174, 86, -44, 325, -19, 72, 110, 52, 84, 110, -54, 125, 23, -358, 10, -126, -202, -52, -73, -74, -130, 63, 1, 105, 71, -12, 115, 133, 33, 32, -114, -97, 154, -18, 176, -49, -145, -102, 367, 72, 269, -135, -171, 247, -48, -29, -45, -309, 109, -46, -82, 161, 48, 96, 18, -57, -119, 39, 194, 139, 12, 149, -41, -6, 152, 62, -104, 85, 12, -1, 16, 140, 41, -37, 167, 68, 72, 104, -40, -234]
4693b34K67J39m42L98l33lM88m06K88%j86K0K38M0Rj24k01N7m0J36J31l42J16
4716A6q6K20k9n3K46k55j77J34j82L4J6R9J77l26j65L81k40jL7N8L01k54J15k16
4740a50L3Q4K15k21j65J98J60j99N6j15j8J74J36k56j8j63J50K80r0k97K28J51
4762A73l3k06j95J18P0ML2l2l2J59J44k74J46P6j70J42j39K53k88M9k06K90J55
4785B36m28L39j62L9l3j76L5K25m9K60l57K8K1P5J81l47Q8J41j61L1J5O1j10J52
4809A04n1M5Q3j27j51J91n0L59l60j42k5L60k24r5LM8j2J10J9MMj87k2j28L3K05
4835fj7K26k21k5j30L68j63Q8j37r5N9k09K49o4K31l21r1M7K1K20n8o9K4J69M0
4860A36p9Q9l34L4J69Q0j96J22k06J60j11K14J95j52j00r0O8j39J35j40oJ32N1
$$ y = [-234, 33, 172, -270, 128, -205, -208, 280, -126, 162, 162, -24, -4, 234, 274, 283, 159, -42, 15, -25, 111, 242, -100, 16, -70, 150, 121, 68, 314, 59, -118, 16, -166, -132, -116, -17, 160, -166, -331, 50, -190, -191, -154, -96, 205, -49, 66, -150, -117, -33, 182, -39, -204, -6, 154, -45, 11, -104, -122, 52, 188, -68, -86, -249, -99, 181, 91, -206, 22, 173, 140, -66, -261, -143, -73, -69, -37, -69, -101, 58, 202, -72, 74, 150, -20, 122, -17, 236, -52, -3, -209, 81, 236, -192, 147, -15, 24, -9, -185, -150, 75, 26, 286, -71, -43, -22, 53, 234, -113, -25, 116, -45, -14, 1, 62, -48, 104, 53, 98, 181, 54, -97, 94, 44, 403, 43, -99, -124, 236, 12, -83, -80, -32, -44, 66, 85, 89, 93, -94, -116, -244, -211, -6, -23, 203, -18, -43, -173, 195, 32, 120, -17, -112, -53, -262, -13, -77, 154, -167, -258, -211, -190, 30, -28, -97, -73, 96, 136, 57, 146, -188, -154, 15, 95, -101, 21, -185, -25, -136, 78, 273, 121, 21, -69, -1, -140, -5, -145, -151, -19, 32]
4883C2J01rj83j6k23K52O3m62K73J14J26j91Q%j54L79q3n9J65q4j19J15K23k10
4907E8j92q3LL99Nl65Q2J1m%j04k9J83J20j58K51J81l93J74J7j5l22K90j41L4
4932Bk05J61k9K11j58K65j92J1j0k3P0k48pK25N8k4k01q4J04L12k99p4j04K14
4956b5R4j42J95J3k2j0r9n6PMJ08O3k16K93j28J84k66j14K89j95j30K29j41J50
4980H5K76m59J20j01J62j9r9kL4J4k11M78l33k3k6R9P7j06Q2j79K76j58J46j25
5004HJ83q0j70j18L33j17k31J22J82kk3m1J0j66j40N19j63k32K18q1k16M28l63
5027a40M4J91nj68J18N4l7J78k56O7L2j38J54L3j63Q2J94l88K07j03K11l35J98
5050C0q8J9j38K07m7O4j70j48K00j49L25l13M81l39p5n8K66j75j1J84KK44k82
$$ y = [32, 133, 124, -59, -75, -298, -46, 17, -445, -172, -58, 68, -123, -115, -115, -269, 110, 27, -32, 133, 49, -70, 45, 268, 58, -134, -217, -214, 185, 190, -175, -93, -82, -86, -86, -190, -219, -36, 84, -74, 177, 358, -35, 139, 156, 141, -181, 109, -32, 2, -203, -42, -71, 140, -18, 247, 55, 66, 56, 33, 103, -145, -152, 73, 131, 107, -94, -178, -74, 238, -61, -135, -239, -25, 69, -73, 122, 135, 113, 103, 4, -52, -45, -41, 67, 130, -86, 207, 79, 263, -3, -117, 172, -23, -153, 76, -65, 85, 361, -98, 22, -79, 83, 64, -35, -37, -3, 11, -200, 278, -55, -78, -104, -5, 72, -34, 48, -131, 145, -13, 133, 8, 191, 111, -59, -177, 156, 39, -192, -70, 112, 110, 87, 46, 56, -110, -250, 269, 106, -126, 92, 11, -205, 223, -140, -96, 95, 90, -78, 40, 94, 57, 235, -21, 46, 78, -60, 94, 127, -36, 46, 240, -148, 59, -44, 167, -168, 30, -58, -39, -177, 30, -17, 47, -123, -271, -71, -220, 105, -208, 273, -66, -141, -199, 67, -108, -119, 65, 67, 311, 29]
5073B9J20j70N5K9n4K3k33J97j64K73k98K28q6l9P0j29L16k48NJ7L12k29j6K42
5097B50N0j79j13j80K82j56K81j12j65L58l02j17K30k09oJ37k18K36l3l93J99
5118a60J35N4p0K22l19J2J30r2Q2J11r3O4k37J23o1J42j8p3J10m9M0j10J5L4j2
5143b0r2O5J9j22p7K42K39Qr2p5k16L50m03J60l6N2j30J31L4J23j25j95k5L65
5167A80k05N6j48K15k65Q5K42j92J08j39j34L34k14J60j11L46k39j14K30k04J27
5188A18j52j08J07j6J06k0J22p4j08K32o6j1l30N0K5K01j39Q1j07J32j43R2J00
5211I2O0k89J32j99R1J20k25K57J92k49P6q0L02l08o9J90l12L90j40O0j96j22
5233b27L09J02k06K78p3k0j84j33K93l50J7K7L72j87j42K09m21J58N0m0J62Q2
$$ y = [29, 149, -21, 34, 63, 9, 32, -201, -4, -168, 105, -193, 35, -51, -90, -20, -149, 167, -81, -76, -59, 253, 24, 8, 250, 300, 121, 8, -172, 110, -46, 235, 123, -42, 316, 14, -103, 127, -82, -88, 49, -169, 67, 34, -359, -160, -25, 29, -41, 181, -138, -126, 4, -88, -6, 105, 12, 76, -161, -38, -99, 43, 25, -48, 62, 13, 53, -57, -42, -8, -20, -112, -47, -28, -150, -227, 15, 254, 262, 170, 95, -121, 229, -174, -14, -50, 2, -128, 3, 37, 160, 35, -160, -185, 180, -25, 31, -117, 98, -167, -82, 160, -32, 76, -63, -197, 137, -77, 83, -28, 318, 79, -35, 195, -9, 118, -34, -142, -35, -51, 55, 35, 157, 83, -25, 207, 141, 130, -200, -150, -125, 76, -63, 18, -89, 43, -100, -8, 92, 152, -137, -5, -204, -113, 7, -218, 39, 231, -18, 58, -22, 280, -28, -97, 93, -219, 171, 31, 91, -105, -227, 82, 184, -22, 256, 183, 163, -21, -154, 139, -211, -194, -167, 205, 18, -124, 85, -336, -178, -128, -168, -6, 76]
5255G6k18K13m6l0J09J13j20j09j2L84k95k14L33k51J13k70L14k98L02o0J89J
5277B24m10J27o1J64j52j32J47K14n6l9k10L21Om62K40K0K37j04j98J96m4j43
5299a15J33L02k79R1l21J28R0j06K7J09P2k14K94k47o7M22m00Q9l62M26J33p6
5321A29k03J03J16r1P0rJ05j35n4j99M10k91K0k82N86r0r2J32n8l43p6K22J52
5344A22k2j77K3K16L7n3k33j13K98q1K2j72J89N1p6p7P1r8Q4J21j31p4J53L7l71
5369b54K77m5j08J28j41J37j53N5O4J2j63K07j03j48J11j7K28O6k37k9j3K31j38
5392c3L78l45m7J1k5L4M1m4K18l67O0rj07L00k39J34r5j12lK55J41l22K76J17
5416B17m59M20M6j89R0j84O7j68M45%k93K26k78P2m8n5L5R3k22J31J3L8j06J8
$$ y = [76, -142, 71, 25, -5, 104, 217, 97, -12, -24, 360, 65, -149, 184, -67, 46, -224, 90, -208, 94, 34, 223, 224, -186, -59, -120, 44, -108, -240, -93, 121, 65, 26, -184, 137, 143, -319, -79, -59, 178, 74, -124, 72, 28, -115, 18, 320, 41, 132, -189, -61, 29, -77, -50, 59, 131, -83, 211, -36, -103, 319, -81, 8, -354, 72, 205, 129, -74, 29, 145, 54, 124, 115, 220, 85, 31, -168, 242, -49, -29, -311, 275, 185, 93, 225, 167, -176, -252, -30, 122, 100, -77, -54, 162, 199, 146, -87, -200, 98, 17, 39, -133, 56, 107, 31, -46, 25, -73, 11, 132, 1, -73, 80, 117, -254, 23, -22, -130, -2, -143, -6, -159, -104, -40, -28, -191, 16, -87, -235, -124, -141, 87, 153, -84, -113, -126, 105, -33, 345, 0, -47, -36, -61, -27, 14, -30, 188, -179, -119, -128, -235, 65, -174, -40, -135, -247, -250, 5, 146, -176, 100, 217, -242, 178, 224, 35, 125, -59, 8, -160, 285, 285, -8, 218, -60, 12, -36, -91, -56, 37, -185, -54, -41, -3, -109, -91]
5440i1L11p0l47J4K39j60R7r0J89l0j35K08J25l06j03J07J56k44K83M5k28j3n4
5463i7J67j09k4M2j30J20j02OnQ6j39J75K47l23J7K57j44J7j71K50n6j85l1K38
5487A06k95K55j43k53O04l45P5ml52O60l51K02J27j45J7j60o0K22j54k84K18J22
5509F2k11J28q5K67n00P40l85R2k16K15K10m90K74J1o9lK3j4n3j16j01L28j29
5532b2O8j33K48Lj01k05J45J17m56L01N6%j61J83Jk77J90k5k4J3QK95l91J96J17
5557A46K08l43L6l14L45j41J07L5J55j62p8j67m8O7q6L78k75K48p2r0J56J32k81
5580d4L5O8o2o0Rq7K59l4n9j24M05m32N6m3K79j05k24L32k09j7J50j87N5m0o2
5605a41K31J6l28L02l0k9k5j66R6o6J03J61K23n01K4o7L04N2j43j4q5m1m7K54
$$ y = [-91, 220, 150, -197, -183, 56, -104, -7, -97, 92, 62, -73, 135, 260, -46, -149, -42, 114, -130, 153, 198, -30, -43, -97, 70, -39, -63, -21, -151, -31, -133, -127, -132, -46, -185, -10, 237, -86, -69, 188, 44, 61, -110, 140, 84, -101, -132, 106, -189, 66, -77, -330, 274, -71, 4, 0, -352, 308, -43, 159, 286, 141, 158, -2, -62, 160, 6, -278, -60, 62, -149, -21, -106, 161, -339, 401, 16, 108, -108, 107, 317, -173, 101, 112, 43, 40, 63, 49, -4, -120, -221, 107, -22, 46, -87, 161, 164, 63, -142, 3, 120, -336, -35, 21, 21, -140, 43, 44, -233, -43, -68, -92, -79, -71, 224, -167, 29, 146, 354, 11, 47, -267, 78, -63, 44, 79, 234, 72, -6, -173, -221, -154, -240, 138, -137, 111, 39, -51, 105, 237, -44, -9, 59, -3, -63, -54, -141, 118, 84, 25, -99, 306, -126, -70, -113, 166, 61, -163, 169, -40, -57, 93, -94, -39, -79, -141, 90, 106, -222, 80, 50, 21, -4, -170, -74, -140, -37, 124, 347, -154, -130, -197, 107, 159, 16, 2, -83, -124, -171, 83]
5629H3k11J55j2R6j18J02k01J0n5L1K74k43K03j98K64k49j13K12j17R2J11R9J40
5652C55k16k70L01l06Q5Q2j84Q0j03p4J97k4o3K04q8L9J26m77O39j82k84K03j01
5675f1j14K24q0k28K01MM0j41K4L38q9q1k77J97j61J76n1Q4K4k31J37l1l3J8P4
5700c7J67r4k23o5L54N1k29Kp0J27K05j65K87l36pK44l06O9J61k17N3k15J69j14
5724a89L22Mk64O9m1R0k6M0l0K50l35R6j86J00J04L25m41L67j84k11R3N9J28j39
5748Aj98J23M3J45m5l5l4Q9k1K0J10j20j42R4qr7j22K59p9K8p3J03j18J13j53
5773a17K42j46n2K34l21K57l72K38K03P6n63J36L64qj06k1j57J38m5J07j63j78
5795b54J89j24J58J05m2l2J97j65j3j95K18j17l9K24l15L03j74M9K9p1J42P9r1
$$ y = [83, -128, 27, 15, 111, -7, 95, -106, -96, -151, -120, 154, -89, 114, -84, 180, -69, -182, 30, -87, 5, 116, 215, 355, 139, -131, 170, -136, -51, 31, -153, -73, -176, -250, -53, -77, -140, 64, -24, 15, 141, -336, 303, 121, -163, 40, -61, -175, 49, -31, -259, -58, -54, -14, -155, -131, 207, 118, 37, -240, -43, -204, -28, -79, 5, 29, -202, -65, -96, -129, -111, -37, 130, 36, -187, -252, 102, 153, -76, -74, -144, -17, 188, 23, 310, -26, -33, 211, -95, -26, 135, -82, -29, -244, -75, -189, 133, 137, -127, -58, -99, -9, -35, 5, -25, 225, -110, -14, -200, -100, 4, 329, -112, 255, 71, -140, -47, 12, 140, 1, -197, -74, -31, 114, 69, 34, 0, 89, 68, 88, 198, 78, -64, 30, 22, -75, -197, 62, -17, 11, -62, 41, -77, 36, -117, 125, -21, -73, 161, -160, 97, -275, -37, 166, 242, -321, -185, 179, 171, 65, 44, -113, 25, -20, 87, -76, -254, -65, -189, -31, 74, 32, 0, 197, 32, 19, -176, 42, -75, -114, 110, -205, 98, -76, -27, 2, -69, 73, 152, 61]
5818F1p9j44J24K25l91L22o4Nm1j80M04l79N7q9m3K9M4m1m5K80R1o6j86j57M32
5843A69j06l7j33L70j81k23p4P5J69k8j94J38j90K45J7j39J05J78J4k18J10M5
5865A12k21nJ60J3N5k66L9J01j34L22l00%L63l17J80qr7J84j50K6j02K52l80K79
5889A06j77p4J99n0M5o8j91K96k53J95j9O1k47r5J65lP6J37J64j64j48P7M1Q5
5913A58j41j21j26L71M7q0j02j11j38K39o7l4RR2n0j35M73j84j81K09l74L03k73
5936b16L4K63l55K84n4J03qq7K18j62j00m9L0j94J20K43M0L9l90L64M8j44P4j42
5960d1m9K9k02J65n3J40m6l9KO5K74m09M92n89L08o2j1j3M4k2j28J46M6r6l9J35
5986D7ol14j2M25M1j22k89L05K52n26P3R2K48j41q0J56m2j82J37j43J17k3k1l17
$$ y = [61, -18, -162, -38, 187, -204, 118, 54, 59, 18, -162, 242, -137, -80, -169, -212, -183, -139, -180, -225, 55, 146, 80, -106, -263, 169, 63, 26, -107, 263, 82, -141, -215, -140, 29, 1, -193, -55, -245, 0, 17, -122, -17, 161, 175, -43, 67, 112, -109, -114, 46, 59, 114, -152, -113, -12, -146, 176, -124, -124, 239, -78, 102, 94, -3, 181, 31, 57, -45, 207, -173, 106, -71, -145, 54, 4, 49, -19, -210, 86, -167, 28, 9, 70, -177, -272, -107, -110, -34, 103, 267, 103, -45, 32, 73, 158, 17, -104, -230, 141, 188, 108, 6, -105, -243, -4, -71, -105, -96, -4, -54, -189, 284, 100, -81, 128, -246, 57, -216, -182, 81, -274, 10, -44, 59, 51, -36, 182, 20, -80, -129, -99, -293, -173, 70, 110, 149, -241, 123, 171, 27, 101, -41, -90, -61, -263, -98, -151, -11, -57, -96, -94, -29, 245, -164, 328, -261, 47, -15, -26, -39, 5, -17, -145, 1, 47, -49, -88, 47, 41, -273, -285, 140, 181, 59, -230, 75, 327, -199, -126, -34, 214, 73, -7, 149, 107, -75, 62, -81, 36, 13, -8, -325]
6010c25J78J39JJ20j33J36l16K18L74m11J72Q9j42j52o7O0o7K30j29r6jK07j10
6033b5J54l6R1j49j7o2L9J6J08j25Q9j17J08j58l0J69j47N7M89m17J47l12R1N1
6057A4jl32K82m9J97k0k09J79k83K77J4j35P9R8l56J14N1J28J45j9Kk26j4q3K94
6082A47k71J51j98L96l67%n4M02j19r4j2P8j06o9J58m9O3j37N5J29O4m19M82l82
6106a52K5L24j86k36M82m80J07J57j53K20n2K4k55J88o5J85k18K05k2j34j87K03
6128b0K5k44J73J25J22j79R4l78M10k23L97m35K48k00Q7k62M86p9k40p0J90L7
6150F4%n6r0o5J6J3M44k27j49O7J40j59J39o1o4P4j12K37q4N8j95o4K11J10j50
6175I7k87K96j91j40M60m25J02L98n52J86j0N3p4j25L02j33J9P6n3n7Q0k2q2J76
$$ y = [-325, -147, -8, -7, 113, -20, 116, -200, 18, 392, -19, 153, 242, 100, -52, -119, -59, -126, 104, -25, -121, -122, 85, -25, 129, 93, 184, 35, 18, -44, -5, 11, 119, -6, 83, -34, 74, -84, -114, 55, -92, -35, 454, 37, 184, -128, -37, 14, 13, -319, -37, -86, 111, 91, -118, 61, -222, 55, 69, -66, 13, 111, -245, -131, -80, 48, 193, 174, 176, -50, -64, -147, 147, -124, 27, -171, 225, -142, -142, -196, 206, 87, -7, -19, 59, -47, -116, 42, -7, 56, -81, -26, 103, 167, -252, 230, -152, -127, 197, 11, -225, 257, -223, -116, 41, -112, 108, 56, 80, -175, 13, -52, 133, -85, 120, 98, -36, -223, -20, 5, -239, -66, 59, 181, 2, 96, -282, 128, -95, 302, -133, 115, -85, 2, -260, 226, 147, -93, -163, 27, 64, 64, 8, -82, -147, -131, -118, 326, 99, -50, 17, 157, -2, 137, 76, 12, 86, -26, 211, 127, 185, -10, -74, 137, 247, 97, -190, 106, -85, -225, 235, -190, -88, 310, -242, -56, -66, -13, -87, -212, 90, -43, -24, 52, -1, -58, 22, 0, -82, 94]
6199I4o4k8N8j17J68p9n3J0J20j23J93m31K83k8O2P9l1k65J60j07J98l31j12P4
6223b70L76r7J65l43K39J03j04o4J33QP9k36RN1P3n4k62M15m17L30r8q0J7J42
6247A15pk76L64j31k04N6K38j57o0J48j76j31J83o7J57l99N74l25K85L1l82M14
$$ y = [94, 30, 2, 60, -57, 111, 32, -21, -11, 109, -14, 179, -252, 31, 3, 65, 144, 113, -152, 8, -99, 99, -232, -344, -270, 106, 9, 174, -169, 70, 173, 69, 5, 138, 146, 225, -11, -2, 49, 122, 68, -194, 221, -196, 134, 36, -44, -27, 115, 108, -168, 196, 65, -139, -83, 155, -2, -62, 86, -90, -221, -38, -105, 52, -347, 227, -98, 187, 218, -164, 250]
$$ [...]
8191a70
##END NTUPLES=NMR FID
##END=
