##TITLE=1H_K-443/1
 CDCl3
 32 sc, 
 14.02.2022
##JCAMPDX= 6.0         $$ Bruker NMR JCAMP-DX V2.0
##DATA TYPE= NMR FID
##DATA CLASS= NTUPLES
##ORIGIN= UXNMR, Bruker Analytische Messtechnik GmbH
##OWNER= root
$$ XWIN-NMR		Version 3.5
$$ Mon Feb 14 11:52:48 2022 Russian Standard Time (UT+4h)  she@DPX200
##.OBSERVE FREQUENCY= 200.131346
##.OBSERVE NUCLEUS= ^1H
##.DELAY= (6, 6)
##.ACQUISITION MODE= SIMULTANEOUS
##.ACQUISITION SCHEME= undefined
##.AVERAGES= 32
##.DIGITISER RES= 18
##SPECTROMETER/DATA SYSTEM= spect
##.PULSE SEQUENCE= zg30
##.SOLVENT NAME= CDCl3
##.SHIFT REFERENCE= (INTERNAL, CDCl3, 0, 15.7039)
##AUDIT TRAIL= $$ (NUMBER, WHEN, WHO, WHERE, WHAT)
$$ ##TITLE= Audit trail, XWIN-NMR		Version 3.5
$$ ##JCAMPDX= 5.01
$$ ##ORIGIN= Bruker BioSpin GmbH
$$ ##OWNER= she
$$ F:/spectra/data/she/nmr/H-F/1/audita.txt
$$ ##AUDIT TRAIL=  $$ (NUMBER, WHEN, WHO, WHERE, WHAT)
(   1,<2022-02-14 11:51:23.95 +0400>,<she>,<DPX200>,
      <continue with go, POWCHK disabled, PULCHK disabled
       configuration hash MD5:
       00 E9 B6 7A A2 85 ED C7 34 08 36 98 17 FE 4E 26
       data hash MD5: 16K
       D3 F7 78 7B AA 64 76 E8 99 A4 87 A5 8C AA EC CD>)
$$ ##END=
$$ 
$$ hash MD5
$$ AD 9E 9A DE 95 7F 98 5E 94 39 34 42 60 20 F3 C0
##$RELAX= 
##$RELAX= 
##$RELAX= 
##$RELAX= 
##$RELAX= 
##$RELAX= 
$$ Bruker specific parameters
$$ --------------------------
##$DU= <F:/spectra>
##$EXPNO= 1
##$NAME= <H-F>
##$PROCNO= 1
##$TYPE= <nmr>
##$USER= <she>
##$AMP= (0..31)
100 100 100 100 100 100 100 100 100 100 100 100 100 100 100 100 100 100 
100 100 100 100 100 100 100 100 100 100 100 100 100 100 
##$AQSEQ= 0
##$AQ_mod= 1
##$AUNM= <au_zg>
##$AUTOPOS= <>
##$BF1= 200.13
##$BF2= 200.13
##$BF3= 200.13
##$BF4= 200.13
##$BF5= 200.13
##$BF6= 200.13
##$BF7= 200.13
##$BF8= 200.13
##$BYTORDA= 1
##$CFDGTYP= 0
##$CFRGTYP= 5
##$CHEMSTR= <none>
##$CNST= (0..31)
1 1 145 1 1 1 1 1 1 1 1 1 1 1 1 1 1 1 1 1 1 1 1 1 1 1 1 1 1 1 1 1 
##$CPDPRG= <>
##$CPDPRG1= <>
##$CPDPRG2= <>
##$CPDPRG3= <>
##$CPDPRG4= <mlev>
##$CPDPRG5= <mlev>
##$CPDPRG6= <mlev>
##$CPDPRG7= <mlev>
##$CPDPRG8= <mlev>
##$CPDPRGB= <>
##$CPDPRGT= <>
##$D= (0..31)
0 1.2 0 0 0 0 0 0 0 0.06 0 0.03 0 0 0 0 0.0002 0 0 0 0 0 0 0 0 0 0 0 0 
0 0 0 
##$DATE= 1644824949
##$DBL= (0..7)
120 120 120 120 120 120 120 120 
##$DBP= (0..7)
150 150 150 150 150 150 150 150 
##$DBP07= 0
##$DBPNAM0= <>
##$DBPNAM1= <>
##$DBPNAM2= <>
##$DBPNAM3= <>
##$DBPNAM4= <>
##$DBPNAM5= <>
##$DBPNAM6= <>
##$DBPNAM7= <>
##$DBPOAL= (0..7)
0.5 0.5 0.5 0.5 0.5 0.5 0.5 0.5 
##$DBPOFFS= (0..7)
0 0 0 0 0 0 0 0 
##$DE= 6
##$DECBNUC= <off>
##$DECIM= 32
##$DECNUC= <off>
##$DECSTAT= 4
##$DIGMOD= 1
##$DIGTYP= 9
##$DL= (0..7)
0 120 120 120 120 120 120 120 
##$DP= (0..7)
150 150 150 150 150 150 150 150 
##$DP07= 0
##$DPNAME0= <>
##$DPNAME1= <>
##$DPNAME2= <>
##$DPNAME3= <>
##$DPNAME4= <>
##$DPNAME5= <>
##$DPNAME6= <>
##$DPNAME7= <>
##$DPOAL= (0..7)
0.5 0.5 0.5 0.5 0.5 0.5 0.5 0.5 
##$DPOFFS= (0..7)
0 0 0 0 0 0 0 0 
##$DQDMODE= 0
##$DR= 18
##$DS= 0
##$DSLIST= <SSSSSSSSSSSSSSS>
$$ [...]
##$SUBNAM2= <"">
##$SUBNAM3= <"">
##$SUBNAM4= <"">
##$SUBNAM5= <"">
##$SUBNAM6= <"">
##$SUBNAM7= <"">
##$SUBNAM8= <"">
##$SUBNAM9= <"">
##$SW= 18.0517287032376
##$SWIBOX= (0..15)
0 0 2 0 0 0 0 0 0 0 0 0 0 0 0 0 
##$SW_h= 3612.71676300578
##$TD= 16384
##$TD0= 1
##$TE= 0
##$TE2= 300
##$TE3= 300
##$TEG= 300
##$TL= (0..7)
0 120 120 120 120 120 120 120 
##$TP= (0..7)
150 150 150 150 150 150 150 150 
##$TP07= 0
##$TPNAME0= <>
##$TPNAME1= <>
##$TPNAME2= <>
##$TPNAME3= <>
##$TPNAME4= <>
##$TPNAME5= <>
##$TPNAME6= <>
##$TPNAME7= <>
##$TPOAL= (0..7)
0.5 0.5 0.5 0.5 0.5 0.5 0.5 0.5 
##$TPOFFS= (0..7)
0 0 0 0 0 0 0 0 
##$TUNHIN= 0
##$TUNHOUT= 0
##$TUNXOUT= 0
##$USERA1= <user>
##$USERA2= <user>
##$USERA3= <user>
##$USERA4= <user>
##$USERA5= <user>
##$V9= 5
##$VALIST= <valist>
##$VCLIST= <CCCCCCCCCCCCCCC>
##$VD= 0
##$VDLIST= <DDDDDDDDDDDDDDD>
##$VPLIST= <PPPPPPPPPPPPPPP>
##$VTLIST= <TTTTTTTTTTTTTTT>
##$WBST= 1024
##$WBSW= 4
##$XGAIN= (0..3)
0 0 0 0 
##$XL= 0
##$YL= 0
##$YMAX_a= 9109
##$YMIN_a= -9196
##$ZGOPTNS= <>
##$ZL1= 120
##$ZL2= 120
##$ZL3= 120
##$ZL4= 120
##$ABSF1= 10
##$ABSF2= 0
##$ABSG= 5
##$ABSL= 3
##$ALPHA= 0
##$AQORDER= 0
##$ASSFAC= 0
##$ASSFACI= 0
##$ASSFACX= 0
##$ASSWID= 0
##$AUNMP= <proc_1d>
##$AZFE= 0.1
##$AZFW= 0.1
##$BCFW= 1
##$BC_mod= 2
##$BYTORDP= 1
##$COROFFS= 0
##$CY= 11.3945322036743
##$DATMOD= 1
##$DC= 2
##$DFILT= <>
##$DTYPP= 0
##$F1P= 2.36226072786647
##$F2P= -0.459571619588291
##$FCOR= 0.5
##$FTSIZE= 0
##$FT_mod= 4
##$GAMMA= 1
##$GB= 0.15
##$INTBC= 1
##$INTSCL= 1
##$ISEN= 128
##$LB= 0.24
##$LEV0= 0
##$LPBIN= 0
##$MAXI= 10000
##$MC2= 0
##$MEAN= 0
##$ME_mod= 0
##$MI= 1.114404
##$NCOEF= 0
##$NC_proc= 0
##$NLEV= 6
##$NOISF1= 3.799351
##$NOISF2= 2.8
##$NSP= 1
##$NTH_PI= 0
##$NZP= 0
##$OFFSET= 15.70392
##$PC= 1
##$PHC0= -16335.91
##$PHC1= 47.80078
##$PH_mod= 1
##$PKNL= yes
##$PPARMOD= 0
##$PSCAL= 0
##$PSIGN= 0
##$REVERSE= no
##$SF= 200.130013532006
##$SI= 16384
##$SIGF1= 3
##$SIGF2= 2
##$SINO= 400
##$SIOLD= 16384
##$SREGLST= <1H.CDCl3>
##$SSB= 0
##$STSI= 0
##$STSR= 0
##$SW_p= 3612.71676300578
##$SYMM= 0
##$S_DEV= 0
##$TDeff= 0
##$TDoff= 0
##$TI= <>
##$TILT= no
##$TM1= 0
##$TM2= 0
##$TOPLEV= 0
##$USERP1= <user>
##$USERP2= <user>
##$USERP3= <user>
##$USERP4= <user>
##$USERP5= <user>
##$WDW= 1
##$XDIM= 8192
##$YMAX_p= 0
##$YMIN_p= 0
$$ End of Bruker specific parameters
$$ ---------------------------------
##NTUPLES= NMR FID
##VAR_NAME=  TIME,          FID/REAL,        FID/IMAG
##SYMBOL=    X,             R,               I
##VAR_TYPE=  INDEPENDENT,   DEPENDENT,       DEPENDENT
##VAR_FORM=  AFFN,          ASDF,            ASDF
##VAR_DIM=   8192,          8192,            8192
##UNITS=     SECONDS,       ARBITRARY UNITS, ARBITRARY UNITS
##FACTOR=    0.0002768,     1,               1
##FIRST=     0,             0,               0
##LAST=      2.2672688,     0,               0
##MIN=       0,             -9196,           0
##MAX=       2.2672688,     9109,            0
$$ Real data points
##PAGE= N=1
##DATA TABLE= (X++(R..R)), XYDATA
$$ plain form
0 0 0 0 0 0 0 0 0 0 0 0 0 0 0 0 0 0 0 0 0 0 0 0 0 0 0 0 0 0 0 0 0 0 0 0 0 0 0 0 0 0 0 0 0 0 0 0 0 0 0 -7 8 -9 13 -16 17 -19 20
57 20 -25 27 -35 39 -43 48 -60 77 -98 137 -221 445 -2157 -8335 1898 9109 4948 1539 3045 4739
77 4739 5411 3561 14 -392 2154 1209 -1410 -1141 -1253 -2014 -370 -36 -2014 -1985 228 1085 -445 -1234
95 -1234 -256 19 292 531 -894 -1167 673 1077 -138 -698 -121 570 1051 898 -569 -522 1862 1351 -813
114 -813 57 892 172 520 669 -443 -578 918 1085 -618 -1038 35 537 296 -1033 -1620 289 840
132 840 -1139 -1555 63 609 -555 -781 397 327 -331 371 652 203 128 238 564 671 21 -375 244 988
152 988 33 -1035 262 857 -543 -510 185 -233 -261 39 -225 -481 -91 167 -245 -162 112 -284 138 461
172 461 -382 -218 534 48 -237 223 180 -328 -60 595 -80 -655 420 543 -462 -350 322 386 -115 -360
$$ packed form
0@%%%%%%%%%%%%%%%%%%%%%%%%%%%%%%%%%%%%%%%%%%%%%%%%%pJ5j7K2k9L3l6L9
57B0m5N2o2P4q2R1j08J37j75K35l58O66k602o178J0233P211m161l409J506J694
77D739O72j850l547m06K546r45k619K69j12p61J644L34j978K9K213Q57j530p89
95a234R78K75K73K39j425k73J840M04j215n60N77O91M81j53j467M7K384n11k164
114h13Q70Q35p20L48J49j112j35J496J67j703m20J073N02k41j329n87J909N51
132H40j979m16J618N46j164k26J178p0o58P02K81m49p5J10L26J07o50l96O19P44
152I88r55j068J297N95j400L3O95m18k8L00k64k56L90K58m12Q3K74l96M22L23
172D61q43J64P52m86k85M60m3n08K68O55o75n75J075J23j005J12O72O4n01k45
$$ plain form
192 -360 138 474 112 -430 -310 723 461 -870 -234 953 117 -683 -84 520 120 -340 -3 64 -71 -15
212 -15 -326 -196 71 -489 -358 336 -203 -794 -149 522 -80 -680 60 532 -38 -71 69 -40 289 353 -5
233 -5 -100 95 357 190 -110 -179 -120 308 292 -547 -338 316 -72 -322 -103 -186 -408 -67 353 -253 -818 25 535
256 535 26 -445 -461 357 906 -103 -793 174 1039 347 -625 3 671 177 25 152 -179 -77 256 224 -123
277 -123 -542 -307 328 247 -571 -950 78 835 -287 -905 15 467 148 -105 -186 -12 333 543 90 -415
297 -415 114 597 268 25 -220 -125 512 370 -315 -439 46 346 -31 -274 -281 -394 211 505 -538 -809 163
318 163 616 45 -668 -358 503 534 -84 -558 13 788 154 -412 96 204 -67 187 264 -239 -487 207 627
339 627 -233 -740 -129 409 281 -490 -754 176 507 -162 -515 -103 279 99 -78 30 -182 -10 497 131
$$ packed form
192c60M98L36l62n42J20J033k62j331O36J187q36q00N99O04m00m60L37O7j35N6
212a5l11J30K67n60J31O94n39n91O45O71o02o00P40M72n70l3J40j09L29O4l58
233er5J95K62j67l00o9N9M28j6q39K09O54l88k50K19q3k22L41M20o06n65Q43N10
256E35n09m71j6Q18N49j009o90R67Q65o92r72O28O68m94j52J27l31J02L33l2l47
277a23m19K35O35q1q18l79J028P57j122o18R20M52l19k53q1J74L45K10m53n05
297d15N29M83l29k43k45R5O37j42o85j24M85L00l77k43pj13O05K94j043k71R72
318A63M53n71p13L10Q61L1o18m74N71P75o34n66N08J08k71K54P7n03k48O94M20
339F27q60n07O11N38j28p71k64R30L31o69l53M12L82j80j77J08k12J72N07l66
$$ plain form
359 131 -260 23 279 334 101 -157 -78 177 321 -40 -419 -14 149 -29 -4 -328 -423 183 291 -352 -610 19
381 19 491 -149 -494 -27 220 127 -97 -202 130 193 -114 29 204 -16 -172 203 423 -213 -422 403 407 -295
403 -295 -311 96 240 -91 -343 -118 107 16 -235 -299 154 61 -367 -23 258 -106 -194 92 167 -39 -92 114 94
426 94 8 82 -100 3 187 -84 -127 37 2 -37 -33 -73 -129 -12 154 -138 -273 254 197 -345 -109 327 173 -206
450 -206 -132 292 218 -141 -113 66 249 -10 -346 65 236 -253 -228 137 11 -329 -194 240 15 -386 -73 210
472 210 75 -154 -279 154 401 -89 -285 144 417 103 -170 150 262 -15 129 212 -101 -80 139 59 -166
493 -166 -291 -116 13 -84 -235 -351 -117 104 -212 -265 -141 -169 108 163 -167 -275 219 569 46 -358 203 545
515 545 218 -42 -20 162 327 49 -103 -1 16 -26 -20 35 -186 -452 69 332 -363 -620 -35 336 -33 -543
$$ packed form
359A31l91K83K56N5k33k58P9K55J44l61l79M05J63j78K5l24r5O06J08o43k58O29
381A9M72o40l45M67K47r3k24j05L32O3l07J43J75k20j56L75K20o36k09Q25Mp02
403b95j6M07J44l31k52K25K25r1k51o4M53r3m28L44K81l64q8K86P5k06n3K06k0
426I4q6P4j82J03J84k71m3J64l5l9Mm0n6J17J66k92j35N27n7n42K36M36j54l79
450b06P4M24p4l59K8J79J83k59l36M11J71m89K5L65j26l40J35M34k25m01L13K83
472B10j35k29j25M33K47m90j96M29K73l14k73L20J12k77J44Q3l13K1K19q0k25
493a66j25J75J29r7j51j16K34K21l16n3J24k8K77N5l30j08M94L50n23m04N61L42
515E45l27k60K2J82J65k78j52J02J7m2ON5k21k66N21K63o95k57N85L71l69n10
$$ plain form
537 -543 -334 244 245 -137 -360 -14 401 97 -89 119 92 143 380 280 -95 -97 366 389 -176 -269 11 134 158
560 158 -171 -437 -98 160 -21 -351 -399 -90 124 -7 -318 -440 95 433 -83 -328 36 333 261 27 5
581 5 154 192 286 185 -107 -38 102 227 121 -397 -377 276 295 -368 -595 36 374 -188 -465 -125 37 56 -100
604 -100 -223 -59 7 1 96 -8 -174 -42 330 303 -213 -158 392 303 -34 -121 -2 196 164 -84 -175 -79 127 68
628 68 -210 -174 -64 -2 68 -147 -301 6 160 -64 -210 -55 100 -39 -20 118 -119 -61 237 165 -50 -127 48
651 48 300 111 -205 -128 247 259 -231 -245 250 143 -221 -75 92 17 -127 -47 120 -65 -146 32 90 19 -136
674 -136 -132 164 122 -197 -117 137 90 -114 -111 113 52 -105 51 36 -23 57 -41 5 80 -37 -7 20 41 15 -15 66 -23
701 -23 -16 180 14 -161 75 169 -73 -153 -41 99 -59 -158 -18 -8 -71 -79 -49 47 -110 -220 52 171 -135 -216 73
$$ packed form
537e43K09N78Jl82k23L46M15l04j86K08k7N1K37j00l75kM63K3n65r3K80J23K4
560A58l29k66L39K58j81l30m8L09K14j31l11j22N35L38n16k45L64K97p2k34k2
581EJ49L8R4j01k92O9J40J25j06n18K0O53J9o63k27O31L38n62k77L40J62J9j56
604a00j23J64O6oR5j04j66J32L72k7n16N5N50q9l37q7J19J98l2k48r1R6K06n9
628F8k78L6J10O2P0k15j54L07J54k24j46J55J55j39J9J38k37N8K98p2k15p7J75
651D8K52j89l16P7L75J2m90j4M95j07l64J46J67p5j44Q0J67j85q1J78N8p1j55
674a36MK96m2l19Q0K54m7k04LK24o1j57J56j5n9Q0r8M6P5j17L0K7K1k6l0Q1q9
701b3PJ96j66j75K36R4k42q0J12J40j58r9J40J0o3qL0R6j57j10K72J19l06q1K89
$$ plain form
726 73 286 -28 -252 95 240 56 -26 5 108 148 7 -4 47 15 -15 23 104 -103 -264 119 176 -211 -250 23
750 23 125 -34 -211 -134 34 74 4 -171 -74 106 111 57 -39 -106 153 245 6 -164 7 241 119 -108 -12 33 -44
775 -44 92 30 -176 -137 64 146 -95 -304 -74 172 115 -208 -318 121 326 -111 -217 37 161 94 -33 -12 4
798 4 -7 146 101 -123 -112 18 218 81 -303 -199 231 164 -190 -317 -7 224 -50 -174 -114 -47 146 109 -130
821 -130 -138 38 199 96 -140 -75 112 217 68 -132 -60 171 97 -8 -25 -126 -1 146 26 -187 -239 114 180
844 180 -158 -295 -110 157 124 -219 -245 112 152 -30 -114 16 87 27 97 120 -143 -55 223 182 -90 -197 60 274
868 274 15 -261 -134 140 158 -203 -216 46 6 -79 -49 -113 -92 -13 57 -18 -164 -58 101 38 -36 -75 -21 144 71
893 71 -72 -14 28 77 51 -16 -77 -65 89 116 -162 -161 114 97 -85 -136 12 121 -40 -114 -20 38 6 -61 13 126 -57
$$ packed form
726G3K13l14k24L47J45j84q2L1J03M0j41j1N1l2l0L8Q1k07j61L83N7l87l9K73
750B3J02j59j77P7J68M0p0j75R7J80Nn4r6o7K59R2k39j70J71K34j22k27R6M5p7
775d4J36o2k06L9K01Q2k41k09K30K46n7l23j10M39K05m37j06K54J24o7j27K1J6
798Dj1J53m5k24J1J30K00j37l84J04M30o7l54j27L10K31k74j24O0O7J93l7k39
821a30qJ76J61j03k36O5J87J05j49k00P2K31p4j05j7j01J25J47j20k13n2L53O6
844A80l38j37J85K67l3l43k6L57M0j82q4J30P1o0P0K3k63Q8K78m1k72j07K57K14
868B74k59k76J27K74J8l61j3K62m0q5L0o4K1P9P0p5j46J06J59o3p4l9N4J65p3
893G1j43N8M2M9k6o7o1J2J54K7k78JK75j7j82n1J48J09j61p4R4N8l2o7P4J13j83
$$ plain form
920 -57 -112 164 110 -105 -101 104 140 -93 -120 68 41 -82 -101 -33 40 -47 -146 23 39 -99 -95 24 81 -51 -65 90
946 90 67 -7 41 31 58 87 41 63 48 39 73 36 28 -31 -37 53 -9 -123 -20 -16 -79 -51 -50 -87 -156 -49 68 -120 -194 1
976 1 94 54 -121 -65 140 151 -60 -48 89 160 16 7 130 41 -25 123 117 -38 -80 33 139 -41 -224 -85 64
1001 64 41 -183 -217 25 110 -91 -127 -60 -13 54 -10 -36 -89 7 170 76 -90 -9 109 171 48 -109 -7 144 86
1026 86 -22 -90 -52 53 39 -12 -152 -145 126 95 -169 -185 -14 136 -14 -200 -55 53 56 -16 -71 8 24 24 88 28
1052 28 -125 10 172 122 -141 -176 119 196 -72 -209 -61 123 95 -184 -154 31 73 8 -74 -64 -21 28 98 1 -175
1077 -175 22 193 71 -86 -87 93 152 14 -53 -44 53 104 -42 -104 -48 -8 93 28 -206 -94 68 61 -87 -144 5
1102 5 80 -38 -26 -41 -9 68 44 9 -12 -45 71 143 -1 -110 -18 189 131 -167 -94 154 116 -51 -107 6 80 -18
$$ packed form
920e7n5K76n4k15MK05L6k33k7J88k7j23j9O8P3q7r9J69J6j38MJ19N7j32j4J55
946I0k3p4M8j0K7K9m6K2j5rL4l7qn9oR0o2j14J03Mo3K8Jl7o9J07J17j88p4J95
976AR3m0j75N6K05J1k11J2J37P1j44rJ23q9o6J48oj55m2J13J06j80j83J39J49
1001F4k3k24l4K42Q5k01l6O7M7O7o4k6n3R6J63r4j66Q1J18O2j23j57J02J51n8
1026H6j08o8L8J05j4n1j40PK71l1k64j6J71J50j50j86J45J08Lp2n5P9J6%O4o0
1052B8j53J35J62n0k63l5K95P7k68j37J48J84k8k79L0J85M2o5q2J0M3M9P0r7j76
1077a75J97J71j22j57jJ80N9j38o7RR7N1j46o2N6M0J01o5k34J12J62pj48n7J49
1102EP5j18J2j5L2P7k4l5k1l3J16P2j44j09R2K07n8k98P3K48l8j67n6J13P4r8
$$ plain form
1128 -18 -84 -50 -40 1 -6 -16 0 -93 -13 117 12 -122 -23 100 73 -84 -57 48 19 24 -30 -48 34 34 -16 9 -30 -1 65
1157 65 11 -35 -33 19 50 -27 -26 58 1 1 35 33 -19 -34 37 64 -56 -58 17 62 5 -114 -41 109 -24 -126 -32 49 -35 -124
1187 -124 -22 81 -74 -94 17 26 0 -83 -26 84 43 -41 19 47 39 18 51 71 -2 -1 119 51 -22 -6 30 56 -46 -81
1215 -81 5 -3 1 -75 -101 -17 -20 -61 -38 -74 -47 28 6 -48 -71 47 133 0 -51 79 92 58 22 -2 33 41 29 61 -31 -63 -22
1246 -22 38 16 -145 -120 107 44 -114 -124 2 71 -28 -102 -18 -1 2 7 -39 -16 -3 15 99 -13 -98 26 107 57 -83 -69
1274 -69 93 72 -62 -74 -30 91 52 -82 -83 -10 13 42 -25 -90 -26 70 65 -60 -91 67 121 25 -11 19 51 54 33 12 -53
1303 -53 -22 106 36 -77 -87 -2 116 -13 -165 -67 89 44 -98 -126 20 58 -2 -8 -39 -3 55 46 12 -4 1 120 106
1330 106 -27 -48 28 159 55 -118 -58 79 53 -19 -94 -44 19 2 -28 -104 -101 4 29 -72 -91 -72 47 25 -88 -51
$$ packed form
1128a8o6L4J0M1pj0J6r3Q0J30j05j34R9J23k7j57K7J05k9Nn4j8Q2%n0K5l9K9O6
1157F5n4m6KN2L1p7JQ4n7%L4kn2j5P1K7j20kP5M5n7j19P3J50j33j02R4Q1q4q9
1187a24J02J03j55k0J11Rk6q3N7J10m1q4O0K8qk1L3K0p3JJ20o8p3J6L6K6j02l5
1215h1Q6qMp6k6Q4lm1K3l6K7P5k2n4k3J18Q6j33n1J30J3l4l6k4L5Qj2L2r2l2M1
1246b2O0k2j61K5K27o3j58j0J26O9r9p4Q4J7LNm6K3J3J8Q4j12q5J24Q1n0j40J4
1274f9J62k1j34j2M4J21l9j34jP3K3K9o7o5O4R6nj25l1J58N4r6l6L0L2Lk1k1o5
1303e3L1J28p0j13j0Q5J18j29j52R8J56m5j42k8J46L8o0ol1L6N8rl4j6NJ19j4
1330A06j33k1P6J31j04j73O0J37k6p2p5N0O3j7l0p6LJ05K5j01j9J9J19k2j13L7
$$ plain form
1356 -51 8 65 20 -5 8 7 16 94 7 -53 27 85 63 -28 -94 23 76 -5 -68 -62 67 31 -72 -61 -18 -21 1 18 -56 -52 -27
1387 -27 59 35 -76 -34 63 81 -24 -83 47 98 -13 -46 31 45 -11 -48 11 -15 -42 -19 5 -20 -24 -14 -9 11 -19 4 -2 -17
1417 -17 9 8 2 14 5 45 32 -37 6 72 22 -39 -22 20 31 -54 -44 -8 -37 -36 -51 -26 -26 -75 -48 15 -10 -60 -45 49 44 -72 -6
1450 -6 58 26 22 14 65 40 8 57 76 6 -15 20 36 21 -84 -26 61 -26 -81 -53 -7 18 -59 -70 -56 -39 -10 -27 -60 -26 -1
1481 -1 12 17 -28 -8 50 50 2 -19 5 72 24 21 24 -25 13 36 26 -22 -40 44 48 -36 -99 -15 41 -10 -93 -78 38 17 -31 -6 -19
1514 -19 -5 20 29 -17 -75 6 77 19 -42 -60 29 87 -15 -67 -2 51 45 -43 -46 13 28 -7 -28 -56 -28 31 39 -7 -46 2 64 37
1546 37 -23 -40 23 68 13 -57 -5 15 42 21 -54 -66 -3 32 7 -90 -89 14 13 -27 -72 -39 35 30 -37 -45 -15 17 23 2 -30 -27 53
1579 53 96 -19 -64 29 91 53 -29 -52 61 72 -32 -56 -33 19 24 -56 -50 -42 -37 14 -26 -61 -60 -19 44 -24 -100 -33 16 3 -28
$$ packed form
1356e1N9N7m5k5J3jRP8q7o0Q0N8k2r1o6J17N3q1o3OJ29l6j03J1M3lK2J7p4MK5
1387b7Q6k4j11M2R7J8j05n9J30N1j11l3P7J4n6l7N9k6k7K3K4k5mJ0NK0l0K3oj5
1417a7K6joJ2rM0j3o9M3O6n0o1J7M2J1q5J0L6k9Jj5K5%m9K7O3k5n0J5R4nj16O6
1450fO4l2mqN1k5l2M9J9p0k1L5J6j5j05N8Q7q7n5K8M6K5p7j1J4J7K9j7l3L4K5
1481aJ3Nm5K0N8%m8k1K4O7m8lLm9L8K3j0m8j8Q4Mq4o3Q4N6n1q3J5J16k1m8K5j3
1514a9J4K5Rm6n8Q1P1n8o1j8Q9N8j02n2O5N3oq8lN9J5l5k1k8K8N9Qm6l9M8O2k7
1546C7o0j7O3M5n5p0N2K0K7k1p5j2O3L5k5r7JJ03jm0m5L3P4no7qL0L2Ok1l2LQ0
1579E3M3j15m5R3O2l8q2k3J13J1j04k4K3N2Nq0OQNN1m0l5JM1O3o8p6O7M9j3l1
$$ plain form
1610 -28 -52 18 32 36 15 -12 -11 39 42 -9 -33 -24 50 27 -57 -36 8 32 4 -35 0 -6 -20 0 -43 -46 -12 4 16 -15 -54 16 73
1643 73 -3 -61 -34 25 -5 -43 -31 -2 -4 -4 -33 5 -13 -13 16 14 -22 -42 -3 34 -6 -69 4 24 14 2 16 12 38 22 15 3 -23
1676 -23 25 16 -19 -16 -31 16 -3 -45 -27 -11 -2 -38 -50 -38 -30 -75 -8 -26 -87 -23 -3 -1 -11 -42 22 43 25 -3 -4 35 16 -1 21
1709 21 37 -12 19 44 -2 -23 -8 31 24 -32 -66 -10 -1 -30 -89 -38 -15 -28 -15 -23 -45 -12 -12 -15 -13 -58 -4 32 -24 -25 -1 29 49 -5
1743 -5 -13 26 21 25 3 -19 8 -2 20 -20 -47 -27 24 -10 -33 -19 -21 38 -3 -21 -14 -23 8 -5 -17 -13 -32 17 6 -42 -39 25 37 -17 -79
1778 -79 -29 27 -12 -41 -55 -17 22 7 -41 -20 -10 5 33 -10 -27 -6 47 62 -18 -23 30 63 9 -26 -33 15 21 -18 -48 -71 -8 -10
1810 -10 -21 -48 -59 -21 10 -30 -77 -63 -19 38 -34 -71 6 26 23 3 -29 -14 36 49 24 -40 11 90 44 8 -31 21 47 14 -34
1841 -34 -23 -4 -3 -23 -57 -41 -39 -18 -20 -69 -69 -21 3 -10 -57 -63 30 1 -8 -26 -9 41 29 0 -9 -13 4 16 -7 -15 -2 -5 24 11 -35
$$ packed form
1610b8k4P0J4Mk1k7JN0Ln1k4RP4k3q4K1M4K4k8l9L5oj4K0m3lL4J6J2l1l9P0N7
1643G3p6n8K7N9l0l8J2K9k%k9L8j8%K9kl6k0L9L7m0o3P3K0j0j2J4mK6j6pj2k6
1676b3M8rl5Lj5M7j9m2J8J6Rl6j2J2Qm5O7j8o1O4K0Kj0l1O4K1j8k8jL9j9j7K2
1709B1J6m9L1K5m6k1J5L9pn6l4N6Rk9n9N1K3j3J3qk2L3%lKm5N4L6n6jK4L0K0n4
1743eqL9nMk2k2K7j0K2m0k7K0N1l4k3J4kN9m1j8PrL1j3j2Mj9M9j1m8LO4J2n4o2
1778g9N0N6l9k9j4L8L9j5m8K1J0J5K8m3j7K1N3J5q0nN3L3n4l5pM8Ol9l0k3O3k
1810a0j1k7j1L8L1m0m7J4M4N7p2l7P7K0lk0l2J5N0J3k5o4N1P9m6l6l9N2K6l3m8
1841c4J1J9Jk0l4J6KK1km9%M8K4j3m7oR3k9rj8J7N0j2k9rmJ7J2k3qJ3lK9j3m6
$$ plain form
1876 -35 2 37 5 -20 -49 2 -11 1 -16 -27 -15 -3 3 -21 -35 -42 46 -26 -45 -21 -26 8 -33 -44 -4 -14 -11 -25 -26 -14 -25 14 6
1909 6 -43 -43 -19 7 -3 -23 -12 20 33 -21 -31 3 23 6 -11 33 1 -13 20 12 -21 14 -2 10 -19 -40 -21 -29 -11 -38 -63 -36
1941 -36 -31 -23 -10 -45 -32 -6 -7 -21 -31 -1 28 -4 -17 6 -3 21 8 3 2 24 15 24 -10 -20 -17 9 21 -25 -64 -9 -3 -30 -59 -44 -17
1976 -17 -27 -56 -50 -25 -36 -31 -53 -47 -27 -21 -25 16 -47 -27 25 41 -7 -39 -12 1 4 12 -12 -15 28 8 0 -17 -26 11 2 -13 -3 -20 11 8
2012 8 -33 -36 2 -10 17 -20 -44 -4 -21 7 -37 -55 -22 -25 -21 -48 -43 -7 -4 -30 -40 -7 10 16 -17 -34 -14 -27 -6 1 -22 16 -7 23
2046 23 1 -11 38 49 23 -21 -23 -12 7 -8 -24 -20 -23 -15 -19 -57 -43 -15 -26 -41 -60 -74 -23 -7 -24 -56 -24 19 10 -4 -29 -11 5
2079 5 15 30 -14 -1 38 15 -9 1 20 41 45 -13 10 0 17 -7 -24 -19 -13 -30 -11 -35 -52 -30 19 -18 -62 -59 -19 1 -14 -34 -33
2112 -33 6 -6 3 -38 10 4 -6 -25 -16 -2 0 23 1 -41 -28 17 25 2 -2 -9 22 11 -11 -19 -31 5 28 -35 -22 -17 -10 3 -42 -23 -4
$$ packed form
1876c5L7L5l2k5k9N1j3J2j7j1J2J2Ok4j4pQ8p2j9K4nL4m1j1M0j0Lj4jJ2j1L9q
1909Fm9%K4K6j0k0J1L2J3n4j0L4K0j7j7M4l2j4L3ql3L5j6J2k9k1J9qJ8k7k5K7
1941c6NQJ3l5J3K6jj4j0L0K9l2j3K3rK4j3njK2rRl4j0LK6J2m6l9N5Ok7k9J5K7
1976a7j0k9OK5j1Nk2OK0OmM1o3K0N2J6m8l2K7J3LQk4lM3k0qj7rL7rj5J0j7L1l
2012Hm1lL8j2K7l7k4M0j7K8m4j8L3lMk7NL6Lk6j0L3J7Ol3j7K0j3K1Pk3L8k3L0
2046B3k2j2M9J1k6m4kJ1J9j5j6MlQml8J4K8j1j5j9j4N1J6j7l2L2M3rj4k5J8J6
2079EJ0J5m4J3L9k3k4J0J9K1Mn8K3j0J7k4j7NOj7J9k4j7K2M9l7m4LM0K0j5k0J
2112c3L9j2Rm1M8oj0j9RJ4KK3k2m2J3M5Qk3mpL1j1k2qj2L6K3o3J3NPJ3m5J9J9
$$ plain form
2147 -4 -2 -2 -30 -29 -2 -3 -16 -6 -36 -33 -7 -23 -20 -60 -6 34 -17 -1 -5 11 12 -5 1 30 23 26 16 -14 26 25 25 -3 11 -9 17 -2 -5 -21
2185 -21 -23 4 -6 -21 -26 -36 -10 -25 -31 -19 -37 -18 5 -21 -36 -13 -13 2 -19 -41 9 23 34 9 -4 3 5 5 -19 5 -10 27 -6 -7
2219 -7 -25 -7 15 -3 -34 -20 -23 -6 -23 -35 -34 -9 -23 -22 -34 -3 -21 -17 -9 -39 -39 5 20 -26 -27 0 14 1 -17 -15 -11 7 1 -18 -16 -2
2255 -2 6 21 -29 -28 0 -14 15 -13 -30 -8 11 -8 -6 -37 -17 -5 -33 -21 -14 2 26 -37 1 -12 -3 -1 -10 -24 -27 -17 -13 -18 -40 -10 1 -17
2291 -17 -14 -10 7 4 26 27 5 -6 20 31 5 -6 15 14 18 2 15 20 5 -19 -25 -28 -17 -37 -26 -39 -47 -11 -9 -35 -31 -37 -7 -17 -13 -29 -33 -3
2329 -3 11 -12 0 7 20 45 10 11 28 35 21 30 -6 12 24 -1 -9 -19 11 21 10 -34 5 1 11 -22 -41 -11 -29 -14 -15 -20 -34 -18 -5
2364 -5 0 -18 -30 0 21 2 -8 -26 6 4 -18 -16 -6 17 22 -12 -20 1 20 6 -18 -33 1 5 -14 -4 -12 19 2 1 -17 -1 2 13 -6
2399 -6 -7 -37 -19 0 -11 -38 -20 -19 -5 -10 -17 -15 -10 0 3 -20 -32 3 -6 -7 -22 8 25 37 22 -3 5 37 27 27 17 0 18 29 23 3 -1
$$ packed form
2147dK%k8JK7jj3J0l0LK6j6Lm0N4M0n1J6mJ6Jj7OK9pLj0l0M0j%k8J4k0K6j9lj6
2185b1kK7j0j5nj0K6j5oJ2j8J9K3k6j5K3%J5k1k2N0J4J1k5j3PK%k4K4j5L7l3j
2219gj8J8K2j8l1J4lJ7j7j2JK5j4Jj2L1j8MQl0%M4J5m6jK7J4j3j8KMJ8oj9KJ4
2255bQJ5n0JK8j4K9k8j7K2J9j9Kl1K0J2k8J2PJ6K4o3L8j3RKrj4lJ0Mnk2L0J1j8
2291a7LMJ7lK2Jk2j1K6J1k6j1K1jMj6J3Nj5k4olJ1k0J1j3qL6Kk6MoL0j0Mj6mL0
2329cJ4k3J2PJ3K5l5JJ7Pj4Rl6J8J2k5qj0L0J0j1m4L9mJ0l3j9L0j8J5jnj4J6J3
2364eNj8j2L0K1j9j0j8L2kk2KJ0K3Nl4qK1J9j4k4j5L4Mj9J0qL1j7jj8J6LJ1j9
2399fjl0J8J9j1k7J8JJ4npKNJ0Lk3j2L5rjj5L0J7J2j5k5QL2j0%j0j7J8J1ok0m
$$ plain form
2436 -1 14 6 -11 -14 -8 -37 -48 -36 -33 -7 -25 -18 0 -39 -27 -22 -6 -32 -17 0 3 2 -4 9 5 15 12 -3 22 23 32 17 8 -11 -7 3 4 -23 -14
2475 -14 -7 -14 1 -4 -17 -13 -20 -10 -33 -27 -7 -2 -8 -31 -37 -21 1 -11 -10 1 8 17 -15 -22 12 22 -3 -13 -23 -9 25 6 -2 -7 5 28 29 -4
2513 -4 -3 -1 13 -19 -15 -19 6 17 0 -10 -27 6 -5 7 -34 -33 -39 -23 -7 -43 -47 -10 -19 -30 -21 -29 -10 -2 -18 -14 5 7 3 -1 1 15 7 35 18
2552 18 11 14 -11 6 -9 -18 14 -2 -6 -14 -8 -20 4 -24 -21 -28 -37 -12 -21 -26 0 -32 -16 -1 -53 -23 -10 -7 -18 -23 15 13 4 12 -10 1 24 14
2590 14 -1 -1 13 34 13 8 7 8 31 19 -20 6 -15 -2 -12 -17 -33 4 1 -4 -25 -36 -8 -1 -16 -14 -22 -22 -13 -25 -4 -31 -25 -6 -16 -9 -10 -4
2628 -4 1 3 2 -2 -14 -15 -16 -6 8 29 13 18 11 2 33 -9 -4 -12 -28 14 -19 -29 -45 -24 -33 -3 -39 -26 -31 -16 -3 -39 -28 -13 -5 -43 -11 -38
2666 -38 -29 -33 -21 3 -14 -4 18 -8 12 11 18 15 5 15 20 18 15 -8 -13 15 2 13 -21 -46 -10 -8 -8 -20 -18 -6 7 -7 -26 -14 -15 -23 -11
2703 -11 -13 -18 2 0 -6 -17 9 3 13 17 0 1 1 -11 -1 -7 -16 10 14 15 -13 8 16 23 20 -10 -13 0 -1 -21 -18 -10 -15 -9 -15 -5 -19 -6 -10 -14 -25 0
$$ packed form
2436aJ5qj7lOk9j1J2LK6j8PJ8l9J2NJ6k6J5J7LjoJ3mJ0lj5K5JRj5rj9MJ0Jk7R
2475a4PpJ5nj3MpJ0k3OK0Nok3oJ6K2j2JJ1PRl2pL4J0k5j0j0J4L4j9qnJ2K3Jl3
2513dJKJ4l2MmK5J1j7j0j7L3j1J2m1JoJ6J6l6mL7rj1RqJ9Qj6MJ9KmmKJ4qK8j7
2552A8pLk5J7j5rL2j6mqOj2K4k8LprK5rnK6l2J6J5n2L0J3Lj1nL8krQk2J1K3j0
2590A4j5%J4K1k1njJK3j2l9K6k1J3j0nj6L7lnk1j1K8Pj5Kq%Rj2K1k7OJ9j0PjO
2628dNKjmj2jjJ0J4K1j6NprL1m2Nqj6M2l3j0j6K1rL0l6J3nJ5J3l6J1J5Ql8L2k7
2666c8RmJ2K4j7J0K2k6K0jPlj0J0Nklk3nK8j3J1l4k5L6K%j2KJ2J3j4j9J2jqJ2
2703a1knK0koj1K6oJ0Mj7J%j2J0orK6MJk8K1QPll0lJ3jk0LQnOoJ0j4J3mmj1K5
$$ plain form
2745 0 -7 -13 -18 -25 -24 3 -19 5 -11 -12 25 16 2 1 12 0 17 -10 20 6 5 37 -4 15 4 25 8 -6 -9 -1 -8 -13 -36 -30 -21 -10 -24 -20 -23
2784 -23 -9 -14 -18 -39 -23 -12 -22 -46 -31 -6 0 -5 10 0 20 26 7 15 3 10 15 22 11 4 -17 25 -2 4 19 -1 2 18 -9 -15 -25 -20 -11 -35
2822 -35 -41 -29 -5 -23 -35 2 -6 -20 -3 -4 0 -23 10 -16 -21 -3 -4 11 9 16 15 16 35 20 -20 2 5 0 3 -10 8 6 -3 2 -13 -2 8 -22
2860 -22 -28 -16 -18 -4 13 -26 -11 -13 -36 1 -22 -15 -11 -7 -12 -12 -18 -36 -35 -11 -20 -24 -9 9 5 14 10 2 16 -15 4 -10 -6 22 8 5 4 13 5 -6 6
2901 6 2 -12 2 -31 -20 -16 -29 -2 -20 -39 -5 -15 -25 -34 3 -17 -17 -16 -20 -12 -18 -9 -3 4 -8 -11 18 41 19 29 14 7 3 -19 -2 17 13 27
2939 27 7 0 -10 -15 -12 -26 -16 -12 -20 -25 -23 -40 -10 -13 -40 -23 -4 -20 -16 -14 -31 -3 22 -21 18 -5 -2 6 22 20 -10 3 21 -13 -1 3 -1 18
2977 18 -8 7 -1 -8 1 -3 -9 -17 9 -5 -5 -20 -20 -12 -8 -19 -39 -23 -20 -10 -16 -16 4 -13 -23 2 -16 -11 -18 -14 2 7 1 -2 4 3 -20 15 20 5 12 0
3019 0 -9 12 20 8 -1 -8 -6 6 -18 -16 -6 -2 -18 -4 -2 -17 -38 -22 -31 -23 -21 -30 -22 0 -8 7 -9 -20 -12 -21 -15 -2 -11 6 10 2 22 0 29 35 45
$$ packed form
2745@ponpJK7k2K4j6jL7rj4jJ1j2J7k7L0j4jL2m1J9j1K1j7j4lQpnk3ORJ1j4Ml
2784b3J4nmk1J6J1j0k4J5K5OnJ5j0K0Oj9Qj2PNPj1pk1M2k7OJ5k0LJ6k7oj0NRk4
2822c5oJ2K4j8j2L7qj4J7jMk3L3k6nJ8jJ5kPjJJ9j5m0K2LnLj3J8krNj5J1J0l0
2860b2oJ2kJ4J7l9J5kk3L7k3PMMn%oj8JK4rmJ5J8mRmqJ4l1J9j4MK8j4ljRqj1J2
2901Fmj4J4l3J1Mj3K7j8j9L4j0j0rL7k0%JmQoROPj2lK9K3k2J0j5pmk2J7J9mJ4
2939B7k0pj0nLj4J0MqnKj7L0lk7J7J9j6MKj7K8K5m3L9k3LQJ6kl0J3J8l4J2MmJ9
2977A8k6J5qpRmoqK6j4%j5%QMj1k0J6LJ0o%K0j7j0K5j8NpMJ6NolOjk3L5Nj5Pj2
3019@rK1Qj2rpKJ2k4KJ0Mj6J4Kj5k1J6rQKrQK2qJ5j6j1QrOJ3rJ7MqK0k2K9OJ0
$$ plain form
3060 45 3 17 11 5 7 -3 6 -19 -7 -20 -5 -15 -28 -19 -16 -13 -32 -31 -20 -33 -13 -14 -22 -11 -11 -15 -15 3 13 20 31 10 -2 30 -15 -9 3 -15
3098 -15 19 15 21 0 26 15 4 -9 4 0 8 4 -13 14 -8 -17 -1 -23 0 -21 1 -30 -23 -28 -20 -10 -4 -14 -16 -3 -9 2 -5 12 5 0 10 -8
3136 -8 -24 16 -3 -9 -13 0 1 17 14 14 3 16 3 5 -1 -28 -29 2 -18 -16 -35 2 -15 -10 -25 -15 -16 -26 -6 -53 -32 -41 -15 -36 -36 -4 -15
3173 -15 -3 2 7 -16 -28 -10 6 -1 9 4 -3 10 20 13 15 25 10 12 13 18 -8 -6 10 -19 -19 -26 -34 -3 -31 -18 -37 -22 -23 -17 -17 -10 -29 -24 -14 -20
3213 -20 -11 7 -8 1 -3 -11 -5 -12 2 8 23 -13 8 15 3 19 3 9 22 -4 -1 -3 35 -3 -9 -18 -7 -12 -27 -14 2 -33 -11 -10 -3 -36 -20 3
3251 3 -22 -23 -36 -5 -10 -15 -17 -13 -1 9 -25 11 -15 0 -3 -2 -1 8 15 3 4 10 14 -6 17 15 3 7 -6 -11 11 -25 -23 -11 -12 18 -22 -19 -28 -2 -7
3292 -7 -6 -35 -21 -4 -26 -22 -12 -1 6 0 2 30 3 7 8 8 25 9 12 12 -1 -3 15 20 10 18 12 19 22 -3 -11 -17 -5 -8 -31 -33 -41 -23 -19 -21 -12 -7 -8 -31
3336 -31 -18 -14 -22 -4 0 -12 -5 -13 8 -5 2 24 6 5 8 -8 10 2 19 3 10 -15 5 -6 3 -3 18 -1 3 -11 -10 -18 1 -25 -24 -39 -18 -8
$$ packed form
3060D5m2J4ooKj0Rk5J2j3J5j0j3RLLj9JJ1j3K0jqJ1%m%J8J0PJ1k1j2L2m5OJ2j8
3098a5L4mOk1K6j1j1j3J3mQmj7K7k2rJ6k2K3k1K2l1PnQJ0Oj0kJ3oJ1pJ7pnJ0j8
3136hj6M0j9omJ3JJ6l%j1J3j3Kok7jL1k0Kj9L7j7Nj5J0jj0K0m7K1rK6k1%L2j1
3173a5J2NNk3j2J8J6pJ0npJ3J0pKJ0j5KJNk6KJ6k9%pqL1k8J3j9J5jO%Pj9NJ0o
3213b0RJ8j5RmqOpJ4OJ5l6K1Pj2J6j6OJ3k6LkL8l8orJ1nj5J3J6l5K2JPl3J6K3
3251Ck5jj3L1nnkMJ2J0l4L6k6J5lJJRPj2JOMk0K3kj2Mj3nK2l6KJ2jL0m0LrK6n
3292gJk9J4J7k2MJ0J1PoKK8k7MJ%J7j6L%j3kJ8Nj0QoPLk5qoJ2lk3kqJ8MkRNjk3
3336c1J3MqJ8Mj2PqK1j3PK2j8jLj6J8qJ7j6Pk5K0j1RoK1j9Mj4JqJ9k6Jj5K1J0
$$ plain form
3374 -8 -13 -15 -17 3 11 6 -10 1 -10 -13 -3 -6 -14 18 0 -7 5 -12 -6 9 10 -1 7 2 3 -8 8 -8 19 16 29 27 38 0 21 -13 -7 11 0
3413 0 -17 -11 -19 -5 -23 -25 -21 -18 8 -6 -28 -20 -13 -16 -29 -22 9 3 -2 13 -1 15 13 29 21 -10 17 -5 4 -4 7 -2 9 16 -8 1 12 -8 11 -9
3453 -9 -14 -30 -29 -9 -4 -9 -35 -29 -11 -7 11 -8 -20 6 -28 -3 -14 -14 -1 -13 0 3 0 18 -7 10 5 -11 11 -12 -15 2 -11 -5 2 -3 -8 3
3491 3 -21 -10 11 -17 -34 -21 -13 -11 2 -21 -35 0 -12 -9 -14 -18 -3 -45 -34 -1 -11 -37 -25 -10 1 16 1 -13 16 -3 28 12 18 15
3525 15 2 19 6 -4 12 2 2 -3 -10 -8 17 -6 -6 1 -19 -25 -37 -19 -20 -34 -19 -29 -17 -21 -11 -15 -10 -19 0 6 -22 7 -13 -6 7 10 21 23
3563 23 0 11 16 4 4 0 -14 9 -2 -18 -12 -5 -20 -2 -5 -19 4 -7 -27 -28 -6 -10 -27 -25 -23 -29 -3 -9 -5 -22 4 23 -14 -6 20 -11 -7 9
3601 9 -9 7 0 -8 -3 -5 4 21 4 1 6 6 4 -9 -12 -8 -9 -6 -7 -17 -16 -17 6 -30 -16 -10 -17 -7 -28 -21 -31 -10 -22 -26 -35 -16 15 4 -19 -17 -24 -3
3643 -3 -4 -2 -6 -11 0 -8 3 16 1 11 24 18 -3 -26 8 -12 5 -8 -14 -7 -29 -20 3 -26 -25 -39 -24 -20 -44 -28 7 -21 -5 -11 -23 1 -7
$$ packed form
3374hnkkK0Qnj6J1j1lJ0lqL2j8pJ2j7OJ5Jj1QnJj1J6j6K7lJ3kJ1l8K1l4OJ8j1
3413@j7OqJ4j8kMLK6j4k2QPlj3PL1onJ5j4J6kJ6ql1K7k2RqJ1rJ1Pk4RJ1k0J9k0
3453inj6JK0Nnk6OJ8MJ8j9j2K6l4K5j1%J3j2J3LlJ8k5J7nj6K2k3lJ7j3OPnnJ1
3491Ck4J1K1k8j7J3QKJ3k3j4L5j2LnmJ5m2J1L3j0k6J2J5J1J5j5j4K9j9L1j6Ol
3525A5j3J7j3j0J6j0%npKK5k3%Pk0oj2J8jj4J5j0J2mJ0mNrJ9Ok8K9k0PJ3LJ1K
3563B3k3J1Nj2%mj4K3j1j6OPj5J8lj4K3j1k0jK2mj7KKoK6oMj7K6J9l7QK6l1MJ6
3601Ij8J6pqNkRJ7j7lN%kj3lMjLjj0JjK3l6J4OpJ0k1Pj0K1j2mrJ9L1j1k3KpK1
3643cjKmnJ1qJ1J3j5J0J3ok1k3L4k0J7j3oPk2RK3k9Jj4J5Mk4J6L5k8J6oj2K4q
$$ plain form
3680 -7 -1 5 -24 -15 -13 -14 14 15 22 18 16 22 3 9 24 13 17 12 -4 -10 -3 -17 -2 -15 -23 -11 -1 10 -11 -9 -7 -15 -18 -10 -29 -33 -17 -27 -15 -32 -14 -13
3722 -13 -18 -5 0 0 -5 1 -3 3 -11 7 -15 25 12 9 18 -5 9 13 11 12 9 -14 4 -8 -14 -15 -10 -9 -28 -15 -30 -23 -14 -29 -21 -14 -47 -8 -41 -29 -19
3763 -19 -10 12 -11 0 -1 -11 3 6 0 8 8 12 7 15 18 3 2 19 3 8 24 -4 12 15 -3 -13 -4 -17 2 1 -11 -22 -21 -5 -9 5 -27 -13 -13
3802 -13 -33 -22 -6 5 0 6 3 -3 -2 -6 3 12 -17 -3 7 -3 9 -13 -17 10 -6 -4 11 34 0 -2 10 -17 -20 -30 -16 -2 -15 -37 -7 -11 -21
3839 -21 1 -11 -20 -26 -39 -22 -21 -15 -22 -31 -17 -6 -3 -7 -4 22 7 13 -16 7 -10 -8 2 13 -14 8 -3 -15 12 4 -6 -3 -6 -5 -36 -28 -31 -41 -13
3878 -13 -10 -22 -37 -35 -36 -29 -16 -27 -12 -24 -26 -7 -44 -11 -21 -14 -17 2 10 12 4 8 -1 9 12 -7 -3 12 8 14 17 -11 2 6 14 -2 -16 -34 -17 -27
3918 -27 -20 -27 -4 -31 -18 -17 -32 -18 -16 -25 -13 -4 -25 -22 -6 -3 -25 -9 18 -7 3 8 22 27 -6 6 5 -3 16 -7 -6 17 5 -2 11 2 -5 3 -3
3957 -3 -9 -27 -18 -4 -10 -7 -10 -15 -35 -25 -11 -11 -20 7 -8 -21 -11 -29 -12 -6 -10 3 9 -2 -2 17 14 2 -3 16 16 -8 10 9 -4 3 -7 2 21 -7
$$ packed form
3680gOOk9RKjK8JPmkOj9OJ5j1Mnj6oPj4J5j3qJ2J0J1k1KKqlQj9mJ6j0J2j7J8J
3722a3nJ3N%nOmOj4J8k2M0j3lRk3J4MkJlk3J8j2ojNJj9J3j5PRj5QPl3L9l3J2J0
3763a9RK2k3J1jj0J4LoQ%MnQLj5jJ7j6NJ6k8J6Lj8j0Rj3J9jj2j1JJ6mJ4l2J4%
3802a3k0J1J6J1nOloJmRRk9J4J0j0J2k2mK7j6KJ5K3l4kJ2k7lj0J4J4j3k2L0mj0
3839b1K2j2roj3J7JOprJ4J1LmLK6j5Ok9K3j7KJ0J1k7K2j1j2K7qj0LlJl1Qlj0K8
3878a3Lj2j5KjPJ3j1J5j2kJ9l7L3j0PlJ9QKqMrJ0Lj9MJ5mOLk8J3MQj6j4j8J7j0
3918b7PpK3k7J3Jj5J4KrJ2Rk1LJ6Lk2J6K7k5J0NJ4Nl3J2jqJ9k3JK3j2pJ3rpQo
3957coj8RJ4oLlnk0J0J4%rK7j5j3J0j8J7OmJ3Oj1%J9lj2nJ9%k4J8jj3Pj0RJ9k8
$$ plain form
3997 -7 -1 15 -22 14 9 -4 -3 -26 -32 5 -20 -29 -15 -11 -18 -3 -23 -28 -35 -8 -19 -19 12 -28 -5 -7 8 -18 4 8 1 1 40 8 -6 0 3 -1 -13
4036 -13 -5 -13 -8 -2 -8 -10 -4 -3 -21 -6 -17 -10 -41 -45 -25 -17 -17 -16 -22 5 -6 -27 17 -12 5 10 -1 -13 -8 8 -13 -16 9 21 1 29 9 28 -14
4075 -14 7 -1 -18 12 3 -15 19 -5 -20 12 -31 -19 8 -3 -6 -6 -39 -36 -6 -26 -20 8 -14 -18 -9 -20 -14 -5 -25 -19 -10 -7 3 11 -20 -5 14
4112 14 5 6 20 11 -1 6 13 28 8 -11 -7 2 -13 -14 -10 -1 -15 0 -6 -20 -29 -8 -34 -24 -20 -19 -11 -4 -29 -12 1 4 12 15 4 0 0 -3 -14 7 22
4153 22 10 0 2 12 2 17 14 10 -3 3 -3 -17 -20 -14 -6 1 -5 -15 -13 -7 11 -16 -10 -4 -52 -1 -22 -6 -26 -13 -9 -33 -30 -11 7 -17 -3 11
4191 11 -3 8 -22 -8 15 19 16 9 9 10 14 -4 5 15 3 -7 -3 -13 -12 -17 -7 -16 -21 -22 -3 -6 -10 -12 -21 -27 -16 -29 -28 -27 -18 -9 -22 -8 2 7 -8 -3
4233 -3 17 18 -2 23 14 16 14 6 29 11 9 1 35 3 17 1 -3 0 -20 -2 -33 4 -10 -7 -24 -22 -38 -35 -48 -37 -17 -22 -23 -33 -7 7 -16 -18
4271 -18 -23 -7 23 -2 -10 0 -3 0 13 -8 -11 -3 15 -17 3 0 -4 25 11 -5 1 -9 -5 10 -23 -2 -14 -4 -3 -11 -18 -17 13 -7 -11 -14 -11 8 -3
$$ packed form
3997gOJ6l7L6nj3Jk3oL7k5rJ4MpJ5k0npK7j1%L1m0K3kJ5k6K2Mp%L9l2j4OLmj2
4036a3QqNOokOJj8J5j1Pl1mK0Q%JoK7j1k1M4k9J7Nj1j2NJ6k1lK5J2k0K8k0J9m2
4075a4K1qj7L0rj8L4k4j5L2m3J2K7j1l%l3LL0k0OK8k2mRj1ORk0ORLJ0Ql1J5J9
4112A4rJJ4rj2PPJ5k0j9MRj5jMRj4J5oj4rK1k6J0MJQPk5J7J3LQLj1m%lj1K1J5
4153B2j2j0KJ0j0J5lmj3Ooj4lOQPoj0KOJ8k7OOm8N1k1J6k0J3Mk4LJ9J8k4J4J4
4191A1j4J1l0J4K3Mlp%JMj8RJ0j2j0Mj0JnJ0rnjJ9lmkroJ1j3JJRRj3J4J0Nj5N
4233cK0Jk0K5rKkqK3j8kqL4l2J4j6mLk0J8l1L7j4Lj7Kj6Lj3J1K0njj0K6J4k3k
4271a8nJ6L0k5qJ0lLJ3k1lQJ8l2K0lmK9j4j6Oj0MJ5l3K1j2J0JqpJL0k0mlLJ9j1
$$ plain form
4310 -3 -13 -20 2 1 -4 -11 22 -6 0 1 -5 7 4 -3 10 9 -18 1 10 12 21 19 7 3 4 -2 -19 -2 -20 4 -47 -6 -7 3 -20 -23 -15 -4 -25 -11 -21
4351 -21 -23 -21 -11 -4 -5 -4 2 -12 20 1 4 -7 7 14 2 7 11 -3 -19 -1 20 29 33 7 0 12 10 -7 -22 -10 -14 -17 -16 6 -4 -17 -18 -14 -13 -8 -26
4392 -26 -28 -2 -17 -7 -21 -28 2 -25 -2 0 -18 10 3 17 7 0 9 -9 -15 -2 -2 5 3 -11 5 -7 2 -15 -29 -9 -5 -6 -33 -13 -22 -17 -5 2
4430 2 -8 -26 -22 -8 16 -16 -28 -32 -25 -12 -12 -19 14 6 3 -6 22 17 -16 -13 -3 6 4 -16 4 -3 10 10 35 3 -7 -2 -11 3 -30 -26 -16 -17 -23 -6
4470 -6 -26 -25 -17 -21 -24 -42 0 -24 -22 -2 -27 -9 5 -13 -2 3 15 1 18 16 6 -11 1 -14 4 11 -3 11 -4 -8 2 2 6 -7 -5 8 -17
4507 -17 -9 -13 -9 -13 -10 -20 -1 -4 -16 -13 -16 2 -5 -15 -18 -17 -12 -11 -12 -3 -19 9 10 12 12 1 10 0 21 39 -26 10 -6 5 -1 4 2 -14 3 6 9 7 -17
4550 -17 -12 -7 -12 -11 -6 -15 -11 -21 -23 -1 -14 -14 -20 -11 -19 -11 -16 1 -16 -2 -5 -16 -6 -14 0 18 16 -3 5 4 -4 -10 -5 -12 -8 -5 -1 0 1 -9 -30 9 5 12 -13
4595 -13 -3 -30 -18 -5 3 1 -29 -31 0 -20 -28 -11 9 -11 -6 -16 3 -9 -11 5 0 2 -13 13 2 11 -5 4 -9 1 -17 -13 1 9 5 3 -18
$$ packed form
4310cj0pK2jnpL3k8OJoJ2lpJ3jk7J9RKRkj2mJoj7J7j8K4n1M1jJ0k3lQJ1k1J4j0
4351b1kKJ0PjJOj4L2j9Lj1J4Pj2NMj4j6J8K1RMk6pJ2kj7j5J2mlJK2j0j3jMJNj8
4392b6kK6j5J0j4pL0k7K3Kj8K8pJ4j0pRj8oJ3%Pkj4J6j2Rj7j4K0Mjk7K0rNJ2P
4430Bj0j8MJ4K4l2j2mPJ3%pL3qlrK8nl3LJ0Rkk0K0pJ3%K5l2j0NrJ4l3MJ0joJ7
4470fk0JQmlj8M2k4KK0k5J8J4j8J1NJ2j4J7kj0j7J2j5J8Pj4J4j5mJ0%Mj3KJ3k5
4507a7QmMmLj0J9lj2LlJ8pj0lJNJjRj6K8JK%j1Rj0K1J8o5L6j6J1oNkj6J7LLkk4
4550a7NNnJNrMj0kK2j3%oRqQnJ7j7J4lj1J0qJ4J8kj9QjqoNpMLMJJj0k1L9mPk5
4595a3J0k7J2J3Qkl0kL1k0qJ7K0k0Nj0J9j2kJ6nKj5K6j1Rj6Rj3J0j8MJ4Qmkk1
$$ plain form
4632 -18 -17 -3 -3 -9 -4 -4 -2 -12 -7 -40 -32 -6 -23 -2 -9 -11 16 -4 -20 -3 -9 2 1 -4 -14 4 -1 -11 17 20 10 10 -1 4 4 18 -7 -5 8 -4
4672 -4 33 -5 -9 -14 -14 -3 -3 5 -6 3 -25 -45 -15 -38 -25 -15 -43 -2 -30 -13 -10 -8 13 -18 5 -13 -13 -1 -32 7 13 8 6 24 20 16 11 21
4710 21 -1 -1 5 8 5 -20 -13 -4 21 -12 -17 -8 4 -11 -2 -14 -7 -25 -22 -16 -14 -12 -25 -19 9 -24 -15 -2 -17 10 -6 -4 -24 -2 4 6 -4 12 -3 13
4750 13 5 38 11 -1 14 -13 -11 12 14 -2 10 -19 -21 -11 -29 -5 -10 -3 -35 -18 -4 18 -20 -5 -21 -12 7 2 19 2 -1 -23 -4 -4 -4 9
4786 9 19 -11 10 0 12 0 -10 26 7 18 -11 -8 -16 -13 6 -26 0 -14 -8 -17 -2 -10 -25 -4 -13 -23 -20 -16 -15 -10 -25 -6 -2 4 -7 11 -3
4823 -3 1 13 -3 -3 -6 17 -1 19 11 19 12 15 -7 -3 11 -3 -3 -16 1 -16 -13 -9 -22 -13 -18 -25 -15 -15 -15 -27 -23 -14 -22 -24 -24 -29 -13 -21 -18 -22 -6 5 10 15
4867 15 -10 0 -8 19 11 0 6 4 18 14 -4 1 3 15 1 5 22 2 -10 -12 7 5 -26 -3 -9 -6 -24 -3 -28 -13 1 -16 -40 -19 -30 -9
4903 -9 12 -13 0 30 9 16 3 9 15 -4 -2 12 23 -2 8 -1 13 -1 15 15 15 -1 -4 10 -8 5 -7 -17 -25 -14 -5 -3 -7 -14 -7 -12 0 -17
$$ packed form
4632a8JJ4%oN%Kj0Nl3QK6j7K1pkK7k0j6J7oJ1jnj0J8nj0K8Lj0%j1N%J4k5KJ3j2
4672dL7l8mn%J1%Qj1Rk8k0L0k3J3J0k8M1k8J7LKK1l1K3j8%J2l1L9OnkJ8mmnJ0
4710B1k2%OLlk5PRK5l3nRJ2j5Rj2Pj8LOKKj3OK8l3RJ3j5K7j6Kk0K2OKj0J6j5J6
4750A3qL3k7j2J5k7KK3Kj6J2k9kJ0j8K4nPl2J7J4K2l8J5j6RJ9nJ7j7lk2J9%%J3
4786IJ0l0K1j0J2j2j0L6j9J1k9LqLJ9l2K6j4OrJ5qj5K1rj0LMJNj5J9MOj1J8j4
4823cMJ2j6%lK3j8K0qQpLk2MJ4j4%j3J7j7LMj3RnpJ0%%j2MRqk%nJ6qLmJ6J1NN
4867A5k5J0qK7qj1OkJ4mj8NKJ2j4MJ7k0j2kJ9kl1K3oLj8K1k5J5J4j7k4K1j1K1
4903iK1k5J3L0k1Pj3OOj9KJ4J1k5J0rJ4j4J6%%j6lJ4j8J3j2j0qJ1RKmpPnJ2j7
$$ plain form
4941 -17 -16 1 -11 -3 -22 -18 -3 -4 16 23 6 14 10 3 8 2 -9 4 12 10 15 2 7 -3 -2 14 6 -12 0 -4 -18 -24 -11 -37 -27 -20 -10 -3 -21 -21 -20
4982 -20 4 -20 -19 -7 -6 -7 18 -6 11 23 13 4 10 8 19 -2 23 14 -3 -11 -4 20 -9 2 16 28 14 -6 2 -6 3 -4 -3 -3 11 -20 -21 -11
5020 -11 -7 -15 3 -5 -18 -4 -9 -4 -3 -1 -13 13 2 18 6 4 18 20 10 10 14 33 21 15 20 16 11 16 -6 -8 19 1 15 15 -9 -6 4 14 -7 -22
5060 -22 -21 -15 -1 -17 2 -17 7 -1 18 14 -8 -11 19 1 -8 -3 11 13 18 22 23 18 32 16 17 17 27 14 5 9 6 17 20 34 -7 11 28 9 -1
5099 -1 2 -5 3 -12 -23 -13 2 9 -4 -5 -2 -18 2 2 1 -19 -2 -6 -6 -6 3 -8 21 -6 19 13 -1 18 23 10 14 -18 15 -3 33 16 24 18 -12
5138 -12 11 -5 18 4 11 -4 -15 -11 -2 -4 -3 -7 -15 -1 10 -11 13 -6 4 0 5 -1 6 3 -6 2 -3 11 15 33 25 14 1 12 17 23 9 -1 -1 22
5178 22 -8 -4 14 4 2 -1 -4 -21 1 -15 -18 -26 -10 -10 -4 -15 1 -11 5 -5 5 0 -3 -16 11 -14 -7 14 31 8 24 29 1 35 8 15 19
5215 19 1 8 26 -11 6 7 5 5 5 2 -3 13 1 3 6 1 -15 -6 -2 -30 -10 -24 -9 -15 -12 -8 -5 0 -3 11 14 -9 -6 1 1 5 13 4 2 6 -1 2 37 -6 19
$$ packed form
4941a7JJ7j2Qj9MJ5jK0Pj7QmpNoj1J3QkNj3Nj0JJ6qj8J2mj4oJ3k6J0PJ0Pj8%J
4982b0K4k4JJ2JjK5k4J7J2j0rOkJ1k1K5rj7qPK4k9J1J4J2j4k0QqRpJ%J4l1jJ0
5020a1MqJ8qj3J4nNJKj2K6j1J6j2kJ4Kj0%MJ9j2oNmnNk2kK7j8J4%k4LJ0J0k1j5
5060b2JOJ4j6J9j9K4qJ9mk2lL0j8rNJ4KNMJnJ4j6J%J0j3rMlJ1LJ4m1J8J7j9j0
5099aLpQj5j1J0J5Pj3jLj6K0%jk0J7m%%Rj1K9k7K5oj4J9Nj3Ml2L3j8L6j7Qol0
5138a2K3j6K3j4Pj5j1MRkJmqJ4J1k1K4j9J0mNoPlrQnJ4MJ8qj1j3J1NOj4j0%K3
5178B2l0MJ8j0kllj7K2j6lqJ6%Oj1J6j2J6j0J0nlj3K7k5PK1J7k3J6Nk8L4k7PM
5215A9j8PJ8l7J7Jk%%lnJ6j2KLnj6RMk8K0j4J5oLMLNlJ4Lk3LP%MQrkMpLL5m3K5
$$ plain form
5260 19 5 -4 7 4 -7 -9 12 -13 -8 -1 -4 1 -1 -39 -19 -16 -35 3 -7 -16 6 6 -10 1 4 13 2 22 0 17 -5 -1 15 -1 3 6 14 17 -2
5299 -2 9 -22 3 -30 1 -2 -14 -12 -7 -18 6 -5 -18 -6 -22 -33 -17 -31 -20 -7 -14 -41 -14 19 -5 -21 -3 4 13 8 -2 -7 -11 5 1 0
5335 0 11 12 5 -6 22 23 12 9 27 23 -8 -16 1 12 -6 6 -15 -20 -8 16 0 12 -2 -13 -10 -31 0 -24 -25 -16 -29 -1 -7 26 -16 14
5371 14 11 8 10 17 11 5 14 -13 4 13 20 14 4 -7 19 17 -5 12 -15 -10 7 2 -16 -3 -8 -7 1 -8 -17 -19 -10 -15 -11 -4 -14 -7 -17 -31 -26 -20 -3 -4 -9 13
5415 13 -13 18 4 6 -8 19 5 -13 1 -3 28 1 15 27 3 6 25 -11 -6 -4 -8 -19 -17 -15 -23 -6 -1 -16 -18 -31 -14 0 -11 -9 -8 -15 -22 -10
5453 -10 6 -8 -19 -4 18 -10 -10 8 -11 -10 -22 -23 16 -19 -4 13 6 -11 0 -2 -2 12 -7 -6 -7 -19 -11 -18 0 -7 -21 -18 -11 -9 -10 -10 -10 -20 -10
5492 -10 -19 -7 11 -20 -20 19 -4 6 17 34 19 -3 0 7 0 -19 0 -12 3 10 9 12 0 30 13 -12 -2 -23 1 -13 -21 -9 -17 -14 -1 -4
5528 -4 -26 -9 -8 -17 -11 4 12 -13 -20 -17 -17 -19 -6 9 0 1 -1 5 3 0 -7 4 16 -9 -2 -17 -9 -22 5 -2 -7 -4 -15 -3 -13 7 -20 -9 -16 -23 -19 -11 -31
$$ packed form
5260A9j4rJ1lj1kK1k5NPlNkl8K0Lj9L8j0rK2%j6J1LRj1K0k2J7k2MJ6j6MLQLj9
5299bJ1l1K5l3L1lj2KNj1K4j1j3J2j6j1J6j4J1J3pk7K7L3k4j6J8PRnj0nmJ6mj
5335@J1Jpj1K8Jj1lJ8ml1qJ7J1j8J2k1nJ2K4j6J2j4j1Lk1L1k4jRj3K8oL3m2L0
5371A4llKPooRk7J7RPoj0j1K6kk2J7k7NJ7nj8J3nJQrrkRnMPj0Pj0j4NOJ7jnK2
5415A3k6L1j4Kj4K7j4j8J4mL1k7J4J2k4LJ9l6NKmj1KKqJ7Nj5kj3J7J4j1KJppJ2
5453a0J6j4j1J5K2k8%J8j9Jj2jL9l5J5J7pj7J1k%J4j9Jjj2QpJ8pj4LPKj%%j0J0
5492a0rJ2J8l1%L9k3J0J1J7j5k2LPpj9J9j2J5PjLj2L0j7k5J0k1K4j4qJ2qLJ3l
5528dk2J7JrOJ5Qk5pL%kJ3J5rJkOklpJ1J2k5Pj5Qj3K7pnLj1J2j0K0k7J1ppMQk0
$$ plain form
5571 -31 -20 -16 -23 -10 -14 -18 -4 -2 -29 -25 -11 -10 -5 -14 -2 -5 -12 14 2 1 -1 -6 2 -24 -24 -14 -1 -19 -12 3 -7 -22 2 -14 -26 -8 -31 -24 -45
5610 -45 -25 -21 -13 -21 5 -12 -12 -16 -4 -19 -19 16 -19 -25 -25 -8 -6 -25 18 -8 6 -7 8 8 -10 -18 -14 -9 -2 7 -2 -6 4 -17 -8 -5 -10 1 -24 -27 -19
5651 -19 -19 -12 -9 -17 -9 1 5 0 -22 -33 -5 8 -16 -13 -20 -13 1 1 -4 -12 28 3 -5 6 -2 -18 -9 -7 8 -3 4 -8 -14 0 13 14 -10 7 -9 3
5691 3 0 -17 -28 -17 6 -15 -29 -29 2 -18 -9 -1 10 -28 21 -12 -14 -5 -2 4 -18 17 7 7 4 10 34 17 7 0 14 10 16 -9 2 -8 -1 -13
5729 -13 28 -3 1 0 -12 -16 7 -6 -27 -26 -16 17 -6 2 0 10 -7 3 -6 15 17 4 -4 -7 13 -23 -10 19 7 6 10 10 8 16 3 15 11 -7
5767 -7 -8 8 -3 -7 10 11 -2 -23 -4 3 1 -4 -14 -22 -10 -32 1 2 10 18 -9 -13 30 -1 -6 -7 -9 -2 -15 -1 7 6 -7 4 30 4 -8 8 -7
5806 -7 -3 21 1 21 21 8 -6 16 18 -5 12 -5 2 -6 -12 -14 -19 -10 -9 -40 -8 -2 8 -5 5 -24 2 10 2 11 -6 11 12 13 13 4 -7 9 19 8
5846 8 7 14 14 17 13 3 -10 -12 5 -2 1 11 27 14 9 -14 -9 1 15 -4 -28 -23 -19 4 0 -19 -8 -14 6 2 7 -8 8 -2 5 12 7 19 14 3 10
$$ packed form
5571c1J1MpJ3mmJ4Kk7MJ4JNrJ2lpK6j2jknQk6%J0J3j8PJ5j0j5K4j6j2J8k3Pk1
5610d5K0MQqK6j7%mJ2j5%L5l5o%J7Kj9M3k6J4j3J5%j8qMNPRrmJ0k1RLnJ1k5lQ
5651a9%PLqQJ0Mnk2j1K8J3k4LpPJ4%nqM0k5qJ1qj6RKJ5j1Pj2oJ4J3Jk4J7j6J2
5691Clj7j1J1K3k1j4%L1k0RQJ1l8M9l3kRLOk2L5j0%lOK4j7j0pJ4mOk5J1j0Pj2
5729a3M1l1Mjj2mK3j3k1JJ0L3k3QkJ0j7J0rK1Kj3qlK0l6J3K9j2jM%kQj3J2mj8
5767gjJ6j1mJ7Jj3k1J9Pknj0qJ2k2L3JQQk7mM3l1njkPj3J4Qjj3J1K6k6j2J6j5
5806gMK4k0K0%j3j4K2Kk3J7j7PqoknRJl1L2OJ0j3J0k9K6QqRj7J7JJ%rj1J6J0j1
5846HjP%Lmj0j3kJ7pLJ0J6j3nk3NJ0J4j9k4NMK3mj9J1oK0mNj5J6j0PPnJ2nj1P
$$ plain form
5887 10 19 -10 4 48 31 10 5 -8 2 -4 14 -20 -8 -8 -11 -19 4 -12 -1 -20 -4 6 8 2 4 -23 -4 7 7 -5 9 3 16 -3 11 21
5923 21 -3 16 -4 -1 -4 5 23 17 22 13 20 5 -7 26 5 28 16 16 7 -4 -18 -8 -28 -18 -2 2 -9 0 -12 -22 -15 -20 -23 -19 -14 0 -4 7 -11
5962 -11 8 4 2 10 0 14 -5 -7 0 -4 18 -19 14 21 -3 -1 2 8 -7 -3 -22 4 -4 -13 20 9 10 -22 -12 -1 -13 -4 -3 8 -17 -4 -6 -10 -2 -10
6002 -10 10 -2 11 3 -4 16 11 9 -6 20 5 13 28 24 18 13 6 22 15 -3 6 17 -17 1 18 2 1 -15 9 -7 1 -11 0 -14 -17 -17 -16 -7 -6
6041 -6 12 -11 -28 -6 4 15 24 2 9 -3 11 9 7 18 1 3 -3 32 3 10 6 20 -3 7 1 9 -4 -10 0 -21 -10 -2 -13 -19 4 -5 -18 6
6079 6 -13 7 -9 -3 -22 -30 -10 -8 -5 12 0 28 14 3 8 -7 8 8 -6 -19 -8 -5 16 -3 20 10 8 8 -1 -10 12 -8 -5 -6 -24 -22 -12 -21
6117 -21 -28 11 -30 0 -18 2 -8 16 -17 5 6 -7 -4 -2 6 -4 8 1 7 6 13 4 5 3 -3 14 5 14 10 -4 -8 15 5 -4 -3 17 0 -15 -19 -31
6157 -31 -8 3 -10 2 -18 -27 -3 9 -15 -15 -9 -8 15 -2 -22 -3 8 -12 -5 10 8 12 13 11 2 5 0 3 16 2 -9 14 18 8 -5 3 9 -9
$$ packed form
5887A0Rk9J4M4j7k1nj3J0oJ8l4J2%lqK3j6J1j9J6J0KoKk7J9J1%j2J4oJ3j9J4J0
5923B1k4J9k0LlRJ8oNrPj5j2L3k1K3j2%rj1j4J0k0J0J6Mj1Rj2j0PnlMNJ4mJ1j8
5962a1J9mkQj0J4j9kPmK2l7L3Pk4KLOj5Mj9K6qrL3j1Jl2J0J1j2RJJ1k5J3kmQq
6002a0K0j2J3qpK0nkj5K6j5QJ5monpJ6pj8RJ1l4J8J7j6jj6K4j6Qj2J1j4l%JRJ
6041fJ8k3j7K2J0J1Rk2Pj2J4kkJ1j7KoL5k9PmJ4k3J0oQj3oJ0k1J1Qj1oK3rj3K4
6079Fj9K0j6Oj9qK0KLJ7j2K8j4j1Nj5J5%j4j3J1LK1j9K3j0k%rrK2k0Ljj8KJ0r
6117b1pL9m1L0j8K0j0K4l3K2Jj3LKQj0J2pOjPrJkoJ7rRmj4mK3j0rJK0j7j5mj2
6157c1K3J1j3J2k0rK4J2k4%OJK3j7k0J9J1k0PJ5kMJkrLnLJ3j4j1K3Mj0j3QOj8
$$ plain form
6195 -9 -16 0 -17 -14 0 -22 -15 -12 -2 -28 -14 -19 -13 -3 11 7 -5 -20 6 -3 -7 9 1 13 19 33 16 18 28 13 13 5 3 -1 2 7 -8 3 -20 12
6235 12 -5 8 34 4 4 -2 -13 7 -32 -27 -20 -40 -6 -25 -19 -3 0 -12 -14 9 -3 4 -7 6 8 0 8 6 -2 35 20 11 27 20 18 12 2 13 14
6274 14 7 25 22 -1 -25 4 9 7 2 3 -3 -17 -21 -21 -17 -12 -7 -5 10 1 -15 20 0 3 -9 3 8 -7 -18 17 9 -5 7 -6 -5 26 8 24 33 15
6314 15 27 7 5 -17 -9 -13 0 16 -2 -11 -8 -17 -10 -4 -12 -33 -17 -28 -29 -16 -35 12 13 15 -8 -1 3 -2 9 16 14 2 3 21 7 1 -6 17 25 19 10 31
6356 31 14 2 17 1 8 -2 10 9 -5 -5 -7 3 -5 -6 -7 -10 -20 -23 -26 -17 -13 -12 3 -2 -9 0 9 -1 21 3 5 5 -3 6 6 16 5 13 -5 7 -4 10
6398 10 10 5 -1 -13 6 3 -3 -6 -9 15 6 -7 -16 -18 2 -4 -10 -4 -12 -16 1 -3 -9 -17 -13 -12 18 1 0 3 2 3 11 -4 18 5 13 21 9 17 22 -3 15 26 14
6443 14 5 15 -12 -1 -12 -18 5 -11 -20 -19 -21 -12 -10 10 19 -9 -4 -20 -15 -5 6 7 3 -12 0 -14 -4 9 6 5 4 -3 -5 -15 7 20 23 1 24
6482 24 1 13 2 23 8 7 10 -11 15 8 -20 -4 -23 -9 -16 -19 -17 -4 -7 -10 6 -3 -20 -16 -5 8 8 -18 29 4 6 12 13 15 24 19 20 10 -9
$$ packed form
6195ipJ6j7LJ4k2PLJ0k6J4nOJ0J4mj2j5K6rmJ6qJ2OJ4j7KJ0j5%qkmLNj5J1k3L2
6235A2j7J3K6l0%oj1K0l9NPk0L4j9OJ6Lj2kK3j2Pj1J3KqQkqL7j5rJ6pkoj0J1J
6274A4pJ8lk3k4K9NknJoj4m%MNNKJ5rj6L5k0Lj2J2Nj5j1L5qj4J2j3JL1j8J6Rj8
6314A5J2k0kk2QmJ3J6j8rLrPOqk1J6j1jJ3j9M7JKk3PMnJ1Pkj2JJ8j4opK3QorK1
6356C1j7j2J5j6Pj0J2jj4%kJ0qjjlj0llRMJJ5npRRj0K2j8K%qR%J0j1Qj8J2j1J4
6398A0%noj2J9lollK4rj3rkK0ooOqmJ7moqMJL0j7jLjJQj5K2j3QQj2QNk5J8J1j2
6443A4rJ0k7J1j1oK3j6rJkRKK0Rk8Nj6NJ0J1Jmj5J2j4J0J3ljjpkj0K2J3Lk2K3
6482B4k3J2j1K1j5jLk1K6pk8J6j9J4plKJ3llJ6rj7MJ1J3%k6M7k5KOJKRnJj0j9
$$ plain form
6521 -9 16 -3 -5 -8 26 -8 -3 -10 4 20 -4 14 -13 -4 -14 -18 -10 -8 -25 -1 -30 -12 -11 -16 -18 -12 -16 -5 -16 -25 -12 1 -8 -4 27 23 13 -6 10
6560 10 -3 -8 1 6 8 15 14 -1 23 4 20 3 -5 -11 4 10 -27 -26 -18 -35 3 0 -4 -10 8 -27 9 -11 10 10 -23 -29 1 1 -28 -8 10 2 -21
6599 -21 48 -6 36 3 13 -3 -9 1 5 -4 8 2 10 15 7 9 -9 17 -7 -4 -22 -29 -23 -4 -23 -20 -21 11 -4 -14 8 4 -10 0 -30 -17 -6
6636 -6 8 -3 0 -2 -3 10 15 16 33 10 10 10 13 9 32 20 3 11 20 32 3 17 16 0 6 -18 -17 -5 -9 -17 -7 -18 -1 -14 -14 -11 3 -18 -25 4
6676 4 -7 -13 -23 -16 -2 2 0 -3 6 5 29 25 9 2 -1 4 -2 13 16 -7 7 3 -2 10 -13 -8 -23 -1 -4 -24 -11 -19 -7 -25 14 0 -15 -11 -8 -15 -9 -15
6718 -15 -2 -13 -10 -18 3 3 -6 16 20 16 4 7 33 23 0 6 -9 20 1 -3 4 -7 -4 4 10 14 14 2 0 -1 -7 -10 -3 -5 -28 -17 7 -6 -13 6 -9
6759 -9 2 2 -29 10 3 1 3 0 -7 2 33 -2 24 13 -4 22 34 12 -1 12 3 -16 4 -2 -3 -24 8 -3 6 2 -5 4 -17 -18 -28 -30 -6 -22 -6
6798 -6 5 -12 -5 -3 4 1 -8 -8 -11 -9 23 2 -10 13 3 26 4 14 32 16 0 36 8 2 4 2 0 -7 14 1 13 9 -5 2 -19 -7 -16 -18 -19 -20
$$ packed form
6521iK5j9klL4l4NpJ4J6k4J8k7Rj0mQKj7K4k9J8JnkOmJ1j1rJ3J3rML1mj0j9J6
6560A0j3nRNKPjj5K4j9J6j7qoJ5Ol7JQj7L8lmoJ8l5L6k0K1%l3oL0%k9K0J8qk3
6599b1O9n4M2l3J0j6oJ0MrJ2oQNqKj8K6k4Lj8pOJ9j9LjL2j5j0K2mj4J0l0J3J1
6636fJ4j1LkjJ3NJJ7k3%%LmK3j2j7QRJ2k9J4jj6Ok4JJ2mqJ0j1J7j3%LJ4k1pK9
6676Dj1oj0PJ4MklRjK4mj6plNoJ5Lk3J4mnJ2k3Nj5K2lk0J3qJ2j8L9j4j5MLpOo
6718a5J3j1LqK1%rK2Mmj2LK6j0k3Oj5K9j9mPj1LQOM%j2kjolPkk3J1K4j3pJ9j5
6759iJ1%l1L9pkKlpRL1l5K6j1j7K6J2k2j3J3rj9K0ojk1L2j1RmpRk1jj0kK4j6J6
6798fJ1j7PKPlr%lKL2k1j2K3j0K3k2J0J8j6j6L6k8oKkkpK1j3J2mj4Pk1J2rkjj
$$ plain form
6838 -20 -19 -17 6 5 -7 5 9 17 -16 -13 13 5 12 -7 4 8 8 15 14 1 -17 -1 17 1 6 -3 -11 6 2 -13 -1 7 15 -4 -11 1 -4 -21 -19 -27 -9
6879 -9 -19 -6 -3 3 -7 -24 -24 -13 -3 -19 7 -15 -9 -9 5 -2 -8 -5 3 12 -9 11 16 25 27 10 5 13 9 -13 3 6 -1 -4 9 4 -3 -20 0 -23 -15 -4
6921 -4 -9 -16 -21 2 -19 -20 -11 -6 13 -9 14 21 -21 -5 23 -6 20 -16 -14 19 11 14 18 17 37 13 21 16 -15 2 -15 -13 8 -29 -13 -1 -15 -14 -17
6960 -17 -2 -1 -28 -6 -20 -14 -23 -7 -11 -14 -13 -7 -12 -8 -1 7 12 8 -5 28 23 -3 3 7 6 -6 15 -6 15 7 16 -3 8 -3 -2 6 2 15 1 -20 -16 -13
7002 -13 0 17 -9 -23 -10 0 -8 -16 -14 -5 -9 -4 -8 -9 -5 12 5 7 -3 20 0 -8 1 4 7 18 15 8 14 14 31 0 4 3 19 -10 -13 -3 -24 -34 3
7043 3 -11 -15 -5 1 2 -17 -14 -8 -17 -3 -13 -11 -3 3 -1 -5 4 7 -8 3 8 -8 -9 14 -1 5 10 -2 10 23 7 4 20 15 14 2 -2 -23 -23 -10 -20 -5
7085 -5 -11 -4 4 -10 18 -7 -1 19 -12 -38 -21 -12 2 4 2 -18 -1 5 -11 10 12 26 8 18 8 7 -13 15 -11 15 -4 7 11 18 -2 1 -5 -17
7123 -17 -8 -9 -11 -8 -11 -18 -27 -8 -5 -4 -7 -6 -15 -9 5 -19 1 -9 -6 5 0 0 11 -24 3 -3 22 9 -4 25 -7 -11 -5 4 -3 -1 7 1 20 13 -12 -6 -3 6
$$ packed form
6838b0JKK3jj2J2MQl3LK6qPj9J1M%Pjj3j8J6J8j6NrqJ7mj5J2QQj9pJ2nj7KqJ8
6879ij0J3LOj0j7%J1J0j6K6k2O%J4poLQRk1K0NRKj7nQmk2J6LplJ3npj7K0k3QJ1
6921dnpnK3k1jRNJ9k2K3Pm2J6K8k9K6l6KL3qLMjK0k4Qnl1J7j7KK1l7J6J2j4Jl
6960a7J5Jk7K2j4OrJ6mlJOnMPQNmj3L3nk6OMjj2K1k1K1qRj9J1j1JQmJ3j4k1ML
7002a3J3J7k6j4J3J0qqKRmNmjMJ7pKj0K3k0qRLLJ1lpO%J7l1MjJ6k9lJ0k1j0L7
7043Cj4mJ0OJj9LOrJ4j0KQOmmRLj5J1Nj6jK3j5ONj2J2J3j6lJ6njj2mk1%J3j0J5
7085eoPQj4K8k5OK0l1k6J7RJ4Kkk0J7Oj6K1KJ4j8J0j0jk0K8k6K6j9J1MPk0Loj2
7123a7RjkLlprJ9LJlJrOJ4k4K0j0LJ1n%J1l5K7oK5j3j3K9l2mORpKQoJ9pk5OLR
$$ plain form
7167 6 -42 -17 -11 9 -10 -27 -37 -8 -10 4 -12 -16 5 -9 -1 -8 12 -3 -11 -12 0 -2 22 19 24 3 14 -22 -15 -6 1 -5 5 4 -1 8 15 15 8 -3 -24
7208 -24 -4 -9 -31 -12 -9 -27 -9 -11 -2 -4 -5 3 -4 -9 15 5 -14 -9 -10 -18 -6 0 23 3 4 -8 6 0 -4 -3 8 8 4 -2 -10 -12 1 -13 6 -13 -1
7249 -1 -8 4 -3 -3 3 -14 -24 -7 -5 -14 -15 -29 -7 7 -20 -24 1 -19 -14 -11 -7 -24 7 -5 1 -3 2 -11 11 25 14 6 16 -7 4 9 -2 -17 2
7288 2 4 -6 12 -15 11 -2 -6 1 -13 -43 -29 -33 -18 -15 -14 -1 -2 5 -15 -2 -3 9 -9 -9 -1 16 2 -18 4 15 29 22 17 8 -7 4 6 -6
7326 -6 -9 9 -4 4 15 9 9 4 9 16 2 -8 -19 -10 5 -22 -32 1 -24 -3 -11 -9 1 0 5 5 2 3 -6 -10 -17 19 -7 9 12 26 8 11 6 5 21 3
7368 3 1 19 5 4 10 -18 -4 -15 6 1 3 -24 6 27 -4 -11 -19 1 -27 -8 -9 -13 -15 -14 0 6 -1 0 7 18 -2 -6 12 14 21 16 11 3 2 9 32 12
7410 12 -14 -14 1 8 -1 -29 -18 -13 -3 -4 0 6 1 -2 -5 8 -24 -24 -13 -18 -13 -4 -15 2 -5 -6 -5 2 7 -6 -23 -11 -21 -22 7 -2 0 -11 9 22 8
7451 8 14 0 26 12 -6 -4 -30 -25 -5 -11 -16 -14 -4 -15 -16 -20 -27 -22 -29 -18 -37 -28 -26 -8 -20 -17 -11 -3 2 -16 -3 -19 -12 -6 1 13 8 -1 8 0 8 9 21 3
$$ packed form
7167Fm8K5OK0j9j7j0K9kJ4j6mK1j4QpK0j5qjJ2kK4lNk1J1l6PRPoJ0jnRP%pj1k1
7208b4K0nk2J9Lj8J8kRkjQpnK4j0j9NjqJ2OK3k0Jj2J4omJJ1%moqkJ3j4J9j9J2
7249apJ2p%Oj7j0J7Krjj4K2J4k7mK5k0NLMj7L1j2OmNj3K2J4j1qJ0k3J1Nj1j5J9
7288BKj0J8k7K6j3mPj4l0J4mJ5LJJ3jPk0J3jJ2j8%QJ7j4k0K2J1J4pnrj5J1Kj2
7326flJ8j3QJ1o%nNPj4j0j1RJ5k7j0L3k5K1qKJ0jN%lJrmpL6k6J6LJ4j8LnjJ6j8
7368CkJ8j4jOk8J4j1K1nKk7L0K1l1pqK0k8J9jmkJJ4OpJPJ1k0mJ8KPnnqjPK3k0
7410A2k6%J5Prk8J1NJ0jMOnllJ3l2%J1nNRj1J7pjJPNj3j7J2j0jK9rKj1K0J3j4
7451HOj4K6j4j8Kk6NK0onKJ0j1jmpNpJ1j9RKJ8j2LOQNj8J3j6POPJ2nrRqQJJ2j8
$$ plain form
7495 3 5 19 -8 -5 -9 1 -1 -13 2 -8 -19 -12 -3 -8 10 -5 -5 -36 -9 -28 -18 -33 -35 -24 -14 -19 -20 0 13 6 -11 11 -14 17 13 21 -7 -20
7533 -20 6 5 22 -10 28 28 23 -2 -12 -7 -10 20 -2 -3 -14 6 4 -31 -23 -2 -15 -13 -8 -33 -40 -25 -27 -25 -19 -20 -23 -10 11 -6 9 -4 8 0 5
7572 5 -9 1 -9 11 2 6 0 -14 1 -15 0 15 8 11 -20 -13 -13 2 -28 7 -10 3 6 -7 -3 10 -10 -20 -22 -26 -22 -18 8 -3 -1 14 2 -6
7610 -6 5 11 10 1 24 5 3 4 -3 3 -3 0 25 0 13 12 -5 6 13 12 -10 -22 -33 -32 7 -11 -11 -8 -14 -17 -17 0 -19 -13 -13 -11 -6 -23 -15 -9 9 -1 24
7653 24 20 12 13 26 11 0 11 -21 -11 0 23 15 27 4 16 6 4 -10 1 -27 2 -15 -24 -12 -20 -12 0 -2 -9 -6 -23 -23 -3 -14 -8 -20 0
7690 0 -6 -19 -37 -14 17 5 5 17 6 11 8 5 -4 -15 2 21 5 -12 -8 9 3 2 -8 -8 -11 -4 4 -24 -22 -6 -11 3 -1 0 -3 -9 -16 -5 -5 11 -14
7731 -14 -2 -5 -9 -1 7 32 7 9 14 12 32 -13 18 -15 6 10 -10 4 5 2 0 1 9 7 -2 -20 6 -3 -12 -17 -38 -12 -8 -6 -17 -23 -3 10 -13 11 -23
7772 -23 -19 -2 -20 -6 -9 -5 -25 10 -8 10 3 -3 -1 3 12 -7 -3 4 -5 -26 -21 -10 9 -4 22 1 -1 -9 -2 -14 -3 -14 -7 -1 -22 -25 -18 -26 -7 -37
$$ packed form
7495CKJ4k7LmJ0kj2J5j0j1PRnJ8j5%l1K7j9J0j5kJ1J0njK0J3pj7K2k5L1mQk8j3
7533b0K6jJ7l2L8%nk5j0NlL0k2jj1K0kl5QK1j3KNk5pJ5kKOjlJ3K1j7J5j3J2qN
7572Ej4J0j0K0rMoj4J5j6J5J5pLl1P%J5l0L5j7J3Lj3MJ3k0j0kmMMK6j1KJ5j2q
7610fJ1OjrK3j9kJpOoLK5k5J3jj7J1Pjk2j2j1JL9j8%Lol%J7j9O%KNj7QOJ8j0K5
7653B4mqJJ3j5j1J1l2J0J1K3qJ2k3J2j0kj4J1k8K9j7rJ2qQJ2kpLj7%K0j1Oj2K0
7690@oj3j8K3L1j2%J2j1Nllrj1J7J9j6j7MJ7ojj0%lPQk8KJ6nJ4mJlopJ1%J6k5
7731a4J2lmQQK5k5KNkK0m5L1l3K1Mk0J4JlkJQkrj8K6rrnk1K6MKj1oK0J3k3K4l4
7772b3MJ7j8J4lMk0L5j8J8poKMRj9MPrk1NJ1J9j3K6k1kqPj2J1j1POk1lPqJ9l0
$$ plain form
7812 -37 1 18 -6 -13 -19 -9 -34 2 7 -4 -14 13 -4 16 4 28 9 24 20 15 5 -17 -24 15 -15 16 -9 6 -12 0 -2 1 -25 -33 -19
7847 -19 -28 -31 -15 -9 -36 -6 -8 -12 -30 -2 11 0 -5 -19 -32 -10 -26 11 1 2 16 2 4 11 20 11 -11 10 1 -4 -8 -15 -5 10 15 -11 -17 -8 4
7886 4 -17 -12 -6 -16 4 -25 -20 -13 -11 -15 -17 -10 -10 7 -8 5 1 -10 -3 -20 -8 -32 -5 11 30 -4 14 9 9 11 4 1 2 -21 -27 -21 1 -7 6 -2 -7 -6
7928 -6 4 -12 -20 -21 -4 -24 -8 -32 -6 -21 2 1 -10 -29 -16 4 -9 -12 13 6 -17 -12 7 -14 -19 4 12 14 23 22 10 8 -8 -7 0 -2 -29 13
7966 13 -6 -10 -7 8 6 -11 -12 -8 -25 -16 -12 -20 -23 -17 -11 -1 1 -12 -10 8 -15 2 -5 -18 -4 1 -5 -1 -25 1 7 3 17 8 4 -7 8 19 6 10 -11
8007 -11 -9 6 -14 -14 -4 -17 0 -21 -20 -17 -18 -20 -43 -13 -26 -16 -32 -36 -4 -10 -29 9 6 -14 -5 -10 -6 -9 -10 0 10 -27 4 -4 9 -10 14 15
8045 15 11 -15 11 6 3 -4 -18 12 -16 -11 -3 -9 -7 6 -18 -18 -10 -8 -31 -32 -11 -46 -23 -23 -13 2 6 -15 19 -14 -10 -9 12 10 -3 3 -8 -10 -3 -5 -5
8086 -5 16 20 -11 17 0 -8 -20 20 -1 -13 -11 -27 6 -8 -12 -17 -9 9 -23 -35 -11 -29 -8 0 -23 -11 12 -8 -11 10 0 -19 1 22 -6
$$ packed form
7812c7L8J7k4poJ0k5L6Nj1j0K7j7K0j2K4j9J5mnj0k2pL9l0L1k5J5j8J2kLk6qJ4
7847a9rlJ6Ok7L0kmj8K8J3j1nj4j3K2j6L7j0JJ4j4KPRrk2K1rnmpJ0J5Nk6oRJ2
7886Dk1NOj0K0k9NPKmkP%J7j5J3mj1Pj7J2k4K7J6J9l4J8n%KplJk3oOK2qJ3qnJ
7928fJ0j6qjJ7k0J6k4K6j5K3jj1j9J3K0j3lK5pk3NJ9k1nK3QKRjj2kj6JPkk7M2
7966A3j9mLJ5kj7jMj7RMqlOOJ0Kj3KJ8k3J7pj3J4NoMk4K6OmJ4rmj1J5J1j3Mk1
8007a1KJ5k0%J0j3J7k1JLjkk3L0j3J0j6mL2oj9L8lk0RnMljJ0J0l7L1qJ3j9K4J
8045A5mk6K6nlpj4L0k8NQoKJ3k4%QKk3jK1l5K3%J0J5Mk1L4l3MJK1kj3Oj1kPk%
8086eK1Ml1K8j7qj2M0k1j2Kj6L3j4mnQJ8l2j2K4j8K1Qk3J2K3k0lK1j0j9K0K1k8
$$ plain form
8121 -6 -17 -15 -3 -3 -24 22 2 2 7 -3 -12 2 6 -5 -16 -22 -18 10 -8 -24 -18 -13 -22 -14 -30 -6 -14 -21 -7 -5 -11 -24 -18 -13 -16 -4 -5 -5 9 4 -16 -4
8163 -4 3 17 -2 5 -4 16 4 -6 -2 -2 24 -9 -10 10 10 -1 -10 -26 -15 -17 1 -14 -7 -18 -29 -11 -18 -21
$$ packed form
8121fj1KJ2%k1M6k0%Nj0rJ4Mj1j1oMK8j8j6ONrQj6K4qpJ4Koj3ONlJ2j%J4nk0J2
8163dPJ4j9PrK0j2j0M%K6l3jK0%j1rj6J1kJ8j5Pj1j1J8pl
8191b1
$$ Imaginary data points
##PAGE= N=2
##DATA TABLE= (X++(I..I)), XYDATA
$$ plain form
0 0 0 0 0 0 0 0 0 0 0 0 0 0 0 0 0 0 0 0 0 0 0 0 0 0 0 0 0 0 0 0 0 0 0 0 0 -16 32 -32 32 -32 32 -32 32 -32 32 -43 54 -64 64
49 64 -64 71 -82 96 -97 112 -126 136 -150 174 -192 214 -244 285 -340 409 -513 680 -979 1749
69 1749 -8245 -9196 1938 -5465 -7525 -3738 1239 1712 1473 -566 960 4034 4196 912 1406 1930 944
86 944 1174 1329 -1191 -1337 566 1058 -826 -1504 -175 506 31 98 -923 -1228 444 752 -854 -1347 -484
105 -484 223 144 -228 -1156 -1056 1065 964 -1361 -524 1070 267 56 520 -246 -304 1063 1274 -337 -581
124 -581 913 1290 616 -319 -682 919 1447 -729 -1292 445 747 -663 -1175 -70 11 -917 -404 131 -403
143 -403 -405 -25 245 368 -126 -286 407 994 257 -713 421 1295 -160 -444 608 303 -72 248 57 -287
163 -287 13 235 -239 -344 25 -260 -172 292 -402 -451 413 66 -427 64 213 -231 -104 464 33 -650 262
$$ packed form
0@%%%%%%%%%%%%%%%%%%%%%%%%%%%%%%%%%%%j6M8o4O4o4O4o4O4o4O4p5R7j18J28
49F4j28J35j53J78j93K09k38K62k86L24l66M06m58N29o25P49r22J193j659K728
69A749r994r51J1134p403k060L787M977M73k39k039J526L074J62l284M94N24r86
86I44K30J55k520j46J903M92j884o78J329O81m75O7j021l05J672L08j606m93Q63
105d84P07p9l72r28J00K121j01k325Q37J594q03k11M64p66n8J367K11j611k44
124e81J494L77o74r35l63J601N28k176n63J737L02j410n12J105Q1r28N13N35n34
143d03kL80K70J23m94j60O93N87p37r70J134Q74j455k84J052l05l75L20j91l44
163b87L00K22m74j05L69k85Q8M64o94m9Q64l47m93M91J49m44J27N68m31o83R12
$$ plain form
184 262 636 -466 -457 399 361 -187 -386 162 438 -15 -394 -169 601 512 -754 -283 1038 217 -820 -36
204 -36 675 199 -313 63 326 130 151 51 -1 356 -23 -188 442 26 -631 -60 489 -140 -793 -117 460
225 460 -241 -467 -53 -139 10 140 -198 -192 72 282 149 -155 -58 140 368 384 -296 -234 588 276 -217 60
247 60 98 -115 28 303 -179 -756 -20 526 -230 -681 -442 177 537 -401 -1056 7 824 43 -858 -186 741
268 741 198 -222 127 23 64 453 319 -29 -224 64 582 351 -413 -609 237 815 -330 -1066 2 531
288 531 -129 -451 -372 -99 147 185 -166 -549 12 575 106 -206 -131 17 530 434 -289 -230 364 584 126 -205
310 -205 -34 25 291 483 -398 -726 300 628 -169 -792 -371 469 322 -447 -654 -61 613 51 -662 -17
330 -17 361 -9 111 256 -113 -203 391 728 -112 -583 183 662 243 -397 -532 309 601 -250 -607 -88 284
$$ packed form
184B62L74j102RQ56l8n48j99N48K76m53l79K25P70q9j266M71J321q21j037P84
204c6P11m76n12L76K63j96K1j00n2L57l79j65O30m16o57N71N49o29o53O76N77
225D60p01k26M14q6J49J30l38OK64K10j33l04R7J98K28J6o80O2Q22l12m93K77
247F0L8k13J43K75m82n77P36N46p56m51K39O19L60r38o55J063Q17p81r01O72R27
268G41n43m20L49j04M1L89j34l48j95K88N18k31p64j96Q46N78j145p36J068N29
288E31o60l22P9K73K46L8l51l83N61N63m69l12P5J48N13r6p23N9N94K20m58l31
310b05J71N9K66J92q81l28J026L28p97o23M21Q40j47p69k07N93O74n62p13O45
330a7L78l70J20J45l69r0N94L37q40m71P66M79m19o40j35Q41K92q51l57N19L72
$$ plain form
351 284 8 -300 -140 -128 -117 291 1 -478 -93 270 165 -30 -188 51 326 346 35 -242 156 399 106
372 106 17 -85 -170 304 371 -297 -482 131 512 -143 -588 -38 286 -7 -215 -257 82 192 -170 -107 106 -66
394 -66 -169 103 300 -139 -402 379 502 -300 -256 286 340 5 -204 55 285 102 -160 -195 155 145 -364 -159
416 -159 216 -147 -295 48 70 -112 -203 55 109 -37 28 -4 9 209 27 -120 113 106 16 21 -23 -42 -15 76 -98
441 -98 -303 133 172 -412 -230 261 46 -306 -205 241 147 -214 -118 160 253 53 -224 107 376 -94 -185 279
463 279 157 -203 -124 263 64 -394 -65 224 -15 -262 -246 36 254 -200 -444 44 278 -49 -317 13 243
484 243 -39 1 237 9 32 309 230 16 -37 146 264 91 -45 -113 38 238 -88 -281 -79 -80 -45 -14 -356
507 -356 -440 1 247 -226 -604 -12 437 -20 -250 -42 193 326 107 -55 157 261 194 150 189 47 -117 250
$$ packed form
351B84k76l08J60J2J1M08k90m79L85L63j05j95j58K39K75K0l11k77L98K43k93
372A06q9j02q5M74O7o68j85O13L81o55m45N50L24k93k08m2L39J10l62O3K13j72
394f6j03K72J97m39k63P81J23q02M4N42N4l35k09K59K30j83k62l5L50j0n09K05
416a59L75l63j48L43K2j82r1K58N4j46O5l2J3K00j82j47K33pr0Nm4j9K7R1j74
441i8k05M36L9n84J82M91k15l52J01M46r4l61R6K78R3k00k77L31K69m70r1M64
463B79j22l60P9L87j99m58L29K89k39k47J6K82K18m54k44M88K34l27k68L30K30
484B43k82M0K36k28K3K77p9k14n3J83J18j73j36o8J51K00l26j93K02jL5L1l42
507c56q4M41K46m73l78N92M49m57k30K08K35J33k19j62K12J04o7m4L9j42j64L67
$$ plain form
529 250 492 -193 -480 174 454 -43 -554 -282 284 128 -359 -485 -124 202 -119 -435 -133 -35 -81 127 41
550 41 -208 -86 357 427 -97 -143 305 384 259 14 -187 193 417 104 -203 -181 146 254 -32 -328 -353 25
572 25 281 -276 -602 -141 156 -33 -280 -255 -9 93 91 39 -114 11 273 292 187 -149 -95 498 456 -219 -358
595 -358 255 548 -47 -403 36 242 63 -105 -213 -55 32 -90 -64 -141 -260 -109 152 71 -352 -318 301 258
617 258 -202 -164 68 218 191 -42 -58 111 244 193 -109 -72 113 112 77 -64 -223 60 186 -82 -226 -48 142
640 142 -48 -105 45 -111 -155 149 77 -146 -144 17 249 57 -249 -72 273 229 -204 -238 268 234 -222 -71 175
663 175 51 -98 -26 129 2 -140 44 139 -4 -98 -80 159 132 -193 -91 166 93 -116 -86 112 75 -94 32
686 32 64 -52 30 12 -30 50 -46 -51 15 16 -10 -41 7 1 -42 107 41 -157 68 211 -38 -115 71 183 11 -112 55
$$ packed form
529B50K42o85k87O54K80m97n11K72N66j56m87j26L61L26l21l16L02R8m6K08q6
550D1k49J22M43P0n24m6M48P9j25k45k01L80K24l13l07K2L27J08k86k96k5L78
572B5K56n57l26M61K97j89k47K5K46J02kn2j53J25K62J9j05l36N4N93m2o75j39
595c58O13K93n95l56M39K06j79j68j08J58Q7j22K6p7j19J51K61q1m23L4O19m3
617B58m60L8K32J50k7k33j6J69J33n1l02L7J85jl5j41j59K83J26k68j44J78J90
640A42j90n7J50j56m4L04p2k23KJ61K32j92l06J77L45m4m33l4N06l4m56J51K46
663A75j24j49P2J55j27j42J84R5j43r4J8K39k7l25J02K57p3k09L0J98l7j69J26
686C2L2j16Q2j8m2Q0r6nO6Jk6l1M8om3J49o6j98K25J43k49p7J86J12j72j23J67
$$ plain form
713 55 97 -17 3 17 52 -41 -174 43 135 -156 -264 35 191 -98 -368 6 182 -72 -156 -59 56 104 -46 -28
737 -28 98 67 42 90 146 -1 -107 178 260 -130 -184 141 185 -18 -210 -97 95 52 -69 -179 -132 74 27 -93
761 -93 -122 -118 79 159 -95 -208 28 230 109 -148 0 159 68 105 88 -73 -23 191 159 -71 -250 -4 221 27
785 27 -247 -301 121 262 -178 -339 14 155 11 -128 -74 13 9 92 87 -112 -54 128 200 99 -229 -81 353 215
809 215 -181 -222 133 301 -18 -187 -54 17 97 23 -210 -165 27 130 -4 -209 -144 78 128 -21 -208 -70 195
832 195 99 -46 -41 -32 96 186 42 -121 -101 199 253 -102 -204 30 197 87 -218 -249 138 150 -127 -198 -29 75
856 75 -25 0 38 -159 -77 201 126 -144 -140 104 305 37 -235 -18 224 212 -124 -160 135 141 -66 -28 -38 -66 44
881 44 27 -61 -160 -82 102 -9 -109 -99 -38 77 45 -122 -48 62 47 27 -16 -21 26 92 125 -111 -113 168 134 -95 -112
$$ packed form
713E5M2j14K0J4L5r3j33K17R2k91j08K99J56k89k70L74J76k54q4R7J15M8j50J8
737b8J26l1k5M8N6j47j06K85Q2l90n4L25M4k03j92J13J92m3j21j10M7K06m7j20
761i3k9MJ97Q0k54j13K36K02j21k57J48J59r1L7j7j61N0K14l2k30j79K46K25j94
785B7k74n4M22J41m40j61L53J41j44j39N4Q7mQ3nj99N8J82P2j01l28J48M34j38
809B15l96m1L55J68l19j69J33P1Q0p4k33M5J92J03j34k05O5K22N0j49j87J38K65
832A95r6j45NRJ28R0j44j63K0L00N4l55j02K34J67j10l05l1L87J2k77p1J69J04
856G5j00K5L8j97Q2K78p5k70MK44K01k68k72K17K42j2l36l6K95Ok07L8j0k8J10
881D4j7q8r9P8J84j11j00J0O1J15l2j67P4J10j5k0m3nM7O6L3k36kK81l4k29j7
$$ plain form
908 -112 16 129 -11 -122 -20 37 -21 -66 -17 49 -101 -142 86 76 -122 -95 109 150 -55 -108 136 128 -43 -28 44
933 44 85 2 -99 43 71 -73 -96 2 32 -64 -123 36 29 -105 -30 -22 10 32 -42 9 16 11 58 63 28 43 22 129 110 -44
963 -44 52 79 19 47 40 4 -43 10 101 -83 -166 16 91 -52 -173 -121 86 68 -162 -138 53 75 -35 -72 79 41 -40
990 -40 115 96 -27 -43 124 180 32 -116 24 186 85 -96 -169 90 168 -102 -170 -30 20 -6 -49 -94 -112 -45 65
1015 65 -13 -159 -63 75 101 -2 -133 21 188 70 -5 -24 42 160 107 16 -60 -37 187 158 -147 -173 79 146 -28
1040 -28 -209 -80 81 2 -88 -123 -39 35 -47 -1 -22 -115 -8 171 78 -138 -121 166 243 -66 -155 48 199 117 -137
1065 -137 -120 108 101 -32 -108 -65 14 33 26 -44 -177 -27 166 10 -159 -88 64 120 -49 -130 -37 85 121 -36 -95
1090 -95 21 76 78 31 -118 -50 119 60 -102 -133 39 102 -47 -92 -11 -24 41 -7 -87 -58 -41 54 71 -78 -119 -14 143
$$ packed form
908a12J28J13j40j11J02N7n8m5M9O6j50m1K28j0j98K7K04M1k05n3K44qj71J5P2
933D4M1q3j01J42K8j44k3R8L0r6n9J59pj34P5QL2K2p4N1PnM7Nl5J5k1J07j9j54
963d4R6K7o0K8pl6m7N3R1j84q3J82P5j43j21N2K07j8k30K4J91K2j10l7J51l8q1
990d0J55j9j23j6J67N6j48j48J40J62j01j81p3K59P8k70o8J40N0k6m3m5j8O7J10
1015F5p8j46R6J38K6j03j31J54J67j18p5j9O6J18n3r1p6K3K24k9l05k6K52O7j74
1040b8j81J29J61p9r0l5Q4P4q2M6k1r3J07J79r3k16J7K87P7l09q9K03J51q2k54
1065a37J7K28pj33p6M3P9J9pp0j33J50J93j56j69P1J52N6j69q1R3J22L6j57n9
1090i5J16N5Km7j49O8J69n9j62l1J72O3j49m5Q1j3O5m8q0K9J7R5J7j49m1J05J57
$$ plain form
1117 143 106 -155 -110 160 110 -100 -80 42 123 0 -56 -19 -1 4 20 -14 -6 -71 -29 100 -37 -137 -24 109 33 -91
1143 -91 -62 96 62 -19 -3 1 47 64 21 12 -15 23 62 2 -33 -41 20 36 -46 -66 12 -13 -41 16 -7 -27 -22 29 64 -43 -38 37
1175 37 55 31 -48 -1 131 46 -61 27 80 -2 -59 -16 79 -44 -106 35 46 -51 -77 -47 51 17 -94 -42 23 -3 -33 -28
1203 -28 46 -13 -29 82 24 -46 30 57 53 -1 -37 36 52 24 -3 -44 22 30 -45 -29 -22 -53 36 -12 -97 -72 7 56 -69 -88 17
1234 17 41 -4 -29 -27 30 49 12 85 35 -16 58 94 60 -72 -54 134 86 -115 -99 53 95 -46 -125 -22 33 -8 -41 -76
1262 -76 -38 9 -25 27 -26 -93 16 97 -8 -82 -44 122 95 -60 -64 24 100 70 -41 -61 24 58 22 -46 -103 -30 50 5
1290 5 -95 -138 50 101 -58 -82 -22 36 34 -14 -20 -41 -1 84 58 -64 -39 42 109 26 -124 -4 115 41 -97 -88 39 94
1318 94 -47 -60 -33 -27 39 -4 -63 -59 -57 54 50 -76 -85 42 126 63 -125 -24 120 72 -20 -40 17 88 63 -25 -45 -16 68
$$ packed form
1117A43l7k61M5K70n0k10K0J22Q1j23n6L7J8NJ6l4Qo5M2J29j37j00J13J33p6j24
1143i1K9J58l4q1J6MM6J7m3rk7L8L9o0l5qO1J6q2k0P8k5k8N7k3k0NN1L5j07NP5
1175C7J8k4p9M7J32q5j07Q8N3q2n7M3R5j23o2J41J1r7k6L0R8l4j11N2O5k6l0N
1203b8P4n9j6J11n8p0P6K7mn4l6P3J6k8k7m1O6Qp5J6Pl1Q9m8q5K5P9M9j25j9J05
1234A7K4m5k5KN7J9l7P3n0n1P4L6l4j32J8J88m8k01J6J52M2j41p9J03N5m1l3l5
1262g6L8M7l4N2n3o7J09Q1j05p4L8J66k7j55mQ8P6l0j11k0Q5L4l6o8n7P3Q0m5
1290Ej00m3J88N1j59k4O0N8km8ok1M0Q5k6j22K5Q1O7q3j50J20J19p4j38RJ27N5
1318I4j41j3K7OO6m3n9MKJ11mj26rJ27Q4o3j88J01J44m8r2k0N7P1k5q8k0K9Q4
$$ plain form
1347 68 46 -46 -52 -27 24 37 -81 -66 3 8 -15 -56 -27 -2 14 63 30 -74 10 90 73 -19 -63 65 105 -4 -66 -1 65
1376 65 55 -72 -29 27 -13 -19 -23 -63 -84 -6 30 0 -107 -48 65 29 -50 -82 18 104 -3 -54 23 37 14 19 17 39 -15 -23
1406 -23 55 1 -9 4 8 28 -29 -34 -9 -4 0 -27 -40 -24 -16 -3 0 -43 -3 55 18 -26 -6 37 55 -19 -19 49 19 24 -4 19 32 -29
1440 -29 -15 22 -9 -49 -37 39 4 -86 -48 21 3 -49 -21 -3 3 -20 -8 45 -15 -41 48 73 28 -14 19 104 25 -55 -6 44 42
1471 42 -7 -37 12 -14 -20 -19 -54 -31 7 -12 -20 -67 -40 25 7 -55 -39 8 28 -8 -16 26 5 18 44 30 -35 3 25 51 -18 -66
1503 -66 4 74 6 -58 -50 77 20 -53 -17 -1 -15 11 -9 -24 -48 -13 84 4 -53 -39 38 66 -13 -90 34 93 41 -24 -41 41
1533 41 71 -20 -26 4 -9 32 2 -40 -46 -23 39 -7 -63 -44 -2 43 -10 -89 5 39 11 2 -15 -48 41 66 39 -46 -37 77 71 -18
1565 -18 -29 -6 84 22 -37 -22 5 27 21 -39 -59 -37 24 42 -44 -92 4 71 2 -54 -71 74 84 -6 -31 -5 67 45 -12 -21 10
$$ packed form
1347F8k2r2oK5N1J3j18J5O9Nk3m1K9K5J6M9l3j04Q4Q0j7r2m4J28M0j09o2O5O6
1376F5j0j27M3N6m0omm0k1P8L6l0j07N9J13l6p9l2J00Q6j07n1P7J4k3NkK2n4q
1406b3P8n4j0J3MK0n7nK5NMk7j3J6QJ3Lm3M0N8l7m4K0M3J8p4%O8l0Nk8K3J3o1
1440b9J4L7l1m0J2P6l5r0L8O9j8n2K8J8Ok3J2N3o0k6Q9K5m5m2L3Q5p9q0M9N0k
1471D2m9l0M9k6oJl5K3L8j9qm7K7O5j8o2J6M7K0l6qM2k1J3K6j4o5L8K2K6o9m8
1503f6P0P0o8o4QJ27n7p3L6J6j4K6k0j5k4L5R7q0n7J4P7K8p9p7J24N9n2o5j7Q2
1533D1L0r1oL0j3M1l0m2oK3O2m6n6J9M2M5n3p9R4L4k8rj7l3Q9K5k7q5RJ14oq9
1565a8j1K3R0o2n9J5K7K2oo0k0K2O1J8q6m8R6O7o9n6j7J45J0r0k5K6P2k2n7rL1
$$ plain form
1596 10 -31 10 -11 -81 -25 9 22 -9 -65 -3 45 14 -27 -48 -15 43 22 -4 -13 -11 47 35 9 -19 11 74 12 -52 2 45 38 13
1628 13 -18 -17 32 -13 -2 -45 -38 2 0 -6 -28 -36 3 44 -37 -49 -2 40 18 -27 -15 34 -8 14 1 0 13 -6 23 17 -29 -29 13 31
1662 31 -19 -73 11 40 -17 -6 -26 9 -1 -26 -21 -14 -30 11 30 -11 -15 -11 35 26 -1 -11 30 11 -8 -14 13 16 -13 -15 0 -35 -25 0
1696 0 6 -1 -41 -9 25 -2 -45 2 -1 16 -27 -19 15 -12 15 58 -9 -11 8 43 26 -10 -39 28 31 -12 -40 -28 25 -10 -24 -11 -22 -18
1730 -18 18 -9 -44 -41 8 39 -31 -21 7 29 43 -36 -43 24 29 25 -4 -17 16 32 13 6 -11 6 46 -3 -26 -46 -9 33 -39 -54 -22
1763 -22 -4 19 -12 -29 -19 -12 14 33 -47 -48 16 56 18 -47 -2 67 35 -21 -30 14 35 30 -40 9 26 7 25 -26 -40 -21 16 22 -29
1796 -29 -45 27 43 6 -52 -15 8 50 9 -2 3 29 50 18 -17 -19 15 74 -1 -36 -21 30 26 -42 -44 -5 7 -10 -16 -47 -5 41 9
1829 9 -15 -39 -22 39 34 -41 -42 11 74 15 -23 4 46 47 14 -32 10 25 7 22 -38 -22 31 12 15 -49 -51 24 31 -31 -47 -31 33 18
$$ packed form
1596A0m1M1k1p0N6L4J3l1n6O2M8l1m1k1L3N8k1k6rKN8j2k6k8L0O3o2o4N4M3pk5
1628A3l1JM9m5J1m3PM0kok2qL9M1q1j2M7M2k2m5J2M9m2K2j3jJ3j9K9om6%M2J8
1662C1n0n4Q4K9n7J1k0L5j0k5NPj6M1J9m1mMM6rk7j0M1j9j9oK7Lk9kJ5l5J0K5
1696@Opm0L2L4k7m3M7lJ7m3QL4k7K7M3o7kJ9L5j7l6k9O7Lm3k8J2N3l5j4J3j1M
1730a8L6k7l5LM9L1p0J0K8K2J4p9pO7Nmk9j3L3J6j9pj7J7M0m9k3k0L7M2p2j5L2
1763b2J8K3l1j7J0PK6J9q0jO4M0l8o5M5O9l2n6rM4K1np0M9J7j9J8n1j4J9L7On1
1796b9j6P2J6l7n8L7K3M2m1j1NK6K1l2l5kL4N9p5l5J5N1mo8kL9J2j7ol1M2M6l2
1829Ik4k4J7O1np5jN3O3n9l8K7M2Jl3m6M2J5j8J5o0J6N3j9Lo4kP5Po2j6J6O4j5
$$ plain form
1863 18 -60 -10 1 21 40 -29 -15 15 51 33 23 -27 32 41 16 -15 -8 21 22 -8 -1 -15 -11 23 -15 -37 -54 -18 22 11 -36 -21 17
1896 17 42 27 -35 4 39 14 22 30 1 6 19 13 -3 -7 -1 27 -2 -22 -16 25 10 -24 -8 -2 18 1 -10 4 -14 6 27 11 -5 -4 13
1931 13 24 3 -8 18 24 22 5 1 5 32 12 15 -20 -27 19 12 -10 -6 -9 -3 9 -44 21 13 -5 21 -8 -13 8 16 38 22 6 -10 22 44 20
1968 20 -28 13 19 -7 -19 -5 10 19 -16 -28 -21 0 0 -22 -11 -16 -18 -2 -7 -39 -33 24 26 -10 -11 -6 23 6 24 8 30 35 15 12 -8 13 16
2005 16 39 2 -21 3 1 -8 -28 -13 3 16 -18 -27 -14 27 7 -1 -20 3 8 38 25 -18 -11 9 49 -14 -29 2 32 9 -40 -28 4
2038 4 6 7 5 -21 -8 19 46 0 -31 -9 21 24 -22 -12 12 47 6 4 -8 8 34 -1 -8 -8 32 21 5 -28 -22 18 5 -6 -27 -22 42
2073 42 16 -25 -31 -24 26 7 -45 -14 -26 23 30 -18 -13 8 44 29 6 15 34 49 13 -14 -2 11 18 -18 -6 0 -3 15 -14 -11 -40 -12 21
2108 21 -23 -33 -12 6 6 -26 -22 17 10 4 11 -18 -13 40 24 21 -18 9 19 13 -9 -14 -1 31 3 -23 -31 -12 16 -8 -6 8 15 4 15 -7
$$ packed form
1863A8p8N0J1K0J9o9J4L0L6j8j0n0N9Rk5l1PK9Jl0Pj4ML4l8k2j7L6M0j1m7J5L8
1896A7K5j5o2L9L5k5QQk9NJ3oj6mOK8k9k0OM1j5l4J6OK0j7j1J4j8K0K1j6j6JJ7
1931A3J1k1j1K6Okj7mMK7k0Ll5pM6pk2MlOJ2n3O5qj8K6k9nK1QK2j6j6j6L2K2k4
1968B0m8M1Ok6j2J4J5Rl5j2PK1%k2J1nkJ6nl2ON7Kl6jNK9j7J8j6K2Nk0lk0K1L
2005A6K3l7k3K4krk0J5J6J3l4rJ3M1k0qj9K3NL0j3m3PK0M0o3j5L1L0k3m9J2L2
2038DKJkk6J3K7K7m6l1K2L0Lm6J0K4L5m1kj2J6K6l5p%M0j1j6l3OM0j3j1k1NO4
2073D2k6m1oPN0j9n2L1j2M9Pm8NK1L6j5k3RJ9J5l6k7J2J3Pl6J2OlJ8k9Lk9K8L3
2108B1m4j0K1J8%l2ML9poPk9NN3j6ll9K7J0ok2nJ3L2k8k6qJ9K8k4KJ4Pj1J1k2
$$ plain form
2144 -7 7 20 9 16 0 -15 8 10 6 12 1 14 8 -6 -1 -6 -12 18 7 -17 5 1 14 -10 -26 5 29 10 -2 -9 -10 10 -18 8 12 -24 19
2181 19 3 17 5 -1 28 20 -2 6 18 6 8 -3 -19 -15 -12 -17 -12 -13 -18 -6 13 -31 -37 13 8 1 17 4 4 7 19 11 -4 -2 41 16 -5 -3 3 17
2221 17 6 -11 -10 11 17 -2 -24 18 14 -17 -6 -13 -26 3 -5 -7 -35 -21 28 14 -11 -33 0 39 18 -5 -12 16 12 17 -10 -4 32 13 23
2256 23 -3 -29 0 15 17 14 -15 6 20 11 -23 -24 -4 7 -29 -15 -10 11 17 6 -1 -5 5 18 18 -1 1 42 19 10 -16 9 37 9 7 -10
2292 -10 -2 6 17 -19 -21 -20 13 15 -18 -33 5 21 16 6 0 35 39 41 -5 -7 20 52 -3 -7 -8 12 17 -15 -17 4 18 -2 -16 -30 -1 -1 -6 -15 -33
2331 -33 3 29 22 3 -1 0 28 17 5 0 14 22 12 -1 16 6 29 13 19 6 23 20 -18 -8 -15 5 17 21 -6 -22 12 -10 -5 2 -38 18
2367 18 34 -8 10 8 21 21 0 -1 -16 15 34 4 -21 13 46 17 -28 -4 10 7 25 -18 -1 -3 -7 -9 -18 0 21 10 -3 2 -4 -4 16 8
2403 8 -5 3 1 12 15 -1 12 7 16 4 4 -2 -11 17 -7 -19 -8 -12 11 -19 6 -14 13 17 0 13 6 21 19 33 6 32 4 20 16 14 1 29
$$ packed form
2144gJ4J3j1Pj6j5K3KmOj1J3oj4NnoL0j1k4K2mJ3k4j6L1K4j9j2pjK0k8K6Ml6M3
2181A9j6J4j2oK9qk2QJ2j2Kj1j6MLnNjnJ2J9m4oN0npJ6j3%LJ2qj5KM3k5k1KOJ4
2221A7j1j7JK1Oj9k2M2ml1J1pj3K9qkk8J4M9j4k5k2L3L9k1k3pK8mNk7OL6j9J0
2256B3k6k6K9J5Klk9K1J4rl4jK0J1l6J4NK1Oj1pmJ0J3%j9KM1k3rk6K5K8k8kj7
2292a0QQJ1l6kJL3Kl3j5L8J6nj0oL5MKm6kK7L2n5mjK0Nl2kK1J4k0j4j4K9%nrj8
2331c3L6K6pj9mJK8j1j2nJ4Qj0j3J7j0K3j6Oj3J7ll8J0pK0J2Mk7j6L4k2NPm0N6
2367A8J6m2J8kJ3%k1jj5L1J9l0k5L4L3k9m5K4J4lJ8m3J7kmkrJ8K1j1j3No%K0q
2403Hj3QkJ1Lj6J3nRj2%orK8k4j2J1mK3l0K5k0K7Mj7J3pJ5kJ4k7K6k8J6mkj3K8
$$ plain form
2441 29 -8 -6 8 -12 25 -6 -11 -13 2 -8 -2 -13 5 17 31 16 3 -15 12 -6 -2 -23 24 14 15 9 2 -1 28 23 21 -11 -14 7 21 -7
2477 -7 -3 2 37 10 -5 5 5 15 1 -12 -8 6 13 16 -16 8 13 24 27 6 0 9 25 22 31 21 22 16 10 17 8 -3 14 10 -14 -5 13 23 7 -24
2517 -24 -6 1 24 -21 4 -1 13 1 -3 -4 6 38 -10 33 -4 4 40 7 -4 -1 0 17 0 -13 -4 6 7 14 8 -4 13 27 8 8 -18 9
2553 9 28 21 -6 11 21 21 25 12 11 14 12 1 -25 -8 -5 7 6 -9 -16 17 11 1 -13 -2 3 4 11 -18 -5 17 6 1 -5 1 20 25 -4 13 5 34
2593 34 33 2 10 4 30 15 2 -4 23 26 17 11 -8 10 4 15 12 -1 -6 0 -14 -11 -2 17 32 6 5 12 31 31 23 4 -2 26 29 20 11 4 10 19 -5 19
2635 19 -5 18 24 -11 3 11 12 -6 6 11 2 6 28 -12 7 2 39 4 -1 -15 1 17 10 10 -10 32 8 -2 9 -9 1 13 16 1 -8 9
2671 9 45 -7 -22 25 21 6 15 6 -7 8 9 3 26 5 23 18 18 -7 5 27 13 -7 1 -8 -3 11 2 4 4 12 27 3 5 14 -6 9 -3 6 -8
2710 -8 17 13 4 12 25 2 27 10 3 19 3 24 10 9 31 0 8 -2 -4 -8 16 -29 9 -12 -4 4 -2 -17 8 13 11 -9 1 -11 9 -1 -10 8
$$ packed form
2441B9l7KJ4k0L7l1nkJ5j0Oj1J8J2J4j5j3j8K7j8Mk1M7j0JoplK9nkl2lK1J4k8
2477gMNL5k7j5J0%J0j4j3MJ4PLl2K4NJ1Lk1oRJ6lRj0JooPrj1J7mk4RJ8J0j6l1
2517b4J8PK3m5K5nJ4j2mjJ0L2m8M3l7QL6l3j1LJJ7j7j3RJ0JPoj2J7J4j9%k6K7
2553IJ9pk7J7J0%Mj3jLkj1k6J7LJ2jj5pL3oj0j4J1NJPk9J3K2j1noOJ9Nk9J7qK9
2593C4jl1QoK6j5j3oK7Lroj9J8oJ1lj3nOj4LRJ9J5k6jPJ9%qj9oK8LrrpORk4K4
2635A9k4K3Ol5J4QJj8J2NrMK2m0J9nL7l5nj4J6J6p%k0M2k4j0J1j8J0J2Lj5rJ7
2671IL6n2j5M7mj5Rrj3J5JoK3k1J8n%k5J2K2j4k0QrNJ4rK%QJ5k4KRk0J5j2Rj4
2710hK5mrQJ3k3K5j7pJ6j6K1j4jK2l1Qj0kmK4m5L8k1QQoj5K5Nkk0J0j2K0j0rJ8
$$ plain form
2748 8 6 29 7 0 0 7 -12 28 -2 -6 -4 -8 5 -15 -1 14 -1 7 1 -19 -1 19 -4 -5 13 26 13 13 3 8 8 20 10 -1 -1 18 24 13
2786 13 6 0 4 -5 -8 -14 8 -3 3 3 -15 1 9 10 0 -4 0 6 8 -2 16 20 9 31 6 25 30 24 10 15 -6 8 13 8 -7 -21 13 17 4 -4 3 5
2828 5 12 6 -36 -7 20 -12 -20 -1 -6 -3 13 7 5 9 28 25 20 7 1 7 14 -4 -20 19 18 1 -7 14 10 10 13 -3 9 -12 14 0 -7 20 6 3 6
2869 6 -8 7 -7 -10 9 -7 -13 25 18 22 -8 -12 28 33 2 17 22 27 14 -8 -14 -11 17 14 14 -2 11 1 1 -9 -7 0 2 5 17 -5 17 26 17 8 -2
2910 -2 17 6 -11 12 2 23 10 17 9 -10 21 6 2 -2 17 28 -6 -3 9 11 24 39 20 24 22 27 9 13 18 6 31 7 7 5 12 6 -2 -9 -16 -6
2950 -6 2 -3 -18 -13 -10 8 -1 14 -21 4 9 -5 -6 17 11 18 13 -5 12 4 17 -1 3 6 0 28 6 4 21 10 20 19 15 -17 1 2 15 5 -8 -4
2990 -4 7 -8 17 -4 -5 12 10 25 13 8 11 3 25 -12 5 13 1 14 13 23 -2 -14 8 0 0 -2 -4 -1 -17 2 -5 -14 4 18 16 11 24 -1 -1
3029 -1 -13 19 -6 -9 8 -11 4 -8 2 14 -2 1 -26 18 -8 2 -14 9 -1 -8 -11 2 -6 26 -5 9 15 12 16 15 24 5 13 25 13 1
$$ packed form
2748HkK3k2p%Pj9M0l0mKmJ3k0J4J5j5Qok0J8K0k3jJ8J3j3%j0N%J2j0j1%J9Oj1
2786A3poMrloK2j1O%j8J6QJj0mMOKj0J8Mj1K2k5J9Noj4Nk1J4Nnj5j4L4Mj3qPK
2828EPom2K9K7l2qJ9nLJ6okMJ9lnj3oOPj8j6L9jj7qK1m%Lj6J2k1K6j4pK7j4lL
2869Fj4J5j4lJ9j6oL8pMl0mM0Nl1J5NNj3k2oLK8l%j6J3j0%j0KPKLJ2k2K2Rrrj0
2910bJ9j1j7K3j0K1j3Pqj9L1j5mmJ9J1l4LJ2KJ3J5j9MkNj8MNj2K5k4%kPoqppJ0
2950fQnj5NLJ8rJ5l5K5Nj4jK3oPnj8J7qJ3j8MLoK8k2kJ7j1J0jml2J8JJ3j0j3M
2990dJ1j5K5k1jJ7kJ5j2nLqK2l7J7Qj2J3jJ0k5j2K2q%kkLj6J9prJ8J4knJ3k5%
3029aj2L2k5lJ7j9J5j2J0J2j6Lk7M4k6J0j6K3j0plJ3qL2l1J4OlMjRj9QJ2j2j2
$$ plain form
3065 1 -3 8 -7 6 0 8 -27 -13 5 -8 8 -14 -10 2 -3 -13 -10 9 0 -6 5 -10 -1 -7 11 -12 -10 9 10 17 20 16 -10 13 5 5 15 12 25 -2
3105 -2 -3 -2 1 3 -2 7 1 -12 -2 -14 -23 15 4 -4 -18 -7 15 -5 6 17 21 20 18 12 -10 -19 15 15 3 -8 1 7 7 -22 1 -8 20 -12 1 2 9
3146 9 16 6 -3 1 5 2 8 -4 -2 -13 -13 -1 -3 5 2 -3 -3 5 3 15 2 -6 -19 -7 -6 5 -18 3 -5 7 7 -11 -6 -5 19 17 5 15 28 6 16 16
3188 16 2 -6 14 0 21 -7 24 20 -2 2 -4 -13 15 -9 -10 9 2 -4 -4 -20 1 9 -8 3 -6 16 19 -1 12 7 14 15 4 23 15 1 17 18 9
3227 9 6 -4 19 10 11 1 -6 -10 -7 6 -8 -3 17 13 -9 0 5 -9 17 2 -3 -26 16 9 31 -8 14 27 -4 -11 0 6 13 20 4 -1 -11 -11 2 11
3267 11 10 14 -6 27 1 -20 5 9 44 7 1 -1 14 9 -17 2 -15 16 6 7 -17 -12 8 7 -17 2 21 19 -8 -8 -2 3 24 9 14 18 0 -1
3305 -1 8 -15 -16 4 25 17 -7 20 31 3 -4 13 4 1 10 9 3 -1 0 -3 0 -10 7 -10 6 4 -8 -2 3 -7 13 -7 15 -1 -6 9 0 44 25 22
3345 22 37 10 28 18 2 26 -11 12 36 -2 3 26 15 17 4 -1 14 -8 9 -14 -11 2 16 -11 -15 5 7 18 8 -11 -2 -1 -13 0
$$ packed form
3065AmJ1j5J3oQl5J4J8j3J6k2MJ2nj0LJ9roJ1j5RoJ8k3KJ9JPLmk6K3q%J0lJ3k7
3105bjJLKnRoj3J0j2rL8j1qj4J1K2k0J1J1Mjkok2rL4%j2j1RO%k9K3rK8l2J3JP
3146IPj0rMMlOj2Kj1%J2kQln%QkJ2j3qj3J2JJ1k3K1qJ2%j8NJK4kj2J0J3k2J0%
3188A6j4qK0j4K1k8L1mk2MorK8k4jJ9po%j6K1Qj7J1rK2Lk0J3nPJj1J9qj4J6Jr
3227Ilj0K3rJj0pmLJ3j4NK0mk2RNj4K6j5nk3M2pK2l9K2J3l1pJ1OPPj6nj0%J3R
3267A1jMk0L3k6k1K5ML5l7okJ5nk6J9j7L1j0Jk4NK0jk4J9J9kk7%ONK1j5NMj8j
3305aRk3jK0K1qk4K7J1k8pJ7rlRjomJlLj0J7j7J6kj2ONj0K0k0K2j6nJ5rM4j9l
3345B2J5k7J8j0j6K4l7K3K4l8NK3j1Kj3nJ5k2J7k3LJ3J4k7mK0KJ1j0j9RJj2J3
$$ plain form
3379 0 -14 -2 5 0 12 -8 4 9 -2 12 8 10 9 17 10 -5 4 24 1 16 6 10 2 12 8 7 3 -20 9 7 -18 -17 -12 -4 23 -13 -6 11 3 -2 2 4
3421 4 -8 3 9 9 -10 7 -16 -9 -13 7 15 -20 4 10 9 13 2 10 23 43 24 7 0 21 29 13 11 9 0 11 35 2 19 1 -3 8 -4 -4 17
3460 17 6 -1 -15 0 1 15 4 10 8 -7 10 11 4 1 26 30 16 9 4 25 15 22 17 -3 7 8 18 -5 15 12 10 -2 1 -2 -3 -1 8 -10 -14 -11 1
3501 1 -21 5 17 19 3 8 -8 10 5 6 19 3 11 -3 17 -2 16 17 -5 22 -9 5 -6 21 19 -1 6 17 18 4 19 19 11 21 40 8
3537 8 8 3 17 -5 6 -6 0 15 -12 8 -4 12 -7 -9 -10 1 -1 -6 -9 2 16 22 15 16 9 8 -10 30 13 25 8 28 19 27 6 7 0 11 4 18
3577 18 19 -17 -11 -16 -14 11 14 -2 8 13 7 -8 13 -2 10 -5 13 7 -5 9 15 8 -5 0 -1 14 0 19 10 14 25 38 9 2 -7 27 6 -2 1
3616 1 -2 5 0 0 12 -4 3 -8 -11 4 20 9 6 1 8 9 3 13 7 5 15 -6 2 2 -4 -13 13 9 8 -2 5 4 -3 1 21 11 5 19 -3 -9 6 13 3 2
3660 2 10 -4 -5 -7 -2 -5 10 4 -5 15 5 8 10 -7 6 12 -1 7 7 6 9 -8 16 25 1 1 4 14 -2 17 14 -4 -29 14 36 16 -1 23 2 -7
$$ packed form
3379@j4J2PnJ2k0J2Nj1J4mKjQpj5RK0k3J5j0MqJ0mjmk3K9kk5JNQK7l6PJ7qnMK
3421Dj2J1O%j9J7k3PmK0Ql5K4OjMj1QJ3K0j9j7pK1Qj6kkrJ1K4l3J7j8mJ1j2%K1
3460A7j1pj4J5JJ4j1Okj5J7JplK5Mj4pnK1j0Pnk0J0JJ0k3K0lkj2LljKRj8mLJ2
3501Ak2K6J2Kj6Nj6J8nJJ3j6Qj4K0j9J8Jk2K7l1J4j1K7kk0PJ1Jj4J5%qJ0J9l2
3537H%nJ4k2J1j2OJ5k7K0j2J6j9kjJ1knlJ1J4OpJpjj8M0j7J2j7K0rQk1JpJ1pJ4
3577A8Jl6OnKK5Lj6J0Noj5K1j5J2j5J8oj2J4Opj3NjJ5j4J9rMJ1J3k9prL4k1qL
3616AlPn%J2j6Pj1lJ5J6j1lnPJoJ0okJ0k1Q%orK6mjj0PjpMK0j0oJ4k2oJ5Pj0j
3660BQj4jkNlJ5orK0j0LKj7J3Oj3Q%jLj7K4Rk4%LJ0j6J9lj8k5M3K2k0j7K4k1r
$$ plain form
3700 -7 15 37 10 25 10 13 16 15 9 18 -9 -3 -2 -9 -1 -3 21 3 -7 -9 23 14 15 22 3 24 2 11 22 10 39 13 16 12 5 0 4 -8 3 -1 -1 -5
3742 -5 11 -8 10 22 3 26 13 6 -13 -13 3 5 -5 -4 24 -1 3 -1 -3 0 -8 -2 -12 12 6 19 -2 21 22 -8 20 14 3 12 6 9 14 8 9 -10
3782 -10 -5 6 23 5 -2 -20 5 -15 -3 -15 19 -6 0 -6 2 7 -26 3 -5 3 1 2 1 2 -14 1 -7 14 -10 -3 17 -8 -1 14 -12 6 10 21
3820 21 -4 14 3 13 17 -8 -2 -9 -12 9 12 23 11 9 -6 12 -5 -10 -18 8 -11 6 9 -3 8 2 19 18 7 15 8 8 5 -10 16 19 14 -8 16
3859 16 -2 8 5 13 15 11 12 -8 42 25 16 8 12 17 16 20 -1 14 13 15 13 19 22 9 4 0 11 -2 10 26 13 -2 17 7 20 22 2 19 7 1
3899 1 -6 15 4 -15 25 27 13 22 1 16 20 9 23 11 -9 -5 -9 15 27 -1 16 -2 -1 4 -13 1 8 0 -10 9 0 7 29 6 -16 -11 13
3936 13 18 3 0 -1 10 4 15 23 26 13 30 0 23 2 20 16 9 6 -9 -7 -16 -13 -1 -9 16 -11 8 9 4 12 -8 7 4 15 18 -2 15 10 12 19 5
3977 5 21 17 9 0 -12 11 -1 37 19 20 5 15 18 19 29 9 23 -6 13 3 30 6 15 24 13 -2 0 8 2 -15 34 -2 4 6 6 0 -1 17 7
$$ packed form
3700gK2K2k7J5j5LLjoRk7OJpQkK4j8j0kL2rJPj9K1k2RJ1j2K9k6LmpnMj2J1m%m
3742eJ6j9J8J2j9K3j3pj9%J6Kj0JK8k5MmkLqOj0K4oJ3k1K3Jl0K8oj1RoLNoJj9
3782a0NJ1J7j8pj8K5k0J2j2L4k5OoQNl3K9qQkJjJj6J5qK1k4PK0k5PJ5k6J8MJ1
3820B1k5J8j1J0Mk5OplK1LJ1j2kj5J8j7nqK6j9J7Lj2J1oJ7jj1Qp%lj5K6Lnk2K4
3859A6j8J0lQKmJk0N0j7rqMNjMk1J5jKkOLj3nmJ1j3J2J6j3j5J9j0J3Kk0J7j2o
3899ApK1j1j9M0Kj4Rk1J5Mj1J4j2k0MmK4J2k8J7j8JNj7J4Pqj0J9rPK2k3k2NK4
3936A3Nj5ljJ1oJ1QLj3J7l0K3k1J8mplj5KrLJ2qK5k7J9JnQk0J5lJ1Lk0J7nKPj4
3977EJ6mqrj2K3j2L8j8Jj5J0LJJ0k0J4k9J9j0K7k4RRj1j5KQoj7M9l6OK%ojJ8j0
$$ plain form
4016 7 -5 -5 16 9 -5 5 28 0 -1 15 11 21 11 40 22 6 0 27 25 0 23 4 1 18 -1 4 -19 5 2 -9 1 3 10 -8 13 4 12
4053 12 -4 -6 25 1 9 6 9 3 10 9 16 4 25 21 18 14 11 8 6 9 4 9 16 1 5 12 20 7 -18 15 5 4 3 -5 9 30 6 20 -8 2 3 7 0 -7
4097 -7 -1 15 -4 5 -5 -2 1 -28 33 -3 14 4 0 15 -7 9 23 9 15 16 7 4 3 3 3 5 21 2 -1 9 -4 18 10 19 15 9 -14 -13 14 20 33
4138 33 -6 11 19 14 -4 -21 11 -2 20 3 -11 -4 5 -15 -1 1 22 -21 0 -5 5 5 -25 9 10 9 -7 3 5 -12 3 9 -5 15 11 -5
4174 -5 4 -9 -20 1 -17 -21 -3 -5 2 -5 17 14 35 10 3 0 8 -2 10 8 -3 15 12 24 13 9 10 20 -2 11 11 4 5 -10 19 13 7 16 11 22 -1
4215 -1 8 -15 -25 -20 -29 -11 -1 -1 -6 0 7 3 -4 -2 2 1 24 9 26 19 -4 30 6 8 31 11 3 11 24 28 22 6 8 11 31 27 23 3 10 15 8 5 25 6
4259 6 31 -1 2 -2 9 -5 7 14 29 8 26 9 -7 12 6 24 -10 -12 5 12 15 27 26 36 6 18 6 43 14 15 7 7 13 24 17 -1 6 -21
4297 -21 9 17 -12 -17 -4 -9 5 24 -2 -14 13 14 -5 -2 -18 -1 1 19 9 14 4 0 7 20 2 18 25 -11 20 4 26 17 -8 14 18 -4
$$ packed form
4016Gj2%K1pj4J0K3k8jJ6mJ0j0K9j8j6oK7kk5K3j9lJ7j9Nk3K4lj1J0KPj8K1rQ
4053A2j6kL1k4QlLoPjPj2K1mlmllkLnNPj5MPQj3k5L3j0jjqJ4K1k4J4k8J0JMpp
4097gOJ6j9Rj0LLk9O1l6J7j0mJ5k2J6J4j4OJrlj%%KJ6j9lJ0j3K2qRmok3JK7OJ3
4138C3l9J7Qnj8j7L2j3K2j7j4PRk0J4KK1m3K1nJ0%l0L4Jjj6J0Kj7J5Oj4K0mj6
4174eRj3j1K1j8mJ8kPpK2lK1k5plQj0J2kj1J8lJ2j1mJJ0k2J3%pJj5K9ooRnJ1k3
4215aRk3j0NrJ8J0%nOPmpKMjK3j5J7pk3L4k4KK3k0qQJ3Moj6KLK0mmk0PNplK0j9
4259FK5l2LmJ1j4J2PJ5k1J8j7j6J9oJ8l4kJ7PLJ2jJ0l0J2j2L7k9Jq%OJ1pj8Pk7
4297b1L0Qk9nJ3nJ4J9k6j2K7Jj9Lj6J7KJ8j0Nj0mPJ3j8J6Pl6L1j6K2rk5K2Mk2
$$ plain form
4333 -4 26 27 2 4 8 -1 1 -6 -8 7 17 -14 -10 -2 -1 19 -5 -3 8 15 4 0 19 20 7 19 -9 22 30 2 7 22 6 17 17 20 30 3 26 -1
4373 -1 40 21 10 12 26 14 11 28 12 10 -5 -2 -16 14 14 -15 -16 -18 -3 -9 -1 0 -9 14 12 5 14 9 12 17 18 11 22 -1 8 14 16 15 -8 4 2 2 1 13
4417 13 8 8 -24 5 1 2 5 21 3 -2 7 9 7 6 3 -3 8 -1 10 10 9 0 8 0 0 1 4 8 10 18 10 21 11 15 43 28 21 8 18 19 -8 18 -9 8
4461 8 -13 13 31 26 -6 -13 24 27 -4 -3 3 -9 7 4 14 -6 -14 0 -1 -3 2 21 26 8 18 5 4 17 14 12 13 13 22 19 38 30 37 18 23 20 18 0
4503 0 4 15 12 -3 -1 -7 17 -17 -1 14 29 -4 -8 2 -2 17 4 -17 -7 -12 -7 26 5 1 2 5 -7 24 17 14 12 15 19 14 25 20 27 12 11 29 21
4544 21 22 0 22 9 1 9 -9 8 6 12 2 -12 2 -10 7 -6 -6 -5 -13 2 18 -23 10 4 2 1 14 13 2 9 -4 20 14 11 15 10 6 22 9
4583 9 16 -13 21 8 3 20 12 -6 5 -3 19 -4 -4 12 9 -11 16 15 1 -3 -5 -1 -8 -18 0 5 18 7 -5 19 16 26 5 6 16 10 14 25 22
4622 22 10 31 16 14 34 18 3 17 -18 -10 0 15 -10 -5 -1 7 7 -17 6 -26 -14 -18 -19 -3 12 -4 5 8 9 -1 -4 -11 -15 -19 2 9 -9 4
$$ packed form
4333dL0Jk5KMrKpkJ5J0l1MQJK0k4KJ1Pj1mJ9Jj3J2k8L1Qk8NJ5j6J1%LJ0k7K3k7
4373aM1j9j1KJ4j2lJ7j6kj5Lj4L0%k9jkJ5oQJrK3kpRnLNJpJ1k3ROKjk3J2k%jJ2
4417A3n%l2K9mJLJ6j8nRKkjloJ1rJ1%jrQq%JLMKQqJ1j0MK8j5pj3J0Jk7K6k7J7
4461Hk1K6J8nl2pL7Ll1JOj2J6lJ0k0qJ4jkNJ9Nj8J0j3jJ3lkJ%RlJ9qPj9Nlkj8
4503@MJ1lj5KoK4l4J6J5J5l3mJ0mJ9j3k1J0nNL3k1mJLj2L1plkLMnJ1nPj5jJ8q
4544B1Jk2K2j3qQj8J7kOj0j4J4j2J7j3%JqJ5J6m1L3okjJ3jj1Pj3K4olMnmJ6j3
4583IPk9L4j3nJ7qj8J1qK2k3%J6lk0K7jj4mkMpj0J8NJ3j1j2K4lJ0k1JJ0oMJ1l
4622B2j2K1j5kK0j6j5J4l5QJ0J5k5NMQ%k4K3l2J2mjJ6J5j6RLJj0lpmmK1Pj8J3
$$ plain form
4660 4 6 9 -7 11 10 5 3 -11 12 12 -4 1 -7 -6 -11 -9 -3 9 -8 -18 -20 -1 3 5 -17 1 -27 -11 -2 -7 0 1 2 13 20 9 21 11 11 0 11 23
4702 23 6 21 23 22 -1 6 14 13 18 -12 22 6 21 12 -9 -7 16 8 -3 11 -6 -3 1 4 3 -22 -28 -2 2 -10 -10 -6 -2 -4 -2 -10 6 -8 -3 27 -9
4743 -9 6 13 -7 9 -12 12 11 9 -10 -9 -11 12 32 -6 10 5 7 9 6 12 23 16 -9 7 4 0 -6 11 -19 16 5 2 -7 -5 -10 1 -3 3 5 -10 6
4784 6 10 14 17 20 19 25 20 0 1 15 16 9 12 12 17 9 9 -7 -15 4 -6 0 -5 -4 8 6 18 5 3 8 -9 -13 -14 5 2 16 5 9 -1 22 -1 19 -3 22
4828 22 8 4 2 16 21 33 21 18 31 22 28 2 19 26 10 8 10 8 7 2 9 -17 -15 -18 0 3 -22 -15 -4 -12 -3 1 14 -17 7 8 1 21 12 2 12 19
4870 19 23 10 -1 -11 12 22 21 4 2 4 2 31 3 31 29 31 13 18 13 39 12 5 5 15 -6 -16 5 14 -2 27 2 2 8 10 -16 -5 10 17
4908 17 4 13 -11 -1 15 27 15 15 24 17 5 11 24 12 28 23 -2 37 -2 16 4 3 20 8 27 14 8 -20 -13 0 8 5 10 -11 8 -22
4944 -22 18 -14 15 19 23 12 17 19 4 13 4 9 26 30 11 18 25 18 31 40 13 26 -3 13 4 7 0 18 7 -2 -17 0 18 0 3 12 1 13 -10
$$ packed form
4660DKLj6J8jnkj4K3%j6NqJnKOJ2j7j0kJ9MKk2J8k8J6RnPJJJ1Pj1J2j0%j1J1J2
4702B3j7J5Kjk3PQjNl0L4j6J5rk1KK3qj1J4j7LMLjk5oK6Mj2%MMkKqJ6j4NL0l6
4743iJ5Pk0J6k1K4jkj9JkK3K0l8J6nKKlOJ1pk5J6lmoJ7l0L5j1lrKnJ1mOKj5J6
4784FMMLLjOnk0JJ4JpL%Nq%j6qJ9j0OnJJ2kJ2j3kNj7mjJ9lJ4j1Mj0K3k3K0k2K5
4828B2j4mkJ4NJ2j2lJ3rOk6J7Pj6kKkjnPk6KlJ8Lk5PJ1qRMJ3l1K4JpK0rj0J0P
4870A9Mj3j1j0K3J0jj7kKkK9k8K8kKj8NnK6k7p%J0k1j0K1Rj6K9k5%OKk6J1J5P
4908A7j3Rk4J0J6J2j2%Rpj2OJ3j2J6nk5L9l9J8j2jJ7j2J9j3ok8PJ3QlNk1J9l0
4944b2M0l2K9MMj1NKj5RrNJ7Mj9PPpJ3Rk7J3k9J6rLpJ8j1rj5J7J8j8LRj1J2k3
$$ plain form
4983 -10 2 5 23 -3 -7 4 9 16 -16 0 11 -1 10 9 11 8 11 10 30 -1 48 47 28 13 7 2 1 17 14 13 10 -8 20 1 -5 -9 -1 25 6 -9
5023 -9 -10 -1 9 -1 11 21 18 6 -5 26 0 -11 2 18 18 29 10 20 -5 2 21 9 32 20 7 32 26 23 1 3 8 0 -3 4 -1 9 2 -1
5061 -1 -13 -6 -16 -19 6 16 -14 -9 15 -6 7 -8 1 6 -3 5 4 16 5 17 -4 5 -5 28 19 -3 20 14 10 18 12 11 -2 8 7 -13 -31 -10 10
5100 10 -3 22 -20 -9 -2 -4 5 -14 11 -14 2 -5 -18 0 5 21 0 14 21 10 10 -12 8 1 -11 23 -3 0 25 14 20 4 -3 33 12 11
5136 11 3 26 11 -6 -3 4 -22 -7 6 -2 -19 22 12 10 -13 -10 7 10 -14 -22 1 -13 8 -18 28 -3 11 -11 -16 -7 9 17 -11 2 15 22
5172 22 37 26 -1 12 11 7 -3 18 9 -13 -4 7 5 -6 -19 -19 9 14 2 0 -1 1 -2 -4 0 2 28 17 -9 -5 7 3 16 13 15 1 -8 -8 -8 18 -1
5213 -1 11 15 -8 18 8 8 12 31 12 8 -3 12 -8 -17 -6 20 -15 -1 -16 -11 -12 -30 -8 -11 -20 -20 -12 12 -10 -9 -16 2 4 1 -26 3 3 14 13
5252 13 11 13 3 19 15 11 3 9 36 12 2 13 -18 19 0 6 13 4 12 4 -12 6 -10 1 0 -2 11 -7 -2 0 -15 -9 2 8 5 3 -2 12 0 5 8
$$ packed form
4983a0J2LJ8k6mJ1NPl2J6J1j2J1jKlLjK0l1M9jj9j5onjJ6ljlj8K8j9omQK6j9j5
5023ijRJ0j0J2J0lj2j1L1k6j1J3J6%J1j9J0k5PJ9j2K3j2j3K5olk2KNqlPnJ0pl
5061aj2Pj0lK5J0l0NK4k1J3j5RNrQjJ2j1J2k1Rj0L3rk2K3omQojj3J0jk0j8K1K0
5100A0j3K5m2J1PkRj9K5k5J6pj3J8NJ6k1J4Pj1%k2K0pj2L4k6LK5j1Oj6pL6k1j
5136A1qK3j5j7LPk6J5J3qj7M1j0kk3LJ7Lk4qK3j4K1k6M6l1J4k2nRJ6Qk8J3J3P
5172B2J5j1k7J3jmj0K1rk2RJ1kj1j3%K8Nj2kjKlkMKK6j1k6MJ2mJ3lKj4r%%K6j9
5213aJ2Mk3K6j0%MJ9j9mj1J5k0rJ1K6l5J4j5Njj8K2lr%QK4k2JpJ8Klk7K9%J1j
5252A3kKj0J6mmqOK7k4j0J1l1L7j9OPrQqj6J8j6J1jkJ3j8NKj5OJ1OlknJ4j2NL
$$ plain form
5293 8 2 11 11 -8 17 -2 16 19 14 16 17 32 3 8 -7 -3 0 -12 3 5 -3 6 -1 1 13 24 10 21 7 5 -1 4 -4 5 -13 -5 -6 -23 -18 -1 -1 13 11
5336 11 5 9 10 18 28 21 24 -1 -4 13 -1 1 14 22 7 0 12 -19 -18 0 -15 -2 -5 15 -24 -7 -12 -15 -14 -14 -10 -4 0 -25 -5 -8 16 7 -3 11 17
5377 17 10 0 -5 33 18 20 17 15 -1 3 5 10 8 0 3 -2 7 10 4 -7 -3 -6 -4 -4 6 -5 -5 1 -33 -5 -4 4 7 -5 -8 -4 -5 2 17 14 3 -17 -1 0 2 6
5423 6 3 29 -8 9 -7 -4 4 2 -3 -15 -17 10 3 -11 8 7 -9 -3 -9 -4 -29 -1 -5 -4 -13 -29 10 -16 -4 -11 -18 -15 -8 -21 -8 4 -11 7 -1 13
5463 13 -5 13 4 0 9 12 14 7 21 3 15 4 12 11 -6 3 -11 -2 -23 -25 -15 -12 -21 -12 -11 -17 -14 -19 -12 -5 -34 -18 -11 -16 -13 -27 -4 12 -10 6 15 1
5505 1 -1 14 13 6 22 8 27 21 29 -3 -1 7 21 16 -1 13 -10 -3 -4 -14 -6 -6 -1 8 -8 -29 -1 0 -3 4 0 -4 7 0 -7 -5 5 -2 6 -4 6 -12 -17
5548 -17 -6 -23 12 26 -11 24 -1 -4 -2 7 13 -10 -2 2 5 2 7 -6 -2 -5 -14 -10 -1 -4 -6 -19 -12 -26 -16 -5 -28 -15 0 10 -9 -3 -4 24 7 -10
5588 -10 6 9 2 4 7 7 0 15 -1 -7 7 11 12 4 5 -2 4 16 10 -4 -14 -14 -9 7 -15 -24 13 10 0 -29 -9 -5 -22 -15 1 3 -7 -14 -7 26 -3 23
$$ packed form
5293HoR%j9K5j9J8LnKJJ5k9Nj5MLj2J5KqRpKJ2J1j4J1j4koNqRj8Qjj7NJ7%J4k
5336A1oMJQJ0pLk5lJ7j4KJ3Qj5pJ2l1JJ8j5J3lK0l9J7nlJ%MOMk5K0lK4rj0J4O
5377A7pj0nL8j5Klkj6MKNkqLnRLoj1MlK%J0j1%Ol4K8JQLj2lMjPJ5lj1k0J6JKM
5423FlK6l7J7j6LQknj2kK7pj4J9jj6OoNk5K8mJrj6L9k6J2ppLPj3J3J2j5J8qJ4
5463A3j8J8rmRLKpJ4j8J2j1Qjj7Rj4Rk1kJ0LrRJoLnPPk9J6PnLj4K3J6k2J6Rj4
5505AkJ5jpJ6j4J9oQl2KQJ4nj7J4k3Pjj0Q%NRj6k1K8JlPmmJ1ppKJ0pQj0J0j8n
5548a7J1j7L5J4l7L5k5lKROk3QMLlNj3MlrMRlkj3Pj4J0J1k3J3J5J0j9OjK8j7j7
5588a0J6LpKL%pJ5j6oJ4MJqJpOJ2oj4j0%NJ6k2rL7lj0k9K0Mj7PJ6Kj0pPL3k9K6
$$ plain form
5630 23 -8 1 16 0 -11 -9 14 -1 27 19 22 39 -11 -5 16 -6 1 26 5 13 10 10 -11 0 -9 -3 -3 -20 -22 -20 -5 -8 -12 -25 -19 -29 3 7 -1 -18
5670 -18 -6 9 10 -30 -3 -1 4 11 15 -8 8 12 6 13 35 -1 11 11 9 2 -17 -8 0 -8 0 -10 -3 -20 7 -14 5 -19 -17 14 -20 4 -15 -20 4
5709 4 31 10 7 29 1 27 4 11 19 -4 11 22 19 16 16 12 31 27 25 18 -2 -13 4 -3 14 -10 8 -10 -15 -3 -32 -21 -19 -9 -10 -2 -6 -11 -11 -30
5749 -30 -1 0 -17 13 6 6 8 2 17 15 9 6 -19 -24 9 -11 0 7 -3 31 -8 9 -2 -7 -6 -2 -23 -4 2 1 -4 -8 -10 -5 -3 11 -8 -28 0 -9 -19
5790 -19 -13 -5 3 6 -16 -14 4 -20 16 9 24 11 1 9 1 4 4 7 -13 7 18 20 1 13 -15 -11 0 12 -14 12 -13 -27 -14 -3 4 11 -9 12
5828 12 -12 -15 -3 -10 -4 -25 -16 5 -19 -6 -8 6 15 0 -5 5 22 -4 0 9 11 14 13 14 14 7 -10 10 9 10 11 20 -8 -2 -10 -1 -6 -3 -10 -4 -1 -9 -1 0 -7 -15
5874 -15 -6 -6 5 21 -7 -18 -10 -4 2 -2 2 -4 -1 19 23 -2 -3 17 17 12 21 14 -4 31 -11 11 6 -8 17 11 -6 -20 10 -14 -10 -12 -3 -5 -5 -19 -24 -18
5916 -18 -33 -5 -4 6 6 -17 -3 -16 0 -7 12 7 4 19 10 12 18 18 6 -2 21 15 -30 15 12 -3 13 30 -7 -5 0 1 -9 -15 -28 6 8 -3 -7
$$ packed form
5630B3l1RJ5j6j1KK3j5K8qLJ7n0OK1k2PK5k1Ql%k1J1rO%j7kKJ5lmj3Oj0L2Mqj7
5670a8J2J5Jm0K7KNPMk3J6MoPK2l6J2%kpj9RQqQj0Pj7K7k1J9k4KL1l4K4j9nK4
5709DK7k1lK2k8K6k3PQk3J5J1ll%mJ9mkpk0j1J7pJ7k4J8j8nJ2k9J1KJ0jQmn%j9
5749c0K9Jj7L0p%KoJ5kolk5nL3k0J1Pj0L4l9J7j1nJMk1J9OjnmkNKJ4j9k0K8rj0
5790a9OQQLk2KJ8k4L6pJ5j3j0QqL%Lk0K0J1Kj9J2k8MJ1J2k6K6k5j4J3J1PPk0K1
5828A2k4lJ2pOk1RK1k4J3kJ4Rj5nJ0J7k6MRKLjJ%pj7K0jJJRk8OqRnLpOLqQJpq
5874a5R%J1J6k8j1QOOmMoLK0Mk5jK0%nRpj8L5m2K2nj4K5oj7j4L0k4MkRk%j4nO
5916a8j5K8JJ0%k3J4j3J6pJ9nlJ5rKO%j2qK3om5M5lj5J6J7l7KNJj0oj3L4Kj1m
$$ plain form
5955 -7 -15 -21 -22 -11 -1 -4 -15 -2 -6 4 13 17 15 -2 -9 -8 13 1 0 -3 23 3 1 -5 -11 -11 13 5 29 17 4 -3 16 6 -15 1 -16 10 -20 -22
5995 -22 -15 9 -17 2 -10 -1 16 -1 -27 -3 -16 -2 11 -11 -6 -12 -7 -8 15 10 25 14 20 26 19 -13 16 1 4 0 7 1 4 -3 -8 -10 2 -18 7
6034 7 -24 -2 -12 7 -4 7 -16 -12 -19 -18 -7 -12 -19 -5 -1 2 5 -10 4 -6 9 22 24 8 7 3 13 13 5 9 25 15 15 2 7 23 -1 12 3
6073 3 5 -20 8 11 -34 -9 -16 -8 -21 -21 2 -26 -20 -14 4 -7 2 -17 -21 2 6 -4 -4 -1 0 4 7 9 12 4 9 -2 -6 12 14 -8 10 12 -4 1 2 2 -13
6116 -13 -5 8 4 -7 -2 -14 -1 -18 -26 -29 -6 -3 -8 14 -19 -10 10 2 0 7 5 -20 -6 -5 -7 -2 -1 -10 1 -2 15 20 14 12 12 27 -5 -2 2 -21 3 -3 -10
6159 -10 7 8 -9 -26 -13 -6 -7 -17 -21 2 -10 -17 -12 -18 2 -18 -18 -16 -9 -6 -7 11 -14 2 13 4 9 19 13 10 13 14 11 1 19 -10 1 -15 -20 1
6199 1 2 -29 -8 -6 -19 -5 6 -11 13 -11 -17 7 -25 -2 -4 -15 -17 19 -17 -11 -11 5 -15 -12 9 -18 12 5 -22 7 0 -1 18 17 10 36 -4
6236 -4 12 -5 17 -12 16 -9 -11 7 -20 -1 -23 0 4 -27 -13 7 7 -1 -16 -13 -19 4 2 -8 -3 -7 -3 4 -1 3 -3 6 -6 11 8 19 7 12 8 35
$$ packed form
5955gqojJ1J0lj1J3mJ0RMkj7pJK1j2jlK6k0koo%K4qK4j2j3pJ9j0k1J6j7K6l0k
5995b2PK4k6J9j2RJ7j7k6K4j3J4J3k2NoNjK3nJ5j1OOpl2K9j5LmPoLpnkJ2k0K5
6034Gl1K2j0J9j1J1k3MpJJ1npJ4MLLj5J4j0J5J3Kj6jmJ0%qMJ6j0%j3NJ6k4J3r
6073CKk5K8Lm5K5pQj3%K3k8OOJ8j1Rj9mK3Mj0%LJMLKLqNj1mJ8Kk2J8Kj6NJ%j5
6116a3QJ3mj1Nj2J3j7qlK3LnK2l3RK0qkPkk5J4JkNJrJ1lJ7Nok%J5l2LMk3K4op
6159a0J7Jj7j7J3Pjj0mK3j2pNoK0k0%KPLjJ8k5J6J1rNJ0olLJlj0J8k9J1j6nK1
6199AJl1K1Kj3J4J1j7K4k4oK4l2K3kj1kL6l6O%J6k0LK1k7L0pk7K9pjJ9jpK6m0
6236dJ6j7K2k9K8k5kJ8k7J9k2K3Ml1J4K0%qj5LoK3kj0NmMPnMoRj2J7lJ1j2NmK7
$$ plain form
6276 35 -4 8 16 2 18 11 1 -16 0 -1 -20 -9 -12 -1 -29 -5 -44 -4 -23 -12 -30 -21 -1 -6 -10 -9 13 -3 2 -12 14 -11 1 11 5
6311 5 12 16 19 11 1 1 6 7 7 13 -1 -1 7 -9 -12 3 4 -13 -17 -23 -15 -25 -16 -15 -3 -6 -12 -10 -29 -28 -6 -25 -14 -14 -2 -9 -2 2 7 -4 1 -1 25 -6 -2 15
6357 15 -14 17 1 -6 8 -3 -6 -16 -15 18 9 -13 -1 -6 -17 -3 -2 -29 7 -21 -27 3 -18 -11 -6 -6 -1 -2 -10 -20 3 -1 -12 -1 -15 -4 1 -2
6395 -2 -5 14 24 22 -11 16 2 32 16 6 13 -6 1 -1 -9 1 -5 -30 -6 -21 3 11 -17 -13 5 -10 -4 -2 -11 -6 -11 -2 -19 -3 -3 6 -10 10 14 11
6435 11 10 2 16 20 -1 24 27 5 18 8 -7 -3 14 -5 15 4 -22 0 -2 -18 10 -3 -14 -7 -8 10 -10 -5 -5 -4 -8 -9 -16 -17 -38 12 8 6 10
6474 10 4 23 7 -1 14 -5 11 15 -5 20 19 11 12 -2 -8 14 16 2 15 5 -11 -5 19 0 9 -30 -6 16 -22 -22 -33 -11 -4 3 -3 -10 -10 -15 8
6513 8 -5 -4 22 0 14 -7 24 22 6 6 -23 5 10 -13 38 23 -9 7 -5 11 -7 -2 4 -9 -9 -19 14 4 -9 -13 -10 -23 -15 31 -20 -9
6549 -9 8 -6 -20 -26 -14 10 -1 -7 16 -18 -13 -14 -25 20 12 4 18 11 23 -7 10 10 19 4 12 -5 23 6 15 -1 -19 3 -6 -11 -3 -20 -7 -19
$$ packed form
6276C5l9J2Qj4J6pj0j7J6jj9J1lJ1k8K4l9M0j9J1j8RK0nmJK2j6Nj4K6k5J2J0o
6311EPMLqj0%NJ%Oj4%Qj6lJ5Jj7moQj0RJJ2loKj9JK2j9J1%J2pPMNj1NkK6l1MJ7
6357A5k9L1j6pJ4j1lj0JL3rk2J2nj1J4Jk7L6k8oL0k1PN%Njqj0K3mj1J1j4J1Nl
6395blJ9J0kl3K7j4L0j6j0Pj9PkqJ0ok5K4j5K4Qk8MJ8j5OKrNnRj7J6%Rj6K0Ml
6435A1jqJ4Mk1K5Lk2J3j0j5MJ7j9K0j1k6K2kj6K8j3j1PjJ8k0N%Jmjpjk1N0mkM
6474A0oJ9j6qJ5j9J6Mk0K5jqJj4oK2Kj4J3j0j6OK4j9Rl9K4K2l8%j1K2PPop%nK3
6513Hj3JK6k2J4k1L1kj6%k9K8Nk3N1j5l2J6j2J6j8NOj3%j0L3j0j3mLj3QM6n1J1
6549iJ7j4j4oJ2K4j1oK3l4Njj1M5qqJ4pJ2l0J7%Rj5Qj7K8j7Rj6j8K2rnQj7J3j2
$$ plain form
6587 -19 9 -14 -25 -29 11 -13 -6 11 -5 15 14 -12 9 4 15 11 -4 6 -8 9 11 5 9 8 2 5 2 0 14 -2 -1 12 10 10 4 -12 -6 -5 -13 15
6627 15 -2 3 -14 -20 -15 -7 -10 -1 -12 -17 -26 15 4 21 5 -2 1 10 2 -11 0 23 3 -15 16 21 -1 6 6 5 -7 -5 0 4 4 -10 -2 -1 15 6 25 -23
6669 -23 -18 10 -13 -10 0 -10 -3 -17 -19 -14 -17 7 -12 -11 3 6 -5 17 1 26 12 6 16 9 5 3 -6 23 28 -5 5 0 -12 4 -14 -3 11 10
6707 10 6 -7 -12 -10 -10 -13 -11 -20 15 -7 -3 -9 4 -17 -8 -19 -10 -19 8 -6 -22 -4 4 13 10 7 9 0 8 -7 13 9 12 2 1 -9 8 15 -3 -4 0 -14 -20
6750 -20 -8 -3 -6 -17 -5 0 7 -17 -14 -6 -13 10 2 6 -2 -4 -11 -9 2 -3 7 13 -15 -11 -12 -16 10 8 -4 -12 8 19 -4 17 24 0 11 3 1 -6 9 -2
6792 -2 -5 -27 -6 -10 -23 -17 -24 -34 -10 -5 -9 3 -28 7 5 13 -8 -1 15 12 -1 -6 -9 -1 4 4 29 23 8 11 17 14 36 -7 3 25 -8 3 -7 8
6832 8 20 -10 -15 14 -13 -7 -6 -23 4 -19 -26 -1 -7 -11 -17 -13 -4 -3 0 -1 -1 -16 -1 -12 9 -2 10 3 12 -4 9 17 20 15 -1 16 -2 14 24 -6
6872 -6 28 5 2 -10 -20 -7 -4 5 -17 5 2 -2 -17 -10 -18 -9 -7 -2 -5 -25 -22 -24 -11 -4 -10 -11 8 2 16 -6 14 7 11 16 -4 11 6 7 8 -12 10 -1
$$ packed form
6587a9K8k3j1mM0k4PJ7j6K0jk6K1nJ1mj5J0j4J7KoMjoLlkJ4j6JJ3k%oj6OJqK8
6627A5j7Nj7oNQlRj1nrM1j1J7j6pLRqj3J1K3k0j8L1Nk2P%jj2KNM%j4QJJ6rJ9m8
6669b3NK8k3LJ0j0Pj4kNlK4j9JJ4Lj1K2j6K5j4oJ0pmkrK9Nl3J0nj2J6j8J1J4j
6707A0mj3nK%lKrL5k2MoJ3k1Rj1RrK7j4j6J8QRllKrQj5K0mLj0jj0J7Pj8jMj4o
6750b0J2Nlj1J2NPk4LQpK3qMqkpKJ1nJ0Ok8MjmK6kj2qK0J1k3K1Pk4J1qkpJ5j1
6792blk2K1mj3Opj0K4NmJ2l1L5kQk1PJ6lj3nlQN%K5oj5LOlK2m3J0K2l3J1j0J5
6832HJ2l0nK9k7OJj7K7k3pK5omoMRJLj%j5J5j1K1j1J2pRj6J3QLnj6J7j8J6J0l0
6872fL4k3lj2j0J3LRk2K2lmj5PqRKNlk0LkJ3PojJ9oJ4k2K0pMNk0J5nJJk0K2j1
$$ plain form
6914 -1 19 -7 -1 -11 -7 11 3 0 1 7 14 -9 -8 -3 8 36 13 18 -4 -4 6 6 2 15 7 11 2 23 17 21 32 28 11 25 18 5 17 23 15 19 18 18 33
6957 33 36 16 16 6 31 7 -4 -12 -4 -10 -7 -8 -15 -5 -24 -17 3 -23 9 9 5 -4 -9 4 -10 24 13 22 7 5 10 10 35 23 15 10 16 19 32 29 2
6998 2 3 12 35 18 -8 25 4 -4 -5 0 -8 -28 3 -6 -39 -6 -4 -12 -20 -8 5 2 -15 -20 11 -5 20 -9 7 25 18 8 -10 12 -4 13 10 19
7036 19 6 3 9 28 18 -10 5 5 -1 7 0 12 -15 -7 9 1 -6 -2 16 -10 -16 -5 25 -4 -12 -7 -17 -3 -7 -8 -2 -7 17 5 14 5 38 28 21 23 16
7077 16 18 17 15 11 -3 14 0 3 11 25 20 1 9 -3 6 4 8 2 14 11 -12 4 11 0 6 -3 -5 -11 7 -11 16 1 1 9 -8 24 1 21 24 4 17
7118 17 18 15 -10 22 23 18 18 4 9 -10 -15 -18 6 -18 -2 -3 -20 -24 -8 -11 -10 3 0 2 10 -5 -8 -17 -11 -6 20 17 8 21 -9 13 19 1 2 2 17 -6
7160 -6 16 -6 10 8 -15 1 12 -12 -1 3 24 9 23 -12 0 0 2 -13 -4 -2 -10 -32 -11 -22 -9 -4 -13 9 -7 -8 -14 8 7 10 -8 7 23
7197 23 7 20 9 16 2 6 16 13 24 -7 16 -11 -7 7 -12 9 13 14 -3 12 -3 4 20 10 -3 10 0 1 13 4 -7 -7 -6 -1 1 13 -2
$$ packed form
6914aK0k6Oj0MJ8qlJOPk3JNJ1K8k3Nk2%J0%mJ3qMrK1oMJ1mj7J4pj3J2OqMj%J5
6957C3Lk0%j0K5k4j1qQoLjpJ0j9PK0k6L2%mrnJ3j4L4j1Rj5kN%K5j2qnOLJ3lk7
6998BJRK3j7k6L3k1qjNqk0L1rl3L3KqqJ2J3lj7nL1j6K5k9J6J8pj0j8K2j6J7lR
7036A9j3lOJ9j0k8J5%oQpJ2k7QJ6qpMJ8k6oJ1L0k9qNj0J4mjOnK4j2RrL3j0pKp
7077A6Kjkmj4J7j4LQJ4nj9Qj2RkMoJ2lk3J6Pj1OrkoJ8j8K7j5%Qj7L2k3K0Lk0J3
7118A7Jlk5L2Jn%j4Nj9nlK4k4J6jj7mJ6lJJ3lKQj5lrONK6lrJ3l0K2Oj8J%J5k3
7160fK2k2J6kk3J6J1k4J1MK1j5J4l5J2%Kj5RKqk2K1j1J3NrK2j6joK2jLj8J5J6
7197B3j6J3j1Pj4MJ0lJ1l1K3k7MJ4j9K1MJj7J5j5PJ6j0j3J3j0JJ2rj1%JNKJ2j5
$$ plain form
7234 -2 -26 13 22 3 2 19 24 26 15 13 37 -7 35 -9 10 20 21 13 8 7 -8 -11 -1 3 -17 -6 4 10 -6 3 -14 -11 -11 -12 6 -5 16 -10 0
7273 0 -1 1 -4 -13 16 -10 16 -7 -1 -8 -10 7 56 20 4 22 19 16 9 17 29 7 9 3 10 -10 -13 -4 9 -13 -5 -18 -10 -8 -1 -17 2 12 -16 -9 -7 -14
7315 -14 -9 6 -7 -2 2 -2 13 44 8 21 0 19 16 12 6 21 8 -1 27 4 27 27 -10 10 -12 13 23 14 3 -4 12 -29 -14 1 -11 -31
7351 -31 -19 -33 -19 -31 -11 11 30 7 9 -3 2 14 12 16 22 25 21 9 5 11 30 5 7 1 15 10 1 -1 2 29 23 7 15 19 7 0 -8 11 -8 7
7391 7 30 -8 -11 7 2 0 2 -15 -4 -16 5 -3 -6 8 17 -12 22 -3 -7 3 5 27 9 15 29 36 20 21 20 2 17 -1 -7 0 8 -27 3 17 11
7430 11 -8 17 2 -5 -4 8 -8 5 8 1 10 5 4 21 -4 -6 -5 -10 22 1 -1 4 17 12 13 -14 17 14 29 41 10 17 22 0 14 1 -10 13 6
7469 6 9 -14 -9 -4 -5 -17 11 20 3 4 8 -8 0 -3 -11 15 19 11 -7 29 8 22 9 13 7 13 24 11 2 7 21 23 21 -5 9 15 9 -1 -2 17 17 16 33
7512 33 0 0 -11 13 -1 -4 -16 5 7 -14 -7 -7 -12 36 9 10 35 -1 -3 7 6 4 -2 19 15 17 11 15 24 -7 2 17 2 9 7 5 3 15 -4 35 12
$$ packed form
7234bk4L9Rj9jJ7NKj1kK4m4M2m4J9J0Jqnjj5lJ0Mk0J1J0Oj6Rj7L%jJ8j1K1k6J0
7273@jKnrK9k6K6k3OpkJ7M9l6j6J8llpQJ2k2KoPk0lRJ3k2Qj3QKPj6J9J0k8PKp
7315a4NJ5j3NMmJ5L1l6J3k1J9lmoJ5j3rK8k3K3%l7K0k2K5J0rj1pJ6m1J5J5j2k0
7351c1J2j4J4j2K0K2J9k3Kj2NJ2kMOLmj2mOJ9k5KoJ4nrkLK7oj6QMj2pqJ9j9J5
7391GK3l8lJ8nkKj7J1j2K1qlJ4Rk9L4k5mJ0KK2j8OJ4Pj6Jjj8J5j8oPQl5L0J4o
7430A1j9K5j5pJJ2j6J3LpRnjJ7k5kJnL2k1kNJ3nJk7L1lJ5J2l1PNk2J4j3j1K3p
7469FLk3NNjj2K8Rj7JMj6QlqK6Mqj8L6k1J4j3MoOJ1j3rNJ4Kkk6J4Ooj0jJ9%jJ7
7512C3l3%j1K4j4lj2K1Kk1P%nM8k7JK5l6kJ0jkoK1mKoMRl1RJ5j5PkkkJ2j9L9k3
$$ plain form
7553 12 0 -21 -3 -8 14 -2 -10 -18 -12 -10 -9 -2 10 10 -21 -2 -10 -5 -12 -10 -6 10 0 -7 15 -3 39 29 14 24 19 17 27 17 7 -2 8 12 -2
7592 -2 5 9 4 -4 10 4 -15 -1 -11 -6 3 -4 -2 -6 -3 -3 -5 -12 0 -7 9 9 10 8 -8 17 3 26 14 1 22 31 20 12 26 8 21 -4 37 35 26 25
7634 25 16 -7 0 2 10 3 1 -16 -6 2 -2 -2 -11 -12 -16 -6 -7 25 6 -4 -3 14 11 10 7 25 -2 6 -2 6 35 6 14 40 1 25 4 28 19 4 -2 -6
7676 -6 22 21 5 -18 -9 0 7 -18 9 -28 -38 -31 -18 -16 -14 -28 -3 -18 -15 -5 5 15 0 4 -14 36 11 8 2 16 3 24 13 28 22 27 16
7713 16 5 2 4 -2 19 10 7 20 -18 39 -3 -10 -13 1 -22 -12 -14 1 0 -24 -8 -21 -7 10 6 -2 -12 -16 4 2 9 6 28 1 9 21 4 35
7751 35 17 18 21 8 16 21 29 4 10 -1 -9 0 -4 7 13 17 -4 -5 -23 1 0 -12 -14 -14 17 5 4 0 2 -13 12 16 7 4 10 7 10 21 16 18 10 2 1 22 4
7796 4 16 11 18 25 8 12 -9 -1 3 3 8 -11 -1 6 -28 -9 -14 -16 -5 -25 -18 -34 -24 -17 -13 3 2 -5 15 4 1 11 19 8 -10 15 7 11 7 3 12 -11
7838 -11 21 4 20 30 25 14 8 26 27 15 25 11 10 -21 -7 15 5 -12 -14 -22 -11 -29 5 2 1 -16 -27 6 4 19 4 6 6 12 12 9 4 6
$$ packed form
7553A2j2k1J8nK2j6qqOKJPJ2%l1J9qNpKMJ6j0pK2j8M2j0j5J0nkJ0j0j0rJ0Mj4
7592bPMnqJ4oj9J4j0NRpKmL%kpJ2pJ6%Jkj6K5j4K3j2j3K1Rj1qJ4j8J3k5M1krj
7634B5rk3PKQpkj7J0Qm%rjmJ0jL2j9j0JJ7ljlJ8k7QqQK9k9QK6l9K4k1K4rj5om
7676fK8jj6k3RRPk5K7l7j0PJ3KKj4K5j5LJ0J0J0j5Mj8N0k5loJ4j3K1j1J5oNj1
7713A6j1lKoK1rlJ3l8N7m2plJ4k3J0kJ5jk4J6j3J4J7mqj0mK0kPlK2k7QJ2j7L1
7751C5j8JLj3QNQk5Oj1qRmJ1OMk1jj8K4jj2k%L1j2jmKj5K5MrlOlLJ1nKqqjK1j8
7796DJ2nPPj7Mk1QM%Nj9J0Pl4J9nkJ1k0Pj6J0PMJ6jpK0j1lJ0Qj1j8K5qMmmRk3
7838a1L2j7J6J0nj1oJ8Jj2J0j4jl1J4K2j0j7kqJ1j8L4ljj7j1L3kJ5j5K%O%lnK
$$ plain form
7876 6 33 12 24 25 6 20 16 0 14 18 -1 20 20 -3 5 13 10 9 14 13 -2 -7 -6 -18 -31 -4 -22 -12 -12 -17 -1 -12 -15 -9 -10 22 2 42 23
7915 23 16 15 8 9 17 44 39 -2 15 11 28 19 19 8 -25 14 -14 17 4 1 -31 -15 21 -20 -5 6 -14 7 -12 10 -18 -4 -6 -11 -5 0 -3 6
7953 6 -4 -19 4 -12 -5 11 7 15 16 7 -4 0 4 22 28 26 -5 24 -17 3 -7 -12 -25 -25 -9 -17 -11 -7 -25 -19 -22 -21 5 0 -17 4 4 1 18 15 12 3
7995 3 -5 -27 4 -6 9 12 -2 17 -7 -2 -2 10 -5 4 -6 -3 -13 12 4 12 11 -19 0 -4 -8 7 -1 -6 0 -7 -20 -25 0 0 -6 -17 -22 -1 3 -6 -10 1
8037 1 3 3 20 18 10 -14 1 19 2 -2 22 13 -11 -1 -5 -3 7 13 1 -8 3 5 -6 14 -14 -6 -13 19 -22 1 -6 -23 -25 12 1 12 -25 -10
8075 -10 -20 -20 -1 -3 6 3 -14 5 0 -11 2 4 16 8 23 25 19 -5 23 7 8 13 4 -3 14 -5 19 7 9 1 -10 -4 -12 -10 -10 -16 8 -28 -27 -10 -17
8116 -17 -5 5 -16 -18 -7 6 5 -4 -3 12 6 -7 9 16 4 0 18 12 0 12 22 10 -16 16 -8 4 -1 0 -3 -8 -16 -8 -10 -9 -14 -34 -1 -14 -1
8155 -1 -16 -18 -8 16 9 0 -17 8 4 -4 -6 -4 -12 -1 19 -2 6 10 31 16 21 29 20 25 30 -9 15 24 21 22 10 8 5 4 2 -8
$$ packed form
7876FK7k1J2Jj9J4mj6J4Mj9K1%k3QQljNjj5nJj2j3K7j8J0%nJ6j1lOjL2k0M0j9
7915B3pjpJQK7nm1J7mJ7r%j1l3L9k8L1j3ll2J6L6m1J5J1k0K1j9K2k8J4knONlR
7953Fj0j5K3j6PJ6mQJrj1MMJ8Okl1K9m1K0j0nj3%J6qOMj8OlJK6nj7K1%lJ7llr
7995Cqk2L1j0J5Lj4J9k4N%J2j5Rj0Lj0K5qQjl0J9mmJ5qnOpj3nK5%oj1nK1MrmJ1
8037AK%J7kqk4J5J8j7mK4rk4J0mKJ0Oj2rJ1Kj1K0k8QpL2m1K3pj7kL7j1J1l7J5
8075a0j0%J9kRlj7J9nj1J3KJ2qJ5Kok4K8j6JNrpJ7j9K4j2Kqj1OqK%oK4l6JJ7p
8116a7J2J0k1kJ1J3jrJJ5oj3J6Pj2mJ8oj2J2J0j2k6L2k4J2nJlnqQkJnk0L3j3J3
8155aj5kJ0K4prj7K5mqkKqJ1K0k1QMK1j5NQrNNl9K4RlJj2kljkj0
8191h
##END NTUPLES=NMR FID
##END=
