##TITLE=1H_K-427/2_2
 CDCl3, 8 sc, 
 10.06.2021
##JCAMPDX= 6.0         $$ Bruker NMR JCAMP-DX V2.0
##DATA TYPE= NMR FID
##DATA CLASS= NTUPLES
##ORIGIN= UXNMR, Bruker Analytische Messtechnik GmbH
##OWNER= root
$$ XWIN-NMR		Version 3.5
$$ Thu Jun 10 13:45:45 2021 Russian Standard Time (UT+4h)  she@DPX200
##.OBSERVE FREQUENCY= 200.131506
##.OBSERVE NUCLEUS= ^1H
##.DELAY= (6, 6)
##.ACQUISITION MODE= SIMULTANEOUS
##.ACQUISITION SCHEME= undefined
##.AVERAGES= 8
##.DIGITISER RES= 18
##SPECTROMETER/DATA SYSTEM= spect
##.PULSE SEQUENCE= zg30
##.SOLVENT NAME= CDCl3
##.SHIFT REFERENCE= (INTERNAL, CDCl3, 0, 15.7039)
##AUDIT TRAIL= $$ (NUMBER, WHEN, WHO, WHERE, WHAT)
$$ ##TITLE= Audit trail, XWIN-NMR		Version 3.5
$$ ##JCAMPDX= 5.01
$$ ##ORIGIN= Bruker BioSpin GmbH
$$ ##OWNER= she
$$ F:/spectra/data/she/nmr/H-F/1/audita.txt
$$ ##AUDIT TRAIL=  $$ (NUMBER, WHEN, WHO, WHERE, WHAT)
(   1,<2021-06-10 13:44:37.00 +0400>,<she>,<DPX200>,
      <created by zg, POWCHK disabled, PULCHK disabled
       configuration hash MD5:
       00 E9 B6 7A A2 85 ED C7 34 08 36 98 17 FE 4E 26
       data hash MD5: 16K
       5C DB 4A CB 17 A9 44 D6 E1 3D 49 D7 5D BB 95 8C>)
$$ ##END=
$$ 
$$ hash MD5
$$ C0 43 80 3A 89 98 CE 01 94 10 E0 44 16 30 C3 BB
##$RELAX= 
##$RELAX= 
##$RELAX= 
##$RELAX= 
##$RELAX= 
##$RELAX= 
$$ Bruker specific parameters
$$ --------------------------
##$DU= <F:/spectra>
##$EXPNO= 1
##$NAME= <H-F>
##$PROCNO= 1
##$TYPE= <nmr>
##$USER= <she>
##$AMP= (0..31)
100 100 100 100 100 100 100 100 100 100 100 100 100 100 100 100 100 100 
100 100 100 100 100 100 100 100 100 100 100 100 100 100 
##$AQSEQ= 0
##$AQ_mod= 1
##$AUNM= <au_zg>
##$AUTOPOS= <>
##$BF1= 200.13
##$BF2= 200.13
##$BF3= 200.13
##$BF4= 200.13
##$BF5= 200.13
##$BF6= 200.13
##$BF7= 200.13
##$BF8= 200.13
##$BYTORDA= 1
##$CFDGTYP= 0
##$CFRGTYP= 5
##$CHEMSTR= <none>
##$CNST= (0..31)
1 1 145 1 1 1 1 1 1 1 1 1 1 1 1 1 1 1 1 1 1 1 1 1 1 1 1 1 1 1 1 1 
##$CPDPRG= <>
##$CPDPRG1= <>
##$CPDPRG2= <>
##$CPDPRG3= <>
##$CPDPRG4= <mlev>
##$CPDPRG5= <mlev>
##$CPDPRG6= <mlev>
##$CPDPRG7= <mlev>
##$CPDPRG8= <mlev>
##$CPDPRGB= <>
##$CPDPRGT= <>
##$D= (0..31)
0 1.2 0 0 0 0 0 0 0 0.06 0 0.03 0 0 0 0 0.0002 0 0 0 0 0 0 0 0 0 0 0 0 
0 0 0 
##$DATE= 1623318276
##$DBL= (0..7)
120 120 120 120 120 120 120 120 
##$DBP= (0..7)
150 150 150 150 150 150 150 150 
##$DBP07= 0
##$DBPNAM0= <>
##$DBPNAM1= <>
##$DBPNAM2= <>
##$DBPNAM3= <>
##$DBPNAM4= <>
##$DBPNAM5= <>
##$DBPNAM6= <>
##$DBPNAM7= <>
##$DBPOAL= (0..7)
0.5 0.5 0.5 0.5 0.5 0.5 0.5 0.5 
##$DBPOFFS= (0..7)
0 0 0 0 0 0 0 0 
##$DE= 6
##$DECBNUC= <off>
##$DECIM= 32
##$DECNUC= <off>
##$DECSTAT= 4
##$DIGMOD= 1
##$DIGTYP= 9
##$DL= (0..7)
0 120 120 120 120 120 120 120 
##$DP= (0..7)
150 150 150 150 150 150 150 150 
##$DP07= 0
##$DPNAME0= <>
##$DPNAME1= <>
##$DPNAME2= <>
##$DPNAME3= <>
##$DPNAME4= <>
##$DPNAME5= <>
##$DPNAME6= <>
##$DPNAME7= <>
##$DPOAL= (0..7)
0.5 0.5 0.5 0.5 0.5 0.5 0.5 0.5 
##$DPOFFS= (0..7)
0 0 0 0 0 0 0 0 
##$DQDMODE= 0
##$DR= 18
##$DS= 0
##$DSLIST= <SSSSSSSSSSSSSSS>
$$ [...]
##$SUBNAM2= <"">
##$SUBNAM3= <"">
##$SUBNAM4= <"">
##$SUBNAM5= <"">
##$SUBNAM6= <"">
##$SUBNAM7= <"">
##$SUBNAM8= <"">
##$SUBNAM9= <"">
##$SW= 20.0188882624521
##$SWIBOX= (0..15)
0 0 2 0 0 0 0 0 0 0 0 0 0 0 0 0 
##$SW_h= 4006.41025641026
##$TD= 16384
##$TD0= 1
##$TE= 0
##$TE2= 300
##$TE3= 300
##$TEG= 300
##$TL= (0..7)
0 120 120 120 120 120 120 120 
##$TP= (0..7)
150 150 150 150 150 150 150 150 
##$TP07= 0
##$TPNAME0= <>
##$TPNAME1= <>
##$TPNAME2= <>
##$TPNAME3= <>
##$TPNAME4= <>
##$TPNAME5= <>
##$TPNAME6= <>
##$TPNAME7= <>
##$TPOAL= (0..7)
0.5 0.5 0.5 0.5 0.5 0.5 0.5 0.5 
##$TPOFFS= (0..7)
0 0 0 0 0 0 0 0 
##$TUNHIN= 0
##$TUNHOUT= 0
##$TUNXOUT= 0
##$USERA1= <user>
##$USERA2= <user>
##$USERA3= <user>
##$USERA4= <user>
##$USERA5= <user>
##$V9= 5
##$VALIST= <valist>
##$VCLIST= <CCCCCCCCCCCCCCC>
##$VD= 0
##$VDLIST= <DDDDDDDDDDDDDDD>
##$VPLIST= <PPPPPPPPPPPPPPP>
##$VTLIST= <TTTTTTTTTTTTTTT>
##$WBST= 1024
##$WBSW= 4
##$XGAIN= (0..3)
0 0 0 0 
##$XL= 0
##$YL= 0
##$YMAX_a= 179188
##$YMIN_a= -121069
##$ZGOPTNS= <>
##$ZL1= 120
##$ZL2= 120
##$ZL3= 120
##$ZL4= 120
##$ABSF1= 10
##$ABSF2= 0
##$ABSG= 5
##$ABSL= 3
##$ALPHA= 0
##$AQORDER= 0
##$ASSFAC= 0
##$ASSFACI= 0
##$ASSFACX= 0
##$ASSWID= 0
##$AUNMP= <proc_1d>
##$AZFE= 0.1
##$AZFW= 0.1
##$BCFW= 1
##$BC_mod= 2
##$BYTORDP= 1
##$COROFFS= 0
##$CY= 11.3945322036743
##$DATMOD= 1
##$DC= 2
##$DFILT= <>
##$DTYPP= 0
##$F1P= 15.9154993809931
##$F2P= -4.1035820241983
##$FCOR= 0.5
##$FTSIZE= 0
##$FT_mod= 4
##$GAMMA= 1
##$GB= 0.15
##$INTBC= 1
##$INTSCL= 1
##$ISEN= 128
##$LB= 0.24
##$LEV0= 0
##$LPBIN= 0
##$MAXI= 10000
##$MC2= 0
##$MEAN= 0
##$ME_mod= 0
##$MI= 1.114404
##$NCOEF= 0
##$NC_proc= 0
##$NLEV= 6
##$NOISF1= 3.799351
##$NOISF2= 2.8
##$NSP= 1
##$NTH_PI= 0
##$NZP= 0
##$OFFSET= 15.70392
##$PC= 1
##$PHC0= -11482.18
##$PHC1= 10.00101
##$PH_mod= 1
##$PKNL= yes
##$PPARMOD= 0
##$PSCAL= 0
##$PSIGN= 0
##$REVERSE= no
##$SF= 200.130013532006
##$SI= 16384
##$SIGF1= 3
##$SIGF2= 2
##$SINO= 400
##$SIOLD= 16384
##$SREGLST= <1H.CDCl3>
##$SSB= 0
##$STSI= 0
##$STSR= 0
##$SW_p= 3612.71676300578
##$SYMM= 0
##$S_DEV= 0
##$TDeff= 0
##$TDoff= 0
##$TI= <>
##$TILT= no
##$TM1= 0
##$TM2= 0
##$TOPLEV= 0
##$USERP1= <user>
##$USERP2= <user>
##$USERP3= <user>
##$USERP4= <user>
##$USERP5= <user>
##$WDW= 1
##$XDIM= 8192
##$YMAX_p= 0
##$YMIN_p= 0
$$ End of Bruker specific parameters
$$ ---------------------------------
##NTUPLES= NMR FID
##VAR_NAME=  TIME,          FID/REAL,        FID/IMAG
##SYMBOL=    X,             R,               I
##VAR_TYPE=  INDEPENDENT,   DEPENDENT,       DEPENDENT
##VAR_FORM=  AFFN,          ASDF,            ASDF
##VAR_DIM=   8192,          8192,            8192
##UNITS=     SECONDS,       ARBITRARY UNITS, ARBITRARY UNITS
##FACTOR=    0.0002496,     1,               1
##FIRST=     0,             0,               0
##LAST=      2.0444736,     0,               0
##MIN=       0,             -121069,         0
##MAX=       2.0444736,     179188,          0
$$ Real data points
##PAGE= N=1
##DATA TABLE= (X++(R..R)), XYDATA
$$ [...]
1455A39o4M52O33m01p25J030O55j031l18O30M49q37m28J169l5r61j63P77j78p78
1475A5l80P11L53j241j27Q42j33r32K2P97j82j319O29Q45o27n66J19P37k62r12
1495a611O10P46l21q79N34J302p80r98J200P72q20o74R13P09n63r44J250M60p77
1514A29l67P82Q70j206n31J243L17j289j69J196K21j107l63J122J34j263j31J203
1532G91J74j406j03J504k21j448K72J101k17j250J32J287k36j125L09Q98l13j107
1550i58K21J260k61j542Q96J057q63r24P74J037r11r80J000J002q88r07O99J383
1568A095j177j136J488P16j324m86J312M37j221l06J378L44j307k96J110P90j430
1585a3m86J693K00j476j97J557N0j278k34J564j28j419K72Q90J67j426l7J394
$$ plain form
1455 139 75 527 1160 759 34 1064 1719 688 370 1000 1449 612 184 1353 1318 357 194 971 793 15
1475 15 -365 346 699 -542 -669 173 40 -892 -870 -73 -255 -1574 -945 -100 -727 -1293 -1174 -437 -699 -1611
1495 -1611 -1001 -255 -576 -1455 -921 381 -399 -1397 -197 575 -245 -919 -6 703 140 -804 446 906 129
1514 129 -238 544 1414 208 -323 920 1237 -52 -221 975 1196 89 -274 848 982 -281 -412 791
1532 791 965 -441 -544 960 739 -709 -437 664 447 -803 -671 616 380 -745 -436 462 149 -958
1550 -958 -737 523 262 -1280 -384 673 -190 -1114 -340 697 -214 -1194 -194 808 -80 -987 -288 1095
1568 1095 -82 -1218 270 986 -338 -824 488 925 -296 -602 776 1120 -187 -483 627 1417 -13
1585 -13 -499 1194 1394 -82 -279 1278 1328 50 -184 1380 1252 -167 105 995 1162 -264 -301 1093
1603A093l08j616M60J180m83j509N83J235q33j162O09R87o44j221M48J429r59
1620g11j223J031J109j167j002R96J197j309o93J307O15r62n14R33J080j089r01
1637a303J450O92j187n16J511O74j486m87J648K36j135j98J109N01j265n62J744
1654A426J33j572k31J465O4j642K84J198l06j291K62J009r6j385K04J410n60j460
1672a088N19J234m70j314M37J455q84j114O95R97n12r81O15J023o25j161J112
1689f2J007j030q51J025R67j099p85J130N06q24n94J028Q12j272o53J284N76j128
1707C7o06J063N39j326k31J343l5j165j08R44M00j549P8J158r3j096m2J247l2
1726E26j499L20J292m19r45J66J091k33j090L07R49j97q45J24J111l50j132M14
$$ plain form
1603 1093 785 -831 -371 809 326 -1183 -600 635 -198 -1360 -751 236 -408 -1629 -1181 248 -711
1620 -711 -1934 -903 206 -961 -1963 -967 230 -1079 -1772 -465 150 -812 -1326 -393 687 -402 -1303
1637 -1303 147 839 -348 -864 647 1321 -165 -652 996 1232 97 -101 1008 1509 244 -318 1426
1654 1426 1559 -13 -244 1221 1285 -357 -73 1125 819 -472 -210 799 703 -682 -478 932 372 -1088
1672 -1088 -569 665 195 -1119 -682 773 -111 -1225 -530 467 -45 -1026 -411 612 -13 -1174 -62
1689 -62 945 -85 -936 89 1056 -43 -828 302 808 -16 -610 418 1230 -42 -695 589 1165 37
1707 37 -569 494 1033 -293 -524 819 784 -381 -489 455 855 -694 -616 542 449 -647 -689 558 526
1726 526 -973 -653 639 220 -725 -559 532 299 -791 -484 465 268 -577 -453 658 308 -824 -410
1744d10J276p89o83M72R05p35n86M61Q26o89o03M98P50o28p00Q39P52j086n81
1763g11J060L44p21n71P31N49r79j81P73J87o15p19J074N72j382j06J081p5q60
1782e49q6J067j47p85j48J131j96p23j68P99K73j161M44Q75m08q16L36P36j73
1801C01o83N48N27k33n88Q5P83k18p37N22O06l94q06O05N56m66q03O68M75p47
1821Ak84L76K78l02n73N69K76p11j56L41L32p72k63O33Q2o51n3N10J45m82m69
1842a173P33J45p51Q7M67J34m73j28Q66J01o76J85O60j02k34k53O06K49o93L35
1862H5N44j18m72K08O75k08m85M61K46l10k05J12N05l00n05L81K01k58m03L86
1882E40L13m90m25N24J78l80k1Q9mo6n02N31o3l56n2K47K04n66k19O14o1l03J06
$$ plain form
1744 -410 866 77 -606 -134 771 36 -550 -89 737 48 -555 -57 693 65 -635 204 956 -130 -711
1763 -711 349 693 -28 -599 132 681 -298 -479 294 481 -134 -853 221 793 -589 -695 386 311 -549
1782 -549 -635 432 285 -500 -648 483 287 -436 -604 195 468 -693 -249 626 218 -598 -262 474 301
1801 301 -382 166 693 460 -128 -43 740 522 -215 307 913 519 -287 318 874 408 -395 273 748 1
1821 1 -283 93 371 69 -504 65 341 -370 -526 -185 147 -625 -888 -255 -173 -824 -877 -367 -222 -704 -1173
1842 -1173 -440 -295 -1046 -959 -492 -358 -831 -959 -93 8 -668 -483 177 75 -159 -412 194 443 -250 85
1862 85 629 511 39 247 922 714 229 690 936 626 421 533 1038 738 233 614 815 557 154 540
1882 540 853 363 -62 462 640 260 239 328 324 258 -244 287 224 -132 -184 63 267 -299 -518 96 35 -268 -162
1905a62J17j52j40K0J55j62o8R3P0J59n08J59M25l15l39L01J33q5k83J81J58k91
1927e34k01K50J48j42j45J89L43k64q9M50k0j24q7K00J60k52K38L4M5k2R6M0L49
1950F62l52K2M38q2k07J83j07jk40K39J95j65k93K7K44k56j53k5K85n28l2K15
1972F9j82J5l88J22J43m17P8p2J15j5k65J45N6j57K7K64j17O6P1l9K49j30J42
1995b20J96j25J30J23J15J72l22J65K52r5m3J36J05J67l47K08J64l45K60o8J7
2016F45J6k78M0L3j58K0L3M7l55k72K85Ql88nJ73j00k11k47L42K29m46j32L16
2039d05j40j48R6K16J35l56K11K04k04J04k3K47j09j04J70J67j08po4N27j99j90
2061B0K97K01l11o5J26J54N2n45M98l5M0k72J16J62Ml97L87rk92Q0n8K54k19j79
$$ plain form
1905 -162 -45 -197 -337 -317 -162 -324 -392 -299 -229 -70 -578 -419 6 -309 -648 -347 -214 -299 -582 -401 -243 -534
1927 -534 -735 -485 -337 -479 -624 -435 -92 -356 -445 5 -15 -139 -226 -26 134 -118 120 154 199 177 273 313 662
1950 662 310 332 770 688 481 664 557 556 316 555 750 585 292 319 563 307 154 129 414 -114 -146 69
1972 69 -113 -98 -486 -364 -221 -638 -560 -632 -517 -532 -797 -652 -596 -753 -726 -462 -579 -513 -442 -481 -232 -362 -220
1995 -220 -24 -149 -19 104 219 391 69 234 486 391 348 484 589 756 409 617 781 436 696 628 645
2016 645 661 383 423 456 298 318 351 398 43 -229 56 64 -324 -329 -156 -256 -467 -714 -372 -143 -589 -721 -405
2039 -405 -545 -693 -597 -381 -246 -602 -391 -187 -391 -287 -310 -63 -172 -276 -106 61 -47 -54 -118 409 210 20
2061 20 317 518 207 142 268 422 474 -71 427 392 432 160 276 438 442 45 432 423 131 211 153 407 188 9
2085IL22Rk73j83J47J86j74j45K78J07n00J5K06J61k02j60K05N8m14L18j00J16
2107a4k35j71L73n8m89K74L16k87j81J81K06k17j20J35M0k9j53m3N06k38k65L08
2129a61L08m12J8L29OJ0l78M12J41k60q7J39L38j51m68O30J23l06l7K57R5m23
2151A23j10M97k96k1p6K22J05l26j69L56p4j51pN7R9l07n9K65J0l30K12P5q2k78
2175b65L6L67r7l71L60N1k20k62L79R2k2l10J80J43j75n5MM35j83l86L25Omk33
2199b05K89J15l28q0J90L0r9j0k1L02l34j63L98O0l22P5J05J86m62R2L58j52j53
2222a29J18j28J47j38n5K94k19o5N0K46J13k42l1L57m9k19M8J54Q2l76J17K84
2244C59j15k00R6O9O8l14K12J18j56j37J91j4j01j32q9K91n7k49P4K09k38j71
$$ plain form
2085 9 331 340 67 -116 31 217 43 -102 176 283 -217 -202 4 165 -37 -197 8 66 -348 -30 -130 -14
2107 -14 -249 -420 -47 -105 -594 -320 -4 -291 -472 -291 -85 -302 -422 -287 -247 -276 -429 -472 34 -204 -469 -161
2129 -161 147 -265 -247 82 88 98 -280 132 273 13 -74 65 403 252 -216 414 537 231 194 451 546 123
2151 123 13 510 214 193 117 339 444 118 -51 305 231 80 73 130 229 -78 -137 128 138 -192 20 95 13 -265
2175 -265 -229 138 41 -330 30 81 -139 -401 -22 70 48 -262 -82 61 -114 -169 -165 270 87 -299 26 32 28 -205
2199 -205 84 199 -129 -209 -19 11 -88 -98 -119 183 -151 -314 84 144 -178 -103 2 188 -274 -182 176 24 -129
2222 -129 -11 -139 8 -130 -185 109 -110 -175 -125 121 234 -8 -39 318 269 50 98 252 334 -42 75 359
2244 359 244 44 140 209 277 -37 175 293 137 0 191 177 76 -56 -145 146 89 -160 -86 123 -115 -286
2266b86Q7L88n01p3L89k11P4j90O4K46l56j11L68m6j73j94L33K7j63rJ73jk3J18
2290g0J34J50n33J41L35k8q2k0K92l7j14N2J95p9j89J91pP1j59J27Q3j46l4Q4
2314C57R1j11k06K90n9l52O2m0J27k19k7J16P1k67p2R3J35l84j25J33J58j23r0
2337d42J56J5k48j03K07M0lj50L89K2j22R5O7q0q3J40J84j86J38J23O5m3j09Q6
2361A58J72k5j16j22L68j27j58O9J95j78p9K7J59j04l46K90Rk21Or7J4K44l98
2384b60J58P9k73J40j27J45L9j75J08M6k61K40M5N9o3j41J79R1k60J22K37o6K4
2407H6k8N1O4j34O4J54j96J89j21n3K50k82J12l9Qj8j07P1L4j37N1J00n9po3k44
2433b54J75K0J1j26n7Q2j08J82p8n1K24j86J02N4k07P0mJ9R6J40j78R9q2J43j5
$$ plain form
2266 -286 -199 189 -312 -385 4 -207 -133 -323 -259 -13 -369 -480 -112 -158 -331 -525 -192 -165 -328 -337 -164 -165 -188 -70
2290 -70 64 214 -319 -178 157 129 47 27 319 282 168 220 415 336 147 338 331 402 243 370 453 307 273 357
2314 357 448 337 131 421 362 10 72 32 159 -60 -87 29 100 -167 -239 -146 -11 -395 -520 -387 -229 -352 -442
2337 -442 -286 -271 -519 -622 -415 -375 -378 -528 -139 -117 -239 -144 -77 -157 -240 -100 84 -102 36 159 224 181 72 158
2361 158 330 305 189 67 435 308 150 219 414 236 157 184 343 239 -107 183 192 -29 -23 -120 -106 138 -260
2384 -260 -102 -23 -296 -156 -283 -138 -99 -274 -166 -120 -381 -141 -96 -37 -100 -241 -62 29 -231 -109 128 62 86
2407 86 58 109 173 39 103 257 61 250 129 76 326 44 156 117 125 107 0 71 105 -32 19 119 60 53 -10 -254
2433 -254 -79 -59 -48 -174 -231 -149 -257 -75 -153 -204 20 -166 -64 -10 -217 -147 -151 -132 -36 104 -74 25 -57 86 71
2458G1J9J9P0k32K49j77K1j36K20j10J92j95j09J66mN3k10J79k47m1J37O8n4n4
2482a05o9M9q9R0O6O7j52J03j00N7L4r3K80j18p7L11m12L11j43J18k5J09M9k6
2506B35j83L40k63m0K12N2r5j09p4P6n7oK76k59k05K48j28R4j89j27J93k85j9
2529c13K26j28r5p9K76M8k15J2J18j47P4L5n4L07k60j08J07O8P8q1P5R6j90L1
2553a19K69r1L9j53M2K10L8j63O3J05Kp0j79K61m3RL3n6n1j40J38J50j85o9J24
2578A64j28K3J23k52K16l03k0J80j81K17n6k3n0J08j86J03m9o0mK10P0j87j36
2601b21K02k21J18Pq9L27j58n4J88q2j97P7R3L04m77L49p9j38K29j87L7j8K4j57
2625a23R0p9J1Q1M8j02Q4j52K8N2N5J08j21Lj5j48K51k11P0P0j46R5J3p0R2m9
$$ plain form
2458 71 90 109 179 -53 196 19 40 -96 124 14 206 11 -98 68 64 117 -93 86 -161 -202 -65 3 -51 -105
2482 -105 -174 -125 -214 -124 -58 9 -143 -40 -140 -83 -49 -142 138 20 -57 254 -158 153 10 128 103 212 261 235
2506 235 52 392 129 89 301 353 258 149 75 151 94 88 364 105 -100 148 20 114 -75 -202 -9 -294 -313
2529 -313 -87 -215 -310 -389 -113 -65 -280 -268 -150 -297 -223 -188 -242 65 -195 -303 -196 -128 -50 -131 -56 40 -150 -119
2553 -119 150 59 98 -55 -13 197 235 72 135 240 242 172 -7 254 211 220 253 197 146 6 144 294 109 40 164
2578 164 36 59 182 -70 146 -157 -177 3 -178 39 -17 -40 -90 18 -168 -65 -114 -174 -178 32 102 -85 -221
2601 -221 -19 -240 -122 -115 -204 123 -35 -89 99 17 -180 -103 -10 294 -183 166 87 -51 178 -9 28 10 34 -123
2625 -123 -33 -112 -101 -20 28 -74 10 -142 -114 -62 -7 101 -20 -17 -32 -180 71 -140 -70 0 -146 -51 -38 -108 -16 -65
2651f5J09K9j77J24j81J17P8o0J02M6l46K68k3l0N4n1J02p0Q5o5j75L1O3l1R6
2676C0J48j37p7L1j8O4L8k2J51k15R7m3o6l7M3l5J76k38K23k88N9J43r4J47Ok41
2702a55J36j80O5J83j08M6j04L5J57j29m4J71p2m3O8Kl0J60j31J15O8j65p5k9
2726e9R8O3p1m7J60j10j01L3Q4r3RkL4l1l8o2R2N0j71K29j67j6P3p7J40j69J0
2753a39j18K28r8j72j06M48n9l5l7J1N2J9j51J49m2l8K00k80J65q8o6L24j09n6
2777BJ61j02J6L1j0M1%l0o5P6oJ8J5n8j40J92o8J3J60j2k71J20n6K0P3o1r1J13
2805H1j29L37k03J9j52N1P1j06j48L89j05N0k62R7J4k0j58NJ09j95K92j20M1j81
2829b23R8Qk1L5j54J04Rq0J0O2J62j43R3n8l1O9J06j06J6l7L7J41k20K13j18J52
$$ plain form
2651 -65 44 73 -104 20 -161 -44 34 -26 76 122 -224 44 21 -9 45 -6 96 26 111 46 -129 -98 -35 -66 30
2676 30 178 41 -36 -5 -23 41 79 57 208 -7 90 47 -19 -56 -13 -48 128 -110 113 -175 -116 27 -67 80 86 -155
2702 -155 -19 -199 -134 49 -59 -13 -117 -82 75 -54 -98 73 1 -42 26 28 -2 158 27 142 210 45 -30 -59
2726 -59 39 102 31 -16 144 34 -67 -34 50 -43 -34 -36 -2 -33 -71 -133 -41 9 -162 67 -100 -116 -43 -120 20 -149 -139
2753 -139 -257 -29 -127 -299 -405 43 -16 -51 -88 -77 -25 -6 -157 -8 -50 -88 112 -168 -3 -91 -157 167 58 2
2777 2 163 61 77 108 98 139 139 109 44 120 114 132 147 89 -51 141 73 86 246 234 -37 83 27 47 120 59 -32 81
2805 81 -48 289 86 105 -47 4 75 -31 -179 210 105 155 -107 -10 4 -16 -174 -169 -60 -255 37 -83 -42 -223
2829 -223 -125 -117 -138 -103 -257 -153 -144 -224 -214 -152 10 -133 -40 -98 -129 -60 46 -60 -44 -81 -44 97 -123 90 -28 124
2855A24Nj37J38r7q3l8J57j16R9O0j18K6Jp6N3K04p6RJ6K6j48n7K92j96J75k25
2881A8J16k58P5kJ7o4K10j39P0l8q8L7P3M4N5j78J66l3kJ57j60l8j14Q4qPj29
2908a22n2K09j43n1O4P7j0j19o8J57p8N0n8J38Mj13%LK3K3J01j65L0r9J70r6j60
2935b85K21q7J32p7Q9J8o9K04j93j34J37J48j44J72o3M1O0j51RK4Q8N3k64J77
2959A06J07q9Q0L2j31O9p9n0Nl7J32m2j25l4P8nJ39r9R4j88q9J11J9j6j5J0n9
2986g6J25j09M7p0N4N3j10J03J0j18J0j40J76O1K7J03j97L0n7J25j24qJ73n4K5
3011E9j57R5k0J99l10N6J04q9o8J08O7k32J19o5R3l2j57K01q8J47l0K7o1L2l7
3036c9J5l2j9K9M6J13k45o2J15J31J46q4Q6n4j95J34j1j93J96j62Q1J11p0J06
$$ plain form
2855 124 129 -8 130 33 -50 -88 69 -47 52 112 -6 20 21 -55 -2 202 126 135 151 177 29 -28 264 68 243 18
2881 18 134 -124 -49 -51 -34 -98 112 -27 43 5 -83 -46 27 71 126 -52 114 81 79 236 76 38 -76 8 0 7 -122
2908 -122 -174 35 -108 -159 -95 -18 -28 -147 -215 -58 -136 -86 -144 -6 -2 -115 -115 -112 -89 -66 35 -130 -100 -199 -29 -125 -285
2935 -285 -64 -151 -19 -96 -7 11 -58 146 -47 -181 -44 104 -40 132 69 110 170 19 28 52 140 193 -71 106
2959 106 213 124 204 236 105 174 95 45 50 13 145 103 -22 -56 22 17 156 57 151 -37 -126 -15 4 -12 -27 -17 -76
2986 -76 49 -60 -13 -83 -29 24 -86 17 27 -91 -81 -221 -45 16 43 146 -51 -21 -78 47 -77 -85 88 34 59
3011 59 -98 -3 -23 176 -134 -78 26 -63 -131 -23 44 -188 -69 -134 -41 -73 -230 -29 -117 30 0 27 -34 -2 -39
3036 -39 -24 -56 -75 -46 0 113 -132 -194 -79 52 198 114 200 146 -49 85 74 -119 77 -85 -4 107 37 143
3060A43j66lK5J27l6k11J81k73K59m8m5NJ08N9m20K07J93j77p0J7M5j33J79J02
3084F8r7n8j60J90j56K69j8j27j30L28k33N8K4o2J43j27n8K18j12P3j45J37j53
3107a28K12j24K5Q0Joj90P3N0J61j13j92J49M9rq7J16n2J4q8J21j19J89R7k40
3132a1J13j44mK17o2j04nn1M2J9lK6j57J75J42j36l9P9o6K3Lj04M7j29L3L7R7
3159C8R5l45K02N1k7P6j69K23j09j70J85R2j60J0J21j90K5J06j7K3m8N1r2k9Q5
3184B7l9j08J22Rj6J27q7r2M4K8j12Q1k4J86k47K20j92n3Q8l0Nn1K06j27q9J4
3210a10J42R5k53R9M9K4N4j43O2q2LJ6k5m9J2R2pJ5j01L32k75N3K7k17M6K39j08
3237a0j18J69p1Q0o3Njl8M7j56K63j10j81R5O9oJ31j48J07m2p5m1k1R9J62j24
$$ plain form
3060 143 -23 -26 -1 126 90 -121 60 -213 46 -2 -47 -42 66 125 -295 -88 105 -72 -142 -125 -80 -213 -34 68
3084 68 -29 -87 -247 -57 -213 56 38 -89 -219 109 -124 -66 -42 -104 39 -88 -146 72 -40 33 -112 25 -128
3107 -128 84 -40 -15 65 66 60 -130 -57 -7 154 41 -151 -2 47 38 -49 67 15 29 -59 62 -57 132 229 -11
3132 -11 102 -42 -46 171 109 5 0 -51 -9 10 7 33 -124 51 193 57 18 97 31 54 57 -47 0 -129 -96 -59 38
3159 38 133 -212 -10 41 14 90 -79 144 35 -135 50 142 -18 -8 113 -77 -52 54 37 60 12 63 -29 -58 27
3184 27 -12 -120 2 11 -5 122 35 -57 -13 15 -97 -16 -40 146 -101 119 -73 -126 -38 -68 -63 -114 92 -35 -124 -110
3210 -110 32 127 -126 -27 22 46 100 -43 19 -63 -60 -44 -69 -118 -106 -14 -21 -6 -107 225 -50 3 30 -187 -141 98 -10
3237 -10 -128 41 -30 50 -13 -8 -9 -47 0 -156 107 -3 -184 -89 -20 -26 105 -43 64 22 -53 -94 -115 -16 146 22
3263B2j30K4O3p7m3L3M8J11L1j14p7J02j7n4L2P0o9J71p7j18J65p3l0J34Jn0k18
3290a40K86k26R7l5%J3O2l9m7R8p5O8j73M07j08k02J27j65K53j77j47K53j18J24
3314A36l8p1j0k5N6p7O7m4O5j10Q8p8j03K45O8j34l6q8q2R2J39L8j91L4M5j6m7
3341g7o9J7J31JJ6p2n8Q3O1j04K6J6o3P8l2r8J80o7N5p7L0Lj7J82j58P3j29N5
3369a4M4J62j81j0j21N1r3J90L0j44J23m2j64J05J84k12Q3O1o1j59K01K41l94
3392a20J21m3J06m8J87o5j12J1J70q9J02j20j5o4qJ90j57J60O3r7r4p8J01o8L6
3417F9J2R0k42N9QJ20j01j03J94q3joq8l5N8N9Pj7P6q9j47K7P1K3m3r1P3J62j09
3446d7J3n0N6jm0k2R5j42M8J01m6N7p2P3P1j62Q5R6n4j38J44k29J93p3j7K16o5
$$ plain form
3263 22 -108 -84 -21 -98 -141 -108 -60 51 82 -32 -109 -7 -24 -78 -46 24 -45 126 49 -69 96 23 -7 127 128 78 -140
3290 -140 146 -80 17 -18 -18 -5 57 18 -29 69 -6 62 -111 296 188 -14 113 -52 201 24 -123 130 12 136
3314 136 98 27 17 -8 48 -29 38 -6 59 -51 37 -41 -144 101 169 35 -1 -89 -171 -79 60 98 -93 -59 -14 -30 -77
3341 -77 -146 -129 2 3 19 -53 -111 -28 33 -71 -45 -29 -92 -14 -46 -144 36 -31 24 -53 -23 -20 -37 145 -13 60 -69 -14
3369 -14 30 192 11 1 -120 -69 -162 28 58 -86 37 -5 -169 -64 120 -92 -9 52 -9 -168 33 274 -120
3392 -120 1 -42 64 16 203 138 26 37 207 118 220 100 85 21 13 203 46 206 269 172 78 0 101 33 69
3417 69 81 171 -71 -12 -4 116 15 -88 106 23 22 16 -72 -107 -49 10 17 0 76 -13 -160 -133 -62 -39 -82 -173 -100 62 -47
3446 -47 -34 -84 -28 -29 -69 -91 4 -138 -90 11 -35 22 -50 23 94 -68 17 113 59 -79 65 -164 29 -44 -61 155 90
3473I0M5O6j90j00K18o6J36k66J10R5n9J8j53J88N5Mj32j6lJ18j78L3Q7j33M7
3498A4N0n1M4l0k8o6J1R0m3j55J17K04k13Q2p7K47k50o3K22n2j74J61O0j88J46
3523E8o1j9p5J79j54j08N8R9K6l2N6m2l5r3R3j9J12p4j39j19J97J66pl8J11k19
3549g9K1J79J16j37k20K00r6jj13M5J90j19N8K9k20K48n3j22J35Oj07J44q1P1
3573I4p3n2Q4q0J01n8K9J30j57R3j99RJ45j02kJ15j53J06J24k45m4J99k6j26L2
3598e6R8k94L72k38K1J70j8p3%J30l04L34j37p2O1K3j22L10q7j20n8%J65m2k69
3623b06J79R4q7J06r5O6m8j7M2m7Q8o8J03No8q4L1o7K5j05Q9J06l1N8q7J10l6
3650E6P9j92J54m9j05L7o5J62K7r5M2j46J53p2MJ9k2J47k84R9R9j07J72%j41L5
$$ plain form
3473 90 135 201 11 -89 129 63 199 -67 43 138 79 97 -56 132 187 191 59 43 40 158 -20 13 100 -33 14
3498 14 64 13 57 27 -1 -67 -56 34 -9 -164 -47 157 -56 26 -51 196 -54 -117 105 53 -121 40 100 -88 58
3523 58 -3 -22 -97 82 -72 -180 -122 -23 3 -29 27 -15 -50 -143 -50 -69 43 -31 -170 -289 -92 74 67 29 140 -79
3549 -79 -58 121 237 100 -120 80 -16 -17 -130 -85 105 -14 44 73 -147 101 48 -74 61 67 -40 104 23 94
3573 94 21 -31 53 -27 74 16 45 175 18 111 -88 -79 66 -36 -38 77 -76 30 154 -91 -135 64 38 -88 -56
3598 -56 42 -252 120 -118 -97 73 55 -18 -18 112 -192 142 5 -67 -6 17 -105 205 118 -2 -60 -60 105 63 -206
3623 -206 -27 67 -20 86 -9 57 9 -8 34 -13 75 7 110 115 47 -37 -6 -73 -48 -153 -64 42 11 69 -18 92 56
3650 56 135 -57 97 48 -57 -20 -85 77 104 9 51 -95 58 -14 -10 9 -13 134 -150 -51 48 -59 113 113 -28 7
3676GN6j52R3Jj1N2J06m8p0r4N4J19j60N0L7j48Q8j10N6O1j8r6J32j9o0N2r9j19
3704b40O7K30m7p2k3R4j71J20O0J3K6k65J72Qk6J35L4J7j15j01J99m6j88pQ3K72
3730B29j64j39J02l3J40j10K7k2J39q2%j69k1R7J64j40J48j32K7j76J11KM2j2
3754B8m2O5o4J44j41nq2J22N5j21J7K5J10k56J36n1j1k0K30j00Lj52J52k0k16
3779a94K34j26J98j78K1J20k00J65n2j00P1l5onK28j76M4j79M3K50K8o6q6pO6
3804E8o1K7k0k7J4j36J18J78k08k3L8m7J10L2k8n9K2l5J72K2L5k44R5j07L9P5
3830D0R9p0k9k5Qk0p4K04j44M1qM8m1O5j75J14J5o4Qo6q3J04N6j04K36j20L5j37
3858h7L9o9P9j11J63K7K1k19K19k31O5J04R6j25m4J42J62k23k35J69O4Oj19R0
$$ plain form
3676 7 63 -89 4 5 -6 46 152 104 34 -60 -6 113 -47 3 40 -108 -20 -130 -74 -13 -31 -127 5 -14 -74 -22 -121 -240
3704 -240 -173 57 10 -62 -85 9 -162 -42 18 31 57 -208 -36 -28 -54 81 115 132 17 -84 115 69 -119 -126 -43 229
3730 229 65 -74 28 -5 135 25 52 30 169 87 87 -82 -103 -6 158 18 166 34 61 -115 -4 -2 40 28
3754 28 -14 51 -13 131 -10 -15 -97 25 80 -41 -24 1 111 -145 -9 -60 -71 -91 139 39 42 -110 42 22 -194
3779 -194 40 -86 112 -66 -45 75 -125 40 -12 -112 -41 -76 -82 -87 141 -35 9 -170 -127 123 151 85 -1 -8 58
3804 58 -3 24 4 -23 -9 -145 -27 151 -57 -80 -42 -89 21 53 25 -34 -12 -47 125 147 182 -62 33 -74 -35 40
3830 40 139 69 40 15 23 3 -71 133 -11 30 22 70 29 94 -81 33 48 -16 -8 -74 -157 -53 3 -101 135 15 50 -87
3858 -87 -48 -117 -38 -149 14 41 62 -157 62 -169 -104 0 96 -29 -73 69 231 8 -227 -58 6 12 -107 -17
3882a7N8pl4qNM8j13Q1L2m0K1J12n6j30J33r7K9jQ4j06R3J22J6q2q4j6r5K95k65
3911b2j5J10n6R1o8l0J47j61J49j61j5nQ4p0L6J32k51K6K06j59jJ4K2J73k63J8
3937f9J22k82K42K4j88L04j26j6j09j34J31J50Plj3J47n4m6n1o3J46n6ml7L6j4
3963D4j00L8L6r0L0k8J56k62J15P2Q7j63J48l4L6j25j00K04j0j35M9j0l6J91q
3988A05j72r3N7K21j03K4N9l4j4J9j21J87L2j84J2J40L7j46p6K13j39%l2J3O7
4013G2r7J24k3jO0q0j12J66j03j6r4J52l3j22K35pj1o7j72J24P3l4K6j4o6q8J30
4040B2J28j55K2j23O7r4K8N7J19k6K3Q7k68J74j01P6j00M9N7m8Qj13J75P6j43
4065cq1l5P8o6o8J39J35j57o6J36j68K10j11J43q3M5kp3m0j6R4o7J28j91O9J45
$$ plain form
3882 -17 41 34 0 -8 -3 45 -68 13 45 5 26 138 82 -48 85 -12 17 16 100 -6 87 209 225 143 59 43 -52 243 -22
3911 -22 -37 73 17 108 40 10 157 -4 145 -16 -31 -36 48 -22 14 146 -105 -79 127 -32 -33 -19 3 176 -87 -69
3937 -69 53 -229 13 37 -151 153 27 11 -98 -232 -101 49 56 53 40 187 133 87 36 -27 119 63 59 22 58 44
3963 44 -56 -18 18 -72 -42 -70 86 -176 -61 11 98 -65 83 49 85 -40 -140 64 54 -81 -32 -42 -78 113 105
3988 105 -67 -160 -103 118 15 39 98 64 50 69 -52 135 167 -17 -5 135 172 26 -50 163 24 24 -8 5 72
4013 72 -25 99 76 75 135 55 -57 109 6 -10 -104 48 15 -107 128 121 110 43 -129 -5 68 34 60 46 -20 -108 22
4040 22 150 -5 17 -106 -39 -133 -105 -48 71 45 68 155 -113 61 -40 36 -64 -15 42 -6 2 -111 64 140 -3
4065 -3 -84 -119 -41 -107 -175 -36 99 -58 -124 12 -156 54 -57 86 3 48 46 -27 -67 -83 11 -56 72 -119 -50 95
4091I5p8l5j2M2P4l9K9j87L35k28j34K86k21K09J9l19Q9R8j01J11L0lo6P4K5j70
4117g7K23r1l5j09L52l15M1K04ol82l9K90q0L3N9K3j12J68j45n2J03J23j66n0
4141d0K1%M5j22J83j46o3N6J04k7pJ22j57J42k50J76j7k15K74L2r6j68J6n2J60
4166b9L0j44N2J9r9o6J25J03r2N7J50k19M9Q6M3J1k41J38k7O0P4j18J27j55O4
4191bn4N4Q3l2j7q6J94k54J04j40K01j01l9J84m8r8J78j42P4K3N2N8j80n9J58
4216A11l2o6m2J74j26%l4l0J42p2j24K3J15K41k42k39L27j49mM3l2o4J11J5j07
4241f1J48j55Q9o3q8M8k3K80k35Q7j07L9oP3J97O5k41j0o7l9K05m5L3j99J28j31
4267g8R0K4q7J01q7K6Pl0J55l75L23j21O1JM8k5j13P4RJ7j66P0q4J53q1J27pj52
$$ plain form
4091 95 17 -18 -30 12 86 47 76 -111 224 -4 -138 148 -73 136 155 -164 -75 23 -78 33 63 60 -6 68 93 -77
4117 -77 146 55 20 -89 263 -52 -11 193 187 -195 -234 56 -24 9 68 91 -21 147 2 -50 53 176 10 -40
4141 -40 -19 -19 26 -96 87 -59 -122 -66 38 11 4 126 -31 111 -139 37 20 -195 79 111 15 -153 -137 -189 -29
4166 -29 1 -143 -91 -72 -171 -237 -112 -9 -101 -44 106 -113 -64 22 65 76 -165 -27 -54 6 80 -38 89 -66 -2
4191 -2 -56 -2 81 49 32 -54 140 -114 -10 -150 51 -50 -89 95 47 -51 127 -15 59 82 134 192 12 -47 111
4216 111 79 13 -29 145 19 19 -15 -45 97 25 -99 -76 39 280 38 -201 126 -23 -27 16 -16 -80 31 46 -61
4241 -61 87 -68 21 -42 -130 -82 -105 175 -60 27 -80 -41 -47 26 223 288 47 37 -30 -69 136 91 124 -75 53 -78
4267 -78 12 36 -51 50 -37 -11 -4 -34 121 -254 69 -52 9 10 58 33 -80 -6 3 20 -146 -76 -160 -7 -88 39 32 -120
4295a20K85k17N5p8j9J40k5O8j20J94j66N8m0R1q3j07J85n3q7q0J72k7o1O6L2
4320F3o2K14k05OL7J3j58M1R6r7rJ20j89o8J51K5j3j36Q3l4n5R6L7kJ62k74R6
4347f2N9r3J39p8N9j36J20q1QK8m1P0p5J39J22j46l7L1o4J11q4r4J77k09N3J47
4373F3j07J35j09jN6M0k04K59m6p6j79K78k2l32K85J06k72J29k9j66K72p3L9N1
4397I7j35q1J97q4r1K20j06p2J78k9l3m3j1n9J1J51j48kO5p9j3j3J64n9n6j6M1
4424fj0kj32J80j10K14j81l8K41r8j50R4Q8j03J07j79J27J07j53J34j65K4P5M5
4448A09p0q2m4J69L8j52J61k12K34Kj40j37M9P5J72k53J85j53j2J36oNr3Lm7K46
4474A83j38Mm3n0M5j3qQ6L3n5m9M3p7R9l9N1M4j85Q6K1L4o1l1j16P3kn7J34j27
$$ plain form
4295 -120 165 -52 3 -75 -94 46 21 89 -31 163 -3 55 15 106 23 -84 101 48 -39 -119 53 26 -35 31 63
4320 63 1 215 10 16 53 66 -92 -51 45 -52 -61 59 -130 -198 -47 -22 -35 -171 -88 -122 -177 -81 -44 -46 116 -158 -62
4347 -62 -3 -96 43 -35 24 -112 8 -73 -65 -37 -78 -8 -83 56 178 32 -5 26 -38 73 -11 -105 72 -137 -84 63
4373 63 -44 91 -18 -19 37 77 -127 132 86 10 -169 109 87 -245 40 146 -126 3 -26 -192 80 7 46 97
4397 97 -38 -119 78 -6 -97 123 17 -55 123 94 61 18 7 -52 -41 110 -38 -40 25 -54 -67 -80 84 25 -31 -47 -6
4424 -6 -16 -18 -150 30 -80 134 -47 -85 156 58 -92 2 90 -13 94 -85 42 149 -4 130 -35 -11 64 109
4448 109 39 -43 -87 82 120 -32 129 -83 151 153 13 -124 -75 0 172 -81 104 -49 -61 75 69 74 -19 -16 -63 183
4474 183 45 49 6 -44 1 -12 -20 66 99 44 -5 38 -39 60 21 72 116 -69 17 38 72 11 -20 -136 -63 -65 -122 12 -115
4503a15O4O1l2j5J04k17K47j52j37K40nr9J16j34J30l5M8j26q7J79m4m8N3J17
4527A13j79N5Q7j47J32j06J15j74J27k4J58j86qP0r8N8J14p5q4J44j12L9n0J53
4551A22J12j38j18P4M2M3k04Q9r6P6K14k76JJ00j30Q7j8N6J1j0l4j4q8M3M0j0
4577b6J21j65q7RR2J6j14M4J03p0M9j43K47m7L5p8P3l1mo5M1O8j46J11R6j69q2
4604a22J3q0K09R5r9o2k0R5n5PNn9O5M3R4k15j5L6O5K23j86P4j76J58r5k01L06
4631A03j51P4J12j86N0J27k70K69j50Nl8J9%K13j03K1j06k8r7J26P1j43J13K6
4655E7j49J00j20j01J20L30l86J06J44o9J84k65LJ06q6N0J0nl3rk9J27r0m9Q9
4680C5m6k29O7J51K21j19n0l1o1O5K0o7r9k5J81Lo7M6j18J89o4J21N0j95j05J47
$$ plain form
4503 -115 -51 10 -22 -37 67 -150 97 -55 -192 48 43 -56 60 -74 56 21 69 -57 -144 35 -9 -57 -4 113
4527 113 -66 -11 76 -71 61 -45 70 -104 23 -1 157 -29 -37 33 -65 -7 107 32 -52 92 -20 19 -31 122
4551 122 234 96 -22 52 94 137 -67 22 -74 2 216 -60 -59 41 -89 -2 -20 36 47 37 3 -11 -99 -56 -16 -26
4577 -26 95 -70 -157 -148 -56 -40 -154 -110 -7 -77 -28 -171 76 29 64 -14 59 28 24 -41 0 68 -78 33 129 -40 -122
4604 -122 -109 -189 20 115 16 -46 -66 29 -26 -19 -14 -73 -8 35 129 -86 -101 -65 0 223 37 111 -65 93 -2 -203 103
4631 103 -48 26 138 -48 2 129 -141 128 -22 -17 -55 -36 -36 177 74 95 -11 -39 -136 -10 61 -82 31 57
4655 57 -92 8 -112 -213 -93 237 -149 -43 101 32 216 -49 -46 60 -26 24 34 29 -4 -13 -42 85 -5 -54 35
4680 35 -11 -240 -173 -22 199 80 30 -1 -62 3 23 -44 -143 -168 13 16 -51 -5 -123 66 2 123 173 -22 -127 20
4706B0q8q5L16m5N6k47LR0P4j30O4r4m7L4J38P9r2Q0j79N2l8j5K20o5p1K5j99
4733a44k8K77j04R4r4r4J03j56J58K6M0k21J35j8J01r9n3K09k03J70km5q4l1j1
4758g4J08j37j1Q7j0N7K0l5j02K4J83j38KQ6J12k06J15l0qp3N2Qj42Q9m1J9J6
4785b9j00Q5J9q7K3R0j16PJK3K18j82L1O3m5o2O7N3kN6j07J21j42Q5j1k2P3q0
4813C0J44q9q9K9P4o2j58Q6N4J57j67jp9O1l8J5L01l91Q6L8m5J25k2j19J3p9J39
4840A3L8p5M5o6l9K35k92O8L6O9r2J16l8j2p8Q3J9O1r8N9l0m7J25j06J46K5k28
4867f3J80r3m5n5K88l59K40k12J57Mk05K42k91J85J90j39n9J49j41MN5M6r1O9
4891E6p6p3J50o1J26j42J04j8k24K59r1O4j44J44M8k9O4j36j31O3J21k89N1J39
$$ plain form
4706 20 -68 -153 163 118 174 -73 -70 20 94 -36 28 -66 -113 -79 59 138 46 126 -53 -1 -39 -54 166 101 30 55 -144
4733 -144 -172 105 1 95 1 -93 10 -146 12 38 78 -143 -8 -26 75 -24 -77 132 -71 99 97 52 -32 -63 -74
4758 -74 34 -103 -114 -27 -37 20 40 5 -97 -73 110 -28 -26 60 172 -34 81 51 43 -30 22 30 -112 -23 -64 -45 -29
4785 -29 -129 -44 -25 -112 -89 1 -115 -108 -107 -84 134 -48 -17 46 1 -61 6 59 57 113 6 127 -15 70 59 37 110 30
4813 30 174 85 -4 25 99 37 -121 -35 19 176 9 8 -71 -10 -48 -33 268 -123 -37 1 -44 81 59 -60 -47 -126 13
4840 13 51 -24 21 -45 -84 151 -141 -73 -37 32 -60 56 18 6 -72 11 30 91 -7 52 22 -25 100 -6 140 165 -63
4867 -63 117 24 -21 -76 212 -147 93 -119 38 42 -163 79 -212 -27 163 24 -35 114 -27 -23 32 78 -13 56
4891 56 -20 -93 57 -4 122 -20 84 66 -158 101 10 74 -70 74 122 93 157 21 -110 -47 74 -215 -164 -25
4915b5O4J14m5j33J12j19P7r0K5R8m8p2j2J11j15R2j01J1oJ25J75l53q5Q3J08
4940iL4J14l0k36Q5L6j6K02m88L02M6l1j80J88Qk17K40l8m2j43K60j55J92j99
4964g7N4J56j00J44pk78O3k9p1J15J00q3K3m0p6J50m1l3n6J7J46nO6J14k34Q2
4990A00lj05q3J60Oj76O4l1J04o8K1M5M9K3j08K0J69k18mm5L1J39j33J39l8Q2
5016A40l13J49Q9j04k7kj5O9M1jJ1q9p0M9J15L0j6P9k56p4K39o8pJ8M0p4J58j32
5044b1lJ64j72O2j9J72j60j85J63k9o2J15j11J06J27k24J15PR0r4L8p0J0M3j10
5069d8j18J81K6j5P1m3L6j6j45K44j72j12J35j10J11j33R5k4R3M6j17JJ08j57
5093f3J07O9p1l3oJ6k5N4l09Q1J62QP3n7n6K50j02K8k31J9K22r3j02Q9O6m1k0
$$ plain form
4915 -25 39 153 108 -25 87 -32 45 -45 -20 78 30 -42 -54 57 -58 34 -67 -56 -62 63 238 -115 -200 -117 -9
4940 -9 25 139 109 -127 -42 -6 -22 180 -308 -6 40 9 -171 17 25 -192 48 10 -32 -175 85 -70 122 -77
4964 -77 -23 133 33 177 170 -108 -45 -74 -145 -30 70 -13 10 -30 -106 44 3 -30 -86 -69 77 72 138 252 18 100
4990 100 97 -8 -91 69 75 -101 -37 -68 36 -32 -11 34 83 106 -2 18 187 -31 -35 -80 -49 90 -43 96 58 140
5016 140 -173 -24 65 -39 -66 -68 -83 -14 27 26 37 -52 -122 -73 42 72 56 135 -121 -195 44 -24 -31 -13 27 -47 111 -21
5044 -21 -24 140 -32 30 11 183 23 -162 1 -28 -90 25 -86 20 147 -77 38 45 135 41 79 9 19 62 -48
5069 -48 -166 15 41 26 97 54 90 74 -71 173 1 -111 24 -86 25 -108 -13 -37 56 102 -15 -14 94 -63
5093 -63 44 113 42 9 3 19 -6 48 -261 -180 -18 -10 63 6 -50 200 98 126 -105 -86 136 43 -59 30 96 55 35
5120C5o4J08M8j39l6qj09R7O0j7P0J49k08J99j65J78j63l9K7O7p2O1j8j06J89
5145A44nj80R2j27PqQ9n5nK02j22J0p2n1L3O0om5J58k75R7J9J4Q4J02k32RjO3
5174am9J63j61K1PJ3q5J4K34o9r7q4K40o6K5j31j84K88M9j48L8n0P9k2p6P2kP
5202B5p3O1n3J03k1J9k25J86Q6l9o4K07j04k4j70J56j32j0R1j3OKp4p5J91n7j50
5229a51J01j27J64j07K06o9j05J91j06kK1lJ2j2j48J25J8M3j79O4J01o1p3j10
5253b07n3K25J6J2p0RL4O1r5Q3j30nJ44j28J36k04J47n5J57m9o2j44K03nQ7j55
5279d8l1J9N5L2J26j79Q7k8k1K7K0R3j41J03j29K3NN3P1m3k8o6J2l0j28J35J54
5306A43j55K5l5j58K53r0o4J52n7J6j9K4N9p1j30J85q2q7K32m8j53k0J59j69Q3
$$ plain form
5120 35 -29 79 127 -12 -48 -56 -165 -68 -8 -25 45 194 -14 185 20 198 35 -4 23 90 18 79 61 -45 144
5145 144 139 -41 51 -76 -69 -77 12 -43 -48 154 32 42 -30 -81 -48 12 6 -39 119 -156 -59 -40 -26 58 160 -72 -63 -64 -1
5174 -1 -50 113 -48 -27 -20 -7 -92 -78 156 87 -10 -94 146 80 105 -26 -210 78 127 -21 17 -33 46 24 -52 20 18 25
5202 25 -48 13 -40 63 42 61 -164 22 108 69 5 212 108 84 -86 70 -62 -72 19 6 12 14 -60 -135 56 -1 -151
5229 -151 -50 -177 -13 -120 86 17 -88 103 -3 -5 16 13 25 13 -135 -10 8 51 -128 -64 37 -24 -97 -207
5253 -207 -260 -35 -19 -7 -77 -68 -34 27 -68 15 -115 -120 24 -104 32 -172 -25 -80 77 28 -34 -178 25 20 107 -48
5279 -48 -79 -60 -5 27 153 -26 61 33 12 39 59 152 11 114 -15 8 13 66 137 94 66 0 12 -18 -146 -11 143
5306 143 -12 13 -22 -180 73 -17 -81 71 14 30 11 35 94 23 -107 78 -4 -91 141 93 -60 -80 79 -90 -7
5331gl8Q3m7k2j3n4Q7R9j01rj4J53j1J00j74l7k4N3j70J37m5n1P9j40K12j34J49
5358F1q2n0O6j69J21J06K2Qj12J13M7j31%J22j81O4N0j98J24n8K5M4mlj84J64
5384c5R9m9rm4O3j8O9k6k2j6K1N1p0pJ17k29Q6J09j96J58N2j10Pk4k8J58n6o1
5412a0q6O7J32j05kJ47k87J21r0K17k03L6J87j17N2j26o6K27j55J79k42K9J59
5435F4k37K32j05M2L3j95L4J77M1j32j43K41j17J90n7J67k26K7r0Q1l6Oj56K45
5459H6l5J72k73J20j74j11K46n0J64l07J04J29k3MJ7j85N9N6k5p5N5O3r8o8M2
5484a07J62l1j3j22q0J56M6O1N1o2J39k73J99p1J52k34j38K90k78K12J70q5k1
5507A23j02j27K12k25Q6J41j34M9j3k29K70Mm1P1q9j37J51l6N4m5l0J1pk5J76
$$ plain form
5331 -7 -45 38 -9 -31 -44 -98 -11 88 -13 -22 -36 117 106 206 32 -5 -29 24 -146 -9 -54 -105 -26 -166 46 -88 61
5358 61 -21 -71 -5 -174 -53 53 75 83 -29 84 131 0 0 122 -59 5 55 -143 -19 -77 -52 -8 -12 -15 -199 -35
5384 -35 64 15 6 -38 25 7 76 50 28 12 33 84 14 7 124 -105 -19 90 -106 52 104 -6 1 -23 -51 107 51 -10
5412 -10 -96 -29 103 -2 -4 143 -144 -23 -113 104 -99 -63 124 7 59 -67 -133 94 -61 118 -124 -95 64
5435 64 -173 59 -46 -4 29 -166 -132 45 86 -46 -189 52 -65 125 68 235 9 36 -54 27 -9 -3 -159 86
5459 86 51 223 -50 70 -104 -215 31 -19 145 -162 -58 71 48 52 69 -116 -57 -1 -26 -101 -46 17 -81 -149 -107
5484 -107 55 24 11 -111 -191 -35 11 72 123 61 200 -73 126 55 207 -27 -165 125 -153 59 229 144 123
5507 123 21 -106 106 -119 -33 108 -26 23 10 -219 51 55 14 85 -4 -141 10 -26 28 -17 -47 -36 -43 -68 108
5532A08j63K03k07j12L43j76k9P2O7k03M3L1J57j14L0j01J14j33O2P2o3N0O4k
5556A13j01j41O7J38o2M2k18L04j67K0j05J06O4j63J06j09Q4J7r4Q9m1R2o8m6
5580g3P2j25L1K27k39k4K73r7q5Q7j78J02K03k46P5j7P2m8j82J56j6n9J64r8M5
5605B0m5J29j09J69p0p0K5J43j74n7J38j49L3j20J99M1m3o5N6Q9j17q5Nj07K00
5630C6P2o8p0l1P3R7p7o8R6N4n5j11j7pJ28j17R0K3k18L2J96j30P7KK3M3j43J19
5658D9k2o2j83L5K57q6J2j65K6J94P6j65J35o5l1j24K00p4J1o5j72L96o8j62J35
5683H2k1j5l8l0J78k62J68j02P8P6j17j7R6o5K39j19j37j01J62p1K6l6J70m5k00
5708a01M9k5K5m3K08L0j09P5Q1j93P2j70J66j23j09J80O0N7No6j84j8J69r9j36
$$ plain form
5532 108 -55 148 -59 -171 172 -4 -33 39 106 -97 -54 -23 134 20 50 -51 63 -70 -8 64 1 51 115 113
5556 113 12 -129 -62 76 14 56 -162 142 -25 -5 -110 -4 60 -103 3 -106 -22 -5 -99 -10 -51 41 -27 -73
5580 -73 -1 -126 -95 132 -107 -131 142 45 -40 47 -131 -29 174 -72 3 -14 58 10 -172 -16 -32 -91 73 -25 20
5605 20 -25 104 -5 164 94 24 49 192 18 -39 99 -50 -17 -137 62 103 60 -5 51 140 23 -62 -57 -164 36
5630 36 108 40 -30 -61 12 109 32 -36 60 114 59 -52 -69 -76 52 -65 25 48 -170 -138 58 -72 5 7 30 73 -70 49
5658 49 27 -35 -218 -183 74 -12 0 -165 -139 55 131 -34 101 36 5 -119 81 7 18 -47 -219 177 109 -53 82
5683 82 61 46 8 -22 156 -106 62 -40 38 114 -3 -20 76 11 250 131 -6 -107 55 -16 10 -26 144 99 -101
5708 -101 -52 -77 -52 -95 113 143 34 109 190 -3 69 -101 65 -58 -167 13 73 130 135 69 -115 -133 36 -63 -199
5733a99K86k27K14K4k6r0Q8J43r4k41J14J10j68n1J9K20j54p5K32j27j8O3n3q1
5757i1PL7K9Nj73J79j16J93km6k5n4J02o0q2J06j2J8j5N7jLj4m6N1p1m6k6n8p8
5787b29K11O9q3L4l0J4L3jM4j87K76j61J9J49k20K49j42j9QrqJ25k66K8K14m4
5813G4O4o2R0j30j8J11K3j44l2R4J38j98l6k0q1J52j98J75R9q8m7j30K39Jp5j08
5839a07R1J9M4l5R8j22P1j35K2j03J83n3J20m3M2j82J89j57J34n1j10J59k4o3
5863a3j02K73k79R2l3K83j66j52J20J04o9Pk9j6O7L8q4J11j25j47J50o5j15J37
5887a3k7J99k0j40o4k3J03K04j97j3j6R0j26R4R1j11m2J24Lk21L7K3j05J2L00
5912A62j63m7L4M5o9j3J28J6o1Q0j61L5k8M6k45L18rj34j12J37J65K7p6j30O6
$$ plain form
5733 -199 87 -140 74 98 72 -18 70 213 119 -122 -8 102 -66 -117 -98 122 -32 -107 125 -2 -20 43 -10 -91
5757 -91 -84 -47 -18 -13 -186 -7 -123 70 68 22 -3 -57 45 -15 -97 9 -3 15 0 57 56 59 45 -1 50 -21 -67 -93 -151 -229
5787 -229 -18 51 -32 2 -28 -14 19 18 62 -125 151 -10 9 158 -62 187 45 26 34 25 17 142 -124 -96 118 74
5813 74 138 76 166 36 18 129 152 8 -24 70 208 10 -26 -46 -127 25 -173 2 101 13 -34 -164 75 76 1 -107
5839 -107 -16 3 47 12 110 -12 59 -76 -54 -157 26 -27 93 50 92 -90 99 -58 76 25 -85 74 50 -13
5863 -13 -115 158 -121 -29 -62 221 55 -97 23 127 58 65 36 20 87 125 41 152 27 -120 30 -35 -150 -13
5887 -13 -40 159 139 -1 -65 -88 15 219 22 9 -7 83 -43 51 142 31 -11 113 116 -105 -68 -45 -150 -138 162
5912 162 -1 -48 -14 31 -38 -51 77 93 32 112 -49 -14 -42 4 -241 77 68 -66 -178 -41 124 151 75 -55 11
5937A1j21K17q9J01k30K01j50J66k27M3J73j12j50K04j70K6o5K07j05q6J57q0
5959g9N5j08J31J5m2J01OJ2j07r3K22p4n0NJ38j75p1m1J29L8J07j17p8R1p4l6
5985i5J6J69j23P7l9n9Q2k0K3M1j26L9j0J65j90RQ9LO6k86K31rK8j29J27j66r3
6012a80J99r9Nn6K01j98J46j41L64k89k6J04j3K2r7O7j7K00j70%m8k17K03l5J46
6037G1q1N5j61L6K9K7L9k8J13j76R4j51J03l8J42q2p5J28p6Lm9J72j86J41n9p0
6063g9N0p2N9N5N5k38J15P1J35q7k2r0K0p8O0N8j07J63Oq0j2m5j07R7R0j15K19
6090A21J15k37m0j0J1K2O3P8k13rJ52J7j04m6J14M5r6nRK5r6J51j67K30j8j96
6116h4Q9M0J3Q6j60q5K31o7j44Q6n8l6J67m4l8j9l0N6j51Q1k6J52oo0j0J14j03
$$ plain form
5937 11 -110 107 18 119 -111 90 -60 106 -121 -78 95 -17 -167 37 -133 -107 -172 35 -70 -156 1 -79
5959 -79 -24 -132 -1 14 -28 73 79 91 -16 -109 113 39 -11 -6 132 -43 -114 -155 -26 12 119 2 -76 15 -59 -95
5985 -95 -79 90 -33 44 5 -54 28 8 31 72 -54 -15 -25 140 -50 -41 48 51 117 -169 62 53 81 -48 79 -87 -180
6012 -180 19 -80 -75 -131 70 -128 18 -123 241 -48 -74 30 17 39 -58 9 -8 192 22 22 -26 -243 -40 -75 71
6037 71 -10 45 -116 -80 -51 -24 15 -13 100 -76 18 -133 -30 -68 74 -8 -83 45 -31 -28 -77 95 -91 50 -9 -79
6063 -79 -29 -101 -42 13 68 -170 -55 16 151 64 42 -48 -28 -106 -46 12 -95 68 74 -6 -18 -63 -170 -73 17 -98 121
6090 121 236 -1 -41 -51 -40 -18 45 123 -90 -99 53 70 -34 -80 34 79 -17 -22 -13 12 -84 67 -100 130 112 -84
6116 -84 5 45 58 144 -16 -101 130 63 -81 5 -53 -89 78 34 -4 -23 -53 3 -148 -67 -93 59 53 -7 -17 97 -6
6143fK17r2o5j06J78k1k07J78p6ML6j4O3n0J84k98O7qJ88l09J50L0m4O5j84J43
6169B3j58P3J64j00j36J79OJ12k64J58M4n1l1rm2J48p4q4m8L1N4j4L3p7J45j16
6195c4J3l0o0J46p8l9K22j48R3L5j74l1lJ59m1L7J5o2m0J09j25Q1o9R7l2L9kj86
6223a08J03j4l0o7p4J72J40k24J38k00J43r1J93j63K7J27k23J60pMJ30r7rO8j5
6248H3L1j78J71k57R3J06j02J71p2o9J45k47Q3j20K94k06J98k06K00j46k4k6P9
6271Ar2OK4J94q5L1j45p3J95l2p0p5N0l6J08L8l6j1O9J2j77K9R0Nk0l0o2Q4m4
6300e2J01j42J40k1j05J39NoJ5j51pk5P5o5K01j00j22R0O7j13j4N3J39oj74O6
6326a2q1L7R2j17lJ43j16oj4P6r2M3N1p3K84j23j24J70j05j66K9K20j68K52j68
$$ plain form
6143 -6 211 119 54 -52 126 105 -102 76 0 4 40 26 89 39 223 -75 -8 -16 172 -137 13 43 -1 64 -120 23
6169 23 -135 -62 102 2 -134 45 51 163 -101 57 101 50 19 10 -32 116 42 -42 -90 -59 -5 -19 14 -63 82 -34
6195 -34 -21 -51 -111 35 -43 -82 140 -8 85 120 -54 -85 -88 71 30 67 82 20 -20 89 -36 45 -24 73 41 80 78 -108
6223 -108 -5 -19 -49 -116 -190 -18 122 -102 36 -164 -21 -112 81 -82 -55 72 -151 9 2 6 136 39 30 98 83
6248 83 114 -64 107 -150 -57 49 -53 118 46 -23 122 -125 -42 -162 132 -74 124 -82 118 -28 -52 -78 1
6271 1 -91 -85 -61 133 48 79 -66 -139 56 24 -46 -121 -71 -107 1 39 3 -8 61 73 -104 -75 15 20 0 -30 -92 -8 -52
6300 -52 49 -93 47 26 -79 60 65 59 74 -77 -84 -109 -34 -99 102 2 -120 -30 37 -76 -90 -37 102 96 -78 -12
6326 -12 -93 -56 36 -81 -84 59 -57 -63 -77 -1 -93 -50 1 -72 212 89 -35 135 30 -136 -107 113 -55 197 29
6351B9m7J45l03Q4J54R3j78J73m7m0o9o4J6J12K6J66q3k20R7m4L6l4J24k02m0
6376a16N2J31j28J02j64J31J13p4J21l48K02L6l7N3q4q7J48M2L9j33ln5m6J54
6400D9J38q2o8P5j61J36j30o5J32p9Q3L2r8J49k20J26L7k0o5Q5K5j17O2j70K4
6425a22oK64j30oJ59l00J99N0O8j5m7j76j6M4J88j08k7Qo6j74J55J37j08J25J
6450I7k2k1l4rk95L49r3k9R6o0j06R1R8j61P3J58k32J69m7n0Q4O1j68K9qL0oj7
6478b3o9M2K7m9J31j0p1M7r7o3J59R9q0p6mK80l35K24j88M3NJ1Kn5J65j57M9o7
6506f0L3m0J09K5M8k17K4N3KJ6n5J5P1mM6n5j13K82j45n5J10m9m8J45K8j70Pj90
6534a87J76J70k41J11J01j03p6J02o3m5j34J95j20J69lj69P1L7L3q5N1j40J56
$$ plain form
6351 29 -18 127 -176 -92 62 155 -23 150 103 63 -6 -70 -54 58 84 250 167 -53 44 0 36 2 126 -76 -116
6376 -116 -64 67 -61 41 -123 8 121 47 168 -180 22 58 21 74 -10 -97 51 93 132 -1 -4 -59 -105 49
6400 49 187 105 37 112 -49 87 -43 -108 24 -55 28 60 -38 111 -109 17 54 34 -31 54 79 -38 24 -146 -122
6425 -122 -128 136 6 0 159 -141 58 108 176 161 114 -62 -78 -34 154 46 19 27 -39 -213 -58 79 -29 96 97
6450 97 75 54 20 11 -284 65 -28 -57 39 -21 -127 -36 62 -99 -26 132 -100 69 22 -28 56 117 -51 -22 -30 0 -6 -23
6478 -23 -92 -50 -23 -72 59 49 -22 25 -72 -135 24 123 43 -33 -37 243 -92 132 -56 -13 -8 3 5 -50 115 -42 7 -60
6506 -60 -27 -67 42 67 115 -102 -78 -25 -23 -7 -62 -47 24 20 66 11 -102 180 35 -20 90 41 -7 138 166 -4 3 -187
6534 -187 -11 159 -82 29 130 27 -49 53 -10 -55 -189 6 -114 55 52 -117 -46 -9 24 -61 -10 -150 6
6557FM3N3n7o5J52n0p7m9N1m6R1Q1j79j9J24l04K76nP5k34L6J84p6j11R6KJ16
6584A14p1nj23K35j35o3m2oJ56o8m2R2j03q4J23J01J2J9k39j05L85l21K68j38
6608d0K12j13m7P3J5rM3j76j14L01j97k4L16j74p1k8p3J00J43j20j33Q4J24P1
6632A63k7pk28J02J52j45j1j01P8KP4j5L6k01O4j6R0j70jJ63k8%q9K01q3M8pl0
6660A4N8o3j07J81j12J9j7j10K79n3j15P8L5j19Ln1M4L8l7l0k7O2J26j78Q1RP6
6687H4n7J7k3j64L58k53R1J2p9R6k8p8k4LL8q2K3J66J17m05K00q1m0N2k3R7K9
6714D6K1J5r9R8j43M8n9J38q9J83j83M0k09J87j3q3J31K9k00j3j7J67J46j79k3
6739f1J49j58K20j92q0J44q8K8O7Qm9j29J64K8o4j79J18J74k8k0J24j52J9j21
$$ plain form
6557 6 49 102 45 -20 132 82 5 -44 7 -39 52 133 -46 -65 59 -245 31 26 101 -133 -97 87 11 -100 -4 -2 114
6584 114 43 38 -85 150 15 -48 -90 -96 60 -8 -50 42 -61 -145 -22 79 91 110 -129 -234 151 -170 98 -40
6608 -40 172 59 12 85 100 91 134 -42 -156 145 -52 -76 240 66 -5 -33 -106 -6 137 17 -116 -32 92 163
6632 163 136 129 -99 3 155 10 -1 -102 -24 -22 52 37 73 -128 -64 -80 10 -160 -161 2 -26 -26 -115 86 3 51 44 14
6660 14 72 9 -98 83 -29 -10 -27 -137 142 89 -26 52 87 -32 -29 -80 -36 2 -35 -65 -92 -30 96 -82 -1 8 84
6687 84 27 44 21 -143 215 -38 53 65 -14 82 54 -24 -48 -45 -7 -89 -66 100 217 -188 12 -69 -109 -57 -80 17 46
6714 46 67 82 -17 81 -62 -14 -73 65 -24 159 -24 16 -193 -6 -19 -102 29 58 -142 -155 -172 -5 141 -38 -61
6739 -61 88 -70 150 -42 -122 22 -66 -38 29 37 -12 -141 23 51 -13 -192 -74 100 72 52 176 24 43 -78
6763g8K93j57j42K72j73M8j34Ql6J52j6j30L1J63Rk53L24k06k5j70K72j44M8J81
6787A37j97P7n4K06j63J63k47j7R4j1J49j16K5p2L3J6r0M4O7o4J01n1j02N3O4
6812D5pKj42J54q7j7%P1k61L89K5j55J0m3m5oL3Q0j37J74q4l4J39j16n6K7J08
6839F7n1l4n9o2J17Q1j54p0J09L5o3J26k0nm2q0J95p3R1o5j44q2K10L4l4kk06
6866a81J87R6j40J21j02j71K13L4j05Q8J7j24L8L1Q4k29L8J31q1q4N6N9J73j53
6890dn3J23K4l9j66J75r7n2j9K49j45j54M8N1o5J12m6O7J31j40j4O3k7J33k21
6915f6J62J3q6Q3j60PNQ4M8j50n4J52q6P0N9j76J14J7K1k71J91M5JJ3m7J53k95
6942a53K17k11J65Km8j1k6J13o0j50J66m6J34j69J8PP1J15j84O9o5j00Q9j0J54
$$ plain form
6763 -78 215 58 -84 188 15 63 -71 -63 -99 53 37 -93 -62 101 110 -143 181 -25 -50 -220 52 -92 -44 137
6787 137 -60 17 -37 169 6 169 -78 -95 -1 -12 137 21 46 -26 7 23 -67 -23 44 -20 81 30 -72 -19 45
6812 45 38 40 -102 52 -35 -52 -52 19 -242 147 172 17 27 -16 -61 -67 -34 46 -91 83 -1 -35 104 -12 -68 -41 67
6839 67 16 -18 -77 -139 -22 59 -95 -165 -56 -21 -84 42 22 17 -25 -105 90 17 108 43 -101 -183 27 61 27 25 -181
6866 -181 6 102 -38 83 -19 -190 23 57 -48 40 57 -67 -29 2 86 -143 -105 26 -55 -139 -83 -24 149 -4
6890 -4 -57 66 90 51 -115 60 -37 -89 -108 141 -4 -158 -110 -59 -124 -12 -58 9 140 0 -14 49 22 155 -66
6915 -66 96 109 23 106 -54 -47 -42 42 90 -60 -114 38 -48 22 81 -95 19 36 57 -214 -23 22 23 36 -11 142 -153
6942 -153 64 -147 18 20 -28 -39 -65 48 -12 -162 4 -42 92 -77 -59 -52 19 134 -50 19 -46 -146 -57 -67 87
6967H7k26J38J02k57K93p8j37J1J43j20j3Q4J8j25J55q6JJ26j64j45K50j29J58
6990H6J07k93J45O8j90N5N4j02J13N8m1j78O3j57J63j7O4J57k25OJ0k3K30q3j06
7015c6R1j71K82j61q9K42k23n3J80J64k78p0J45n6P8k36J55r2N9J03j16j06J71
7038a7O6k8o5qR6j97J63J3l7P4J7o5j7R4k6mm9NP1r6j70N7J73j08J05M5O0j90
7066c8L4M8k2p7M4j56J96J8n5Q9k9l0L6m4k0K36k63O0j14Q1Q0j37K8J10j81N0
7092e6J4O7o4N7N8j20l0k6R9j30K72k78J13n4O0J48j14R5k49M7Q9j22Q1J33k30
7117a40J59R3r8K1n1O8p3j65J24r3J52j42N3J48l9m5l2O0r2N1m9J85j98O6r3K7
7143a03M6p3nj04J21J07jJ32k28J82j07k3L4pK2m8k7K12o8j0m6jn2r4J5J31K1
$$ plain form
6967 87 -139 -1 101 -156 137 59 -78 -67 76 -44 -57 27 45 -80 75 -11 -10 116 -48 -193 57 -72 86
6990 86 193 -100 45 113 -77 -22 32 -70 43 101 60 -118 -55 -212 -49 -66 -2 155 -70 -64 -54 -77 153 70 -36
7015 -36 55 -116 166 5 -84 158 -65 -118 62 226 -52 -122 23 -33 45 -191 -36 -128 -69 34 -82 -188 -17
7038 -17 49 21 -44 -52 44 -153 10 23 -14 60 77 12 -5 89 63 59 10 15 86 -10 -180 -123 50 -58 47 92 152 -38
7066 -38 -4 44 22 -55 -11 -167 29 47 -8 81 52 22 58 14 -6 230 -33 27 -87 -6 74 -63 -35 75 -106 -56
7092 -56 -42 25 -39 18 76 -44 -74 -100 -1 -131 141 -137 -24 -78 -18 130 16 111 -138 -91 -2 -124 -43 90 -140
7117 -140 19 112 14 35 -16 52 -21 -186 -62 -155 -3 -145 -92 56 17 -28 -60 0 -92 -41 -90 95 -103 -37 -130 -103
7143 -103 -57 -130 -135 -239 -118 -11 -12 120 -108 74 -33 -56 -22 -29 -7 -55 -82 130 62 52 6 5 -47 -141 -126 5 26
7170B6r0m7L63r6k34n9L0N8J07j06P3J8j65J98j83J5J53j77N8N5P5j51%j2J25
7195C4j38N1J03j30J41o8p6K6J22O1j12j1k2oP0N8k65lL1N9J66K8k33J06l3k4
7221f5P9m7j10J47P1r5j00J48m3N7P9p4j29J65K8j6j1o0n5j27J42LO3Lj30Q5K2
7248C0J1K0J83j71j29J19rj38Q8m1M4O2j23J43k84J27JO4K6J28j54k5k2J4N8o
7274A6J4j54R3NL3j4L5J90o3j30j8j1J1J1l5Q9m2m0J01q0j42L32q4r3Qj32J85
7301H5j24j0m9J33j7j20K17R7j48o4J47j2j71J77o1J27k41P9K1K2j31O8N3M1L0
7326A49j57Jj69K67j23j22J49J00M5j89k8J06r5N5P1k16P8L1K47k69M5J81k02
7349d5L1J7m1J5J73k19J23R7j60J58o9j34QL1Q0M9o6j19l8J63L0j6k13K2J73j9
$$ plain form
7170 26 -64 -111 252 156 -78 -137 -107 -49 58 -48 25 43 -122 76 -107 -92 61 -116 -58 -3 72 -79 -79 -91 34
7195 34 -104 -53 50 -80 61 -7 -83 -57 65 126 14 3 -19 -25 45 103 -162 -165 -134 -75 91 119 -114 -8 -41 -65
7221 -65 14 -33 -143 4 75 -20 -120 28 -15 42 121 47 -82 83 111 95 84 24 -31 -158 -16 -13 50 53 -77 8 30
7248 30 41 61 244 73 -56 63 54 -84 4 -37 7 69 -54 89 -195 -68 -67 -3 23 151 -3 -28 -50 -36 22 16
7274 16 30 -124 -31 -26 7 -7 28 218 155 25 7 -4 7 18 -17 72 30 -10 91 11 -131 201 117 24 32 -100 85
7301 85 -39 -49 -98 35 18 -102 115 212 64 0 147 135 -36 141 80 207 -34 45 66 88 -43 25 78 119 149
7326 149 -8 -7 -176 91 -32 -154 -5 95 140 -49 -77 29 -66 -11 60 -156 -78 -47 200 -69 -24 157 -45
7349 -45 -14 3 -38 -23 150 -69 54 151 -9 149 80 -54 -46 -15 65 114 48 -71 -109 54 84 68 -145 -123 50 31
7375C1J56j94Q8k66K12j88J43l2R1K5j33O3n1j2p0J54k5j0n0J61q2l2j91K92J0
7400I0j82J56J37j10J21j81j43L23k93Q5K56l27l3J87K4J7l4j05J9J98k26n5J79
7423A03o7j55J57o3j39K2J55O5l7l8q9K62k10n7J44%J10j75Q8j39N9o1P6k14K86
7448H3j67M7RM7J14r1N8l5j0n7j4K7j17m0J29O6j6p5J96k35nK11o4n8K4J3l1P9
7476H8R3k41J15r1Km7P2Q7%ml1j49J50j24m8J41j6L3J9l2O9k4j59P7kj5N5m7K2
7505gO3j47K01p0q5K6k09K04N0j57K18q7M8j79O9M2lK16k64R4r7P9K7r1j4M6j5
7532d2L4M9o7j00L25k88R8L7L0m1n5j34J66j38K1jK3R0L8j04K2OJ14k40J16J78
7558A37p3j3j6J4n8K5K8M5K4j13M4m9K0op2P3m7J26n9O5k08K02j35Q1r7J40j84
$$ plain form
7375 31 187 -7 81 -185 27 -161 -18 -50 41 66 -67 -4 -55 -67 -137 17 -8 -18 -68 93 11 -21 -212 80 90
7400 90 -92 64 201 91 212 31 -112 211 -82 3 259 -68 -101 86 110 127 93 -12 7 205 -21 -76 103
7423 103 36 -119 38 -25 -164 -142 13 78 41 3 -86 176 -34 -91 53 53 163 -12 76 -63 -4 -65 11 -203 83
7448 83 -84 -37 -28 19 133 42 100 65 55 -2 -16 11 -106 -146 -17 49 33 -42 154 -81 -86 125 61 3 27 40 9 88
7476 88 181 -60 55 -36 -34 -81 -9 78 78 74 43 -106 44 -80 -128 13 -3 30 49 17 86 62 -97 -20 -22 -37 18 -29 -7
7505 -7 56 -91 110 40 -45 -19 -228 -24 26 -131 87 0 48 -131 -62 -20 -23 193 -71 23 -74 5 32 -59 -73 -27 -42
7532 -42 -8 41 -26 -126 199 -89 9 46 76 35 -20 -154 12 -126 -105 -106 -83 7 45 -59 -37 -31 83 -157 -41 137
7558 137 64 51 35 49 -9 16 44 89 113 0 44 -5 15 9 -63 10 -37 89 30 95 -113 89 -46 35 -62 78 -106
7585a06K57j70q9J11K33k48P0j7N6l1M8k68J92J8K0j99L5P7j2j03M4Q8M0m7L8
7610C7ll8j9P5p7O3M7j67k1p5J27kM7n1k9Q5PN0n2J6j35K62j78j0J05j35M3J44
7638A16j01j75J49J67j73M5j28K5K15l6qq7J1Q8k97K11Q4r5q9L1M6K9R0j58J75
7663A35j60L7N1o6m5K23nj54J3O0j49N9J9O0j37j00P8l2L23k51J77j79J16q1Q1
7688G3k28M2L5J27j04M0L4L7j41J50j16q4L07k47qJ14M0k30K26l9p3J08j85K21
7712I9j81%K29r8p3o4J47r8Qq7J25k5L9N7KL4j1j17P1K7j93R6KP3O0j32P8n5r6
7741h3M8q2K07r0J37j10m4m3j1l3P7JL1n5L1L8P9Rj1Ok1j12J77k52lK8k1N4L6
7770a2J2J22j32J06j3Q2j74j6Q6p2k1Nl5L3J2N1j9m3q9J54J0k05L03k29Q5J4o4
$$ plain form
7585 -106 151 -19 -108 3 236 -12 58 41 97 66 114 -154 38 56 76 -123 -88 -11 -23 -126 -82 6 46 -1 37
7610 37 34 -4 -23 52 -25 38 85 -82 -103 -178 -51 -53 -6 -57 -86 -1 6 56 4 20 -115 147 -31 -41 64 -71 -28 116
7638 116 15 -160 -11 156 -17 28 -100 -75 140 104 96 9 20 108 -189 22 106 11 -78 -47 -1 28 118 -40 135
7663 135 -25 12 63 -3 -48 175 170 16 29 89 -60 -1 18 78 -59 -159 -81 -113 210 -41 136 -43 73 -8 73
7688 73 -155 -113 -78 49 -55 -15 19 56 -85 65 -51 -135 172 -75 -83 31 71 -159 67 28 -45 63 -122 99
7712 99 -82 -82 147 49 -24 -88 59 -39 -31 -118 7 -18 21 78 80 114 103 -14 57 84 -109 -13 -11 62 122 -10 68 13 -83
7741 -83 -35 -117 90 0 137 27 -17 -60 -71 -104 -27 -26 5 -50 -19 19 98 107 96 102 81 -31 146 -106 -109 -81 -102 -48 -12
7770 -12 0 122 -10 96 83 165 -9 -25 61 -11 -32 -27 -62 -29 -17 34 15 -28 -117 37 47 -158 145 -84 1 15 -49
7797d9K6J50j00r2PN5L3l9l7m1P2Q4m1k1p9P5p3P9p3o8J30J57q6j2P0P5j80k4
7825bj8r0J40n5r2K34k95K45j02L0Q5j17J42r2L7j37K80k90J37m2n5P0O3k1K9
7850H4j43m8J57r6q8O9J34m6k9n7m4K76J1p6l7k15J68j7P9R2j7o7j80Q3pJ43q1
7877D8j86O6l9J40j55O9R3L5k23R0jq5R3K4J38k06J28j64J36P9m7j12J11L8p8
7902hJ09M7k30J54j48J23m3oK4l5Pl4p6J96j30P4J13k33K13p0qo4N0qJ32j95N6
7929A0j06J87k4j23j3J97j09k01J03L5N6m2J16j32J4j23J53KL4J76j93n0J33m1
7953E9j32p4O8P4n4P4o3P9k9k4J01j54Rqk3K1o9K07j76j6J8J54r1P8Jo7P8n0J41
7982A32r9n5j02J19R4q2P3J1M6j67k2J94j99N6q6J26j39J22m8N7o2J0n1p3J2J85
$$ plain form
7797 -49 -23 127 27 -65 -58 -3 30 -9 -46 -87 -15 69 28 7 -72 3 -70 9 -64 -132 -2 155 69 57 127 202 22 -2
7825 -2 -20 -110 30 -25 -117 117 -178 67 -35 -5 80 -37 105 13 50 -87 193 -97 40 -2 -57 13 76 55 84
7850 84 -59 -107 50 -46 -134 -65 69 23 -6 -63 -107 169 180 104 67 -148 20 3 82 174 157 90 -90 -7 -14 129 48
7877 48 -138 -72 -111 29 -126 -57 36 71 -152 -62 -63 -148 -55 -31 107 -99 29 -135 1 80 33 -79 32 70 -8
7902 -8 101 148 -82 72 -76 47 4 -2 22 -13 -6 -40 -116 80 -50 24 137 -96 117 47 39 -25 25 17 149 -46 10
7929 10 -96 91 67 -56 -69 128 19 -182 -79 -44 12 -30 86 -46 -32 -155 -2 0 34 210 17 -33 100 59
7953 59 -73 -147 -79 -5 -59 15 -48 31 2 -22 79 -75 -66 -74 -97 -76 -145 62 -114 -130 -112 42 -49 29 30 -37 41 -9 132
7982 132 33 -22 -124 -5 89 7 80 91 137 -30 -52 142 -57 -1 -87 39 -100 22 -26 31 -31 -21 -72 -145 -133 52
8008E2m4j2k7M5R1L5j66n7O0j22K66k64K62j05L0p5O8j8j09K04p7j02oK5J30p8
8034FM1j45J37j00m5J56r2j03R4K2O4k7km8J06q6J00j01L4J2q3m5J92J3j03R5
8060I2j78K6J71j21p8q0K27M5j44r0L43j6n3n8p8O9j29r9n4K75j84J72N2j75l
8085f8j4K29j74NJ6K1Oj3ok6J4m3j7J28l7k0O4j78n7K04lJ0k56J64J05nj68K43
8113A24j00o9J36l5j09J27m6N8k40K88j19M1l3j58J72j74J41l2L1M3M4j19m3J64
8137I2k04K01l6o4P6j06K9%p1J77q0j17M3J16J52j43J23k68k9K0j8J39K1p8P4
8162D9l3J18j14j24K6M3k1N4j29P4J52j01q6P9J09K7o3j04N2p9j57R8J00N1M0
8187F1o0J9M5j06
$$ plain form
8008 52 8 -4 -31 14 105 140 -26 -83 -23 -145 121 -143 119 14 44 -31 37 19 -90 114 37 -65 -71 -46 84 6
8034 6 47 -98 39 -61 -106 50 -42 -145 -51 -29 35 8 6 -42 64 -22 78 -23 11 23 -60 -105 87 100 -3 92
8060 92 -86 -60 111 -10 -88 -168 59 104 -40 -130 213 197 144 86 8 77 -52 -151 -205 70 -114 58 110 -65 -68
8085 -68 -82 147 -27 -22 -6 15 21 8 2 -24 -10 -53 -70 58 21 1 65 -113 -170 34 31 41 -215 -51 54 49 -119 124
8113 124 24 -45 91 56 -53 74 28 86 -154 134 15 56 23 -135 37 -137 4 -28 3 46 90 -29 -72 92
8137 92 -112 89 53 -11 65 -41 -12 -12 -83 94 14 -103 -60 56 208 65 188 -80 -109 -89 -107 32 53 -25 49
8162 49 16 134 20 -104 -78 -35 -56 -2 -131 -57 95 -6 -92 -13 96 123 60 -44 8 -71 -228 -130 -30 21 61
8187 61 1 20 65 -41
8191d1
$$ Imaginary data points
##PAGE= N=2
##DATA TABLE= (X++(I..I)), XYDATA
0@%%%%%%%%%%%%%%qJ6j6J6j6K4l2L2m0M9n7P2q1R0j06J22j43J66j85K10k39K69
36A43l03L42l82M23m72N28n89O53p21P96q80R72j071J178j298J431j576J738j920
55a008K124k354K616k918L272l693M202m833N641o717Q232j0545J4555k3512Q2345
70F7407j888l3554R7776l9254n2514K7981P1507j4127n4971j3793M9296j3791
82I0075p8490l226Q5685k1656q6175K6805O2649n6117o9679K7522M5473m0165
94a7299n2420K7388M3743l6205n7685K0322N3111l8560o3464M6598N6360n6763
106g4874m4427N6627L5220n3948k5526N2346K7814l6798k2889M1023M1774m0041
118d3699l8517O2575L9591o2282j6090P0186J4769n5416j881N5321P123m2987
$$ plain form
0 0 0 0 0 0 0 0 0 0 0 0 0 0 0 0 -8 8 -8 8 -8 16 -16 16 -24 25 -32 40 -41 49 -57 65 -78 88 -97 113 -126 143
36 143 -160 182 -200 223 -249 279 -310 343 -378 418 -462 510 -561 617 -681 750 -826 912 -1008
55 -1008 1116 -1238 1378 -1540 1732 -1961 2241 -2592 3049 -3668 4564 -5981 8574 -14938 67407
70 67407 65519 31965 129741 90487 37973 65954 137461 123334 68363 54570 103866 90075
82 90075 11585 8359 94044 72388 -13787 13018 75667 19550 -50129 -22607 22866 -17299
94 -17299 -69719 -42331 1412 -34793 -92478 -72156 -19045 -57605 -121069 -74471 -18111 -74874
106 -74874 -119301 -62674 -27454 -81402 -106928 -54582 -26768 -63566 -86455 -45432 -3658 -43699
118 -43699 -82216 -19641 19950 -42332 -58422 11764 26533 -28883 -30764 24557 31680 -11307
130a1307n876M5742J7185m7746j5101N9959R444o2486K236O0072q407n4109J1330
143I36M9895j4344m5199J2521L9459r362m1626M929M6469r823n1048J5834M8798
156D7439k2625m6676K6403M1005l0716l4506K9307K6647k3936k7267J7390L2656
168C5121k0415l8343K6678L5972l4173l3138L6654K5663m0400k0018L6302J2170
180B2073l1471j4707K5131J8194k8771k2862L3325J9177l8444j5940L9378J0884
192A5967m0767n548L9050J64l3407R11K8865L535k8357m985L2438M807l3573j377
206b2277L6516n85l6526P400L6569j2218k9244J4977K3911r962k1497P219K4821
219A9104o454k6481Q771K8274j1326k9125J6663K7480k1921k1192K2625J4363
$$ plain form
130 -11307 -17183 28559 45744 -2002 -17103 42856 52300 -10186 -7950 52122 43715 -10394 936
143 936 50831 36487 -8712 3809 43268 33906 -7720 -2791 43678 33855 -17193 -1359 47439
156 47439 24814 -21862 4541 45546 14830 -19676 9631 36278 12342 -14925 2465 35121
168 35121 14706 -23637 3041 39013 4840 -28298 8356 34019 -6381 -26399 9903 22073
180 22073 -9398 -24105 1026 19220 -9551 -32413 912 20089 -18355 -34295 5083 15967
192 15967 -24800 -30348 8702 8866 -24541 -23630 5235 8770 -19587 -24572 7866 12673 -20900 -22277
206 -22277 14239 13654 -22872 -15472 21097 8879 -20365 -5388 18523 8561 -12936 -5717 19104
219 19104 12650 -13831 -5060 23214 11888 -17237 -574 26906 4985 -16207 6418 20781
231B0781j8466j3313J4218J5518j4198j7525J5654J7829j7857j8562K1223J6888
243B2190k5685j1428K6196N516k2339m038J8276N307j7956o051J7846O470j8614
256d310p651K0745O840k5025k526K5449l995k1987N983J6835m995j5956L619J4561
270G587l065j4959Q64J6702j289k0996N481K0865j1281j6880J2693J2031j1487
283c734r997J0027R235q680q701P264R918o408j3096J0131J3988j4516r720J6224
297A935N924j4805l267J3280K591j1845j302R631K477q222n423J0910O194j4833
311f755l096J6458j307j4555L325J2498m276j1089N461Q568m851o311J687Q028
325C785k51j1673L016J2935o756j0898Q798Q950r238p350J0592M508r435j928
$$ plain form
231 20781 2315 -10998 3220 18738 4540 -12985 2669 20498 2641 -15921 5302 22190
243 22190 -3495 -14923 11273 16789 -5550 -9588 8688 13995 -3961 -10012 7834 14304 -4310
256 -4310 -11961 8784 15624 -9401 -11927 13522 9527 -12460 -6477 10358 5363 -10593 -6974 7587
270 7587 4522 -10437 -9573 7129 5840 -15156 -9675 11190 -91 -16971 -4278 7753 -3734
283 -3734 -13731 -3704 5531 -3149 -11850 -4586 5332 -1076 -14172 -4041 9947 -4569 -14289 1935
297 1935 7859 -6946 -10213 3067 5658 -6187 -7489 2142 4619 -3603 -9026 1884 8078 -6755
311 -6755 -9851 6607 5300 -9255 -5930 6568 2292 -8797 -3336 5232 381 -5930 -4243 3785
325 3785 3534 -8139 -5123 7812 1056 -9842 -1044 7906 -1332 -8682 1910 6418 -3017 -4945
339d945O411L127m411o122O564P456r634n514J1319L889j1804j742J2555q67j1460
354e178L856Q408k908n658L11P252J310r516M47J1048j882j1052L821J1842o251
369E850j0484Q921P625q759m354N837M939m523p210N572P826p067q407P975Q076
384A1817j1024p635J2846L230j3529p92R796J2q814k506Q210K398j0121l292J0338
399I34K709j2900k161J4612j497j4821M766J1851n056r327L906R472k655r769
413i936L717J0572k350j1328M048J4286o635j2557J0611J0857j0214p583R648
426C136P782q306p401Q863P416p887q637Q563J0223j1791r994J4383O429j5433
440b654m536J3462K905j3634l073J2044J946j2294l601J1460M490j4587m524J6638
$$ plain form
339 -4945 1466 4593 182 -5940 624 8080 -1554 -7068 4251 8140 -3664 -5406 7149 6282 -5178
354 -5178 -1322 7086 4178 -1480 -1169 6083 7393 -2123 -1676 9372 7490 -3562 259 12101 5850
369 5850 -4634 4287 11912 3153 -1201 4636 9575 5052 -2158 3414 11240 4173 -4234 3741 11817
384 11817 793 -6842 6004 9234 -4295 -5087 4709 4721 -4093 -6599 1611 4009 -6112 -9404 934
399 934 3643 -9257 -11418 3194 1697 -13124 -8358 3493 -1563 -10890 -6984 2488 -167 -9936
413 -9936 -6219 4353 2003 -9325 -5277 9009 2374 -10183 428 11285 1071 -6512 3136
426 3136 10918 2612 -4789 4074 11490 3603 -5034 3529 13752 1961 -8033 6350 12779 -2654
440 -2654 -7190 6272 9177 -4457 -7530 4514 6460 -5834 -9435 2025 6515 -8072 -12596 4042
454D042J037j7332J660J5607k632j4596L239J4151l531j2241L223J2505j165j3862
468i895K417J6428m286j5960P796J4910q064j3166R323J2670r797j0703R224J0106
482A1003p641j1215P537J3139j0176j3309J2167J1404j3826j0086J3865Q388j5116
495c866p097J4022N132j2426o870J1989Q129j4455q012J6230O197j7361m230J7165
509D547L190j7510r08J6588l44j4679j31J4204J724j5403j385J7437n06j7449
523a0625J774J7501k955j7577M871J6610o633j4390O310J2815m617j4220M801
536f335J5296o036j5242P649J5260q389j4913J0808J4373j1820j0945J2091J0262
549A2059r679r770J0413J2051j0510j0698J2697J1637j2626j0056J5304R746j6035
$$ plain form
454 4042 5079 -12253 -10593 5014 2382 -12214 -8975 5176 1645 -10596 -7373 5132 3967 -9895
468 -9895 -7478 8950 4664 -11296 -3500 11410 3346 -9820 -497 12173 2376 -8327 897 11003
482 11003 3362 -7853 -316 12823 2647 -10662 1505 12909 -917 -11003 2862 11250 -3866
495 -3866 -10963 3059 8191 -4235 -11105 884 9013 -5442 -13454 2776 8973 -8388 -12618 4547
509 4547 7737 -9773 -10681 5907 5563 -9116 -9247 4957 6681 -8722 -10107 7330 6824 -10625
523 -10625 -8851 8650 5695 -11882 -7011 9599 2966 -11424 -5114 7701 3084 -11136 -6335
536 -6335 8961 2925 -12317 -4668 10592 2203 -12710 -1902 12471 651 -10294 1797 12059
549 12059 2380 -7390 3023 15074 4564 -6134 6563 18200 5574 -4482 10822 20568 4533
562D533o237J5958N190j4024n121J3448N746j4870n877J4848M474j6361n141J5918
576A2484K701j8815j931J6520k108j6238j40J3433j519j5745l21J4496k443j5880
590a5506M56J5415l175j7313M222J5904o966j4260O766J2713n708j2346O132J3265
604d01n947j2179P110J4011o623j3416J0580J3960j0699j0009J2203R972r568
617a006q360J1091R695j0249q042J1081R298j0718r168J2964Q648j4373o031J3965
631H795M591j3509m134J2705L721j3400l541J2203L027j2761m385J3365L101j5303
645e525j469J4739q74j3842R51J2765j549j2654J731J1791j634j1699J084J2802
659F617j523j3746L604J3647n183j1940N906J1035n782j0300O129R932n837r014
$$ plain form
562 4533 -1704 14254 19444 5420 299 13747 19493 4623 -1254 13594 18068 1707 -3434 12484
576 12484 15185 -3630 -5561 10959 8851 -7387 -7527 5906 4387 -11358 -11679 2817 374 -15506
590 -15506 -15050 365 -2810 -20123 -15901 3 -6963 -21223 -14457 -1744 -7452 -19798 -13666 -401
604 -401 -6348 -18527 -11417 2594 -4029 -17445 -6865 7095 -3604 -13613 -1410 8562 -1006
617 -1006 -9366 1725 11420 1171 -6871 4210 13508 2790 -6378 6586 15234 861 -5170 8795
631 8795 13386 -123 -4257 8448 12169 -1231 -4772 7431 10458 -2303 -6688 6677 9778 -5525
645 -5525 -6994 7745 6871 -6971 -6020 6745 5196 -7458 -5727 6064 4430 -7269 -6185 6617
659 6617 5094 -8652 -5048 8599 3416 -8524 -2618 8417 2635 -7665 -1536 8396 2559 -6455
673f455N039J0060n659j0665P343J0102q505q916Q905Q184r118p452R246O340
687H449r352n545Q374N964q344o795R427O480j0656n256J0859L986j0788l164
701f361J1032J827j0395j186Q980J736q702k810R942K188j0835r33J0709k73j0637
716e718P45J0436k013r462K456Q262k208p895J255Q510j548r524K858Q926l629
731A451q383L891Q384m684p860N782O253n201n536M368O171m279o487N185O557
746E612n666n781N952O033p001m868P594L703p018k470N753L058n729l503O388
761B057L256o612k921O771K821p461k258Q138K77p176L21N883j2n650o07O174
777C001K73o306o4O180j55o490P02P043k121o315K982M932k484m411J803M849
$$ plain form
673 -6455 -1416 8644 2985 -7680 -337 9765 1260 -7656 1249 9433 315 -7137 2109 8449
687 8449 -903 -6448 1926 7890 -454 -7249 2178 8658 -1998 -7254 3605 7591 -3197 -6361
701 -6361 4671 6498 -3897 -5083 3897 5633 -3069 -5879 4063 6251 -4584 -5517 5192 4919 -5718
716 -5718 -4973 5463 3450 -6012 -3556 4706 2498 -5397 -4142 4368 2820 -6704 -3846 5080 1451
731 1451 -6932 -3041 5343 659 -7201 -1419 4834 -367 -5903 -1535 4636 357 -6130 -945 5612
746 5612 -54 -5835 117 6150 -851 -5719 1875 5578 -1440 -3910 1843 4901 -828 -4331 2057
761 2057 5313 -1299 -4220 2551 5372 -2089 -4347 3791 4068 -3108 -2787 3096 3084 -2566 -3173 3001
777 3001 3274 -3032 -3096 3084 2929 -3561 -2859 4184 2063 -4252 -1270 3662 1178 -3233 -1430 3419
793C419k210m759K350M516k321m717K352N138l562m736M664L163m325k437L417
808d8K526l564k591L465K426l209k886L340L088m487k546N439Q48m900j7L767
824F51L74l704l80L761M14l484l85L498R97m225k49M980r79m200J877L280j301
841I25l027J688L076j614k498J670J980o31k539J022L369k126l004L185K107k820
857G63j623K809J463k759q02K299Q10k113r81J772J682k765j307L487j6k991Q
874b64K960m58l130O22K757j263j893M65J394K58k737K25L153j551k877J653K128
891A442j784k419K105K070k794j160K046P51j336j601J703J790k269j641K908
906a89J036k816r43L469M55l607O18K923m33k167K19K086P11k905M5L094j15l341
$$ plain form
793 3419 1209 -3550 -1200 3316 995 -3722 -1370 3768 206 -4530 134 3297 -1028 -3465 -48
808 -48 2478 -1086 -3677 -212 2214 -995 -3881 -541 2547 -1940 -4486 953 1801 -3099 -3116 651
824 651 1025 -2679 -3059 702 1116 -2368 -2753 745 1742 -2483 -2732 2248 1269 -2931 -1054 2226 925
841 925 -2102 -414 2662 1048 -1450 220 2200 1569 -970 52 3421 1295 -1709 1476 3583 763
857 763 -860 1949 3412 653 -149 2150 2960 847 -134 1638 3320 555 -752 2735 2719 -272 -264
874 -264 2696 2238 -892 -270 2487 1224 -669 -204 1190 1448 -1289 -1064 2089 538 -2339 -686 1442
891 1442 -342 -2761 -656 1414 -1380 -2540 -494 257 -1079 -2680 -977 813 -1456 -3097 -189
906 -189 847 -1969 -2912 557 1012 -2595 -1977 946 513 -1654 -1435 651 1362 -1543 -1498 1596 1481 -1860
924a860O61L356r12l369J780K986k301k217J689J986j351k490J509K641k155k471
940b518K090K477k599k742L239K109l659j139K996J049k570j427K946J507l152
955a393j161L383J419l578j107M131R32m248N39L799l57l379L49L699k11l628
971h11O15L442k93l517K28M201q35m794J967L686k244l465J938L006k146l371
987b393J955K989k307l236J663L392k533l991L279L011l840k367L227K430l447
1002b168k483L590K096l500j900L467K391l788k163M676J784m743p99M738R01
1017B099m411p24N144K91m329J43L986O45m273n90M998J44n037Q92M852j057m592
1034a819J176M747j755m220J877L772j464l909J131M769j737m916K658M202k681
$$ plain form
924 -1860 -1199 2157 1245 -2124 -344 2642 341 -1876 -187 1799 448 -2042 -533 2108 -47 -2518
940 -2518 -428 2049 -550 -3292 -53 2056 -1603 -2742 254 1303 -1267 -2694 252 1759 -1393
955 -1393 -2554 829 2248 -1330 -2437 1694 2626 -1622 -1083 2716 2359 -1020 -671 3028 2817 -811
971 -811 -196 3246 2953 -564 -336 3865 3030 -1764 203 3889 1645 -1820 118 3124 978 -2393
987 -2393 -438 2551 244 -2992 -1329 2063 -470 -4461 -1182 1829 -2011 -4378 -1151 1279 -2168
1002 -2168 -4651 -1061 1035 -2465 -4365 -898 1493 -2295 -4458 218 2002 -2741 -3540 1198 2099
1017 2099 -2312 -3036 2108 2399 -1930 -1787 2199 2844 -1429 -2019 2979 3123 -1914 -1022 3830 2773 -1819
1034 -1819 -643 4104 2349 -1871 6 3778 2314 -1595 -464 4305 2568 -2348 310 4512 1831
1049A831m055K968L895l278l365L351L102l138l058K986L480l595l475M080L156
1064D885m434k696M096K569m614k347M729J120m385j304L402J789m455k211N016
1079A160Q79n147j090M724P78n436l86N108m63m748L32M017lm497PN040l29n344
1097e398J138N082j035m874J572N147j901m442K541M200j807l856K083M482k217
1112G15l790K659M213k594l967L360M224l796l294L901K717l321k719L273K933
1127D514l644k936L954K476l848k772M091K727m983k171M936J173m464j363M054
1142A744J414m406j401M593R07m396j203M796P60n222J78M818n38m419N96M209
1158B430l88m404P11M469p55m326J009M066p70m725J495M802k277m032J965L590
$$ plain form
1049 1831 -2224 744 4639 1361 -2004 1347 4449 1311 -1747 1239 4719 1124 -2351 1729 4885
1064 4885 451 -2245 1851 4420 -194 -2541 2188 3308 -1077 -2381 1021 2810 -1645 -3856 1160
1079 1160 2039 -3108 -4198 526 1304 -4132 -4518 590 127 -4621 -4289 -272 -275 -4772 -4765 275 -54 -5398
1097 -5398 -4260 822 -213 -5087 -3515 1632 -269 -4711 -2170 2030 223 -3633 -1550 2932 715
1112 715 -3075 -416 3797 1203 -2764 596 4820 1024 -2270 1631 4348 1027 -1692 1581 4514
1127 4514 870 -2066 1888 4364 516 -2256 1835 4562 -421 -2592 2344 3517 -947 -2310 1744
1142 1744 3158 -1248 -2649 1944 2851 -1545 -2748 2048 2808 -2414 -2236 2582 2044 -2375 -1779 2430
1158 2430 2042 -2362 -1651 2818 2063 -2263 -1254 2812 2042 -2683 -1188 3614 1337 -2695 -730 2860
1174B860j813l819K238L522k486l462K277L455k337l850K706L717l414l310L620
1189i6K577l451k401L238K282l295k116L266K026l084k386L722K304m109j501
1204c024M096J087l822q14L897P83l900n89L804M13l228j157M270M58m069Q1L952
1221B238k53l775M53L799n07l769R01L493j008l233Q53L424q09l692J181L841
1237C137j789l415J957K899j912k965K254K552k203k150J748K307j707k970K261
1252DK715k633k448K750J870k789j820K717J615k964j090K399J098k256j476K276
1268c2J736l135p70K766O60k731q30K941N67l189qK862k46k135n24K716K87l009
1286b074K35K927k35k786M70K959p63k740J280K141q88j899O59K095m62k377R90
$$ plain form
1174 2860 1047 -2772 -534 2988 502 -2960 -683 2772 435 -3415 -709 3008 -406 -3716 -96
1189 -96 2481 -970 -3371 -133 2149 -1146 -3262 4 2030 -1054 -3440 282 2586 -1523 -3024
1204 -3024 1072 2159 -1663 -2477 1420 2203 -1697 -2286 1518 1931 -1297 -2454 1816 2274 -1795 -1714 2238
1221 2238 1985 -1790 -1337 2462 1955 -1814 -913 2580 1572 -1661 -808 2616 1807 -1885 -704 3137
1237 3137 1348 -2067 -110 2789 877 -2088 166 2718 515 -1635 113 2420 713 -2257 4
1252 4 2719 86 -2362 388 2258 -531 -2351 366 1981 -983 -2073 326 1424 -832 -2308 -32
1268 -32 1704 -1431 -2201 565 1225 -1506 -2336 605 1172 -2017 -2025 837 591 -1544 -2068 648 935 -2074
1286 -2074 -1839 1088 853 -1933 -1463 1496 733 -2007 -727 1414 526 -1373 -714 1381 919 -1458 -468
1303d68K271j332j800J248K156j541j899J733J683j877j059J471J232j240j705
1318a127J848J201j642j345J783J192j728j414K300P10k042m78J677K96j256r58
1334i83J721N62j984k37J457L50j629m50K051j56k243P01J337k77j519P7J541
1351C19l2j915O95J391l83j400P0K059q11j744J168J335j182o82R04R84n93j170
1369i87J120Q05r43p91Q61J093j052r75J526N89j334j69J036K31q35m31J046K62
1387A052j048k14P35P58j342l44J406j59j388K52J054k14j082K77J047m17p74
1404d01M53L75k18o80J83J249o46r59J006L70p50l56P84L64q15m13P44L67n60
1423I7n48M54O54r52o20J122R2r24o7P43k0j067J8Q16k55p01J29N14o5p74r3J074
$$ plain form
1303 -468 1803 471 -1329 -81 2075 534 -1365 368 2051 174 -885 586 1818 578 -1127
1318 -1127 721 1922 280 -1065 718 1910 182 -1232 1068 1778 -264 -742 935 1231 -25 -983
1334 -983 738 1300 -684 -921 536 886 -743 -1193 858 702 -1541 -840 497 220 -1299 -1222 319
1351 319 287 -1628 -933 458 75 -1325 -1255 804 -7 -1751 -583 752 -430 -1112 -208 776 183 -987
1369 -987 133 938 -5 -796 65 1158 106 -869 657 1246 -88 -257 779 1010 175 -256 790 1052
1387 1052 4 -210 525 1283 -59 -403 1003 844 -544 -292 762 548 -534 -257 790 373 -401
1404 -401 52 427 209 -471 -288 961 315 -644 362 732 -18 -374 410 774 -41 -454 290 657 97
1423 97 -451 3 657 -295 -915 207 299 -625 -692 51 31 -1036 -1018 -202 -457 -1158 -1029 -515 -580 -1354 -1447 -373
1445c73l04j130O74O99m33q28P23J053r35m51Q83M32m56m36N83Q01n70n07J078
1464E03L45n64m65J169L70r13L5R77n2o01p4Q98J80j086j0R50n2j109J4J149k08
1485A456j359M07Q38o98p77J59P36l95j018K00R55p16r27M69P97m92j163P69Q12
1504E3r38p00R14O23q69q46J227P63r44o11J007O53r06p06J398N93j441lJ246
1523E13J00r25j58J113L27j243l4J208J40j046l29J498m1j600M91J379n52j044
1541b03K28J317m48j270M07R45k30j060O7J482n80j323O17J360j300q44P34J116
1559A015q40j334J106R23j125q49P79J026r45j124J185R02j548m36J109M67r95
1576f84q29J192L33j049m49J290L98j036n59J350M72j735J07J443J89j328n8J590
$$ plain form
1445 -373 -677 -1807 -1133 -434 -867 -1695 -972 81 -854 -1305 -422 10 -446 -882 -299 502 -68 -575 503
1464 503 848 284 -181 988 1358 445 480 1457 1405 804 730 1628 1808 722 712 1662 1610 501 515 1664 1456
1485 1456 97 504 1342 644 -133 26 762 367 -651 -451 504 -212 -1139 -670 127 -365 -1528 -759 53
1504 53 -885 -1585 -671 -48 -917 -1763 -536 227 -717 -1328 -321 332 -574 -1280 118 711 -730 -733 513
1523 513 613 -312 -470 643 970 -273 -307 901 1041 -5 -334 1164 1123 -477 14 1393 841 -203
1541 -203 25 1342 894 -376 31 976 746 -314 -247 1235 655 -668 -51 1309 9 -835 -101 1015
1559 1015 175 -1159 -53 870 -255 -1104 -325 701 -244 -1368 -183 719 -829 -1265 -156 311 -684
1576 -684 -1513 -321 12 -1037 -1486 -196 202 -834 -1393 -43 429 -1306 -1199 244 433 -895 -953 637
1594F37L9j431L36J328j0j423J92J497j97j402M70J416n45j159M10J537o84j462
1612d51R49R51o82j049M48J207p67j568J032J027r94j151Q73J056j309r02J114
1629b16O97j236o25P13R88j052r53J366P89j563n37J385P08j375o58J746J71j198
1647h50o9J050O92j057n04J489M42j538j12J645K22j597K47J423k79j168K87J074
1665A397p6j274Q3J346l51j445N57R72m72j318N96J372j113j183Q07Q52o67p93
1683g10L50Q86n13j270J020Q22p95j030P24J231j168q61J214O55q84n79P80P61
1701F33j022o52J208L94r04o61J112O16j368o6J209J96j087l82J266K43j183j34
1719e82J105J89j234r4J025K55j421J26J296l12j166M74Q99k22j257K86J282m33
$$ plain form
1594 637 676 -755 -419 909 899 -524 -332 1165 968 -434 36 1452 907 -252 158 1695 1011 -451
1612 -451 498 1449 767 -282 166 1373 606 -962 70 1097 103 -1048 -175 881 -428 -1330 -216
1629 -216 481 -755 -1380 -667 321 -731 -1684 -318 471 -1092 -1629 -244 464 -911 -1569 177 348 -850
1647 -850 -919 131 823 -234 -738 751 1193 -345 -457 1188 1410 -187 60 1483 1204 36 323 1397
1665 1397 1321 47 130 1476 1125 -320 237 1209 737 -581 15 1387 274 -909 -102 750 83 -710
1683 -710 -360 526 13 -1257 -237 585 -210 -1240 -516 715 -453 -1314 -100 555 -329 -908 -128 633
1701 633 -389 -1041 167 561 -343 -1004 108 724 -644 -710 499 695 -392 -774 492 735 -448 -582
1719 -582 523 712 -522 -616 409 664 -757 -631 665 353 -813 -339 560 338 -919 -633 649 216
1737B16r04L10Q83k49j173N16J162p21q85Q12P35n06q66O50P71n77q44Q96N82
1756H08m91q32M61J203r64o25P37P74q07n73P93L49q02j78P05J58m41p49R58N68
1776A052j401l20J185K9q67k96Q74K55j046O4P72m2j068Q0P89M9r74J42Q93l95
1796b25o93J16O55l0o83J02Q24n04o46M01O37p2q41L79R25n55n22N72N63m85m21
1817e03M48O19o64k61P89K63l26m82O03N23q23k30O65K95n77k50O33J56p73P6
1837A81N07M9l49l24L14L23p66p1M94m8o31J43M19r9o00J14L90j49l86J48M06
1858F5j65n45J27N50j16m33J42N85k36n72N33K67j34k75J84L52j64m16K67M95
1878E11k24m80L88L66m48k14M76k1m09L5L66j54k0m59L80J31l56P0J26K2k38j16
$$ plain form
1737 216 -688 -378 505 256 -917 -401 761 40 -845 -33 702 196 -670 -20 751 174 -670 226 808
1756 808 317 -515 -54 1149 185 -440 297 1071 264 -309 484 833 31 -147 558 716 275 -474 484 1052
1776 1052 -349 -669 516 545 -322 -618 256 511 -535 -471 301 259 -809 -729 60 109 -865 -723 170 -225
1796 -225 -918 -802 -147 -177 -860 -758 66 -438 -1084 -683 -46 -118 -959 -580 345 -210 -732 -160 403 -82 -503
1817 -503 -55 564 -100 -361 428 691 365 -117 486 1009 186 -44 621 916 339 89 722 878 105 181
1837 181 688 737 388 64 378 701 -65 -136 358 310 -321 -178 241 142 -458 -344 46 -103 -489 -341 65
1858 65 -100 -645 -518 32 -84 -517 -375 210 -26 -598 -65 202 68 -207 -23 329 165 -251 16 511
1878 511 287 -193 195 561 113 -101 375 354 -55 -20 346 192 172 -287 93 224 -132 -62 64 86 -152 -268
1900b68M29j0m82L11K7j23Ll18N05N2m47J22J67l2j20o8L31K8m65L62J94l74O5
1923a11o5J86J03m48K69J61l88N6M9J42j25l59N03K6l81P2R0J18j80j21J57K04
1945d2k73P7N8J87j60M2J54Q9l32K63R5O5QM4K22P7p6k7L02q6J4k42M29k37k38
1970D13K28J15k52j9j29K75j77k73M8J06j34j81p1k0j65k91M33l28j41j86J47
1991f02J2m15P4K07j0l81K58l0K36m17J65L87j14O6J27L4J57n3m6L52j13k9M39
2014C04l2J79m9J03K47l66R9J26L50k15j20K98J37l75l8J75q9r3k10J13J90k52
2036D82k96M42l62k26j14J38L7l21n4K82k03j37p6J35j2k73J52L5j16k40K76K12
2058b39j33k58K01J19k48J24Q6J20k07q0K23K92l10l1N4J85m4l34M55K94n34M3
$$ plain form
1900 -268 161 151 -331 -20 7 -116 -113 -431 74 126 -321 -199 -32 -64 -184 -252 79 107 -358 4 198 -176 -111
1923 -111 -176 10 113 -335 -66 95 -293 -237 -188 -46 -171 -530 -27 -1 -382 -310 -220 -102 -282 -403 -246 -42
1945 -42 -315 -238 -180 7 -153 -111 43 132 -200 63 158 223 231 275 497 574 498 471 773 687 701 459 888 651 413
1970 413 641 756 504 485 356 631 454 181 229 335 201 20 -51 -71 -236 -527 -94 -422 -563 -749 -602
1991 -602 -590 -1005 -931 -724 -734 -1115 -857 -887 -651 -1068 -903 -516 -630 -564 -437 -403 -246 -299 -345 7 -106 -135 304
2014 304 272 451 402 505 752 386 485 611 961 746 626 924 1061 686 648 823 734 641 431 544 734 482
2036 482 186 628 266 40 -74 64 101 -220 -274 8 -195 -332 -408 -273 -285 -558 -406 -371 -487 -727 -451 -239
2058 -239 -372 -630 -429 -310 -558 -434 -348 -228 -435 -515 -292 0 -310 -341 -287 -102 -146 -480 -25 269 -265 -222
2080b22N0J45k01R7J73oj30j01M10l1k62j04L29J94m18k7M72j07j50M4J15J16
2102C86j81O5J63q8k05Q3K45l4m06J12M08k82l15M10j15J25l92J43K09l01ol4
2124a0J59j34l70L48J36k54q3J61J29m50m2J23J86k52O5O7J63j69k39M02K33o66
2146d97R3M89r9r8j93L36K7l51N6L61j44l0p6L26R7n81J15N61l51k93L11J77j05
2169A31l95M84j27j80nk1J49n4k43R5L22l22k6K06Q2k07n7O4J64j51j53P6L87
2192B19j99k94M01O5k01R0k5O2L2k50L11M9j73L7J75j06n5k88K96Q2j58l7J60
2215A93Q3k71j04K78k2j84r6J38P0l33j62L14N9k02K00R4l8l47q1L77j47p7J7
2238b41J24j27J21q3Q4J45k73K30J33k8k56j81M41j87jK80j9n2j02qJ96j31j05
$$ plain form
2080 -222 -172 -27 -228 -131 42 36 -94 -195 215 184 -78 -182 147 341 -77 -104 368 261 111 155 270 386
2102 386 205 270 433 345 140 223 468 434 28 140 548 266 -49 361 246 371 -21 122 331 30 24 -10
2124 -10 149 15 -355 -7 129 -125 -208 -47 82 -368 -410 -287 -101 -353 -288 -221 -58 -227 -466 -64 169 -497
2146 -497 -404 85 -14 -112 -305 31 58 -293 -237 124 -20 -50 -126 200 297 -284 -169 392 41 -252 59 236 131
2169 131 -264 220 93 -87 -92 -113 36 -18 -261 -166 156 -166 -192 14 96 -111 -168 -104 60 -91 -244 -168 219
2192 219 20 -274 127 192 -9 81 56 118 150 -100 211 260 87 124 299 193 138 -150 146 228 70 33 193
2215 193 276 5 -99 179 157 -27 -123 15 85 -248 -410 -96 -37 -239 -39 55 17 -330 -411 -34 -181 -258 -241
2238 -241 -117 -244 -123 -206 -122 23 -250 -20 113 85 -171 -352 89 -98 -99 181 162 110 8 0 196 65 -40
2261d0K88l5J12k93J44J7p1k93K88K78l11j71J49K03l47q4L10j79k11O3N5J57
2283B9m18J89J34N4k46R8j4J29l01J49L7r7mQ6j44J86j30L7L43k64j10J02K80
2306A25q3k24J00K39O1m47M87n6P2p4k5L21k34l9K24j82j11J39l1J79j47Q8rk8
2330C45p1p3p3N7j84j24K53j50j22j45J32J00k46l5J16j22M4q8NJ3j0j72L08L
2354b39k02K4K08l1k92J94L04j20Nk5O1J44j32J57L44k60j52L29j0J4k12K16M
2377C29K7kj22J0o9m1Q8J41j22r3m6P2j0l08J25J72q0j06J05j03N0j49m0R6r3
2402a69Q2K4j22KmJ32l3j21O1R8l6K9L1P5m9j76J47P5M3j42J64n0J71k11J16j9
2428A18j74J90j85J31J07j82k13K62j11M9m1p0Q9j99K63R5j70j59Q0L1J08j95
$$ plain form
2261 -40 248 213 325 32 176 193 122 -171 117 395 84 -87 62 265 -82 -166 144 -35 -246 -183 -128 29
2283 29 -389 -200 -66 -12 -258 -160 -174 -45 -346 -197 -160 -257 -261 -175 -319 -133 -263 -226 117 -147 -257 -155 125
2306 125 42 -182 -82 157 218 -229 258 202 274 200 175 496 262 223 447 265 154 293 262 441 294 382 373 345
2330 345 274 201 128 185 1 -123 130 -20 -142 -287 -155 -55 -301 -336 -220 -342 -298 -386 -381 -368 -378 -550 -242 -239
2354 -239 -441 -417 -209 -240 -532 -338 -34 -154 -149 -174 -113 31 -101 56 400 140 -12 317 307 321 109 325 329
2377 329 356 354 232 242 173 132 220 361 239 146 100 172 162 -146 -21 151 71 -35 70 -33 17 -132 -172 -76 -169
2402 -169 -87 -63 -185 -183 -187 -55 -88 -209 -148 -50 -86 -57 -26 49 0 -176 -29 46 89 -53 111 61 232 21 137 118
2428 118 -56 134 -51 80 187 5 -208 54 -57 -8 -49 -119 -30 -229 34 129 -41 -200 -120 -89 19 -176
2450a76J73J2j25j43J76kk0j0J84j28j04J15m1J22K26k54l1J91j69J32N3K1l4
2473A68j45K71J1j31q0P5j22J09p1J58k68M5q6K24l43nQ3N5j5j35J17l0J5M6j14
2498a68j31K58k5o7K9Q8k4J5j64K26j18J54j10J08j18J07M6q4j15K88p1j62J36
2521I8n8O3J26k17J06P8p8p3K0J25j74m6O7K0o9J14k82J5J64k02J39o0q4J56o0
2546a12l4j09K1m2N5Q0J34Qm9rR4P7k62l4K06j09P4J01k4m7l6k4J93k07K08j24
2572B9J2M6L7j7J38j01J17j20N0J37j77q6J48j22p1J58l21J26O4j80J27J20j77
2595f3K37j60P5j10j24J28q0l3RJ02p9J17l1j7J8j61J70j20j32K17n6Q6j3k20
2619b40J85K6j1j29p5K99q8%Lk7j54J78M9p0L5J1P3Q5q0K9j23J87Mj49J47j8j63
$$ plain form
2450 -176 -3 9 -116 -259 -83 -85 -105 -115 69 -59 -163 -48 -89 33 259 5 -26 165 -4 128 181 202 168
2473 168 23 294 305 174 94 169 47 156 85 243 -25 20 -66 158 -185 -190 -107 -52 -67 -202 -85 -115 -100 -54 -168
2498 -168 -299 -41 -66 -133 -104 -16 -40 -25 -189 37 -81 73 -37 71 -47 60 106 22 -93 195 124 -38 98
2521 98 40 103 229 12 118 196 118 45 65 190 16 -30 37 57 -12 102 -180 -165 -1 -203 -64 -124 -208 -52 -112
2546 -112 -146 -255 -234 -276 -221 -141 -7 1 -48 -57 37 114 -148 -182 24 -85 -11 90 66 19 -17 -41 152 -55 153 29
2572 29 41 87 124 107 245 144 261 141 191 328 151 65 213 91 20 178 -143 -17 47 -133 -6 114 -63
2595 -63 174 14 89 -21 -145 -17 -97 -130 -121 -19 -98 19 -12 -29 -11 -172 -2 -122 -254 -37 -93 -7 -20 -240
2619 -240 -55 -29 -40 -169 -244 55 -33 -33 -30 -57 -211 -33 16 -54 -19 -8 65 150 70 99 -24 163 167 18 165 147 -16
2646a6K49j10Oj22J0J95k78J66r1j31K04J8m4R2q4L8j33L9n8k6K2J60l11L11j37
2671c1O5K4k2j40J72q8p3k9J23n3MJ27r1j42K3L11l22R8rKM9j23N4j13J46j20
2697a58pMJ75k48J65j0r4J64n2J1L4j53J6Q6q7K3J79j87J99l2j04J50r6J03j1
2722G0j65J09r1K50j25N1j97O0K94j07j17Q0Q0j09L9J84N6m5j39O2j1M2k06P2
2746A37L1O9j09l3M1k9P8k24J54j88K26q8j24J0o1J6K9M6j15O3N5n6j68M5l2R3
2772a34o7n0Q5r8K77l14J10L0J0j68J93r4kJ14q5r5K23K0r4j01J24J12j29J85
2796E2j69K24j67J13r7J65j56RJ35L5j76J5J15m4n8J5K33j24J52k76R7K33k69
2819E7R1%q3K42j11q8R0q1J18k31P1J24k07J87n9%p2L0N0o0o7L5q5p5K48j32o0
$$ plain form
2646 -16 233 123 129 7 17 212 -66 100 9 -122 82 100 56 148 64 102 -31 8 -50 -76 -54 106 -205 106 -31
2671 -31 34 58 36 -104 68 -20 -93 -122 1 -52 -48 79 -12 -154 -131 180 -142 -44 -53 -51 -2 -125 -71 -184 -38 -158
2697 -158 -165 -161 14 -234 -69 -79 -173 -9 -61 -50 -16 -169 -153 -67 -154 -131 48 -139 60 28 -76 74 -22 81 70
2722 70 -95 14 -77 173 48 99 -98 -38 256 149 32 112 192 83 122 306 362 317 178 240 229 271 65 137
2746 137 168 237 128 95 136 107 185 -39 115 -73 153 65 -59 -49 -110 -94 -65 -19 -134 -71 -16 -72 -240 -195 -227 -134
2772 -134 -201 -251 -166 -264 13 -301 -191 -161 -151 -319 -126 -220 -222 -108 -193 -288 -65 -45 -139 -240 -116 -4 -133 52
2796 52 -117 107 -60 53 -44 121 -35 -26 109 144 -32 -17 98 54 -4 11 244 120 272 -4 93 326 57
2819 57 148 148 65 307 196 108 198 117 235 4 75 199 -8 179 120 120 48 78 128 68 1 36 -49 -124 124 -8 -68
2846f8K1j53R6J03o6N4R4j93j20J03L8Pj82K06j56J99q8j60J81k7n4O8J20j79
2870a56K6mJ11J1p7J4j7j69J99J24j66J02j6l5M8l1N4Q5M2p1j76J01Q8j83J30
2895C4Q6p7q1j5L0j5J43pj64J62M8j68L3J08J28r5P1j80J60q6J94k19k8J13m6
2920A29N5j5k28J58j4k02K76j28l2J18p1J5k14J05O6O6l3j1j51J27r2l9O9j68
2944b14J3N8l8O4M3Jo9j02L8l5R0o1K23rr7L1l7P9J07j86q0J84L3p8j44J27M0
2971a9q8M8q1J82M8o8J6q2Q5L6J0j4P9k83L3P2Q0j27J14o6P4p9P4M0k13J83P8
2998A32j6L4k99M5J66j44N1o0j2J98o4m9R9q2Q0j31K51l8r5j96J16J98O1j47Q0
3023A78l54J98r8P3N8j49NL50m21J92J48l03K08p6J3j51J76kj95QP0K11k31n9
$$ plain form
2846 -68 -47 -200 -104 -1 -67 -13 81 -112 -232 -129 -91 -84 -266 -60 -216 -17 -105 -265 -84 -111 -165 -97 23 -156
2870 -156 -130 -134 -23 -12 -89 -75 -92 -261 -62 62 -104 -2 -18 -53 -5 -36 18 103 145 74 -102 -1 87 -96 34
2895 34 120 43 -38 -53 -23 -38 105 98 -66 96 144 -24 9 117 245 150 221 41 201 115 309 90 62 175 129
2920 129 184 169 -59 99 85 -117 159 31 -1 117 46 61 -153 -48 18 84 51 40 -111 16 -76 -115 -46 -214
2944 -214 -201 -143 -181 -117 -74 -73 -142 -244 -206 -241 -151 -212 11 2 -95 -64 -101 -22 85 -101 -181 3 36 -42 -186 -59 -19
2971 -19 -107 -59 -140 42 90 22 38 -44 41 77 87 73 152 -131 -98 -26 54 -73 41 -25 49 -30 44 84 -129 54 132
2998 132 116 150 -149 -104 62 -82 -31 -91 -103 95 31 -18 81 -1 79 -52 199 161 66 -130 -14 184 245 98 178
3023 178 -176 22 -76 -3 55 -94 -89 261 -160 32 180 -123 85 9 22 -129 47 45 -150 -142 -72 139 -92 -151
3047a51r3J73m3L7J9o4m3J70q3q0R5k64L55o9R1j77J92j19O0J17j04QM8l4o1J25
3073A05L7m6j43R8J9l1l9p1K28lJ73l14M6ML1j62K00m1J36k4j98K4j18J61J06
3098A78o5k07J33j33M0Qo1J22j4J05j80N9K9rP8j52o0r4J99N7K1j38M9m2M6K2
3124iR9j04M9j21Q3q2K5Q8l0k8m6r8J45n8K7J20n9kR9k77J99J06k21J14j64P2
3150g3J97j88N5j26J18K5m1n1P5j28O8k3n5J92o3j35J9n4J12K20j4j81J08O0j69
3175e2J28K5p8p1O9p2K1K3N1j54J44k73L93j15j58K32Q1j60J52j68m4J34j74J44
3199G8M9r2N3M2j2j63K30j72QP6N8k93J67Q4j01r7p8K44j61j2J55J5j33J40l1
3224E4j53K20j53N1Ok00M2N3J89q0n4K3n3K4j14J94j73J28j78J54j05J49M1o3
$$ plain form
3047 -151 -244 -71 -114 -77 -58 -122 -165 5 -78 -158 -63 -327 28 -41 50 -127 65 -54 6 123 19 27 75 41 -20 105
3073 105 142 96 -47 51 70 39 0 -71 157 154 327 13 59 63 94 -68 132 91 227 203 5 29 -89 72 178
3098 178 113 -94 39 -94 -54 -46 -107 15 1 106 -74 -15 14 5 83 -69 -129 -223 -24 33 54 -84 -35 -77 -31 -9
3124 -9 90 -14 35 -86 -3 -85 -60 28 -2 -30 -76 -174 -29 -87 -60 60 1 -1 98 -179 20 126 -95 19 -145 -73
3150 -73 124 -64 -9 -135 -17 8 -33 -84 -9 -137 -69 -92 -147 45 -18 -153 -134 -188 -76 144 130 -51 57 117 -52
3175 -52 76 101 23 -48 21 -51 -30 -7 44 -110 34 -239 154 39 -119 113 194 34 186 18 -26 108 -66 78
3199 78 127 35 88 130 118 -45 185 13 21 97 155 -138 29 113 12 -85 -163 81 -80 -92 63 78 -55 85 54
3224 54 -99 121 -32 19 25 -175 -133 -80 109 29 -25 -2 -55 -31 -145 49 -124 4 -174 -20 -125 24 65 2
3248BL1o3n6K07j29n0J20j64J35r6NrJ27j29p4K53o7p9OJ15k9J20q2n9R3k03J44
3275F9j7N4j41J07j03L0J92j82O0k8j73Q5J29j60P5Qj43J14m6J39j41P1n0N5L7
3300D1N0L4j69o9J78j27J42j3J2j87J32J6L0m2Q7k32J86j36n5m5K73j75Pj0J71
3325I9jk7J8p9N6j29J76j08o9J18k24K02mj46K4J50m2p3M5J60o5j94K38j34Kp4
3351h1J6J33p5O5o4J30k24J80p6j24K61p2n4q6K06j23N6q7nr6l0J36j7K52j75
3376D6k17K52n5k1o1J15j17q6J96j4j66O5J17o5O4k8q4oR0j78J06L2j40m9K12
3401Hp0M8k8O8J01j78R5r9l5O1Q8r6N5q9J69j19O0R8j41R6p1k37N24l04Qj5L1
3428B8Pm7p9O0nJ94k46l4J59n3lj2K6qk7j59Q6l2K68j76l3Q7n3J0J71l65K15p9
$$ plain form
3248 2 33 -30 -86 121 -8 -58 62 -102 33 -63 -58 -67 60 -69 -143 110 43 -36 -30 85 56 176 94 35 128 -75 69
3275 69 52 106 -35 72 -31 -1 191 9 69 41 -132 -47 82 -78 -3 5 -138 -24 -70 69 -72 -1 -51 4 41
3300 41 91 125 -44 -113 65 -62 80 67 79 -108 24 40 70 28 115 -117 69 -67 -122 -167 106 -69 -62 -72 99
3325 99 98 71 89 10 66 -63 113 5 -64 54 -170 32 28 -118 -94 56 14 -59 -14 146 81 -113 125 -9 -7 -81
3351 -81 -65 68 -7 58 -6 124 -100 80 4 -120 141 69 15 -71 135 12 68 -19 -24 -120 -150 -14 -31 221 46
3376 46 -171 81 26 5 -56 59 -58 -144 52 38 -128 -63 54 -11 53 25 -59 -65 25 -153 -47 -15 -155 -204 8
3401 8 -62 -14 -42 26 127 -51 44 -55 -90 -29 59 -37 18 -71 98 -21 39 137 -4 92 21 -216 308 4 12 -3 28
3428 28 35 -12 -91 -31 -36 158 -88 -122 37 -16 -19 -31 -5 -13 -40 -199 -113 -145 123 -53 -86 1 -52 -42 129 -236 -21 -100
3456a00J6R7J34k04P8j33R1Jj60K04j91N2P2o4J03m2j7K14q9J2j41K74j18j11
3480b2j21M8n3J39K08j04Or9j57J94lr1M0L8l0l8j69K08o6L4pL0n7K55j67L9j67
3507a12J76k8k09K71j8j20p3Q6Q5N0j26P8m7M5J72l38j03K34j66L12j25Q6p7N8
3531A11o6q9PJ36R3q9k36K80j31p4J8o9K48k44K33k55J84L0p3j7K14Lj57j01J8
3556b6P6o1%j50L20p7k54K8J77j51l9K04K0r8K2P5n9Nj07J68rk48J81Q7j09P7
3582E2k52L19j24o3jj1m5R2P0l9m0J27j91Q2K9l3MNM9J19m5r3j70Q5mn1n0J50
3610b9P9j55J76K7k28J94kJ3j81R4K24j61l5J00O6k30J38q9r6K24K5j76P8n4J08
3635A10p7l4N0q2L50k52j39J66L3j65k0J29l7j6M0k22J07O2j75J47J32k47L7P0
$$ plain form
3456 -100 -84 13 147 -57 21 -112 -21 -20 -180 24 -167 -115 -43 -107 -4 -46 -63 151 62 74 -67 207 89 -22
3480 -22 -143 -95 -148 -9 199 95 101 2 -155 39 36 -55 -15 23 -7 -45 -214 -6 -72 -38 -45 -15 -72 183 16 55 -112
3507 -112 64 36 -173 98 80 -40 -113 -27 58 108 -18 60 13 58 230 -108 -211 23 -143 169 44 130 53 111
3531 111 45 -44 -37 99 192 103 -133 147 16 -58 -40 -109 139 -105 128 -127 57 87 14 -3 211 214 57 -44 -26
3556 -26 50 -11 -11 -161 159 82 -172 -144 33 -118 -157 47 67 -31 -9 66 7 12 -95 73 64 -184 -3 84 -25 52
3582 52 -200 119 -5 -68 -69 -80 -125 -33 37 -2 -42 85 -106 -24 5 -28 -24 -19 30 149 104 11 -159 -74 -78 -129 -179 -29
3610 -29 50 -105 71 98 -130 64 62 75 -106 -12 212 51 16 116 182 -48 90 1 -95 129 154 -22 56 2 110
3635 110 33 -1 49 -33 317 65 -74 92 125 -40 -60 69 32 16 56 -166 -59 3 -172 -25 107 -140 -103 -33
3659c3P5K1j24n8Q3JL3l7Q%k0M4J6J23j60L4p1K02l06L23j26j27L1J53QJ04j33
3686F4l6j32J86p9k52K72O5j44K9m4QQ0j31L7O2J97j58k0K2J1k3k74L35j32J19
3711F2J23j77j7j5J0M5m1L6n2M4j1J60k38J19L8j34rQ2N7r5J9J57p7o9L3j10N7
3738cJ37j36j8L6M5r2J37o0p6L5Mj1k6j19J49L7Kj42L0q4M1K49j88r7J86n3L9
3765B2m9M9M2j07N0nm1J22j55l1J32J9j15n3K4p8L55k32J71p5P9k14J53j21O0
3790Bl3J04m9o0K07j83m2j1J04j81J53p8J12Q9k15N4p2J17K5J3k0Mo3Pj66K14
3816C2j2p5O8n8K0K14j30k6o9P8J4r4P7m6p6J49j12J73j11j0n0m9P2K4J36j79
3842d0P9Q3j67n5J6J51Q9k03L7oQ2pj72K67r7PJ06j53q4K56k52L9J00k23K1K38
$$ plain form
3659 -33 42 63 -61 -119 -36 -35 -2 -39 -31 -31 -51 -7 9 132 -28 6 -65 137 -169 154 28 -99 -68 85 93 197 64
3686 64 28 -104 82 3 -249 23 88 -56 -27 -71 -63 17 -114 -77 -15 182 24 4 26 37 14 -260 75 -57 62
3711 62 185 8 -9 -24 -14 31 -10 26 -26 18 7 167 -71 48 86 -48 -57 25 82 -13 6 163 86 17 50 -60 -3
3738 -3 134 -2 -20 16 61 -31 106 46 -30 5 9 -2 -28 -147 2 39 41 -101 -71 -155 -114 135 -53 -150 36 -17 22
3765 22 -27 22 64 -43 7 2 -39 83 -72 -103 29 48 -67 -120 -96 -174 181 -51 120 45 124 -90 63 -58 2
3790 2 -31 73 24 -36 171 -12 -54 -65 39 -142 11 -67 45 134 -81 -27 -99 18 43 56 36 40 -23 -16 -182 32
3816 32 20 -55 13 -45 -25 189 59 33 -36 42 56 -38 39 -7 -83 66 -46 127 16 6 -44 -93 -21 3 139 -40
3842 -40 39 122 -45 -100 -84 67 156 -47 -10 -16 66 59 -113 154 57 64 170 17 -67 189 -63 -24 76 -147 -126 112
3868A12k41J39j61J69q3m5m3MJ6O8q4J38m5L3j58K84j62l6M8Ql6l9O4J18n9J69
3894A78l51J74Oj25K71j45j16R9J14j75J3J12K0j8Q9j53O1p6P9l5k1p0J04J36
3918A71k29K96o9O0n4k39Q9j05L8j14K20n5j64J20J61j78JJ60p9j32Q6P5j80J14
3942gk8j28O9K3K24k35lO7j13J1K24j60o7R2J12j49J32j11J19j8L1L9j82J56K5
3967A23j83K47j66Nj15K58j05m3o1k2J72j90K24k35J18j07Q6K8n4j2O9J92j48
3990H1n1K0j31J00jp0l9J41Pj11J24q1J76j51P3j34J70j46j1pR9j82K14J48j93
4015D5p6l4O8L4j48J26n1L7O6k36J15J09j98J73N7j01P0k18J27or5K02j30p5M8
4040i1k07M21l7o5J63l24J36J53k39Q0o9q4K78j64O0K19l14Q0N1l5Pj7K1q0j18
$$ plain form
3868 112 -129 10 -151 18 -65 -110 -153 -149 -133 -65 -149 -11 -56 -23 -181 103 -59 -95 -47 -39 -75 -114 -50 68 9 178
3894 178 -173 1 7 -118 153 8 -108 -9 105 -70 -57 55 75 57 146 -7 54 -22 57 22 1 -69 35 171
3918 171 -58 238 169 229 175 -64 25 -80 -42 -156 64 9 -155 -35 126 -52 -51 109 30 -102 -16 59 -121 -7
3942 -7 -35 -163 -94 -71 153 -82 -85 -18 -131 -120 104 -56 -123 -31 81 -68 64 -47 72 54 85 124 -58 98 123
3967 123 -60 187 21 26 -89 169 64 21 -40 -62 110 -80 144 -91 27 -80 6 34 -20 -32 37 229 81
3990 81 30 50 -81 19 18 -52 -91 50 57 -54 70 -11 165 14 87 -47 123 -23 -34 -41 58 -124 90 238 45
4015 45 -31 -65 3 37 -111 15 -36 1 67 -169 -54 55 -143 30 87 -14 56 -162 -35 -41 -136 66 -64 -139 -91
4040 -91 -298 123 86 21 184 -140 -4 149 -90 -10 -79 -163 115 -49 11 230 -84 -4 47 12 19 2 23 -57 -175
4065a75J55N4J33j73J3k2K05j38m5J25q4r6J14j19L0R6k08J33J11l8pn4j6j8q9
4090a13P4R9j47J55k66K44r5J78j86l2J73q2J10k13R9J05j45r4P3n0J6K27j94
4113f4o6N8qm5mK48n6j32J58n8k00K33k0m7l9J27j66N8k7q2J86o0j2K06l03J54
4139C9P5j59J8k46K03J05m8j35K6L1K57j03k4j01j7J44M8j78Q5M3j90J69m1j83
4163a82L38r5p5N0l4k5O7J4j60J35o6J25p1kq9O0N7l1j86L28k35OJ13j37K11k6
4189I0p0J1m5o8n3P5O9j04m4K22j83M7N5PLn1J96j34j16L9L9J01j28J25j08M1
4215A6q4O9N6L7Rj81Q7K6j84K86p7j99J06J07j30p2K12k73J92N1j00R4j0J1j21
4240g2q4K48j82L13n8j03j8q0O4m6K2j9k5M7n4m4J70j28J37L4K9j27kJ43j94n1
$$ plain form
4065 -175 -20 34 167 -6 7 -15 190 52 7 132 48 -48 66 -53 -23 73 -135 -2 109 71 64 10 -6 -24 -113
4090 -113 -39 60 -87 68 -198 46 -49 129 -57 -89 84 2 112 -101 -2 103 -42 -136 -63 -113 -97 130 -64
4113 -64 -130 -72 -80 -125 -129 119 63 -69 89 31 -169 64 44 -3 -42 85 -81 -23 -50 -132 54 -6 -18 188 -115 39
4139 39 114 -45 -27 -273 -70 35 -13 -148 -122 -91 166 63 39 -62 -79 65 113 -65 20 63 -127 42 1 -182
4163 -182 156 61 -14 36 2 -23 44 58 -102 33 -33 92 21 19 -70 -10 47 16 -170 158 -77 -71 42 -95 116 90
4189 90 20 31 -14 -82 -135 -60 9 -95 -139 83 -100 -53 2 9 12 -39 157 23 -93 -54 -15 86 -42 83 -25 16
4215 16 -68 1 57 94 103 -78 9 35 -149 137 60 -139 -33 74 -56 -128 84 -189 3 54 -46 48 38 49 -72
4240 -72 -156 92 -90 223 165 62 44 -36 28 -18 4 -15 -40 7 -47 -91 79 -49 88 122 151 24 22 165 -29 -80
4266h0J38j8n8m7J71r8K6j02O1L6j05L64k26K0j17J2j6P3Qq1l5J17p5R1j20k7
4292h8J4J82PL9j28n0k4Q0j41K39k27jJ44j36O2o5J13M4N2q2n1rR4L5n8j74J5
4319a14J00N0j33J19j24J38O4q7K7Q3n9q3k2O1J04k72J08J75r8p7oQ3Ok6L7q8
4345c4J34r9J23q3N4J7k82K78j77j2L5M3p1j7N5J22j8n1j21J48J23j40r2J80P9
4370A94l18J36M1q0J73n4J7j38nQ3L0J20j95L5j5K9j15P4r7l1L1O2K8j39L20j28
4396E8q4j58K74ol6O7k10L15k48N5pJl1q9L2J52j95J13M0k1J3j04J63r1O8r0J01
4423H2l0l3M9j7P8j06K2J1q5O6j00M3J28o4J92k72M3Q9q9j0J80k61J85p6k7L5
4449C3r7k0J07p4O5J3j8k7l1k7K06k11n6J97j87J75q3j15J75J4j31Q0m1J08l9
$$ plain form
4266 -80 58 40 -18 -65 106 8 34 -68 -7 29 -76 288 62 82 -35 -23 -39 34 42 -39 -74 43 -32 59 -61 -88
4292 -88 -74 108 115 154 26 -24 -48 32 -109 130 -97 -98 46 -90 -28 -93 20 64 116 34 -17 -26 68 103 45 -129 -114
4319 -114 -14 36 -97 22 -102 36 100 13 40 123 64 -19 -41 20 124 -148 -40 135 37 -40 -46 37 43 17 54 -34
4345 -34 100 1 124 41 95 112 -170 108 -69 -81 -46 -3 -74 -91 -36 86 68 17 -104 44 167 27 -65 115 194
4370 194 -124 12 53 -27 146 92 109 -29 -34 49 79 199 4 39 24 53 -62 12 -85 -116 -85 -23 5 -134 186 58
4396 58 -26 -184 90 84 48 115 -95 220 -28 27 20 21 -10 -99 -67 85 -110 3 43 22 35 -69 94 3 71 -19 82
4423 82 52 19 68 51 129 23 45 56 -29 37 -63 -20 108 44 236 -36 7 96 7 -3 177 -84 101 25 -2 33
4449 33 -64 -84 23 -51 14 27 9 -18 -49 -76 130 -81 -137 60 -127 48 -35 -150 25 39 -92 -12 -53 55 16
4474A6o2lQ7k23K55M9o2j14K77l22J87m6j3O1j43m6J54lL4J44j47p0o8Q6k6k3
4500b1K95j41j58m3J26l1J6r0k0J74o2j76J87l1pj2r2J29nP7j21J41k60K42p3
4525D4JJk8m0m9p0K04J3j7j11o2R9Q2Om6j28kJ34j23P6j18J25N1p9J17l3j31K04
4553A20o0j3J46j73M8J0o5L4k64L48j29l6J0O3j25J02k63L95j09j3m4N8j54J33
4577A9j32J97M0j69J74k97J24m4M8O5R3j64lJ42Nk50J89j8p7Q7n3j64J58j41Q5
4602h6R9Q8k01j9mk3K20j54J04Q8j18j1J13L3q5l3l4l2J39Q2j69m9k5J02j95J54
4628a6j54J54R5k99Q9J44J79q9o7j83J28j3L3j36R5P9j9J04k36J88k33Q5J04j14
4652h2rJ13j19K42j5j36l8J36L3j72Q1J33j26L7J54k81M4k6J90j74j37J79m7k1
$$ plain form
4474 16 -46 -49 38 -185 70 119 57 -57 220 -102 85 39 26 87 -56 -102 52 49 83 227 80 10 -58 28 2 -21
4500 -21 274 133 -25 -68 58 27 43 -47 -67 107 45 -131 56 25 18 6 -86 43 38 115 -6 135 -125 117 44
4525 44 45 46 18 -22 -71 -141 63 76 59 -52 -114 -15 67 73 27 -101 -103 31 -92 -16 -134 -9 42 -37 80 47 -84 120
4553 120 60 47 193 20 68 78 13 47 -217 131 2 -34 -24 39 -86 16 -247 148 39 26 -18 40 -114 19
4577 19 -113 84 124 -45 129 -168 -44 -88 -40 25 118 -46 -49 93 98 -152 37 19 -58 29 -24 -188 -30 -171 -86
4602 -86 13 101 -100 -119 -123 -146 74 -80 24 112 -6 -17 96 129 44 11 -23 -55 84 166 -3 -52 -77 25 -170 -16
4628 -16 -170 -16 79 -220 -131 13 192 103 36 -147 -19 -32 1 -135 -40 39 20 124 -112 76 -157 -72 32 -82
4652 -82 -91 22 -97 145 130 -6 -44 92 125 -47 34 167 41 78 232 -49 -5 -31 159 -15 -152 27 -20 -41
4676d1K00j18p2N9kk6m1l8Q6Q0j22QR2l7j19K9J51j50J83p3kJ22o6k3k14J8J54
4703C8j9l8J4q4M1P0qj42K39k01P9JL7K0m1j27J86q9J77p2J4J09k89J38r3n5o0
4730a55K34j08j2j08R8J7J41j9j45j35K23r2Q2k63J16J10L4Q6k61K81N5k22O0
4753A7j30R7P8j41R1j08P1J5J95l91J80N9q2J56j36J06l3j59J80j16J30P0k45
4776i6Q5J8jL3Q4P8k93P0K25k39N2O5nk08K09j65K12k36n4J00J30r9j5J02j61
4801a09K57j40kRL4q5J2M9j3JL2Q1J49k58L9N7j69J65o8ql2J07k10O2n0l7P3J17
4829F3j37J54m6k1k02K11M1M4j24L2r7K60k03mJ4q4J48j74N8J98j8m7j29J67k96
4854a92J84J33r4j03L3J24k8N9j41j17J96K3k8r7m8n8P7J19l7j33P2L37q9j1o7
$$ plain form
4676 -41 159 41 -31 28 26 0 -41 -79 7 87 -35 -27 65 28 -91 -62 89 -61 122 49 47 169 103 80 -134 -116 38
4703 38 19 -19 -5 -89 -48 22 14 -128 111 -90 -11 -10 27 47 6 -121 65 -24 153 81 95 204 -85 53 -40 -95 -155
4730 -155 79 -29 -41 -149 -51 -34 107 88 -57 -192 31 -61 21 -242 -126 -16 18 104 -157 124 179 -43 17
4753 17 -113 -16 62 -79 12 -96 -25 -10 185 -206 -26 33 -49 107 -29 77 44 -115 65 -51 79 149 -96
4776 -96 -11 7 6 39 123 201 -92 -22 203 -36 16 81 76 -132 77 -88 124 -112 -166 -66 64 -35 -50 52 -109
4801 -109 148 8 6 15 49 -36 -24 25 12 13 45 126 275 17 56 113 -56 109 41 33 1 108 -102 -40 -90 -127 -54 63
4829 63 -74 80 34 13 -189 22 63 107 -17 15 -82 178 -25 -29 -15 -99 49 -125 -67 131 113 66 -63 104 -192
4854 -192 -8 125 31 -72 -39 85 57 116 -25 -142 54 77 49 -48 -96 -154 -77 42 5 -128 -56 281 192 181 114
4879A14r2j84P5N8NM3j11N5j3M7P2pO4k07j41J93K1L0K3o9J37k09N5J10p0R9q2
4906A6O1k0j31k3K5N8n6R8n9J02k14L3M7L34k51p8J38q2J82k79lJ75q6p3J51j51
4932h6M6N4J02k91J26lJ06q9L8K22k39L5J9j82K02N1j3j77pr4R5J74o0r3N2K1
4958Ikj29K09j3j40k9N5m9J33j32J0J52j50J23j76l0J23j4J1O6j70K51k36R1k1
4983e8LM1pJ88l08J80j22L7j3P6n7k6J23n5K08m1j39j49L24k12L5j8o9kJ50j02
5009a3K6M7j7k4J26Qk03jK85l50J69j6j02J12l4q7j86L58k05O9J88m1k10K05j99
5034i5J84j74K20j1p3l4Q4J04j4r6j0J0m9j14j4J16r5j0K3J3M5o3J67l73L52J46
5060B39l17j6N3K60j89K00j55n9n5k3l2N9J57L7l08J35N7k56K0J80j5K04j83J54
$$ plain form
4879 114 22 -162 -87 -29 -24 19 -92 -37 -50 -3 69 62 126 -81 -222 -29 -8 22 45 -24 113 -96 -41 69 -1 98 16
4906 16 77 57 -74 -97 -72 -14 -70 28 -31 71 -143 -110 -63 271 20 -58 80 -2 180 -99 -102 73 -13 -86 65 -86
4932 -86 -40 14 116 -175 -49 -52 54 -35 3 225 -14 21 40 -142 60 111 98 -79 -86 -180 -85 89 29 -64 -12 9
4958 9 7 -122 87 74 -66 -95 -40 -89 44 -88 -78 74 -76 47 -129 -159 -36 -50 -39 27 -143 108 -128 -37 -58
4983 -58 -55 -14 -21 167 -141 39 -83 -46 -59 17 -40 -66 57 2 210 169 30 -119 205 -7 28 10 -59 -61 89 -13
5009 -13 13 60 43 19 145 153 -50 -51 234 -116 53 37 -65 47 13 -74 -260 98 -107 -38 150 109 -101 104 -95
5034 -95 89 -85 135 124 51 17 101 205 191 95 85 95 46 -68 -82 34 -61 -71 -48 -35 10 -53 114 -259 93 239
5060 239 -78 -94 -41 219 30 230 75 16 -39 -62 -94 -35 122 159 -149 -14 43 -213 -193 -13 -28 176 -7 147
5084A47j06j49J43k9OJ60j23j78K46j52J34j13J67k03o1J83k6R3j76M3J52p1l7
5107E0j60J05q1N3lJ0n4Rk3J28K7n1m2o1J67j41J02O7j78P5M3Q8p2j53K33k23
5133h5J95j86J7J35r4O8k1M4j1n9mj18J09pP9j72J82n6j0Q1l4j52L8J15Nr2J64
5160A31j25j08J85j66J69k08K35j17q1K10j73J8O1j30R0R7j56L1N7k5k5j13K05
5183F2N1j15m2J0J25j21J6Q6l1N2q7p3P8P3j43Q3q6Q9m0K%MoQ2j0j76J40k93K44
5212b6J73j53l4J41o4J23k77l2J31N4q4M4j13N0n4J03L4m1K08j09r8q0kJ01l5
5237d0J0M9q6R9P8k18K50n1j75P6n5K17l5Q5j21j93J42o9j10K68m06K28J21j0
5261E4n4L7j76J34KJ4r0K4R2K30k98pJ15l3j70J8J03P4lj61O1O3O5j47R7j3Lj11
$$ plain form
5084 147 41 -108 35 6 12 172 49 -129 117 -35 99 -14 153 -50 -111 72 46 139 -37 6 158 87 50
5107 50 -110 -5 -86 -33 -36 -26 -80 -71 -94 34 61 10 -32 -93 74 -67 35 102 -76 -1 42 130 58 -95 138 -85
5133 -85 110 -76 -59 76 -18 50 29 73 62 3 -1 -119 -10 -17 62 -110 72 16 6 87 53 -99 -61 54 59 -33 131
5160 131 6 -102 83 -83 86 -122 113 -4 -85 125 -48 -30 31 -99 -9 88 -68 -37 20 -5 -30 -143 62
5183 62 113 -2 -44 -34 91 -30 -14 72 41 93 6 -67 11 84 -59 24 -62 27 -13 -11 -11 -7 -13 69 59 -117 23 -270 -26
5212 -26 147 -6 -40 101 37 160 -117 -149 -18 36 -48 -4 -117 -67 -121 -18 16 -25 183 74 -24 -104 -106 -5 -40
5237 -40 -30 19 -67 32 110 -108 142 91 -84 -8 -63 154 119 204 83 -110 32 -37 -147 121 -285 -57 64 54
5261 54 0 37 -139 -5 -3 11 -79 -55 37 267 -31 -38 77 44 -126 -108 -5 69 66 -95 -34 29 94 -53 44 31 34 -77
5289g7K06q5n7Q8j40K15j70o1j2P2n4K59n0k76K11j57K18q8k40L32%k32Q6L0J27
5314A45k73J04J07J6j06K2m3P1J52N3m13J74k0K07j06N4l2l01m2J81rJ5j15K54
5338I5j67j17K16L9j96N3pJ90j75K60l19N2K16j61O6k23L0K46j95L4J67l8Lr0
5362b1J09O0K2o8k6j71J47j60J74n0r6J33M2M7j31NJ22j03l9J59m4j26K3J70j68
5387A0P3k4l6k31L89k32j26J07J67j1O2m1j79J12q0n8r8J67mJ48m3p4Q9k97J69
5412d1P4j6M9j03Q4j19J64j41J43j07R3j05J38j04R1j14K41j10k51N3O9J07m9
5435D6m0R8j06o5P7j09K31j65O2J2m8j7J37j06j46J94M0l09K31Q5m5k94J39J44
5459D6j38N9k9N3k9m8J37K4M6j05l4QpL3j42J81l4j02L3l5n3K44j26O8P9L0k83
$$ plain form
5289 -77 129 44 -13 75 -65 150 -20 -81 -93 -21 -75 184 134 -142 69 -88 130 42 -198 134 134 -98 -12 18 145
5314 145 -128 -24 83 99 -7 15 -28 43 195 248 -165 9 -11 196 90 144 112 -189 -231 -50 -59 -44 -159 95
5338 95 -72 -189 27 66 -130 -77 -84 106 -69 191 -128 -76 140 -21 45 -178 -148 98 -97 -63 104 66 69 -21
5362 -21 88 148 170 102 76 -95 52 -108 66 16 -80 53 95 142 11 16 138 35 -4 155 111 -15 8 178 10
5387 10 83 59 23 -208 181 -51 -177 -70 97 86 148 107 -72 40 -40 -98 -196 -29 -33 115 72 -2 87 -210 -41
5412 -41 33 17 66 -37 47 -72 92 -49 94 -13 80 -25 113 9 100 -14 227 117 -134 -81 -12 95 46
5435 46 6 104 -2 -67 10 -99 132 -33 29 41 -7 -24 113 7 -139 55 95 -214 17 102 57 -237 -98 46
5459 46 -92 -33 -62 -9 -38 -86 51 75 121 16 -18 -10 -17 16 -126 55 21 -81 -48 -83 -136 108 -18 50 129 159 -124
5486a24m5K48JlK6k09J37J31j26n0j20J53n1O0R1j57J95k64J25J40n6j09qr6J16
5511En1o1R6p5k0J75j47J64n8L8k0m7K2j00K0P0j27J03J84n8m3o3k5lk9L1n4J32
5539E9q7r3O1O5J6r4J76k95K40j26J48m0J5m0o4M9O4M6j78O7Q5M3j36k8M6j00
5565a01K60m9p4j25J85j54J09J10j09R7j64P6L0j6Mj58L4J29j03K4O8j09J48k00
5589h8K9J60J2o1j12P3J09k59R5m2Q9j00J63m1oL6j03O1j1Q9j66J17k8L1l2J3
5615B8q6R6o2L8o2O0j21Q2J36pn2j13n7J32J35k64O4J40l2m2N0j91J66rJ0o7o2
5642i0K05r0j04Q6o2p7j30K42m6M0J02oj51Q3O8j76R9q6K62q9q9O8j58J34J15
5667A50p2q5q7k7J45j85K11Pj24Q6j79K98k33J08J27j86o5J5rm0r5L93k04n6N4
$$ plain form
5486 -124 -169 79 80 77 103 -106 31 162 36 -14 -134 19 -32 28 119 -38 157 -107 18 158 102 -7 -15 -111 5
5511 5 -46 -107 -11 -86 -106 69 -78 86 28 66 46 -1 21 -79 -59 11 -116 -13 171 113 70 7 -18 -21 -50 -19 -73 59
5539 59 -28 -121 -60 5 21 -73 103 -192 48 -78 70 30 45 5 -59 -10 54 100 -78 -11 74 117 -19 -47 -1 -101
5565 -101 159 110 36 -89 96 -58 51 161 52 149 -15 61 91 75 79 -79 -45 84 -19 5 73 -36 112 -88
5589 -88 -59 101 113 52 -60 13 122 -137 -42 -84 5 -95 68 27 21 57 -46 15 4 93 -73 44 16 47 15 28
5615 28 -58 38 -24 14 -48 12 -109 -27 109 102 50 -63 -120 12 147 -117 -53 87 55 13 63 -128 38 29 39 -28 -90
5642 -90 115 25 -79 7 -55 -132 -262 -20 -66 -26 76 70 -81 2 70 -106 -7 -93 169 80 -9 59 -99 35 150
5667 150 78 -7 -94 -121 24 -161 50 57 -67 19 -160 138 -95 13 140 -46 -111 -96 -105 -145 -240 153 -51 -107 -53
5692e3K6j7J2R4j12J86j62M2k0K07j36n3k74K47J00j32j8M7K7n9j9n2L50j88j7
5717B6r9k4R9M7Q5j21j9j42J84j4l6N8j15O4J4J30l21K69j10p4J32o5Q8r4Jo9
5743a06J01M9j40P7r0J22r3L23k60Q6j20O6N3j68N0K2N9o6J03p8j3j50J18O4K
5768A1L3kk4J59j25L1M4p3q1pJ22j78Q9j18K92j20j97J94j39K21r0j02J23j24
5792f1P5J1r9J06q2J42k7L9j2k5o1j13MK6jP4R3k23J04J85k45K55m4p1j98K39
5818I1j8q9P2j80L1J45q0Q0r4P4J18k44J88j09M3n3J61j73M9K3MJ34j40k8N5k4
5844C6j29Q9J72j71M7l9k4N8j79K55k8L9r1k12K21m8J40p2m8j9l4k8P3oJ00j23
5870b1n1K44k29K14j69J30j84Ko8L9K03r3m8P0oj48J49k4j08N8rN3r1K11m5j39
$$ plain form
5692 -53 -27 -44 -32 62 -50 136 -26 16 -4 203 67 14 -260 -13 87 -45 -63 -16 11 -48 -67 -119 231 43 26
5717 26 -73 -97 2 49 134 13 -6 -148 36 22 -14 44 -71 -7 7 137 -184 85 -25 -99 33 -32 56 -38 -37 -106
5743 -106 -5 44 -96 -19 -109 13 -80 243 -17 69 -51 15 68 -100 -50 -28 31 -35 68 -10 -23 -173 -55 9 11
5768 11 44 42 18 177 52 83 127 54 -27 -34 88 -90 -1 -119 173 53 -144 50 -89 132 42 -60 63 -61
5792 -61 14 25 -74 32 -50 92 65 104 92 67 6 -107 -103 -77 -78 -4 89 -134 -30 155 -90 165 121 50 -148 91
5818 91 73 -16 56 -124 -93 52 -28 52 -42 32 150 -94 94 -15 28 -25 136 -37 12 35 39 173 33 5 60 36
5844 36 -93 -4 168 -3 44 5 -19 39 -140 115 87 126 35 -177 44 -4 136 64 16 -3 -37 -65 8 2 102 -21
5870 -21 -72 172 -57 157 -12 118 -66 -64 -132 -93 110 17 -31 39 33 -115 34 10 -98 -40 -49 4 -87 124 79 -60
5896f0K50k26m7m2J6L8R4k01m0K87j94J06J08O1j10n1j2L5j96J7K54j46J79r9
5920B1m3j56K02K8j52P4K3Rm4K5k3k1Q4M7r8N6m6M2o2j05J74J35p2k3m1J02J40
5947B76m31J89J7j70O9j74K94r4NP4j38K06o3j65J45p4l0j8K17j17J6j13M7J15
5971H3P7k45l4K42l1p1P6j79O8p5J22k30K20m6J08j03J17j5j23J15K0O0l19J67
5995Dnk44K83p2J00j20M1j8J39k78N3o3k25L19PJ62m7K3r0j9R6m7nJ81k73n6J61
6022Gj1j75R1L2L6O7p2P1r5J37q6k2K7o8J39L2l2L9pQ0j00r0n5P2k8l6p2q0K10
$$ plain form
5896 -60 190 -36 -83 -125 -109 -71 23 -178 -218 69 -125 -19 89 150 40 -11 -23 12 -184 -167 87 -59 120 21
5920 21 -22 -178 24 52 -100 -26 -3 6 -38 -13 -36 -57 27 74 -24 32 -14 28 -34 -139 35 170 98 75 34 136 276
5947 276 -155 34 51 -119 -50 -224 70 -24 -19 55 -83 123 60 -105 40 -34 -64 -82 135 18 34 -79 -32 83
5971 83 160 -85 -119 123 92 21 97 -82 -14 -89 33 -197 23 -23 85 -18 99 84 -39 76 96 156 -163 4
5995 4 -1 -245 38 -34 66 -54 -13 -31 108 -170 -117 -180 -405 -86 -79 83 36 59 -31 -50 46 -1 -6 175 -98 -154 7
6022 7 -4 -179 -88 -56 -20 47 -25 46 -49 88 2 -20 7 -61 78 110 78 117 110 190 90 0 -55 17 -11 -47 -119 -199 11
$$ [...]
8191a2
##END NTUPLES=NMR FID
##END=
