##TITLE=1H_K-426/2_2
 CDCl3, 8 sc, 
 31.05.2021
##JCAMPDX= 6.0         $$ Bruker NMR JCAMP-DX V2.0
##DATA TYPE= NMR FID
##DATA CLASS= NTUPLES
##ORIGIN= UXNMR, Bruker Analytische Messtechnik GmbH
##OWNER= root
$$ XWIN-NMR		Version 3.5
$$ Mon May 31 11:38:25 2021 Russian Standard Time (UT+4h)  she@DPX200
##.OBSERVE FREQUENCY= 200.131506
##.OBSERVE NUCLEUS= ^1H
##.DELAY= (6, 6)
##.ACQUISITION MODE= SIMULTANEOUS
##.ACQUISITION SCHEME= undefined
##.AVERAGES= 8
##.DIGITISER RES= 18
##SPECTROMETER/DATA SYSTEM= spect
##.PULSE SEQUENCE= zg30
##.SOLVENT NAME= CDCl3
##.SHIFT REFERENCE= (INTERNAL, CDCl3, 0, 15.7039)
##AUDIT TRAIL= $$ (NUMBER, WHEN, WHO, WHERE, WHAT)
$$ ##TITLE= Audit trail, XWIN-NMR		Version 3.5
$$ ##JCAMPDX= 5.01
$$ ##ORIGIN= Bruker BioSpin GmbH
$$ ##OWNER= she
$$ F:/spectra/data/she/nmr/H-F/1/audita.txt
$$ ##AUDIT TRAIL=  $$ (NUMBER, WHEN, WHO, WHERE, WHAT)
(   1,<2021-05-31 11:37:02.65 +0400>,<she>,<DPX200>,
      <created by zg, POWCHK disabled, PULCHK disabled
       configuration hash MD5:
       00 E9 B6 7A A2 85 ED C7 34 08 36 98 17 FE 4E 26
       data hash MD5: 16K
       81 5F 6F 93 D7 F1 CC FD 62 54 82 99 3A E4 3E AD>)
$$ ##END=
$$ 
$$ hash MD5
$$ 60 F6 BD 58 30 99 BB C1 C3 7A BB 87 38 1D D7 40
##$RELAX= 
##$RELAX= 
##$RELAX= 
##$RELAX= 
##$RELAX= 
##$RELAX= 
$$ Bruker specific parameters
$$ --------------------------
##$DU= <F:/spectra>
##$EXPNO= 1
##$NAME= <H-F>
##$PROCNO= 1
##$TYPE= <nmr>
##$USER= <she>
##$AMP= (0..31)
100 100 100 100 100 100 100 100 100 100 100 100 100 100 100 100 100 100 
100 100 100 100 100 100 100 100 100 100 100 100 100 100 
##$AQSEQ= 0
##$AQ_mod= 1
##$AUNM= <au_zg>
##$AUTOPOS= <>
##$BF1= 200.13
##$BF2= 200.13
##$BF3= 200.13
##$BF4= 200.13
##$BF5= 200.13
##$BF6= 200.13
##$BF7= 200.13
##$BF8= 200.13
##$BYTORDA= 1
##$CFDGTYP= 0
##$CFRGTYP= 5
##$CHEMSTR= <none>
##$CNST= (0..31)
1 1 145 1 1 1 1 1 1 1 1 1 1 1 1 1 1 1 1 1 1 1 1 1 1 1 1 1 1 1 1 1 
##$CPDPRG= <>
##$CPDPRG1= <>
##$CPDPRG2= <>
##$CPDPRG3= <>
##$CPDPRG4= <mlev>
##$CPDPRG5= <mlev>
##$CPDPRG6= <mlev>
##$CPDPRG7= <mlev>
##$CPDPRG8= <mlev>
##$CPDPRGB= <>
##$CPDPRGT= <>
##$D= (0..31)
0 1.2 0 0 0 0 0 0 0 0.06 0 0.03 0 0 0 0 0.0002 0 0 0 0 0 0 0 0 0 0 0 0 
0 0 0 
##$DATE= 1622446622
##$DBL= (0..7)
120 120 120 120 120 120 120 120 
##$DBP= (0..7)
150 150 150 150 150 150 150 150 
##$DBP07= 0
##$DBPNAM0= <>
##$DBPNAM1= <>
##$DBPNAM2= <>
##$DBPNAM3= <>
##$DBPNAM4= <>
##$DBPNAM5= <>
##$DBPNAM6= <>
##$DBPNAM7= <>
##$DBPOAL= (0..7)
0.5 0.5 0.5 0.5 0.5 0.5 0.5 0.5 
##$DBPOFFS= (0..7)
0 0 0 0 0 0 0 0 
##$DE= 6
##$DECBNUC= <off>
##$DECIM= 32
##$DECNUC= <off>
##$DECSTAT= 4
##$DIGMOD= 1
##$DIGTYP= 9
##$DL= (0..7)
0 120 120 120 120 120 120 120 
##$DP= (0..7)
150 150 150 150 150 150 150 150 
##$DP07= 0
##$DPNAME0= <>
##$DPNAME1= <>
##$DPNAME2= <>
##$DPNAME3= <>
##$DPNAME4= <>
##$DPNAME5= <>
##$DPNAME6= <>
##$DPNAME7= <>
##$DPOAL= (0..7)
0.5 0.5 0.5 0.5 0.5 0.5 0.5 0.5 
##$DPOFFS= (0..7)
0 0 0 0 0 0 0 0 
##$DQDMODE= 0
##$DR= 18
##$DS= 0
##$DSLIST= <SSSSSSSSSSSSSSS>
$$ [...]
##$SUBNAM2= <"">
##$SUBNAM3= <"">
##$SUBNAM4= <"">
##$SUBNAM5= <"">
##$SUBNAM6= <"">
##$SUBNAM7= <"">
##$SUBNAM8= <"">
##$SUBNAM9= <"">
##$SW= 16.9725357007746
##$SWIBOX= (0..15)
0 0 2 0 0 0 0 0 0 0 0 0 0 0 0 0 
##$SW_h= 3396.73913043478
##$TD= 16384
##$TD0= 1
##$TE= 0
##$TE2= 300
##$TE3= 300
##$TEG= 300
##$TL= (0..7)
0 120 120 120 120 120 120 120 
##$TP= (0..7)
150 150 150 150 150 150 150 150 
##$TP07= 0
##$TPNAME0= <>
##$TPNAME1= <>
##$TPNAME2= <>
##$TPNAME3= <>
##$TPNAME4= <>
##$TPNAME5= <>
##$TPNAME6= <>
##$TPNAME7= <>
##$TPOAL= (0..7)
0.5 0.5 0.5 0.5 0.5 0.5 0.5 0.5 
##$TPOFFS= (0..7)
0 0 0 0 0 0 0 0 
##$TUNHIN= 0
##$TUNHOUT= 0
##$TUNXOUT= 0
##$USERA1= <user>
##$USERA2= <user>
##$USERA3= <user>
##$USERA4= <user>
##$USERA5= <user>
##$V9= 5
##$VALIST= <valist>
##$VCLIST= <CCCCCCCCCCCCCCC>
##$VD= 0
##$VDLIST= <DDDDDDDDDDDDDDD>
##$VPLIST= <PPPPPPPPPPPPPPP>
##$VTLIST= <TTTTTTTTTTTTTTT>
##$WBST= 1024
##$WBSW= 4
##$XGAIN= (0..3)
0 0 0 0 
##$XL= 0
##$YL= 0
##$YMAX_a= 280996
##$YMIN_a= -52442
##$ZGOPTNS= <>
##$ZL1= 120
##$ZL2= 120
##$ZL3= 120
##$ZL4= 120
##$ABSF1= 10
##$ABSF2= 0
##$ABSG= 5
##$ABSL= 3
##$ALPHA= 0
##$AQORDER= 0
##$ASSFAC= 0
##$ASSFACI= 0
##$ASSFACX= 0
##$ASSWID= 0
##$AUNMP= <proc_1d>
##$AZFE= 0.1
##$AZFW= 0.1
##$BCFW= 1
##$BC_mod= 2
##$BYTORDP= 1
##$COROFFS= 0
##$CY= 11.3945322036743
##$DATMOD= 1
##$DC= 2
##$DFILT= <>
##$DTYPP= 0
##$F1P= 15.9154993809931
##$F2P= -4.1035820241983
##$FCOR= 0.5
##$FTSIZE= 0
##$FT_mod= 4
##$GAMMA= 1
##$GB= 0.15
##$INTBC= 1
##$INTSCL= 1
##$ISEN= 128
##$LB= 0.24
##$LEV0= 0
##$LPBIN= 0
##$MAXI= 10000
##$MC2= 0
##$MEAN= 0
##$ME_mod= 0
##$MI= 1.114404
##$NCOEF= 0
##$NC_proc= 0
##$NLEV= 6
##$NOISF1= 3.799351
##$NOISF2= 2.8
##$NSP= 1
##$NTH_PI= 0
##$NZP= 0
##$OFFSET= 15.70392
##$PC= 1
##$PHC0= -11126.72
##$PHC1= 19.20099
##$PH_mod= 1
##$PKNL= yes
##$PPARMOD= 0
##$PSCAL= 0
##$PSIGN= 0
##$REVERSE= no
##$SF= 200.130013532006
##$SI= 16384
##$SIGF1= 3
##$SIGF2= 2
##$SINO= 400
##$SIOLD= 16384
##$SREGLST= <1H.CDCl3>
##$SSB= 0
##$STSI= 0
##$STSR= 0
##$SW_p= 3612.71676300578
##$SYMM= 0
##$S_DEV= 0
##$TDeff= 0
##$TDoff= 0
##$TI= <>
##$TILT= no
##$TM1= 0
##$TM2= 0
##$TOPLEV= 0
##$USERP1= <user>
##$USERP2= <user>
##$USERP3= <user>
##$USERP4= <user>
##$USERP5= <user>
##$WDW= 1
##$XDIM= 8192
##$YMAX_p= 0
##$YMIN_p= 0
$$ End of Bruker specific parameters
$$ ---------------------------------
##NTUPLES= NMR FID
##VAR_NAME=  TIME,          FID/REAL,        FID/IMAG
##SYMBOL=    X,             R,               I
##VAR_TYPE=  INDEPENDENT,   DEPENDENT,       DEPENDENT
##VAR_FORM=  AFFN,          ASDF,            ASDF
##VAR_DIM=   8192,          8192,            8192
##UNITS=     SECONDS,       ARBITRARY UNITS, ARBITRARY UNITS
##FACTOR=    0.0002944,     1,               1
##FIRST=     0,             0,               0
##LAST=      2.4114304,     0,               0
##MIN=       0,             -52442,          0
##MAX=       2.4114304,     280996,          0
$$ Real data points
##PAGE= N=1
##DATA TABLE= (X++(R..R)), XYDATA
0@%%%%%%%%%%%Qj6J6j6J6k4L2m0M8n6P2q8J03j19J36j55J79k08K40k73L12l55
33a88M00m51N08n72O43p19Q02q93R92j100J218j350J492j645J814k000K204k425
51a270K669k942L248l588L968m402M901n480O158o969P962r203J0809j2980J6090
66H971k0937K9583m9658J80641J32396j61320J11777q9866k8779J6653m4901K9815
78A14375j7044l3714R1778p3688p363P1707q5157j2247K6728o1828p159j7676
90a1288q211P824l6026J9669M0588o2227L6117L6608o2375K9422J3608l4130J8728
103a1693j5978J0666J4382m6168N3580K318n9549P2651k1318l2576M5403k3063
115a1345J0489O9j3173M2999l6842j0780N6464n7759n531L9688m3343O623Q437
$$ plain form
0 0 0 0 0 0 0 0 0 0 0 0 0 8 -8 8 -8 8 -16 16 -24 24 -32 40 -48 55 -64 72 -83 96 -112 128 -145 167 -188
33 -188 212 -239 269 -303 340 -379 423 -470 522 -578 640 -710 782 -863 951 -1049 1155 -1270
51 -1270 1399 -1543 1705 -1883 2085 -2317 2584 -2896 3262 -3707 4255 -4948 5861 -7119 8971
66 8971 -11966 17617 -32041 148600 280996 119676 231453 141587 112808 129461 84560 114375
78 114375 97331 63617 155395 81707 74344 146051 60894 48647 75375 13547 6388 -11288
90 -11288 -19499 -11675 -47701 -28032 12556 -49671 -13554 23054 -39321 -9899 3709 -30421 -11693
103 -11693 -27671 -17005 -2623 -48791 4789 7107 -52442 20209 -1109 -33685 11718 -11345
115 -11345 -856 -787 -13960 29039 -7803 -18583 37881 -19878 -25409 14279 -29064 -22441 -14004
128a4004j187J3653j5082K4281K1115l8468K6215K3526n5239K2173J2769l6465
140a6713J2180K669L014M635j1102L3133J017l6750M8263j0573m2307M0716j8529
153I653j6052J2370r318J5599j5597l182L6743l6826m538M1626m3738R40K2860
166A0540k2025N760n070J0031N285k6665K2597R716m1369K3383J2593l6011J9757
179a1478O250p737M924k349J6791q363j7265K9456j2668l0110L6172j3551j9125
192b9053K5289o390M429k135J759J9971k4216j482K9066l4183k107K8529k5951
205a6474O789J0655r44Q410j2005J7745M894k8595K0446P588l4515J9923Q121
218A2038j8300J1673J507Q571n631p612K3506j3578j9212K8262j0996k1806K6218
$$ plain form
128 -14004 -15191 -1538 -16620 7661 28776 -9692 16523 40049 -15190 6983 19752 -16713
140 -16713 -4533 -1864 1150 5785 -5317 27816 28833 -7917 40346 29773 -12534 28182 9653
153 9653 -6399 5971 -3347 12252 -3345 -6527 30216 -6610 -11148 30478 -13260 -12320 10540
166 10540 -11485 -5725 -10795 -764 4521 -22144 453 10169 -31200 -7817 4776 -31235 -11478
179 -11478 -5228 -12965 -8041 -10390 6401 -1962 -19227 10229 -2439 -32549 3623 -9928 -29053
192 -29053 -3764 -10154 -5725 -7860 -6101 13870 -10346 -11828 17238 -16945 -19052 9477 -16474
205 -16474 -9685 970 26 8436 -3569 14176 19070 -9525 10921 18509 -16006 3917 12038
218 12038 -6262 5411 6918 15489 9858 2246 25752 12174 -7038 21224 10228 -11578 14640
231A4640p847o593O203oQ653j7938L900J8622k8263L14K7709k6696N09K0751j2544
246A414K040l418Q142j684k2993J8775J947k9829J9951J0171k4360J7082O544
259C782n801N58k778J2425j6594j0869K3013j6600j6173K8389q196j1550J9230
272a164j518J214n701N660R318k3452O415J6929k5273L084K1760j8169L470J0404
286B977j965R14q856J5240j988j9842K1077L784k2899J7949P232j6000Q418N53
300F594K792q111m496J8770j5144o855K4443j0435j0284K1398o639o958M041j593
314G523K476j6527P650J0614k2243Q496J7829j8129L503J4174j0501p04k549N121
328F733n062j5245J7503l088j7845J8800L919j7373J2239M271q264p94j512Q644
$$ plain form
231 14640 6793 200 6403 6397 15050 -2888 1012 19634 -8629 -8315 19394 -7302 -6793 13958 1414
246 1414 3454 36 8178 6494 -16499 2276 4223 -25606 -5655 4516 -19844 -2762 3782
259 3782 -2019 -1461 -4239 8186 -8408 -19277 3736 -12864 -29037 -648 -8844 -20394 -1164
272 -1164 -2682 -1468 -7169 -1509 7809 -15643 -9228 7701 -17572 -14488 7272 -10897 -7427 2977
286 2977 1012 1926 -6930 8310 6322 -13520 7557 11341 -11558 6391 13623 -2377 6041 6594
300 6594 9386 1275 -3221 15549 405 -6450 17993 7558 -2726 18672 12033 5075 9116 7523
314 7523 9999 -6528 1122 11736 -10507 -2011 15818 -2311 1192 15366 4865 4161 1612 6733
328 6733 1671 -13574 3929 841 -17004 1796 5715 -11658 581 4852 -3412 -4206 -5718 2926
342B926j4077l048K0171j5891o179K0711r114r101J2222l628k526n087N319O230
356a072j7203J1762J1730j7905P826J3180j4229J283O997l602j683n047J3248
369E285l302j1475K0583r33j2888J4743K397j1994N071J96k21o198j197J4339
383A4406j3652o72J8361j1834n204J4064p160n970L103n44J171j1095Q614P260
397A0848j7959J0711Q168j5276K564P128q618j564o78M441k947q982J6620m564
411a08j1253J5375k079j1721P208J471n994q63Q52P983j0212M03J6300j4033k026
426h697J3761r030o094P415j603k368k878O219N023j3879J1770O127j6495P556
440c173O419j1417k09N317j373k648k185J2107m845q920J7162n277j0891J0581
$$ plain form
342 2926 -11151 -14199 5972 -9919 -16098 4613 -4501 -13602 -1380 -5008 -7534 -12621 -7302 -1072
356 -1072 -18275 -6513 5217 -12688 -4862 8318 -5911 -4628 2369 -1233 -2916 -7963 5285
369 5285 1983 -9492 11091 10158 -2730 12013 14410 2416 7487 7683 7462 1264 67 14406
383 14406 754 82 18443 6609 1405 15469 8309 2339 5442 4898 6069 -5026 3588 10848
397 10848 -7111 3600 11768 -3508 -944 6184 -2434 -3998 -4676 -235 -3182 -12164 4456 -108
411 -108 -11361 4014 1935 -9786 -2578 -1107 -7101 -7964 -7112 871 -9341 -8938 7362 -6671 -8697
426 -8697 5064 -3966 -10060 -2645 -4248 -6616 -9494 -3275 1748 -12131 -361 5766 -10729 -3173
440 -3173 3246 -8171 -8380 -3063 -4436 -7084 -9269 2838 -2007 -10927 6235 958 -9933 648
454F48n53q706L454L091K10l835K509J1453j2293J034J3844j2680k511R719n106
469B78m246L984K591O27p148R075M839j5892J0231L809j2859L657M656m919j549
484b866K586M717l717n418J4000p297r816J3299n380q431N284K281m246j570M040
499b534M553r208J410J1239j4395k20R858q514k768O340M20k979m05O556R26j1032
515a0753J0868K478j4563R093L873p938K209N416O07k857L02Q909o435o201J4143
530I151q025o796J0589k451m222L044M181r16m723M694N811j2574K598R129j2517
545c027P16P568m044k910L500L652k970m531P698L41j1514R967J450j0164O540
560B272L399l943j371K973K309o157k546R574q172n675J2118o129m035O278M73
$$ plain form
454 648 95 -8611 -5157 -2066 -1856 -5691 -3182 8271 -4022 -2988 10856 -1824 -4335 5384 278
469 278 -3968 16 2607 3234 -3914 5161 10000 -5892 4339 8148 -4711 -1054 3602 -1317 -2866
484 -2866 -280 4437 720 -4698 9302 2005 -7811 5488 108 -8323 -3039 -758 -5004 -6574 -2534
499 -2534 2019 -7189 -5779 5460 -8935 -9155 703 -7811 -10579 -4239 -3819 -6798 -7203 -647 279 -10753
515 -10753 115 2593 -11970 -2877 996 -6942 -4733 683 1290 -1567 -1265 7644 1209 -4992 9151
530 9151 1126 -5670 4919 2468 -1754 1290 5471 4555 -168 4526 10337 -2237 361 9490 -3027
545 -3027 -2311 5257 1213 -1697 1803 5455 2485 -2046 5652 5993 -5521 4446 5896 -4268 2272
560 2272 5671 1728 357 3330 5639 -518 -3064 6510 -1662 -7337 4781 -1348 -5383 895 1368
575A368k908k225L417J54r333K886N361j2165L484P159p790J544M658J070k883
590f203p1N549k586p126Q633K04r744R070J955n346K751L451M26l371J766N501
606D859n884l019J1181o702l729R524l602k569J465K183j734n484M822K673r302
621e318M598P386r469L491N351l609j599O80K831n427l372O373k528p276R515
636A627J18o553O422J589k906j831K631O43o945l35O044o975l184R670n629k393
652h007N421q26j423j950L935k11o348N075M005q932M947N206o646J518K761N77
668h98l353j0O099l707l066Q571n62n880P389N69m611J267Q50J00n257K642L787
685C930o165M34P792m631k265P717k733k971M16J942k191m368M954R87p300N427
$$ plain form
575 1368 -1540 -3765 -348 -194 -9527 -6641 -1280 -13445 -9961 -2802 -10592 -9048 -4390 -3320 -6203
590 -6203 -6274 -725 -3311 -10437 -1804 -1600 -11344 -2274 -319 -5665 -2914 537 963 -2408 -642 4859
606 4859 -1025 -4044 7137 435 -3294 6230 2628 59 1524 3707 1973 -3511 1311 3984 -5318
621 -5318 -720 6666 -2803 688 6039 2430 831 1511 4342 -1085 -4457 1916 -612 -7888 1627
636 1627 1745 -4808 1614 3203 297 -1534 1097 1740 -5205 -5540 504 -6471 -9655 15 -5614 -8007
652 -8007 -2586 -3412 -4835 -6785 -2850 -3061 -9409 -4334 -329 -9261 -4314 892 -5754 -4236 -1475 -898
668 -898 -4251 -4261 1838 -1869 -4935 3636 3074 -2806 4583 5152 541 1808 2658 2758 -2499 143 3930
685 3930 -2235 -1801 5991 1360 -905 6812 4079 1108 1524 3466 1275 -3093 1861 2848 -4452 975
701I75M445p910L217L544l292j178K20L741n386j081O753m250m261P376j410o173
717d670M734O4k971j888L135J549n882L590M714o133l78P053n317k588M229j533
733b292j965r02M627j390m124O425J610o911M517L882o871J452K265o85k579O28
749b313N417m597q72P021k855m160O053r30l966K469J017l99l561M329K526o015
765h36L066M765o104k93N048l659j944J777J500j867k614N799j146m811M658J337
781D676o089K085K693m323j84J259K029l958K47N287m721k073N327k588m555L975
797i13J60k451n15K549J203n363M054K463n918J038L852m596j208L963j056j497
813d235M93M480k181k946O302j183m744M034J839m800J997K365o91j402J395M275
$$ plain form
701 975 5420 -2490 727 4271 979 -199 21 3762 -1624 -2705 4048 -202 -4463 2913 1503 -4670
717 -4670 64 128 -2843 -4731 -1596 -47 -5929 -2339 2375 -3758 -4136 2917 -2400 -4988 -759 -2292
733 -2292 -4257 -5159 -532 -1922 -6046 379 1989 -4922 -405 3477 -3394 -1942 323 -362 -2941 -2313
749 -2313 3104 -1493 -2365 4656 1801 -2359 3694 2764 -1202 1267 2284 1885 -1676 2653 5179 -836
765 -836 2230 6995 891 598 5646 1987 43 1820 3320 1453 -1161 4638 3492 -1319 3339 4676
781 4676 -1413 672 3365 -958 -1142 117 2146 -1812 -1565 3722 -999 -3072 2255 -333 -4888 -913
797 -913 -753 -3204 -3719 -1170 33 -5330 -1276 1187 -4731 -3693 159 -4437 -5645 -1682 -2738 -4235
813 -4235 -3742 738 -1443 -4389 1913 730 -4014 20 1859 -2941 -944 1421 730 -672 723 4998
829D998m919M17M929l750j704M128j169k841K586R65m02k280L146J306n957L586
845C039K125n005M31L334k162j131J661J268j405k168M548k267m035M479q28m019
861b135K414J841k759J51J690J182l682M52M116n366p14L716k716k561L236J87
877i48k037K00K011R5m261L346J533n365K418K414k955n1L156o08j262N59L190
894A435k095k843N646k061k661L834R58k343J084K750j189j340J144K432m817
909f6Q54M078m439m00L953j164k116K338Q95j336j706K731M5m912L390J366m234
926g23K040K122j948p54J970K91k197r21L531k862k646M840k098k517K318Q70
942A316k255n04J596o8l707J316K762m659O36L329k491j068K420M12k494L04J983
$$ plain form
829 4998 79 496 5425 1675 -29 4099 2930 89 2675 3640 3238 958 4104 5410 -547 3039
845 3039 5164 159 590 3924 1762 631 2292 3560 2155 -13 4535 2268 -1767 2712 1884 -2135
861 -2135 279 2120 -639 -488 1202 2384 -1298 -846 3270 -2096 -2810 906 -1810 -4371 -1135 -948
877 -948 -2985 -2785 -774 -679 -4940 -1594 -61 -5426 -3008 -594 -3549 -3600 -444 -1052 -2314 -1755 1435
894 1435 -660 -3503 2143 82 -2579 1255 2213 -130 954 3704 2515 1175 2319 4751 -66
909 -66 788 4866 427 27 3980 2816 700 3038 3933 2597 891 3622 3667 -1245 2145 3511 -723
926 -723 1317 3439 1491 737 2707 2998 801 -120 3411 549 -2097 2743 645 -1872 446 1316
942 1316 -939 -1443 153 85 -3622 -2306 456 -4203 -3567 -238 -2729 -3797 -1377 -965 -3459 -3155 -1172
959a172r97k889L575O25l955L541J473k135J50K667l34j923J226K022k161j492
975a779M647k194j885L702k98j838J034J937j919j375J920J167l662J633L175
990D265m163Q92K298j054j920J703R58k386o47K775p82l053L382L75l068K064
1006A639R98j680j189J580j12k668P23K488k413j118M080k355j606K355N9k125
1022a344m80J993j094k113J520J879l664J490K619l159M02J078j56j754N42J768
1038d73j539j263L391n74k883L310M10k266Q10J138m37j798J736J308k002J91
1054i41L188k158j183L462j127j243N91J400j162r08K158K55k649K127J911l431
1070B90J098J942j767p47L92J348j817m70K346j052k010L040n03k665J922J69
$$ plain form
959 -1172 -2169 -5058 -1483 -858 -4813 -1272 201 -1934 -1784 883 549 -1374 -148 1874 -287 -1779
975 -1779 2868 674 -1211 2491 2193 355 1389 3326 1407 32 1952 3119 -543 1090 4265
990 4265 102 994 3292 2238 318 2021 2979 593 -54 2721 1939 -1114 2268 2643 -425 1639
1006 1639 2637 957 -232 1348 1236 -1432 -709 1779 -634 -1752 2328 -27 -1633 722 781 -1344
1022 -1344 -1824 169 -925 -3038 -1518 361 -3303 -1813 806 -2353 -1951 -873 -1029 -2783 -2241 -473
1038 -473 -2012 -3275 116 -458 -3341 -31 379 -1887 -1077 61 -376 -2174 -438 870 -1132 -941
1054 -941 2247 89 -1094 2368 1241 -2 589 1989 827 -81 2077 2332 -317 1810 3721 290
1070 290 1388 3330 1563 816 1208 2556 739 269 2615 1563 -447 2593 2090 -575 1347 1516
1086A516j651m01J465r4k220J110J604k268o47L090k308j307J761m48j054n52
1102b404J990o60j618J808R79k890J321J462k677N63J058j95j140Q31J983k181
1118a770j6K321q46j922K656l87j650R87P76j03j192J907P53k398Q51K195j815
1135C47r00K469j405n98J015R84q75q20K170l06j830J633P96k743J092J256j845
1152D40q3P34J010j659j8K531k343q95K124q14k289K102j69p84o21J204J70k218
1170a578J703R92k389L4J963k043p12J766k43q82j63J593j217r26K018o22j801
1187b507J009J593k442R70J081m78q35N99J714k026L1K000j181j312K234m66j336
1204a352J656N17m20p08J623K46j901J283R06j982J60J820j121n54J088M15q93
$$ plain form
1086 1516 -135 -536 929 835 -1385 -275 1329 -939 -1586 1504 -804 -2111 -350 -798 -1852 -2404
1102 -2404 -414 -1074 -2692 -884 95 -2795 -1474 -12 -2689 -2126 -1068 -1263 -2403 -1572 411 -1770
1118 -1770 -1786 535 -311 -2233 423 36 -1614 -627 149 46 -1146 761 1514 -884 -33 2162 347
1135 347 -553 1916 511 -87 928 1912 1037 217 2387 2081 251 1884 2680 -63 1029 2285 440
1152 440 357 1091 2101 442 424 2955 612 -283 1841 1027 -1262 840 671 -113 -734 470 640 -1578
1170 -1578 125 1117 -1272 -1238 725 -1318 -2030 -264 -507 -1389 -1552 41 -1176 -2102 -84 -706 -2507
1187 -2507 -1498 95 -2347 -1377 -296 -774 -1609 -1010 704 -1322 -1291 709 -472 -1784 450 -16 -1352
1204 -1352 304 821 401 -307 1316 1562 -339 944 1850 -132 28 1848 727 173 1261 1676 783
1221G83m23K068j329j107J790j12j728Q37J125j554M55L60M75j910M72J490k159
1238d67J96J483r62j095J698r1j179l5J051l05k027J676K99k139Q94J064j461
1255a400L3J703o97m24l4J141j229j046J984r41j136J785L57j591Q13J055q61
1272d88m85R33J023k097M74J498j341l9J435j72j197J080M73o33m32J027L23k136
1290g54J996M01j084L73J073p60m39Q96m3r84l55J586j164j048J971m62p52Q60
1308A311J42r07R2N27m10j055M82J080j806K28J451j127l72Q74M5r22J96J53m44
1327d62j212J329L73j881J522K71j151J27R78n40o18J86N94p40o76J760r79m34
1345a553J265j31r13Q52M59o83j70N12N14j247P39J267j382J44J094j60j280J307
$$ plain form
1221 783 360 2428 1099 -8 1782 1670 -58 779 1904 350 805 1165 1640 -270 202 1692 -467
1238 -467 -271 1212 250 -845 853 762 -417 -452 599 294 -1733 -57 242 -1897 -1003 61 -1400
1255 -1400 -1367 336 -361 -785 -819 322 -907 -1953 31 -910 -2046 -261 96 -1495 -682 373 -488
1272 -488 -973 -40 983 -1114 -640 858 -483 -522 913 741 -456 624 1097 464 32 1059 1382 -754
1290 -754 1242 1643 559 932 2005 1245 806 1702 1659 675 320 1906 742 -306 1665 1203 451 1311
1308 1311 1453 546 638 1165 755 -300 182 1262 -544 -316 1135 8 -364 510 555 -367 -171 -18 -462
1327 -462 -1674 -345 28 -1853 -331 -60 -1211 -1084 -106 -646 -1264 -1078 -484 -1224 -1900 -140 -1119 -1553
1345 -1553 -288 -419 -1332 -480 -21 -704 -874 -362 152 -1095 -356 911 -471 -327 767 607 -673 634
1363F34K63p45j60J114p7j439J597L11j389O89L83n07n06P36j37q01K44J094r13
1382C91o09J663q02o18M80P5r52J57M61m2r06M22P15j521N30R96j191k23N68m2
1402d48j010M53N47o41n83J249l52j286J426l9j048K99P19r4r96Q78O05p50j63
1421a234J474j175j42J214l80p45M62N67n38j42J068R4q15Q82P01j277L86P61
1439A161r29r8L87M57n78J31O09j80q40J534k57j172R21J52m13n90R28j29p65
1458C29M46M68j067RJ444j531j58N47r1p81K86P59m39m84J38O40j278K86L17j011
1478a171L38J81J42p86O30N37o02m24R77k06j361J355k36r09O65J82l06k93Q18
1497d69K58n00NJ008p19l19R87l93l29K57N00o56l6R18j72n80P33N84j456Q15
$$ plain form
1363 634 897 152 -8 1106 1029 -410 1187 1498 109 798 1181 674 168 904 767 -34 210 1304 391
1382 391 -218 1445 643 25 505 580 -372 -215 246 204 -702 -280 435 -1086 -556 440 -751 -974 -406 -448
1402 -448 -1458 -1005 -458 -1099 -1682 -433 -785 -2071 -645 -684 -1732 -1433 -714 -808 -1804 -926 -321 -1071 -1234
1421 -1234 240 -935 -1077 137 -243 -988 -526 41 -497 -639 429 523 -292 590 1291 14 400 1161
1439 1161 232 134 521 978 400 531 1140 960 120 1654 1397 225 1146 1298 885 295 1223 1094 329
1458 329 775 1243 176 185 1629 98 -60 487 396 -385 -99 660 221 -263 -125 515 -763 -477 -160 -1171
1478 -1171 -833 -652 -510 -1296 -666 -129 -731 -1155 -178 -384 -1745 -390 -626 -1535 -870 -688 -994 -1287 -469
1497 -469 -211 -711 -706 302 -417 -736 251 -142 -471 -214 286 -370 -406 512 340 -240 493 1077 -379 436
1517D36N05l82oN3O42q21K1Q75n72n32R60m33o20P09K85m21Q3P6k8m38J12K82
1539G86o91k54P43q94l9O77k75j65P9o4q2m92O43k76o54J87P84j210O02j68nj73
1561i41J41O08j120L21O12l68l54N91j54k97K65M29o9n67P64j08n42N45M28o76
1581d92m0R12l78L8K13K78n17K7O58j90l34L07K44o82L84O76o23J12R2J49o01
1602B33L40N78n89k22N14j75n03P04j79k57J09j0j89o28O09l3m66q2N65o60J7
1623c24L23k88m08K13L17l60n74O86q2o26M96K25n04J31L20j37l73M96J35j004
1643a338O65N37n43k24N69J29o81N93K95k81j69M39k34k45N88J22k91O9N16j47
1663C69j10%L44k33l48O46m22N8N14k51j89N2N59p18J39J59K21o43K08O42j074
$$ plain form
1517 436 941 559 553 606 1248 427 448 1323 751 219 1179 746 126 835 1120 699 782 858 830 392 504 786
1539 786 95 -159 584 -310 -349 328 53 -112 -33 -97 -179 -671 -28 -304 -958 -771 13 -1197 -595 -763 -768 -941
1561 -941 -800 -192 -1312 -991 -379 -747 -1101 -510 -664 -961 -696 -267 -336 -903 -139 -247 -789 -244 184 -492
1581 -492 -532 380 2 40 253 531 14 41 699 509 175 482 726 44 428 1104 481 593 685 834 233
1602 233 573 1151 562 340 854 679 176 880 701 444 553 543 354 -274 335 302 -164 -246 319 -341 -324
1623 -324 -1 -289 -697 -484 -167 -527 -1101 -415 -497 -1123 -627 -402 -906 -775 -455 -592 -965 -469 -334 -1338
1643 -1338 -673 -136 -679 -903 -334 -205 -886 -293 2 -279 -448 -9 -243 -488 100 222 -69 0 516 369
1663 369 259 259 603 370 22 668 246 304 818 567 378 430 989 271 410 569 790 147 355 997 -77
1684g7M86K37l96k58L46K6l95K39N6j76l68M38n7n82M45L03q74J71N28n04j87
1705e99p3L92m26j80O43k95k12M95m00m70M16J65l00J45J28J10l94K04M06m86
1725g31L78Q0j02k73L96J85j15k18K15K15m54N95L33m30p5K50l08m9N82j14j07
1746B53r8O76n11q6O84m66j42K23J07k12k16Q4M63o38L08J42l55oL26j42n29M91
1768C56k09l25L10P9j23k69M42k08o62L37J66k78l5J31k56N1K28P2k92p7L94m78
1790f46K13K01k32j88M25k21J2jK19L6l07J93M31n54J62L59j28k56L94k57O0J70
1812H5P1J31n69O79j75l34M38P5j11j07K65P7k44kK24k0k16L91k96j32Q5J87k82
1835B20R7K32k81j90L65k8o46L48J90l69K47k92J25j87M4Q5j0oJ05j70o38P10
$$ plain form
1684 -77 409 646 250 -8 338 364 -31 208 264 88 -280 158 101 -481 -36 267 -607 -436 92 -412 -599
1705 -599 -672 -280 -706 -886 -243 -538 -750 -255 -655 -1125 -709 -544 -844 -699 -571 -461 -855 -651 -245 -731
1725 -731 -353 -273 -375 -648 -252 -67 -182 -400 -185 30 -424 171 504 74 -1 249 -59 -108 474 360 253
1746 253 155 831 320 234 918 452 310 533 640 428 212 296 759 121 429 571 216 210 536 394 -135 356
1768 356 147 -178 132 211 88 -181 261 53 -609 -272 -106 -384 -419 -288 -544 -493 -265 -193 -485 -562 -168 -646
1790 -646 -433 -232 -464 -652 -227 -448 -436 -437 -218 -182 -489 -296 135 -419 -257 102 -26 -282 112 -145 -85 85
1812 85 156 287 -282 397 222 -112 326 401 290 183 448 525 281 279 503 483 267 658 362 230 315 502 220
1835 220 317 549 268 78 443 415 -231 117 307 -62 185 -107 18 -169 -125 -40 -50 -56 49 -121 -759 -49
1857d9k34j22J76J20j08k23j1K62k63K44Q0k73P9J70j81j29K23K29l37o9L69J23
1879G6l07L41K69n85K70L04l60L69J31q9k08j20J13R5j38P7R1j89M80l5j02k75
1901B08K93J5RJ0J58n45L01K71l39P6j02r4n9LL15j75l22L38r6l74P3K52k6j5
1925A75j18R9j58K26j05jl15L18j51o8J68j91j41K91o3m29K48M90k57j54J95J02
1947A61l91K86k51J46q9m16P63r9K00J40k03k49j6K16k16L42M6o90K43J23L03
1968C49Jp0O9k01M48k4k6k00J08r17Q10k00P16j34n80L60j06j46qK20k54p6q9
1991E0Ro2J25j14l41M22L3p3j30J18L80n01J25j1j65P9k75K92k65J63o4j30N3
2014b82K46j71r6M4P3L16m22K80j28j92L81j58l33K44L53n94M71q1n1l3k15P53
$$ plain form
1857 -49 -283 -405 -229 -109 -217 -440 -451 -189 -452 -208 -128 -401 -322 -152 -333 -462 -239 -10 -347 -416 -47 76
1879 76 -231 110 379 -206 64 368 8 377 508 419 211 91 204 299 161 238 329 140 620 585 483 208
1901 208 501 516 525 535 693 148 449 720 381 457 355 261 202 205 520 345 23 361 265 -109 -36 216 190 175
1925 175 57 156 -2 224 119 118 -197 121 -30 -98 70 -121 -262 29 -34 -463 -215 275 18 -136 59 161
1947 161 -230 56 -195 -49 -138 -554 209 110 310 450 247 -2 -18 198 -18 324 370 -320 -77 46 349
1968 349 350 280 349 148 596 572 546 346 454 -463 347 147 863 729 149 509 403 257 249 469 215 139 50
1991 50 59 -3 122 8 -333 89 122 49 -81 37 417 -84 41 30 -135 -56 -331 -39 -304 -141 -205 -335 -282
2014 -282 -36 -207 -303 -259 -186 130 -292 -12 -140 -332 49 -109 -442 -198 155 -439 32 -49 -100 -133 -348 405
2036D05m92K82n7M9l71O34j3k54J44N0J11k06j6Q4J28k68J34k2K9j6J01l01K69
2059D04k14pJ74j56l6k37J24J32k05J80R9k07k34R6J8k9j17R9j31j46J56K26k99
2082c10l7K05j8j18M8J90m26M50l6k72P5K19n9j98P6k4J54k14O8J88q1n5l3Q5
2106a23L2K87j46n0J54L1j50nJ77k62K9K78l06J89J89j72k2K6O6k5J89n0k00J89
2130C25o5M5J49m60J24j5r0K9P8K98l77J18k57R7P1j19l41O4K58J1P1K0j20r5
2154a81K46j31k19P0K44k00j71J38K31j33M8j72M82m12O2j07j6J37Q7k92J5L11
2176C7j39J63j85K18K19m96K76k47j2L11k2k79J88R9j23K1L04Mk14J56k35L0m2
2199C2L88k05j11K36j41N1kk8k48L02n6k33J50q0K22N2j88J08j40P2J07m90O5
$$ plain form
2036 405 -87 195 138 187 -184 450 437 183 327 377 488 282 266 350 478 210 344 322 351 335 436 135 404
2059 404 190 183 357 201 165 -72 52 184 -21 159 258 51 -183 -87 -69 -98 -215 -116 -247 -393 -237 -11 -310
2082 -310 -347 -142 -160 -278 -230 -40 -466 -16 -52 -324 -249 -30 -89 -287 -211 -235 -81 -295 -227 -39 -120 -175 -208 -123
2106 -123 -91 196 50 0 154 185 35 30 207 -55 -26 252 -54 135 324 152 130 156 222 197 386 336 136 325
2130 325 260 305 454 -6 118 103 13 42 120 418 41 159 -98 -1 70 -49 -390 -326 -68 -57 14 34 -86 -181
2154 -181 65 -66 -285 -215 29 -171 -342 -204 27 -106 -58 -230 252 -160 -98 -205 -221 -84 3 -289 -274 37
2176 37 -102 61 -124 94 313 -183 93 -154 -166 145 123 -156 32 131 8 29 333 337 123 279 44 74 32
2199 32 420 215 104 340 199 250 248 220 -28 274 218 -15 135 55 277 329 141 249 109 181 288 -202 -137
2222a37J17J46m98K53m1K33m26K87k5l0P7j29K19k33N9K25l61J26J10l01n0K47
2244a32j64J92q5k0q1j52L23j07J32L4l2N6k30K68J8R9k36M31l23Q3j52L64o8
2267B18j3j66K66j60L4Pj95J76K04j03ML7l5k64Q8jJ1Q7R7p7j42o3o4J92r0O7
2293A15r4L8L2L9m6n6L2j11JK59j48rr7j4J41j30r7n4L4J35q4K3j5j07j85K56
2319a42k20J16J26J30j43J98o8k25N4J6K55l46R6J48o6R2J7R3o4m5j13K86k7k00
2343c2J58J17J33l48J29Q3k7J97l13q5M16k95j41L79j36k22J34l15J22K80j05
2364A29R0j67k20L0J18J07J84n90N93l70J30j10q8J78j64L16l06M8o1L3M0n3k8
2387a61m8L34k21l01K75k46K98k01J43k33K41p2J40k60J81J97n9L7K0j58r0J78
$$ plain form
2222 -137 -20 126 -372 -119 -160 73 -353 -66 -91 -121 -44 -173 46 -187 -128 97 -264 -138 -28 -329 -379 -132
2244 -132 -296 -104 -189 -209 -290 -442 -119 -226 -94 -60 -92 -36 -266 2 20 119 -117 314 -9 74 -78 286 218
2267 218 205 39 305 145 179 186 -9 167 371 268 272 309 274 10 98 97 108 195 292 215 73 10 -54 138 48 115
2293 115 21 59 91 130 84 28 60 -51 -50 209 61 52 -45 -59 82 -48 -145 -199 -165 -30 -114 -91 -106 -213 -398 -142
2319 -142 -362 -246 -120 10 -133 65 -3 -228 -174 -158 97 -249 -153 -5 -71 21 38 131 67 22 -91 195 168 -32
2343 -32 126 243 376 28 157 240 213 410 97 12 428 133 -8 371 235 13 147 -168 -46 234 129
2364 129 219 52 -168 -138 -20 87 271 -319 274 -96 34 -76 -164 14 -150 166 -140 -92 -153 -120 -80 -133 -161
2387 -161 -209 125 -96 -397 -122 -368 -70 -271 -128 -361 -120 -192 -52 -312 -131 66 7 44 64 -94 -184 -6
2409fJ83r2m5J42J44k79l2J74j35K32j09k4l0J56l06L74l30qP6Q9j1K46j61o9
2433A79J14j54m2J41k01J04q0J5kq5J5J59j63Q9j33L32k69j88L1j67J32J62k1
2456c2k3J51j59n9O1k78L32j82j28K24l43M19j85K1K5k05L55k20L4rl1J20J41
2479B9j50O0K06k69M8L78l69m7K84j14mp7R6M2o0O5j28j4K60j61J81j90L00k89
2503G7J99P9m18M50k66J63m78K96R9J6j94M6J67n22N32k76j16K79m45L66j29o8
2525a43P1L69n97M53k81r9Lj5P7k99N06k43L05m99K64o7J95q5p2j04j28J50K14
2548b5l52J87J71j37k5K7R6KJ07j42K81k95J62k5M3j59R3P8M2o8J91l2m5o8J12
2573B19r4q7l7K45j26K08j60k88K96P9j54m1K59l07R6j36K06P6q9j65kJ44j62
$$ plain form
2409 -6 177 85 40 182 326 47 15 189 54 286 177 153 123 279 -27 347 17 9 85 174 163 409 248 179
2433 179 293 139 97 238 37 141 61 76 74 -11 4 163 0 89 -44 288 19 -169 -138 -305 -173 -11 -32
2456 -32 -55 96 -63 -122 -61 -339 -7 -189 -317 -93 -436 -17 -202 -181 -156 -361 -6 -226 -192 -201 -232 -112 29
2479 29 -121 -61 145 -124 -76 302 -67 -114 170 56 52 -25 71 113 53 118 -10 -24 236 75 256 66 366 77
2503 77 276 355 -63 387 121 284 -194 102 201 217 23 69 236 -286 246 -30 -146 133 -312 54 -75 -143
2525 -143 -72 297 -300 153 -128 -227 -224 -239 -162 -461 45 -198 107 -392 -128 -195 0 -85 -157 -261 -389 -239 -25
2548 -25 -377 -190 -19 -156 -181 -154 -58 -56 51 -91 190 -105 57 32 75 -84 9 87 129 61 252 220 175 107 219
2573 219 125 38 1 246 120 328 168 -120 176 255 101 60 319 12 108 -28 178 254 165 0 -2 142 -20
2596b0K09j57O9k26r4K25r8K59m91M14j34N8Q2k44J64k17r5J21K7j22K97k2k08
2619b03mj84K20J34K4o0L6R3k83J73j10M8Q9J09j13J5j87L19l6j18K19k04J0n
2643a8Rk4K2J27m09L55K55k71j23Q6j42K02K78j33O6m60L49Pk22J71j05K00j54
2666F6J64n15M21j47M5l8j56J02j34r3M0P8R0k19J50J08l9j09k0J23j2j79J15
2689a59l83N80j37k00J17P0j6q9L06k05J83r3M03o88J49K4J76j40l16M46J7l21
2711b76p7N55l90O9M19l71J01o36P81J9J17l62K09j152J281k89l63J3J7R43M37
2732A045j448N33N35j245K20N9R70k76L01r51K11N5K83k28k26r8Oj02M42p6q7
2753g7k80l75J005m33L43p04O18n20K42j35k92j77Q79j57O02p06L06L8p7pj59
$$ plain form
2596 -20 189 32 101 -125 -219 6 -92 167 -324 90 -44 14 96 -148 16 -201 -296 -175 -148 -270 27 5 -203
2619 -203 -207 -391 -171 -37 -13 -73 -37 56 -227 -54 -164 -116 -27 82 -31 -16 -203 116 80 -38 181 -23 -13 -18
2643 -18 -9 -33 -11 116 -293 62 317 46 -77 9 -133 69 347 214 280 -180 169 176 -46 125 20 220 66
2666 66 230 -285 136 -11 34 -4 -160 -58 -192 -285 -245 -167 -77 -296 -146 -38 -77 -186 -206 -83 -95 -274 -159
2689 -159 -542 38 -99 -299 -182 -112 -128 -217 89 -116 67 -26 377 -311 -162 -138 38 -102 -418 28 45 -276
2711 -276 -353 202 -188 -119 300 -71 30 -606 175 194 311 -51 158 -994 287 -2 -365 -352 -335 608 1045
2732 1045 -403 130 665 -580 -360 -301 669 393 694 -257 -46 9 292 64 -162 -260 -254 -356 86 10 -77
2753 -77 -357 -732 273 -160 183 -521 97 -423 -181 -316 -608 -785 94 -63 539 -167 139 177 100 93 -66
2774f6M42r69L94L80q1k59K95Q9k69K11m40K14K02J01O8n40J126q73J97L54l59
2795B17J52l62k17L78j59N85l52k67P3L05j92R6m7o1N2m2N9r1n9j23K19J47l71
2818f0O4j38N0j41M7J60k12J57j46M87k28O2j11o2Q6j56J63j31l00L07p5N5j17
2841b39J00j41M43j07j9j23j98k52J056q45N5K62j04P3j83O37p81K16j39N78p00
2862d11J018r47P15n67K32K63k4m55M59o2k61M6L56k15ll8J50j07k24K4J39j36
2884d8J30J58k67M7K4p9K27k95K07M7j46Q9j82qJ59q9j06K91m44K61p2Q2mk8j16
2909a62J07q6m2k4K20j76r7L8O1J77j94n2k3M59l31J75k26M8K32k10K0m9j2J44
2933cn7q2R3J16o7k10J64K68o6Jn2k3J66j91J03j00L9J15p0k01K01J61k73L5J96
$$ plain form
2774 -66 376 -593 -199 181 100 -159 136 225 -44 167 -273 -59 143 244 312 -228 898 25 222 576 217
2795 217 369 7 -210 168 9 594 242 -25 48 353 161 257 210 149 201 159 218 127 68 -55 164 311 -60
2818 -60 4 -134 -84 -225 -178 -18 -230 -73 -219 268 40 102 -9 -71 15 -141 22 -109 -409 -102 -177 -122 -239
2841 -239 -139 -280 163 56 37 -86 -284 -536 520 -325 -270 -8 -112 -39 -222 415 -366 -150 -289 289 -411
2862 -411 607 -340 375 -192 40 303 279 -176 283 221 -40 6 362 147 144 106 256 149 -75 -51 88 -48
2884 -48 82 240 -27 20 44 -35 192 -103 104 151 5 94 -88 -96 63 -26 -132 159 -285 -24 -96 -14 -18 -46 -162
2909 -162 -55 -141 -183 -207 13 -163 -260 -222 -161 16 -178 -230 -253 206 -125 50 -176 -128 104 -106 -86 -135 -147 -3
2933 -3 -60 -142 -49 67 0 -210 -46 222 156 157 105 82 248 57 160 60 99 214 144 -57 144 305 32 67 263
2958B63j39oq1j2o7N1P5O2k8M6j64P3r2j38Q5j87L93O6k04K42k08j06j57JJ45
2983h7j60J24k50M93j00k22pJ72k63K6K93q8L5k12Q7j19J22O3l09K86o3K34l27
3006b72K88q3j3M5J79r7j42K28n06L76J92r2Nm3l3J84J08j61j53m1L12o3k95K31
3030A54J26l85M17j42l30N2Q8K35k38J94j23j73Q9J03L8q4Q8n2q7J47k10J19J60
3053A86k59p8K38p9j32r2Q3O1k5J5J13r3jj60r7J21PJ2J93l31nL34j1k89J68k31
3079c52M37K7j48j56K19k76M01j73m6K09m35J93l8K52j92K80Q3l41Q8l9J01R9
3101A93k11J81J16j27J71l7k5k52J74k48K59j47N5J24Lj13Q4j12j28j50J95J35
3123A40l75J80j73K26p1K84k65j94J17lO8j94K48j13OL27j55j62n8K03m1j01l5
$$ plain form
2958 263 124 118 37 25 -42 9 84 146 118 164 0 73 -19 -157 -72 -259 134 200 -4 238 30 -76 -233 -232 -87
2983 -87 -247 -123 -373 120 20 -202 -209 -37 -300 -274 19 -69 -34 -246 -159 -278 -156 -93 -402 -116 -179 55 -272
3006 -272 16 -67 -80 -35 144 47 -95 133 -373 3 195 103 108 65 32 216 324 163 10 -31 281 218 -77 154
3030 154 280 -105 312 170 -160 -108 -20 215 -23 171 48 -125 -36 67 105 21 109 57 -30 117 -93 26 186
3053 186 -73 -151 87 8 -124 -216 -133 -72 -97 -82 31 -62 -63 -223 -320 -199 -192 -180 13 -318 -323 11 0 -289 -121 -352
3079 -352 85 112 -36 -192 27 -249 152 -21 -67 142 -293 -100 -138 114 -78 202 285 -56 32 -7 94 193
3101 193 -18 163 279 152 323 286 261 9 183 -65 194 47 102 226 229 116 200 88 -40 -190 5 140
3123 140 -235 -55 -228 -2 -73 211 -54 -248 -131 -134 -66 -260 -12 -125 -119 208 53 -109 -167 36 -5 -106 -141
3146a41N7j49M18k67J57O4l00M6j34J70R8J02Nl03J42j45K75m36K57J10kR9k5
3169I8o3k4j04L57l04J11J3K35k60n6J22M6m6q8K69q3j01K08l17K28J29l55M45
3192D60n37J71M0k27L99k89l7J64k76J12l8l44L61J33l62P1j9O7K60o1J03n43
3214c92M36j09l66J25J02J82K90n20J09M37m69J48n1Ll5N5L1J29l36L42k21K97
3236A87l23K62l2l1J54k60M09m20J97mj25L1J82k84L8L45q6j79L34k78O3j86K42
3259B36L9k46K92K2k95R8N4k68mM6Q7L06k57k04L26J5l16k64L44L0r7lM2lm2p4
3285a36j8K50l64P2Q5k9R4j29J23oK44k39J0J60j35j51j24J48R9M9k58K20J65
3308A30l29K3J12j45pO70k59m56L09J68q98O17L63m88j08M15j72M97m77m00K52
$$ plain form
3146 -141 -84 -233 185 -82 75 139 -161 -115 -249 -79 19 121 126 -177 -35 -180 95 -341 -84 26 24 123 98
3169 98 35 11 -93 264 -40 71 84 319 59 3 125 171 125 37 306 223 122 330 13 241 370 15 460
3192 460 -77 94 134 -93 306 17 -20 144 -132 -20 -58 -402 -41 92 -270 -199 -218 -151 109 48 151 -392
3214 -392 44 -65 -431 -306 -204 -22 268 -252 -143 294 -175 -27 -78 -75 -110 -55 -24 105 -231 111 -110 187
3236 187 -136 126 94 63 217 -43 366 -54 143 139 14 45 227 -57 -19 326 240 61 395 117 180 -6 236
3259 236 275 29 321 343 48 146 200 -68 -72 -26 61 367 110 -94 232 247 -69 -333 11 41 -56 -59 -17 -20 -62 -136
3285 -136 -154 96 -268 -196 -111 -140 -46 -175 -52 -58 186 -53 -43 117 -18 -169 -293 -145 -46 3 -255 -35 130
3308 130 -199 -176 -64 -209 -216 454 195 -261 48 216 -682 -65 298 -190 -298 117 -55 442 -35 -435 -183
3329a83k95L19L94p0j08L02r4J65q49K68J68p7p5N57m36j27K37K52o55P27m48
3350b8P13o57k80M50o51l4O53j73jk76J82J04Q1m14K9r6J14J42K84o32M97Q4k75
3373a84K3P25r17M31j06K41m43m18M62K2L18r18L89K70k54J058l60l96M31n48
3393a74K39q33Q65l86K57p5N29r44O94o00P04J8l06n5M30J63M2o32J53J57J13
3414C59m16o0K67j01K04l01K18j2j22K78m49L25k17K1Q3l1r1j60J86J66j67j22
3436a42J76l20R2J95P7k27N2j59K0R9J12j88K17J69m83M7K07j41L51k02k93P9
3458b62J63j07o8J84q1P1K66j26J22p4j02J67k07K84j76%R3L5j98J85k42J66l3
3481F0p2j30K89N4r6P8K93k65m16M80o1q1p3K02j84k15M47m62J58O1N5N9k26K52
$$ plain form
3329 -183 -478 -159 235 165 57 359 265 430 -419 -151 17 -60 -135 422 -14 -141 96 348 -307 420 -28
3350 -28 685 28 -252 198 -453 -487 166 -7 -8 -284 -102 2 83 -331 -302 -398 -284 -142 142 -490 7 91 -184
3373 -184 -161 564 -353 78 -28 213 -230 -648 -186 -164 154 -764 -375 -105 -359 699 339 -57 374 -174
3393 -174 65 -768 97 -289 -32 -107 422 -522 172 -428 276 294 -12 -67 363 526 568 -64 89 246 359
3414 359 -57 -117 150 49 253 -48 170 158 36 314 -135 190 -27 -6 77 46 -45 -205 -19 147 -20 -142
3436 -142 34 -286 -194 1 78 -149 -97 -256 -236 -137 -25 -213 4 173 -310 -263 -56 -197 154 -48 -341 -262
3458 -262 -99 -206 -274 -90 -171 -100 166 40 162 88 -14 153 -54 230 54 54 147 182 -16 169 -73 93 60
3481 60 -12 -142 147 201 105 183 476 211 -205 275 214 133 60 262 78 -137 310 -152 6 67 122 181 -45 207
3505B07KM3q0j99Q5K61k79l35K35L0R7j37l33L60j1m9j83J79l3J28k05n2L62j
3529I2k99o0J74q5M1j1J14j75K03Oj2p0K6J31j35L7k1J08j93J12M8j80M83l05
3553B9p2J26O7K30m20K71k55J45l4j12J87j98J66j20p9J09j05r4L14P2k97K62
3575A92r6m2j61O0P2j71O4J73P2k28K3j8k5J97q1L1qj69m6J50j31K9J13n8Oj77
3601b29Q0PQK18q6j81N8j18N60k89m78P4P97j174M64N0j3L31L92q3o59M15K63
3624D07j82J87l44j4K55l82P3K34l7M5J17m57K64J60l50Kn2L16k47J49k21K32
3646A55k18J93%Qr4R1N4j2k19j01K74j00J64k81K9Q6K33j39p7K88j51j47J6l1
3670B1k0lj71R4Oq1j22Q6r5K21r9N2k7p2k0M9K22k43N1J78l94N18l1k54J88K6
$$ plain form
3505 207 209 252 172 -27 58 319 40 -295 -60 -30 67 -70 -403 -43 -54 -103 -286 -107 -140 -12 -217 -269 93 92
3529 92 -207 -267 -93 -178 -137 -148 -34 -209 -6 0 -12 -82 -56 75 -60 -23 -44 64 -129 -17 31 -149 334 29
3553 29 -43 83 150 380 -40 231 -24 121 87 -25 162 -36 130 10 -69 40 -65 -159 155 227 -70 192
3575 192 96 54 -107 -47 25 -146 -82 91 163 -65 -42 -60 -85 112 31 62 54 -115 -161 -11 -142 -113 0 -58 -52 -229
3601 -229 -149 -142 -134 84 -2 -183 -125 -243 317 28 -450 -376 421 -753 -289 -239 -252 79 471 388 -271 144 407
3624 407 225 412 68 54 309 -73 0 234 197 242 359 -98 166 326 -24 -22 -74 242 -5 144 -77 155
3646 155 -63 130 130 138 44 135 189 177 -42 -143 131 31 195 -86 -57 29 262 123 46 334 183 36 52 21
3670 21 1 -2 -173 -79 -73 -154 -276 -190 -285 -64 -163 -111 -138 -210 -230 -181 41 -202 -151 27 -367 151 120 -134 54 80
3696H0j00j64L86j96J69k72K84N4j24O7o3j99RJ35K4N4k06jJ54k09M0K18K4l0
3720A34l95M21O7l50K48K03k17q2n7K1j44L27P6r5k87J67j38J93q2j13J74j46
3742g5K0j41J77k12R4Q9k84pN1L45m7M8k10J10r7J45jp8p2pjJ19N2p3J83k65K4
3769a13P4j2J00m1r5q0M30k18l8j59L19k5J86k28L2p1lL5%J63Om42M47K15l91
3794I1j2M3o1J31j97J48m2M6N9j68J8l42L53r0j11l5J52N2J38l3j11K0j34o4J19
3819c0J65j96L47m40K12j87Q5q0J4K41j55j1l92K30%J70J5j20M12m69r9K38o4
3842a14J10k9l39K32J86NLr9o9l4R0o7K36K9m4o9O8l4J64l22J08J13j13N0J30
3867A91j72N1J12j74J47k14M9J10k52r9L86m8J86j81R3j76K5J09M7j92l27K78
$$ plain form
3696 80 -20 -184 202 6 175 -97 187 241 117 184 121 -78 -69 66 90 144 -62 -63 91 -118 -78 140 164 134
3720 134 -261 160 227 -123 125 328 111 29 -28 -7 -151 176 252 157 -130 37 -101 92 10 -103 71 -75
3742 -75 -55 -196 -19 -231 -137 -48 -332 -339 -288 57 10 58 -152 -42 -139 6 5 -73 -145 -152 -153 -34 18 -55 128 -137 -113
3769 -113 -39 -51 49 8 -87 -167 263 45 7 -152 167 142 328 100 132 61 58 93 93 256 262 -180 267 482 91
3794 91 79 122 61 192 -5 143 101 147 206 38 56 -286 67 -23 -134 -169 -17 35 173 140 29 49 -85 -149 -30
3819 -30 135 -61 286 -154 58 -129 -44 -124 -110 131 -24 -35 -427 -197 -197 -27 -12 -132 280 -189 -288 -50 -114
3842 -114 -4 -33 -372 -140 46 51 54 -45 -114 -148 -58 -125 111 140 96 27 95 61 225 -97 11 124 11 61 191
3867 191 19 70 182 8 155 -59 -10 100 -152 -251 135 87 273 92 185 9 34 143 190 -2 -329 -51
3889e1J26j93R9q0R6J06k12j5J43k47K09N1j78m6K49j90K57j98O2L25l61j01j31
3912b80L04q4J6L1L2Kk0m5K6k39K54J17k76K23j18J45k1r1kJ51j40j04J49j54
3936a24K4K95k49M2J03n8j37K01q6L39l21K81m45L57k27J22m5N3q1R8j7p1R7q0
3960G1k0j45K35l3j87O7l00J06L47ON1k46j1J79j20j1j17J43j7j83L7l4J64R9
3984H1k61J54K07j6k04k27L4Qq2K93N2o9J7k06J52J95l5k9M5k04q0K59r3M1K4
4009E6J72k00J6Q0k25K69k8K64n15K80j27P4j38j26J96J29r2J7k12N4J13N1k26
4032a18K09J7M0L7p6K07m21N5r3L04k18J3K2k73L56j26j28L20j88n5J00J48l81
4055b49J44n7J80o8J16j04O2k57K38K4k49J74j6j44l8L65l34l8J76J23l28N16
$$ plain form
3889 -51 75 -118 -19 -99 -3 103 -109 -124 19 -228 -19 32 -146 -192 57 -133 124 -74 -12 313 -48 -149 -280
3912 -280 24 -60 -44 -13 19 21 1 -44 -18 -257 -3 114 -162 61 -57 88 67 -24 -26 125 -15 -119 30 -124
3936 -124 -100 195 -54 -12 91 33 -104 97 11 350 29 310 -135 222 -5 117 72 125 44 142 125 54 151 71
3960 71 51 -94 141 108 -79 -12 -312 -206 141 147 198 -48 -59 120 0 -11 -128 15 -2 -185 -148 -182 -18 81
3984 81 -180 -26 181 165 -39 -266 -232 -224 -306 -13 39 -30 -13 -219 -67 128 93 64 109 -95 -175 84 -9 32 56
4009 56 228 28 44 124 -101 168 140 404 -111 169 42 116 -22 -148 48 177 85 102 -110 -56 57 108 -118
4032 -118 91 108 148 185 109 316 -105 -50 -143 161 -57 -44 -22 -295 61 -65 -193 127 -61 -116 -16 132 -249
4055 -249 -105 -162 18 -50 66 -38 24 -233 5 29 -220 -46 -62 -206 -244 121 -213 -251 -75 48 -280 236
4077B36l82J10Jm1J99j02j0p5L72m78J74n8O1K73r0l00N4K72k01l7J32j70k4K06
4101A22m2J8j27J68q0m2q4J51LL6j74Q5j07N3K07k10k7K33j83k32J87O1k08J60
4125c2O1j1j59o6K52k59J42M01o57K94r7%K05r9L79m51j91m71J000p83N49N7L83
4148D47k23k80Q0m82L61j5K69k57j64K0O7k7M62M9l57j97M54o3j44R0o5j41O6
4171e0j24K08Q2j27J43r8J47j22L4m12J66oJ97L6R8k91N3o3K08r0J28k41M11j78
4195A09m09M74l62P3O0P1J4n5k9M0n4j1kk7r3K58p1n8M8q5K68k25M03o20J306
4220A023j141O10n78J2J19N9j45p6K04k20J32j4J23j30J96l03n1K43rr8K7pP7
4243E3j10J21M2K58M4l13j58K21J2L9o4l4k8J74L9L3k14j94J63l64J28K68k1J96
$$ plain form
4077 236 -146 -36 -35 -76 123 21 11 -64 308 -170 4 -54 7 280 190 -110 -56 216 15 -22 110 -60 -84 122
4101 122 80 98 -29 139 59 17 -67 84 87 123 -51 34 -73 -20 187 -23 -50 183 0 -232 -45 16 -192 -32
4125 -32 29 18 -141 -207 45 -214 -72 329 -328 -34 -131 -131 74 -25 354 -97 -288 -759 241 -542 7 64 447
4148 447 224 -56 24 -458 -97 -112 157 -100 -264 -244 -177 -204 258 307 -50 -247 207 144 0 90 25 -116 -50
4171 -50 -174 34 116 -11 132 34 181 59 93 -319 -153 -159 38 74 172 -119 -66 -129 79 -11 117 -124 287 109
4195 109 -300 174 -188 -115 -55 16 30 -25 -54 -14 -68 -79 -81 -108 -201 57 -14 -72 -24 -109 159 -66 337 -283 1023
4220 1023 -118 492 -86 -74 45 104 -41 -117 87 -133 -1 -15 108 -22 174 -129 -180 63 54 -44 -17 -24 53
4243 53 -57 64 106 364 408 95 -63 158 170 209 145 111 83 257 296 329 115 -79 84 -280 -152 116 95 291
4267B91m35J02j00J55r7J00r9r7J43J58J15q6l20k5L42m07j23R2K37K4J1l4M4
4290iN6j49k9j22K14o0r4K03J03j63o80O44l5P3j30J86K57m06J71l10K94l30L90
4313G4N30n99L20j80j99J1r4J61J0l1P3o5K99l22P8J04Q3m02K80k03J64r9J98
4336A91l5j69J24P2k7k0j22R2Q2j79P7M3l05J60J41j23Q7j39k52J15R3m3J49j38
4360a26J61m7j97P9K0Q0j02L1J25r1O2n7J20l01K88j26JO1Qm4Q3j65j33L35Lp9
4386a1n6o3R6r1J12j20M30n60K45R1j59j1L17j67Q1mL0nj26l60K48q2J78Qp2N6
4412Ej5L39l22P4j3j57R0L02k70J40K23l84J4j25K76k85J73N4q4r7k09K42k8q1
4436a38o0J55q6J18r4M1r5LJ91j91K78j70Q3K6j00K17l41M8j96N8Q7K40O6o5k05
$$ plain form
4267 291 -144 -42 -142 13 -84 16 -83 -180 -37 121 236 150 -170 -195 147 -260 -383 -291 -54 -30 -19 -53 -9
4290 -9 47 -102 -131 -253 -39 -99 -193 10 113 -50 -730 -86 -121 -48 -178 8 265 -141 30 -280 14 -316 74
4313 74 604 5 325 145 -54 -43 -137 24 34 3 76 11 310 -12 66 170 253 -149 131 -72 92 -7 191
4336 191 156 -13 111 183 156 136 14 106 188 9 86 129 -176 -16 125 2 89 -50 -302 -187 -94 -137 12 -126
4360 -126 35 -12 -209 -130 -110 -30 -132 -101 24 -67 -5 -62 58 -243 45 -81 -80 -19 -11 -55 28 -137 -270 65 68 -11
4386 -11 -67 -130 -34 -125 -13 -133 297 -263 -18 73 -86 -97 220 53 134 130 160 155 29 -331 -83 -165 13 21 -51 5
4412 5 -10 329 7 81 68 -89 1 303 33 173 396 12 26 -99 177 -108 65 119 35 -62 -271 -29 -57 -138
4436 -138 -198 -43 -129 -11 -105 -64 -159 -156 35 -156 122 -48 35 61 -39 178 -163 -115 -311 -253 -166 74 140 75 -130
4461a30J78O2J3j21j28M8J08J54k83J2K04n4m4R4j25n4K19Q1p0j55q5L13j83J64
4485B18j59j0j43P6Q9J6J68l64N62k64j92K23j42K8j65j37L54j04q6M8R2j5jL2
4509A24k69J23j05J87j44j4K45j63j01J89j97K71r2k13J16P3k1m2l2j27N9J26
4531gj77K26p8k73J68L57k01l9N5j20m2K80j33j11R6P7r9O4k3m7J29j76M8jJ09
4556H2N1j53p8N6J55k9K66l55K71l2l49J3L14p9J63k42Q2L2j17M0j68l7o8J18
4580f4j7J4N2n9J03j08J64j48j36J35k00K45N5R6l63N7k7J91k67L15Nj97K40o7
4604A9J9Q2j18L8q4j4o6M2J04N5J0oK6j46J38j94K13M6j72j06O2N7J45k71K74
4629A53r7j47K5k10O48l84J43p8J36j9j35r4J98j71M8J75k37n5k3L0L16k90J03
$$ plain form
4461 -130 48 110 123 2 -126 -78 30 184 -99 -87 117 63 19 113 -12 -66 153 234 164 9 -76 237 54 218
4485 218 59 49 -94 -18 71 87 255 -109 453 189 -3 220 78 106 -59 -196 158 54 -32 16 108 93 92 124
4509 124 -145 -22 -127 60 -84 -98 147 -16 -117 72 -125 146 54 -159 -43 30 9 -33 -65 -192 -133 -7
4531 -7 -184 42 -36 -309 -141 216 15 -24 31 -89 -131 149 16 -95 1 78 -21 43 20 -27 102 -74 -26 -27 82
4556 82 133 -20 -98 -42 113 84 350 -5 266 234 -115 -102 212 133 296 54 136 168 51 91 -77 -114 -182 -64
4580 -64 -81 -67 -15 -74 29 -79 85 -63 -199 -64 -264 -19 36 132 -231 -174 -201 -10 -277 38 43 -154 86 19
4604 19 38 120 2 40 -44 -58 -124 -82 22 77 87 81 107 -39 99 -95 118 164 -8 -114 -52 5 150 -121 153
4629 153 56 -91 -66 -276 372 -12 131 53 189 170 35 -59 139 -32 16 191 -46 -101 -124 -94 222 -68 35
4652C5R7j91j18L05k5p5Kj53P7J64k37K53k46J16k93K12N8j0j02r8L70q1j01J04
4676F3p6J2j09n5J61J02q3k48L49jm6r8K6m16J46K56J00k14K64l24K93pK4m1J
4701G9M9R1k25J29j37K23k23J74l2j05J32q3l3m3j19J89J28j38L6j1J52Mk31J45
4725A51n1N4k8l0p7m5O1j2K7k2m89M30n8J11J3k15P3j3N3o1J88j67J48P3o3o6
4751a5Q0j59J69k84j13K25J78j06R8k47K50l9r3J13K6k7j04rJ28k2Pr0J64k08
4775g8J68kj51qJ90p4L3R5j37L2j15q3K20J06k29Q8j61J7K77j75ml2O3K2P9j52
4801a1o7p5O4K65J6q8k44j68K09Q3Pm6on6M8LN5j33J53j71J07j87L94l97J20o8
4827a93K28k9j5l9m2k4J37q5J09Oj15r8k58M10J04m2Pj28j6J92L1k56N7O0k26
$$ plain form
4652 35 132 -59 -177 128 103 28 30 -123 -46 118 -119 134 -112 4 -289 -77 -19 -29 -131 -229 141 60 -41 63
4676 63 -13 -1 -110 -165 -4 98 15 -233 116 115 69 -29 -3 -419 -273 -17 83 -131 133 -191 102 95 119 78 79
4701 79 128 219 -6 123 -14 209 -14 160 128 23 155 72 39 -4 -123 66 194 56 92 81 233 237 6 151
4725 151 100 154 126 96 19 -26 35 23 50 28 -461 -31 -89 22 35 -180 -107 -120 -67 -128 60 -107 41 114 51 -15
4751 -15 65 -94 75 -209 -322 -97 81 -25 73 -174 76 37 -56 57 83 56 -48 -57 71 49 56 -34 130 -78
4775 -78 90 88 -63 -71 119 45 78 173 36 68 -47 -130 90 196 -33 55 -106 -89 188 13 9 -23 40 62 141 -11
4801 -11 -78 -153 -89 176 192 104 -140 -308 -99 -16 -9 -55 -61 -117 -69 -66 -11 -144 9 -162 -55 -242 152 -245 -125 -193
4827 -193 35 6 -9 -48 -90 -114 23 -62 47 53 -62 -160 -418 -8 96 54 61 -67 -83 109 140 -116 -59 1 -225
4852b25M08r6n8o4J09r3L88l29K23k29K39m27J51M0j54m4R1J96K17k27nK1J83
4875C15k58J43J06l44Q1K10k08N5J7j1j66k0j7J23M4j56n8mJ78k10K62j25J5k2
4899e0j12k36L36L8J65j82j25L97q4k60O8j59J22N4R5J73k1j93L7p4N9m6L8l5
4923EJ45o2l70K54K1k32L13j00j9L47j92k03J27K7j62J54J20j02J97j70j0j9L9
4946A08j95K16l30K02q9M87l23L0j43K75o6k76J15P9j56J67j85J49k57j9J36k86
4968c61L79j59J64O2k5l24L53k57jo9K13J01k92J67J17l26M49k28r8J13O9j53
4990a06P6Lp4J67k5j87K25o3j06J1J15o1Q2Q0l48J65O0j95K44R9l9J52r0J4l13
5015a14K35j63L05k02K6j83J03J86m8Qr3L5k8J23k36J17j3j9J59Jp1j38k92L56
$$ plain form
4852 -225 183 87 29 -35 74 -19 369 40 263 34 273 -154 -3 37 -117 -161 -70 126 343 116 111 132 315
4875 315 57 200 306 -38 43 253 45 100 117 106 -60 -80 -97 26 70 -86 -144 -148 30 -180 82 -43 -28 -50
4899 -50 -162 -398 -62 -24 141 -41 -166 231 147 -113 -45 -204 -82 -28 67 240 219 26 63 -11 48 2 40 5
4923 5 150 88 -282 -28 -7 -239 74 -26 -45 302 110 -93 34 61 -101 53 173 71 268 98 88 69 108
4946 108 -87 129 -201 1 -88 399 76 106 -37 238 172 -104 11 90 -66 101 -84 65 -192 -211 -75 -361
4968 -361 18 -141 23 85 60 -264 89 -168 -169 -238 -25 76 -216 -49 68 -258 191 -37 -135 -22 47 -106
4990 -106 -30 -27 -101 66 41 -146 79 16 -90 -79 36 -25 57 137 -211 -46 14 -181 63 162 123 275 185 199 -114
5015 -114 121 -42 263 61 87 -96 7 193 145 153 60 95 67 190 -46 71 58 39 198 199 128 -10 -302 54
5039E4KJ8k53M6J52N3k10o6J18J39k25J61J03P1n5q4L00o32M09l28P4J24o0l7
5063a26J31J23m18K25L8M1%N8n8j73O1J43N3j93k8K86p9k8L7o8N2J22k19Q1n1
5088A0J83k19N0p2J97j10K8J2j38M4L48l44j50M92l80K24m08K89J30l74J00J73
5110H5Nq9j47l5MO2J17j32J29K0j62L2j49J11P6K57k35p9J18J7j5MJ11k48J98
5135E5q6o0J53p7J90k23J7J13m9k15J87j61P5kK9l1M2J35K3J3j07L3K3o1j61K00
5161E5j8k06K52j62om7J77M7j2j61l5K58j8j11N4j58J93M9j11K0Q3l42K18N6j2
5186F3j54j29K05P0o5n3m5Q5q0n1N9rj73M0j49K16J01J95j72R5j97P8M6J0l0K19
5212A75k35J22j88j99K60j18L00R2j32j83K20j55O3k12K40p5j7q9Q9J04r8k05
$$ plain form
5039 54 56 74 -179 -133 19 72 -138 -204 -86 53 -172 -11 92 163 108 24 324 -308 101 -227 -153 -29 -89 -126
5063 -126 5 128 -290 -65 -27 14 14 72 14 -159 -98 45 98 -95 -123 163 84 56 93 25 77 199 -20 61 10
5088 10 193 -26 24 -48 149 39 67 79 -59 -15 333 -11 -161 331 -49 175 -233 56 186 -188 -88 85
5110 85 90 1 -146 -181 -177 -115 2 -130 -1 19 -143 -111 -260 -149 -73 184 -51 -130 -12 5 -10 -6 105 -143 55
5135 55 -31 -91 62 -15 175 -48 -31 82 33 -182 5 -156 -81 -83 -54 -85 -43 92 115 128 21 54 77 16 -145 55
5161 55 37 -169 83 -79 -85 -132 45 92 80 -81 -116 142 124 13 67 -91 102 151 40 60 143 -199 19 75 63
5186 63 -91 -220 -15 55 -10 -63 -108 -23 -103 -154 -95 -104 -277 -237 -386 -170 -69 126 -46 49 -148 -70 -24 -14 -44 175
5212 175 -60 62 -126 -325 -65 -183 117 209 77 -106 114 -41 22 -190 50 -25 -42 -131 -42 62 -36 -241
5234b41R2K57n2K30l46J44J5J40j79k12K76OQ2r7pk56J08P9J74m05M14j32m1n9
5258a0J26M4k21NJ61j56K67j75J74l12N5K49k25j00m7K83k48n2j6O2J64m9j00
5281a21L4J46n5L0J72l14m3J19m6L12k00l69L42j39M9r6J81j33n8J31j1J41j12
5304d0J64m5j5k1J50K9n8k06K62j81J82l68J71j1o8J54k73K11n0J34M6O9q3J4
5328A67l9l04K22j74oP4q3rL8K51O2k97Q0P0n1j9O5rO9R9j49j25Q8k42L94l07
5354a35Q9j39J36J28K7k30M6K54k66N2l1L2r9Q7n7J50J2m4LL9j51O5K7J2O4k39
5380a68J50P4k34K42m5k45L60j99J80Nk0P8j83k12K71K54k69k28K39P8J00l08
5402h0J61J85l54j00J47l1j6N8M3J69k36J44p1l7P1j04L5J5J4j20j34K12l0k8
$$ plain form
5234 -241 -149 108 56 286 -60 84 99 239 60 -152 124 130 212 115 108 -148 -40 39 213 -192 222 90 49 -10
5258 -10 116 160 -61 -56 105 -51 216 41 215 -97 -42 207 -18 -118 -165 118 -130 -182 -198 -136 28 -21 -121
5281 -121 -87 59 4 34 206 -108 -151 -32 -78 234 34 -335 7 -132 -83 -179 2 -131 -189 -58 -69 72 -40
5304 -40 124 79 64 43 193 222 164 -42 220 39 221 -147 24 13 -55 99 -174 37 -13 121 167 236 153 167
5328 167 128 -176 46 -128 -134 -60 -143 -152 -114 137 199 -98 -18 52 1 -18 47 38 107 206 57 -68 20 -222 172 -135
5354 -135 -46 -185 -49 79 106 -124 -78 176 -90 -38 -69 -37 -136 -49 -106 44 56 12 15 54 -97 -32 -5 7 71 -168
5380 -168 -18 56 -178 64 19 -226 134 -65 115 120 100 178 -5 -217 54 308 39 -189 50 128 228 -80
5402 -80 81 266 -88 -188 -41 -72 -88 -30 13 182 -54 90 19 -18 53 -51 -16 -1 13 -107 -241 -29 -59 -87
5426h7Q6M5j93M1J66j12P4P4l7j13l73N17k59m2J48J30p4K9O1r3j10L7J30r9J37
5451H3j80on3J56O2n9L9J26n8k46L64m23K65j2o8Q9j78MM2K21l0k4m0j60L75O
5477B95k09j49J09k22J96K80k13M6J06k21J48p4l19K31J00o4q8J13m2p7J78K1
5499A45j3r5p0K0Q9k01J42k65K89j84J92N3m41N10q5k82K15k15K03j92J69m0L1
5522b5J62k59K47%k24K50m6j13J51k65J28N9J0l8j22p3J29N6j08p4J71k02L22
5545A36J23k65K5j41J00o6K60j23p9qn7n1m4J16L2n1J84k90J66Q8m0j06J69j14
5569c6J55O4l9j98O1j10q5L46k23N3P2j33J92q6j29P4k56L72j99j31L64l8r6l4
5593d0K5J15J17l97K16M3n2L0N2M4L7m4q0K8l51L35K8r6k08J9K99L5j53R0p7L05
$$ plain form
5426 -87 -1 44 -149 -108 58 -54 20 94 57 -56 -429 88 -171 -213 -65 65 -9 20 81 -12 -122 -85 45 -54 83
5451 83 -97 -103 -156 0 62 3 42 168 110 -136 228 -195 70 58 -10 79 -99 -95 -53 168 138 114 74 -86 289 295
5477 295 86 -63 46 -176 20 300 87 133 239 18 166 92 -227 4 104 40 -48 65 23 -54 124 145
5499 145 132 37 -33 -13 76 -125 17 -248 41 -143 49 102 -339 171 86 -196 19 -196 7 -185 -16 -56 -25
5522 -25 137 -122 125 125 -99 151 105 -8 143 -122 6 65 75 37 -85 -158 -29 27 -81 -155 16 -186 136
5545 136 259 -6 19 -122 -22 -88 172 49 -30 -38 -95 -146 -190 -74 -42 -93 91 -199 -33 55 15 -91 78 -36
5569 -36 119 183 144 -54 7 -103 -188 158 -65 -12 60 -73 119 33 -96 -22 -278 94 -105 -236 128 90 -6 -40
5593 -40 -15 100 217 -180 36 79 27 57 109 153 190 146 66 94 -257 78 106 10 -198 -179 120 155 2 92 15 320
5619C20l10P5j8l75O79R3n85L43j02J17k20K08j17N6nM2o23M3L50K43n67M9q7
5642c91N7J30L32l6l63L84k58K52k76k53n2P35m04N73r24J56M26r25Q21L58r50
5663f08M04M2J67M43l36n27K10J04L80n37K77j72q9k51Q11k72k76L07o7J94m35
5684b31K86n1K30j93j19K4L70k51K6Q7j52j67J67k03J50jK75l74R5j5K00q4J18
5707A87L4j17%j32K7N5k36L65J74j02l20J75KK19k59k64J83J36O0j70J62j38k75
5730b34L33m5m4R2l72K51j33j39J61k3j36M34p9J36m8L6l49L89l23l17N81o3n61
5753d53J79O09l18O4l35N61m21J30K0j71K35k71K95NJ8K82k93j90L77j60l07j15
5775b59J24J06Qj26L30J72k73J1r4M4J58j0k56Q2Q7M8l83K44k40L51k01M43o53
$$ plain form
5619 320 10 85 67 -308 371 464 -121 222 120 237 17 225 108 164 159 201 -422 -379 -29 214 -353 -304 -391
5642 -391 -334 -204 128 92 -271 113 -145 107 -169 -422 -474 261 -143 430 -494 -338 88 -837 -16 342 -608
5663 -608 -204 -162 5 448 112 -415 -205 -101 279 -258 19 -153 -242 -493 318 46 -230 77 10 204 -231
5684 -231 55 4 234 41 -78 -54 316 65 91 178 26 -141 26 -177 -27 -28 247 -127 -32 -47 153 69 187
5707 187 221 104 104 -28 -1 54 -182 183 357 255 -65 110 112 331 72 -192 -9 127 187 17 179 41 -234
5730 -234 99 54 10 102 -270 -19 -152 -291 -130 -153 -289 145 66 202 154 190 -159 230 -93 -410 171 108 -453
5753 -453 -274 335 17 81 -254 307 -114 16 36 -135 100 -171 124 129 147 429 136 -54 323 163 -144 -259
5775 -259 -135 -29 -21 -147 183 355 82 93 -1 43 201 191 -65 17 104 152 -231 13 -227 124 -77 366 -287
5798b87K39J31n2j00L71J63m65J60o68R34k10K67l31m42R81j019L40K30o65J019
5818E96p86J053j331R67l61j68m61L54L90j30p54O26L48j276J203m57k18Q59l16
5837A38k23K60M82n15J88n2q28L76j80K45Q7N4p4k22J39J85j44K86j40m7N0r4
5859b9J76j35m9j05J79P3j66j90N14l02J31mr0J19k8j45J35o3j33k18K35K01K46
5882C52K93r11OO66r1j57m07L30m0K25j10j48R5j09j45J73l0Q5M5j06K3Q9oj24
5906bJ94k31Q3j26K70k56K02k64M23m51J79J05k53p8J52N1n8J4j12K14J72Kq2
5929A48l4j88K25j80j60K50R7j91k3k06J81N9k10L32m0m5L2j14K1J63k84K32j09
5952d4r4M8l56M95J4j21J17l1j00O8j47J07M1j33K64l0%m93N73l36L19k41K48
$$ plain form
5798 -287 -48 83 31 -69 302 465 0 160 -508 426 216 483 152 -290 691 -328 12 242 -423 596
5818 596 -190 863 -468 499 138 -30 -491 -137 253 123 -631 -5 343 -933 270 -187 -405 454 138
5837 138 -85 175 657 142 330 278 -550 -174 -354 -109 -22 32 -42 -264 -125 60 -84 202 62 15 65 -29
5859 -29 147 12 -37 -142 37 110 -56 -246 268 -34 97 93 3 122 94 -51 84 21 -112 -330 -95 106 352
5882 352 645 -266 -260 406 315 158 -249 81 41 266 156 8 103 -6 -151 22 -8 77 122 16 39 128 122 -2
5906 -2 192 -39 44 -82 188 -68 134 -130 293 -158 21 126 -127 -205 -53 -2 -60 -46 -158 56 228 230 148
5929 148 114 -74 151 -29 -189 61 158 -33 -56 -262 -81 -22 -232 100 60 15 47 -67 -46 117 -167 65 -44
5952 -44 -138 -90 -446 49 63 -58 59 28 -72 -4 -151 -44 -3 -136 128 98 98 -395 178 -158 161 -80 168
5975A68l36N5K10j89Q6J49o9j25L5L1r5mJ05N1o6k65J91K9K4K2J4j75J80M2j07
6000c9R3R1k17J28o6J95r7j5M6n7k24P3J33m6K9j37K59j63q4L7j48J97n0K09m2
6025A05o8J87n10P3M16j11L4j59L9m0k2J61m77L19M22l89p8O24o06lJ99k59L28
6048A85l02J80l55J59l09P74n30L45j27L1J41N2k97O10o70K67K39l43j27K40n7
6069A06k11J26J07j85r1N37m12L4j88M26l42K00K34p4p00N56o33J180j102M00
6089c2J18q07J202j193L74R0O06J81m02l25o5K52J9k75J59l4R0r0J0P9j95K25
6111a3r5J98l9k2k57J50J76k28P6p2j1K64l23L49j4j34J03j51k3j93K27Q7k8j13
6135h6l8O7M5j62L99j42j8k5r2J87R4j36k76J04J59J01k17P6jn6Pp6n4M7L4K81
$$ plain form
5975 168 -168 -113 97 -92 -6 143 74 -51 -16 15 -80 -84 21 72 6 -259 -68 -39 -15 7 21 -154 26 68 -39
6000 -39 54 145 -72 56 -10 185 88 73 119 62 -162 -89 44 -2 27 -110 149 -14 -98 -61 -209 -12 -62 147 105
6025 105 37 224 -286 -213 203 92 126 -33 6 -34 -56 105 -372 -53 369 -20 -98 526 -80 -83 116 -143 185
6048 185 -117 63 -292 -133 -442 332 -198 147 20 51 192 244 -53 557 -113 154 393 50 -77 163 106
6069 106 -105 21 128 -57 -148 389 -23 11 -177 249 -93 107 341 267 -433 123 -510 670 -432 -32
6089 -32 86 -721 481 -712 -338 -248 358 539 137 -188 -253 -1 18 -257 -98 -132 -42 -132 -122 -43 -238 -13
6111 -13 -108 90 51 29 -228 -78 98 -130 -54 -126 -137 127 -196 153 139 5 108 -43 -66 -259 -32 55 27 -86
6135 -86 -124 -57 -12 -174 225 83 65 40 -52 135 229 93 -183 -79 80 181 -36 40 39 -17 -10 -86 -140 -93 -59 222
6161B22k96P6j89L09K0l3l21J76K33l34K95l16L10k48J51J5K26k65O5j99R3pr0
6184a07J3k4K19O0r3j21l0p0K20j08J12j34j53J82K25k04j14j2J58j22J93l35
6206b45K45J8k5M4J22k45j9M49l38R5o7j45N2R5r5M0J12m6R0Kj32o0J76j32n9
6231f8l9L14R7j79r3O3N5j25O1j10k16J41j16M9K58J01r3j1k29J71j41j0P1j29
6255a78P5o6L17j89P6k60M49l74%K94k59J13j83O6K82l44L54k38K63k54J33l26
6277b49J25N4q7L79l34K49j36K22j47J17rj58P5J30k64J55j21J51k31K04j30N2
6299D7k26j51K75nK19k8j4J68l96J84j12K1n1J71P4j05k6j81J7j2J36J82j53l2
6323Bm4MJ12j38j9M8K51p6q8p6QJ0J33l25J67K13j18o7N1r3J48j35j40J2j60J10
$$ plain form
6161 222 -74 2 -187 122 142 109 -212 -36 197 -137 158 -158 152 -96 55 70 296 31 96 -103 -10 -17 -107
6184 -107 -94 -118 101 161 68 -53 -83 -153 67 -41 71 -63 -216 -34 191 -13 -127 -139 19 -103 90 -245
6206 -245 0 18 -7 37 159 -86 -105 344 6 101 34 -111 -59 36 -59 -19 93 47 137 139 7 -53 123 -9 -68
6231 -68 -107 207 304 125 32 95 150 25 86 -24 -240 -99 -215 -166 92 193 100 89 -140 31 -110 -120 -49 -178
6255 -178 -103 -169 148 -41 35 -225 224 -150 -150 144 -115 -2 -185 -119 163 -181 173 -65 198 -56 77 -249
6277 -249 -124 -70 -157 222 -112 137 1 223 76 193 184 26 101 231 -33 122 1 152 -79 125 -5 47
6299 47 -179 -330 -55 -60 159 131 117 285 -111 73 -39 -18 -69 102 176 71 45 -136 -119 -131 5 187 34 2
6323 2 -42 -38 74 -64 -83 -35 216 140 52 -24 -16 -6 127 -198 -31 182 64 -3 48 -45 103 -32 -172 -160 -320 -210
6349b10K69j62N4Mk16J71L2J27j13J13r5l1P0k35j9L12j33n0N5L50J9l04L9k2
6373B5O6j1j30J29n9J90j08j5j56M4j58K80k07J47R6j17nq8J25r7R1j73o8Q6J03
6398a0n3k5j90K98j06J60m88J95N39q50O06K50m10l02L94k35K83q7K47k31k02
6419b17K76j60p8M11l70J33q0J25J48j36j79J08r6L19k36q5K8K72j23j07l5j31
6441b13L35o3rP6j08J15p8q0L2J15j1j10k7K1K18j76J92k79P8K5p6J35k21k26
6465c35K24R4r9K60M7l11p2K70j18K51k77J71j40r1Q0K49j02k06J76K41j6k07
6487H9j06O7O8j30O9k69L09j88J26o5J16o1J23j71q0J28p0K01m2j22j56K09j67
6510a22J20K5J53j59m0L4L40l21Lj04j10L56j38m3k9Q0J03m17K63N3J49k31Q4
$$ plain form
6349 -210 59 -103 -49 -45 -261 -90 -58 69 -44 69 -26 -57 13 -222 -241 71 -62 -112 -57 293 312 8 47 25
6373 25 91 80 -50 79 20 210 102 87 -69 -25 -183 97 -110 37 133 16 11 -77 48 -49 42 -131 -199 -113 -10
6398 -10 -63 -88 -278 20 -86 74 -414 -219 320 -530 76 326 -84 -386 8 -227 56 -31 216 -15 -217
6419 -217 59 -101 -179 232 -138 -5 -85 40 188 52 -127 -19 -115 204 -32 -117 -89 183 60 -47 -82 -213
6441 -213 122 59 50 126 18 133 55 -25 7 122 111 1 -26 -5 213 37 229 -50 28 53 -23 112 -109 -335
6465 -335 -111 -17 -116 144 191 -120 -192 78 -40 211 -66 105 -35 -126 -46 203 101 -105 71 312 296 89
6487 89 -17 50 118 -12 57 -212 97 -91 35 -30 86 25 148 -23 -103 25 -45 156 114 -8 -164 45 -122
6510 -122 -2 23 176 17 -23 11 351 30 33 -71 -181 175 37 -6 -35 45 148 -269 -6 47 196 -35 49
6533D9J36L1R2l96N8J25p8J0J18l76O54l42J53n63N87l22j10J6J87J74m77N54
6555B80m32K62j19R0j40j21Q3%J30k00J94K49k27k00j83K5J13L07R2k79r0J54
6577a2qm3L22j78J17L2p3k2k49M0k40K77k2P7o6j9J8q6J07J05p8J8N3j85L80l17
6603e2k7L87m79J61J12p9n2j40N9j1K11M9j5q9j11K95o8r6j5J96l28j94K23j07
6627a70K94k00J64N3M3j14k65L93k84K56q4kk40K65n67N21j13K13l74n1k1J62
6649a21Q3J48M9m50L79L17m30l63K53J18K35%q07j68M80O46k98m01k5j59P15j42
6671E9j88M36o32K50L1L71P6M4J29p55j25L39k95M48k23o41J213q48N03P5l88
6692a21k9J20l55P35j34n7j77j38M09j1k38l85K20R2r5j56mM73j85l1K65j37k11
$$ plain form
6533 49 185 216 308 -88 -30 95 17 27 145 -231 423 81 234 -329 258 -64 -174 -158 29 203 -274 280
6555 280 -152 110 -9 81 -59 -180 -97 -97 33 -167 27 276 49 -151 -334 -309 -196 111 203 -76 -166 -12
6577 -12 -20 -63 259 81 198 230 157 135 -114 -74 -314 -37 -59 18 -48 -67 -49 -135 -28 77 -1 17 70 -115 265 -52
6603 -52 -79 308 -171 -10 102 23 -29 -169 -110 -121 90 139 124 35 -76 219 151 55 40 236 -92 -286 -63 -170
6627 -170 124 -76 88 141 184 70 -195 198 -86 170 86 84 -156 109 -458 63 -50 163 -211 -262 -283 -121
6649 -121 -38 110 159 -291 88 405 -25 -388 -135 -17 218 218 -589 -757 -277 369 71 -330 -355 -514 201 59
6671 59 -129 307 -325 -75 -44 327 403 447 576 -179 -304 35 -260 188 -35 -676 537 -311 192 267 -121
6692 -121 -150 -30 -385 350 216 159 -18 -156 253 242 4 -381 -161 -69 -164 -320 -324 149 -36 -67 198 61 -150
6715a50j15K42N3l30K65o3p9N0k12L13j40P3M5M2l0m2p9J63j27K24q6j42L49j45
6739G9J07mj51l5J09pk08J66n0k54L97l93K37j63J19q6J25j31J62L3j8O5r5r0
6763h6J40L2j28P5N9J28n9j92N8J04j11J2k25K61k05K67j93j39L40j27j66J26
6785b9Ll05L71m49Q23o80M47k37J21j6l68K02L79l13J24K88o27O83j36l65k25
6806c09K50K83l73N73n22K4M54j9m76N7J57j7Pk99K62j03R5p8j60L35k52MO8P1
6830C2j33M5J5k9k3K98j29j47K69M0k67pj5K6o8o6N1J70J97k57M3J23J09r1q4
6855A02k55L99n81L41j10J47j25N8L8N1k09M5L4o3M63k58l12Q9l5N13n77m29Q52
6878A78n10j5K84J47j89L96k41p9j17Q4O1l4K20j42M9n1n7J50r0J86j1l18R8J3
$$ plain form
6715 -150 -265 -23 30 -300 -35 -98 -177 -127 -339 -26 -166 -93 -48 -6 -36 -78 -157 6 -121 103 17 -125 224 79
6739 79 186 182 31 -4 105 98 -110 56 6 -248 149 -244 -7 -170 -51 -137 -12 -143 19 52 34 99 4 -86
6763 -86 54 86 -42 33 92 220 161 -31 27 131 20 32 -193 68 -137 130 -63 -202 138 11 -155 -29
6785 -29 -26 -331 40 -409 414 -266 181 -56 65 49 -319 -117 262 -51 73 361 -266 417 281 -84 -309
6806 -309 -59 224 -149 424 -98 -74 380 361 -115 -58 99 82 89 -210 52 -51 44 -34 -194 141 -111 -107 -39 32
6830 32 -101 -56 -41 -70 -93 205 76 -71 198 238 -29 -36 -51 -25 -93 -159 -108 62 259 2 45 168 277 186 102
6855 102 -153 246 -335 6 -104 43 -82 -24 14 65 -144 -99 -65 -128 335 77 -235 -146 -181 332 -245 -674 178
6878 178 -332 -347 -63 84 -105 291 50 -29 -146 -62 -1 -35 185 43 92 41 -16 134 44 230 219 -99 -1 12
6902A2n4P7J34m5j00j36R4K86m25K83n7J8r7J92p8j68J77j55m7J42j49Q4J65k83
6926a30j1J61K9k50L67j91p6J72q6J69j6j75K38k5l55J08J03k59J90P5M2j07q4
6949a11K51j04P2j87K71l42p9J01j18J85J38R8n6l31L45l9J87l09J32k22K07j69
6971h0J21j08n0K72p8j04n3M13l55n2K27K5k08o8K41j68J36O9q4q9O3j83J83k73
6995b03J79J22M6l23Q9l5r8L45l86J31M4KJ58n1j30k4K1j40L99j42j24nJ55M5
7019G5n2R1k36P5k01N1J5J25j29M9J01K36m00L39l4l6j63J31o5Q5k7J21j65%n1
7044f5K00J45k48j15J57q9L0J49k03J56O2r7q4KQ9p9O1M7j12L4j38J77Ro8nO8
7070H3O0q2l01L08p9j62K69j34J15m0j74K02k4k46L79j06J19j88N1n5j03J7J35
$$ plain form
6902 12 -42 35 169 124 24 -112 -18 268 -157 126 69 87 -10 182 104 -64 113 -42 -89 53 -96 -12 153 -130
6926 -130 -141 20 49 -201 166 -25 -101 71 -15 154 138 -37 201 176 -179 -71 32 -227 -37 38 80 -27 -111
6949 -111 140 36 108 -79 192 -150 -229 -128 -246 -61 77 175 119 -212 133 94 281 -28 104 -118 89 -80
6971 -80 41 -67 -117 155 77 -27 -80 333 -22 -74 153 178 -30 -98 143 -25 111 180 96 7 70 -113 70 -203
6995 -203 -24 98 144 -179 -90 -125 -223 122 -264 -133 -89 -87 71 20 -110 -134 -113 -253 146 4 -120 -125 30 75
7019 75 23 114 -122 -47 -248 -197 -182 -57 -186 -137 -36 200 -200 139 105 69 -94 37 -28 57 30 151 -14 -14 -65
7044 -65 135 280 32 -83 74 -15 15 164 -39 117 179 82 -2 0 89 10 71 118 6 40 -98 79 88 20 15 83
7070 83 143 61 -240 68 -11 -173 96 -38 77 37 -137 65 41 -205 174 68 187 -1 50 -5 -108 -91 44
7093D4j66J18k80L46O2l13J25p0r9L49k31K47k13o9K72k64R7M14m07J79j01j24
7115h4J28j77J00k41L08O5q7j1L7Q8j9O9l4R2j34j95Q6P8j03K72k02pPJ16j93
7140d1J96j40l7J08j23K58l66K9K69l3l52N53j89q4k05J49M1m1q3m6L32j60N8
7163I3K28l62N7N6J20k24q6J54j60J04J99n3o6O3j78J55o6q1J53Kk58K67k30N2
7187f1P3O1J9j71L39l83o7N8J95l10L03j60L90r0l2j55kj35L9l6N8J88k31K16
7211A06j55q3K34r6L0P8j31R2j35Q0N6m8K2Rj26K20j18j96m1K64P9kk86K7j09
7236b29J49r9J71r4M4J0m0J05p5J51q4P0K3J14l43J06j17J76J0j04J53j25J34
7259A06l51L80O7L0Ll59P3J42m8j33K02Q7N4m61J16OQ0K4JL3r4j09J41N2J44n2
$$ plain form
7093 44 -122 -4 -284 62 124 -189 -64 -134 -233 116 -115 132 -81 -150 122 -142 -45 369 -38 141 40 -84
7115 -84 44 -133 -33 -274 34 99 12 1 38 126 107 176 142 234 100 -95 -9 69 -34 238 36 29 36 152 -41
7140 -41 155 15 -22 86 -37 221 -145 -116 153 120 -232 321 132 48 -157 -8 33 -8 -91 -137 195 35 93
7163 93 321 -41 16 72 192 -32 -118 36 -124 -20 179 126 60 123 -55 100 34 -47 106 108 -150 117 -113 -61
7187 -61 12 73 92 -79 260 -123 -190 -132 63 -247 56 -104 286 196 164 9 7 -128 -89 -125 -67 121 -110 106
7211 106 -49 -132 102 6 36 114 -17 75 -60 20 76 28 50 59 -67 153 35 -161 -202 62 141 139 -147 -120 -229
7236 -229 -80 -179 -8 -102 -58 -48 -88 17 -58 93 9 79 102 216 -127 -21 -138 38 48 -56 97 -28 106
7259 106 -245 135 202 232 235 -124 -51 91 43 -90 112 199 253 -208 -92 -86 -6 18 19 52 -42 -151 -10 42 186 134
7285A34j01j10J9l2m3J94K1j16JLn6K0L91k79L8k11J56j30m2J48L1lm2r0J68j01
7311c2n8Qr7M3L36k04K5J04j22P3k03O1J32q8j41nL30L0j80k39K43J76R2l62J04
7336B6k80L72j12j8l06L06J4K7J1J87k58Q4J21j00K5j45J40O0l16Q4O6M8p7Q0
7360C9KO1j27o5M1J13p6J18Kj47J36m4J23l60K59J40m12J64J66k55J77L2j27M6
7384FL9k05J7N4K17j53QJ6k22O5k1K85r1m4K97k75q6J78m20M90j86j0j55K01J06
7409A11r3j34K25k29J07J47J56k70j66K08k78J71M5N5j38L85j74Q8k54J90k57
7430a05J30j19J51j01k86K94l4J74lq3j17O7k22J99l6M19j97r7J85k14N3j21J35
7453G2p9l9RN3k22J62j2K0J05j57r3J68N2k18K91r3k1p6mK13l56Q1J99J44k76
$$ plain form
7285 134 33 -77 -58 -90 -133 61 82 -34 -33 -30 -86 -66 325 46 84 -127 29 -101 -143 5 36 33 -9 -99 69 -32
7311 -32 -90 -82 -179 -136 200 -4 21 125 3 76 -127 -66 66 -22 -163 -168 162 192 12 -227 16 192 284 -78 26
7336 26 -254 118 6 -12 -318 -12 2 29 40 227 -31 53 174 74 99 -46 94 154 -162 -78 -12 36 -41 39
7360 39 41 102 -25 -90 -49 64 -12 106 108 -39 97 53 176 -184 75 215 -197 -33 133 -122 55 87 -40 6
7384 6 45 -160 -143 -89 128 -25 -17 -1 -223 -158 -179 106 15 -29 268 -7 -93 85 -335 155 -31 -41 -196 5 111
7409 111 18 -116 109 -120 -13 134 290 20 -146 62 -216 -45 0 55 -83 302 128 216 -38 152 -105
7430 -105 25 -94 57 -44 -330 -36 -70 104 101 18 -99 -32 -254 -55 -91 328 131 34 219 5 58 -63 72
7453 72 -7 -46 -37 16 -206 -44 -56 -36 69 -88 -181 -13 39 -179 112 19 -2 -78 -82 131 -225 -144 55 199 -77
7478g7L2k0m6J18p7l9K1l1J06O5j85K08j16L9k6R4k6J64j30J23k24N0p9L6N7N4
7504I1K5Q9k27j04K04m8K42j85PR5j47j44R9J10j36P0k12M42j21o2k75J56Lj23
7528a51p0M2J5K24j63P7J31j03m9Q7J9J16j51l81J85K09j16J27Lj4K1l2j04j17
7552a95mJ19L1Mj18J56J58o3j97j1K10j24J4k10J40K16j15j4r1k8K45J6j93m5
7576i9J34L0j1l1J86k05m7O4R7l25J87N0q0k2M0J41k8m7K17m7l08J92j03Q2j68
7601a01J94j22J97j84J0L6Q6k28Q2n8J67l11P0J07K02r2p2L0j10P2N7NR3k35n0
7626a55M35k84O3k09j4O5l4M0j26j35M05MN8j99n9K23l57K15J11r6R8k05J4L72
7650B30j90J24Nq6j26K23k72K25K26k99j7j0l1P8o2Q4k5j39J81j32j33L13l5k07
$$ plain form
7478 -77 -45 -65 -111 7 -70 -109 -88 -119 -13 52 -133 75 -41 -2 -28 66 40 204 74 197 -27 23 -56 -20 37 91
7504 91 116 205 -22 -126 78 30 272 87 94 189 42 -102 -3 107 -29 41 -171 271 150 88 -187 -31 -28 -151
7528 -151 -221 -179 -164 60 -103 -26 105 2 -47 40 59 175 24 -357 -172 37 -79 48 51 37 58 26 -78 -195
7552 -195 -199 -80 -49 -45 -163 -7 151 88 -109 -120 90 -34 -20 -230 -90 126 11 -3 -94 -122 123 139 -54 -99
7576 -99 35 65 54 23 209 4 -43 21 118 -207 -20 30 -50 -72 -32 109 81 34 251 204 -104 88 -15 67 -101
7601 -101 93 -29 168 -16 -6 30 116 -112 -30 -88 79 -232 -162 -55 147 55 -17 13 -97 -25 32 37 130 -105 -155
7626 -155 280 -4 59 -150 -164 -99 -133 -93 -219 -354 51 55 113 -86 -145 78 -279 -64 47 -49 49 -156 -142 230
7650 230 40 164 169 83 -43 180 -92 133 359 60 43 33 2 80 18 102 77 -62 119 -13 -146 167 132 -75
7674g5J47q4K47k34o1J14n6J3j14L37k43J95k69Q8j19j40K5K12j04K52l82L54
7696A03j10L42l55k26K16j15J79O9k54J47rJ14o1k44K13J05M9l7K6k47%K10nN
7720A15l58J41J36R6N0k69J07K6j24L55j73M3j64K41m2k30l0l9L4L59o2J28k29
7743A11j58q6J58j4nm5k32K81P4j0j75K5J81n1l11K26P5j31K02r3k18L10k89M6
7767a29R7l9L0j5q4J39j04N1K43j64l0Q8j87J49P7n4j68K17n5j87o4m4M2K50j93
7792a34K85j82j15J04o9K28J82j84q4M3k21J0K8K51N1l38K50N1k15J72m2j55O8
7815a6r9j00K78jj27MJ11J00P1n49O09l44M32j31m28M17j44k48J2K39k16K61l09
7838a78K61J8j37j92J60r0j69L60o8j85J02p3L02j60q3J7J27N7o6j04J43P5j58
$$ plain form
7674 -75 72 -12 235 1 -60 54 -2 11 -103 234 -9 186 -83 5 -114 -254 -229 -17 -121 131 -251 103
7696 103 -7 335 -20 -246 -30 -145 34 103 -151 -4 -13 101 40 -204 9 114 163 126 152 -95 -95 115 110 115
7720 115 -243 -102 34 130 180 -89 18 44 -80 275 102 145 -19 222 180 -50 -80 -119 -85 274 212 340 111
7743 111 -47 -133 25 11 6 -39 -271 10 84 74 -101 -76 105 54 -257 -31 44 -87 115 22 -196 114 -175 -129
7767 -129 -32 -71 -41 -56 -140 -1 -105 -54 189 25 -5 83 -104 45 122 68 -100 117 62 -125 -189 -233 -191 59 -134
7792 -134 151 -31 -146 -42 -111 117 299 115 31 74 -147 -137 -109 142 193 -145 105 156 -59 113 71 -84 -16
7815 -16 -115 -215 63 62 -65 -61 50 150 221 -328 281 -63 369 238 -190 227 83 -165 -153 86 -130 131 -178
7838 -178 83 101 -36 -228 -68 -158 -327 33 -35 -220 -118 -191 111 -49 -132 -115 12 69 3 -101 42 117 -41
7861d1n8N1Q4q6K10k51R7j99N50l34l98M59j21l0o6N11l83m9j55J51n8P35r05
7884b86n7J42N35j21K61r48K30j57J98K22K98l3o23J170l76m34N6n9l22R10m64
7905A42l01L87k97k40N7o9M16L7mj19m4J90k87R9j01p6L19l25K04r6j5J53j77
7928a47QK39j96J26r5k06o9M22p4J21j08J19j79k31M39n3N1O0j73k89L87j62N8
7951D8o2J68p7r5j10K8L0n3M21m22K08M8j41q6J60l1J67j5Q1k21j87O8p5J60N3
7976F5j12n4O1J09k65J70JQ8R3m7j23Qo3r6K00O6j94J59j97J17o9k28L52M1j30
8001d8l6P2j68L28l39L24m11K99j01r5J25J20j15J29j14k39L97j71J25j27n1J54
8023E8k94L40k5j26J90l33K42J31j95o7J61j07J26K3P0j69J17k56n5L97k90P6
$$ plain form
7861 -41 -99 -48 36 -50 160 -91 6 -193 357 23 -375 84 -37 -67 -133 378 -5 -54 -209 -58 -116 619 -286
7884 -286 -343 -201 334 213 474 -474 -244 -401 -203 19 317 284 -339 831 455 21 77 18 -304 606 142
7905 142 -159 228 -69 -309 -252 -321 95 132 128 9 -35 155 -132 -33 -134 -210 109 -216 -12 -108 -123 30 -147
7928 -147 -139 100 -96 30 -65 -271 -340 82 8 129 21 140 -39 -270 169 116 167 227 54 -235 152 -10 48
7951 48 -14 154 77 -18 -128 -100 -70 -123 298 -124 84 132 -9 -95 65 34 201 186 267 46 -141 -73 -148 12 65
7976 65 -47 -101 -40 69 -196 -26 -25 63 156 109 -14 -6 -69 -165 35 101 -93 66 -131 -14 -83 -311 41 82 -48
8001 -48 -84 -12 -180 148 -191 133 -278 21 -80 -175 -50 70 -45 84 -30 -269 128 -43 82 -45 -96 58
8023 58 -236 104 79 -47 143 -190 52 183 -12 -79 82 -25 101 124 194 25 142 -114 -169 228 -62 14
8045A4O1q0j14O5J44j25J54J61m46M16j70k28K7PJ06Q1J22m78K82L8K2J16j70
8068Ej02m7J87k02j06r4K97o5J09l9j01L25l29L92k88M2J06k77p3L90J10k54k4
8091c8lL4o6r5l4J4K92J4j61J02j27J62j32J87j21M7k0n0N1N4p0k79J31PK40l15
8117a76L24k79J61OK8N4j47P5M5J09k72oR1j16J45j09JJ56l2P4j96P5J31O9k83
8142g2K06O5m11Q5K04j18K0k47M73k47L9J53k95K34j08j2j4J27N0l27K34p6l2
8165f9Q2j7RK28l26pJ6N8j26J82N5k69J25rK48l14J39J16o3r8J82k32L21r0k00
8190e9k2
$$ plain form
8045 14 75 -5 -119 -54 90 -35 119 280 -166 250 80 -148 -121 -114 -8 73 195 -283 -1 37 59 175 5
8068 5 -97 -144 43 -159 -265 -359 -62 -127 -18 -57 -158 167 -162 230 -58 -16 90 -187 -260 130 240 -14 -38
8091 -38 -41 -7 -73 -168 -202 -188 104 118 -43 59 -68 94 -38 149 28 75 55 5 56 110 40 -239 -108 -101 139 -176
8117 -176 148 -131 30 36 64 118 -29 46 91 200 -72 -78 13 -103 42 -67 -66 90 58 132 -64 11 142 211 -72
8142 -72 134 199 -212 -127 77 -41 -21 -268 205 -42 -3 150 -145 89 -19 -31 -45 82 132 -195 39 -37 -69
8165 -69 13 -4 5 233 -93 -100 -84 -26 -152 30 85 -184 -59 -68 180 -134 5 121 58 -40 142 -90 231 141 -59
8190 -59 -81
8191h1
$$ Imaginary data points
##PAGE= N=2
##DATA TABLE= (X++(I..I)), XYDATA
0@%%%%%%%%%%jRj6J6j6K4l2L3m1N6o4P2q8J05j28J51j76K04k34K70l08L51m00
33b13M56n18N84o56P36q25R22j028J143j269J407j558J723j903K100k315K550
50A336k808L094l409L760m151M590n086N649o300P060p962R050j0395J2114j4396
65g854J7593k2451L0852m9678J76779O7223k799K5118j37695O0137p1408j0800
77G5017j0050n8188M8164j7971o7953J00772n0030l4460O5407l2531j5054K1959
89B5082j3592J3554k2933l612L8999m8226j0800O1919o1693M851M6096l6244J5733
102I134J3598o193K8198l6575J5407K9374p9164L7155J5257p1283M5556m271j6373
115b0180K5772j4913L3608k028l2414N8853k6137m0365N7664l3404j8312K7448
$$ plain form
0 0 0 0 0 0 0 0 0 0 0 0 -1 8 -8 8 -8 16 -16 17 -24 32 -32 40 -48 57 -71 80 -96 108 -126 144 -164 187 -213
33 -213 243 -275 309 -347 389 -436 486 -542 601 -668 739 -819 904 -999 1101 -1214 1336
50 1336 -1472 1622 -1787 1973 -2178 2412 -2674 2975 -3325 3735 -4227 4823 -5572 6542 -7854
65 -7854 9739 -12712 18140 -31538 145241 212464 209665 234783 97088 157225 85817 75017
77 75017 64967 6779 54943 36972 -30981 69791 19761 -14699 50708 18177 3123 25082
89 25082 11490 25044 2111 -1501 37498 -10728 -21528 40391 -21302 -16451 29645 -6599 9134
102 9134 22732 16539 44737 8162 23569 52943 -26221 10934 26191 -45092 464 -3807 -20180
115 -20180 5592 -9321 24287 22259 -10155 48698 22561 -17804 39860 6456 -11856 15592
127A5592j3118Q938p348P098K7343k9228M645M2214m4014J902M0033l7508L342
140A9891J6245j1035K386j3068J0539R222m2795K5057J8828n4932L6317J0891
152B7546l2152K4711n414K437l362j9368K7120k0677l0899M5805k5975k3327M3637
165A0082j7903j127J1711j311J1132k2678M897K0055l9017K970L0060l7987P509
178b1607K3147j7051P100J599P555m3j9458J9419M342l5712K7181R732l3545K7243
192i8L578r062P317n147J5456j1846j3793L1950j7150j8242L8991j6712r083K2692
206A8851r329M654p897K799J2594k6668Q106K2293l0928P788K5318k4937N966
219H610P219n075j532j4130J4222k945k4970K2955P455k8359K4755P143j8750
$$ plain form
127 15592 2474 11412 4064 11162 38505 9277 13922 56136 12122 14024 54057 16549 19891
140 19891 36136 25101 27487 14419 24958 34180 -8615 16442 35270 -19662 16655 27546
152 27546 -4606 20105 14691 17128 13766 -5602 21518 841 -30058 15747 -10228 -33555 10082
165 10082 -7821 -8948 2763 1452 12584 -10094 -5197 14858 -24159 -21189 8871 -29116 -21607
178 -21607 1540 -15511 -8411 -6812 743 700 -18758 661 5003 -30709 -3528 6204 -27341 -98
192 -98 3480 -5582 1735 -3412 12044 198 -13595 18355 1205 -17037 21954 5242 -3841 18851
206 18851 9522 14176 6279 9078 21672 -4996 3110 25403 -5525 2263 27581 2644 8610
219 8610 15829 10754 9222 -4908 9314 6369 -18601 4354 11809 -16550 8205 15348 -3402
232c402J1969k640K286j0937p857J9333j8528j2429L2095j4201j3693L0143r827
245B312n662N431p97M224k0123Q532J3148k8637Q661K2569k6126O458J7762j4760
259g008K726j132P625m266j5132K3076k205k2066K5194M088k3588J7699K312r847
273b524O93j253J1670j4239j598K5271j5987o818K7805j3823j0304J5702q313
286F282l187o273N742O771j9531J4773J4968k2589R735J7830k0838K509N690o838
300E044l021r532J4525n732j4848K3149j303j8284J9400J414j6029Q174j440j77
314A340q426j060J6292j8032j865K1858j5287p824J9102j0451o262N645N32K456
328a982j1715J2274Q676k0588J2152J1539k1504M154J0561j3640M54J653N966
$$ plain form
232 -3402 8567 5927 8213 -2724 -10581 8752 -9776 -22205 9890 -4311 -18004 12139 2312
245 2312 -3350 2081 1284 5508 -14615 -6083 7065 -21572 -12911 9658 -16468 -10010 7752 -7008
259 -7008 -4282 -5414 2211 -2055 -17187 5889 3684 -18382 6812 10900 -12688 5011 7323 -2524
273 -2524 -1831 -3084 8586 -5653 -7251 18020 2033 -4785 23020 9197 -1107 14595 6282
286 6282 3095 -3178 2564 9335 -10196 4577 19545 -3044 6691 24521 3683 6192 11882 5044
300 5044 2023 -7509 7016 1284 -13564 9585 8282 -10002 9398 10812 -5217 2957 1517 1340
314 1340 -7086 -8146 8146 -9886 -11751 10107 -5180 -13004 6098 -4353 -10615 -4970 -4438 -1982
328 -1982 -13697 -1423 7253 -13335 -1183 10356 -11148 -6994 3567 -10073 -9619 -7966 -2000
341b000k870p462K1777n594j3009K0482k268j6985J2304q0q256J160R64R658j1223
356c402L474J8941j6363k13J7260j3064o318J1446n959k381k072O518L975j5301
370c459J4009N632j8782Q745P645j5966K288N404m478p65l505J1786o025j0230
384g701J7858p980j3225J3239k396j1574O731R27M25m320K613J2626j5428K300
398e905J4016j4859k934J2080p722l309M934J887K271p557J0880M286j6220J2031
412C879M571j5009N992O793p583J720L084O011l157n944J5947p822j0915J5231
426A2798n171j0589R104R68m631R27K598O039j0912K081J2351j7711Q68J1475
440A0195j1736l176R105j590k470m55O838N45j3701J2371J538j6469R335M160
$$ plain form
341 -2000 -4870 -12332 9445 3851 -9158 11324 9056 -7929 4375 4295 -3961 -2801 -1837 7821 -3402
356 -3402 72 19013 2650 2437 19697 6633 315 11761 5802 3421 1349 7867 11842 -3459
370 -3459 10550 16182 -2600 6145 13790 -2176 112 5516 1038 273 -3232 8554 2529 -7701
384 -7701 10157 2177 -11048 2191 -205 -11779 -5048 -4121 -3696 -8016 -5403 7223 -8205 -5905
398 -5905 8111 -6748 -9682 2398 -5324 -8633 -3699 -1812 459 -7098 3782 8068 -8152 3879
412 3879 8450 -6559 -567 6226 -1357 363 3447 9458 6301 357 16304 8482 -2433 12798
426 12798 7627 -2962 6142 7110 2479 3406 6004 12043 1131 3212 15563 -2148 -1280 10195
440 10195 -1541 -4717 4388 2798 328 -127 6711 7256 -6445 5926 7464 -9005 330 4490
454D490j0452K981N815j815j951l43Q633p796p709J5261r627q662J2246k198o665
469g792N431K741n74m896K345Q026j5171K453J0521j4017J149R288m996j939M086
484c345K393j459o612Q743j13j4669J2523J251j1451P222N195m090n89M303L115
499B417o042l329J2212q824o654J4288n463m921Q883J890l672R42M034J829r325
514a735M059R106j5220M431J0056r571N49O696j071m054o77N107k722j0396J1127
529E685o36j2430J1288J229p546K985L445k400n013J129N262q714l037J3181r023
544d595l490J2149l130m321M126K557l469m634M365K830j1176N653Q098j1657
558f694M901P162n312j165L146J286m533m014P531l038r435J2212r24q425Q218
$$ plain form
454 4490 -5962 -2981 2834 1019 -932 -1275 7358 -438 -8147 7114 -2513 -11175 1071 -1127 -7792
469 -7792 -2361 380 -194 -5090 -2745 5281 -9890 -7437 3084 -10933 -9784 -496 -5492 -7431 -3345
484 -3345 -952 -2411 -9023 -280 -393 -15062 -2539 -1288 -12739 -5517 -322 -4412 -5001 -698 2417
499 2417 -3625 -6954 5258 -3566 -10220 4068 -1395 -6316 2567 4457 785 1727 5761 7590 -1735
514 -1735 2324 11430 -3790 641 10697 1126 1675 8371 7300 3246 2569 7676 4954 -5442 5685
529 5685 5049 -7381 3907 5136 -2410 575 4020 1620 -3393 -2264 2998 -5716 -8753 4428 -4595
544 -4595 -8085 4064 934 -3387 739 3296 -173 -4807 -442 2388 -8788 -3135 4963 -6694
558 -6694 -1793 5369 57 -1108 2038 3324 -1209 -5223 2308 -730 -10165 2047 1123 -7302 916
573I16J412l320o99K945J990o096O54Q799p955j146J1884o903j895O317p20l029
589C154l87M361p56n788O089N520j0204N620O558q731P98L043k133m478o82M225
605F209l828n418R484j467q552J0038p40o349K370R38j894n588K367M210p989
620f209O7R843p802j458Q591m408j967R78K616k771l754N608M89p832N759M437
636B187j0060M147L734n152p13K224K075m015k17P414k711n362R991j924o870
651e252O641q90k762p78K966J914m529L958O389o568J266Q498p054j059M316k016
667E040k080j943N255j811n064O570K022p891M752L614p297R89J591o78l537M38
683c0M683m950k587O601k855o268P505j364n171K397J736P4l607L827K745o809
$$ plain form
573 916 2328 -992 -1691 1254 3244 -2852 -2198 6601 -1354 -2500 9384 2481 586 6903 6183 3154
589 3154 2767 7128 6372 584 6673 12193 1989 7609 14167 5436 6234 9277 7144 2666 1984 6209
605 6209 2381 -3037 6447 4980 -3572 6466 5726 -623 1747 2685 791 -4797 -2430 1780 -6209
620 -6209 -6142 3701 -4101 -5559 3032 -1376 -3343 -2365 251 -2520 -6274 -666 -177 -8009 -2250 2187
636 2187 -7873 -3726 8 -5144 -5857 -3633 -1558 -5573 -5790 1624 -1087 -6449 3542 1618 -5252
651 -5252 1389 499 -2263 -3041 -75 1839 -2690 1268 7657 1089 2355 10853 3799 2740 7056 5040
667 5040 2960 1017 6272 4461 -603 5967 7989 98 4850 8464 1167 2156 3747 3069 -468 -30
683 -30 4653 -297 -2884 3717 862 -5406 2099 735 -4436 -2039 -303 -229 -3836 -9 2736 -4073
699d073J651N977p608j468O300m973j479J576K725k111k344P133j448n988O152
714B2J248q105L402K898m431r5K334K896m542J514O531m790k824P310k680n209
730d521O074o10k151K60L008J073m726M569K764o570J421N838o613n12M770j740
746B334r04k95M922k810l632O372j188o647M710J564o007K511K222j026k147J922
762A901L636o066P7N371n298l089N354j887l585L352Q81r67k749L861Q01o339
778d746L265K656o132L75M799m286l62K091J274j553j912N215k600m316M949j91
794a474n372L860K325l606J233J936J620l973J536M429n747O2N481k912k279M690
810A809K9k150R08L048m35m721M910J135o077L122L314m218K72L921j507j090
$$ plain form
699 -4073 -2422 3555 -4053 -5521 779 -4194 -5673 -4097 -1372 -3483 -5827 1306 -142 -6130 22
714 22 1270 -6835 -3433 -535 -4966 -5061 -2727 169 -4373 -2859 3672 -1118 -3942 3368 688 -4521
730 -4521 1553 943 -1208 -948 2060 3133 -1593 2976 5740 -830 591 6429 -184 -696 4074 2334
746 2334 1430 1135 6057 3247 -385 5987 4799 -1848 2862 4426 -1581 930 3152 2126 -21 1901
762 1901 5537 -529 -452 4919 -379 -3468 1886 -1 -3586 -234 647 -320 -3069 792 1593 -4746
778 -4746 -1481 1175 -4957 -4582 217 -4069 -4431 -2340 -1066 -2619 -4531 684 -1916 -6232 -1283 -1474
794 -1474 -6846 -2986 -661 -4267 -3034 -1098 522 -3451 -1915 2514 -3233 -3171 2310 -602 -2881 1809
810 1809 1838 -312 596 3644 3209 -1512 3398 4533 -1544 1578 4892 674 946 4867 3360 2270
826B270J34L029l242k705N155l018l456M186N65m238K535J810j758j426R19K235
842B995n715J001L908m611j012M604j682k385K690K88p18k359L013j6n118M088
858a029J036m429J847L085k768p31K264N3j972j296M474l302k341M769q13k769
874c922L005J663k720K71J430J032l543J342L978m925J125M385k676q21L709j98
890C135k025N50J583n28l769M369N42m846L686K002k935J86K390j723j559P38
906A796J755l095j592N097l119k081M080n72k836J558J263k038j449J503J431
921A701m431J709L591m192M49L201j801j930K012J08j819j197K500m84m000M588
937Ek16l409K375J468k538j253K405p8k321K52L804k807j234N016j957j824K906
$$ plain form
826 2270 2404 5433 2191 -514 4641 1623 -1833 2353 2918 -1320 1215 3025 1267 -159 760 2995
842 2995 -2720 -1719 2189 -2422 -3434 1170 -512 -2897 -207 81 -637 -2996 17 1 -5117 -1029
858 -1029 7 -4422 -2575 510 -2258 -2989 -725 -672 -2644 -3940 534 -2768 -5109 -340 -1153 -3922
874 -3922 -917 746 -1974 -1703 -273 759 -2784 -1442 2536 -2389 -1264 3121 445 -376 3333 3135
890 3135 1110 1660 3243 2715 -1054 3315 3857 -989 2697 4699 1764 1950 4340 2617 1058 1796
906 1796 3551 456 -1136 3961 842 -1239 2841 2269 -567 991 2254 216 -1233 270 1701
921 1701 -2730 -1021 2570 -1622 -1173 2028 227 -1703 309 417 -1402 -2599 -99 -583 -4583 5
937 5 -211 -3620 -1245 223 -2315 -3568 -1163 -1241 -3562 -3310 494 -2313 -3547 1469 -488 -2312 594
954E94P16k424K34K074l02k155K225K475m315K382K923l229m07K441l64k386R39
971A421J691j314k290M094l91m146L839J94k790M51J564j464j915J680J350k857
987h83k3L921l450j005L344j652j986J057J421j948r01K620K77l011J897K317
1003A995m272J295J787k042j516J825M23j919K75K445j149k341L948j044k926
1018c216K575K25j969l54K279n00j633J362K457k730k78M193l226m04K036p91
1034B6j156M90K119r35j244K296R92l378K100J712l294N61J586l94j445J275J230
1051B541j474q48K991j108k718L164q37k318J041R40q23j234K128K74k368O68
1067A9K273k883o79K821k077r69O55J133j297j109K658o70k464K069R01l414J193
$$ plain form
954 594 1310 -1114 -880 1194 892 -1263 962 3437 -878 1504 4427 1198 791 3232 2868 482 1421
971 1421 3112 1798 -492 3602 3211 -935 2904 3098 308 759 2323 859 -1056 624 1974 -883
987 -883 -906 3015 -435 -1440 1904 252 -1734 -677 744 -1204 -2105 515 792 -2219 -322 1995
1003 1995 -2277 -982 805 -1237 -2753 -928 -505 -2424 -2149 296 -853 -3194 754 -290 -3216
1018 -3216 -641 -416 -2385 -2739 -460 -960 -2593 -1231 1226 -1504 -1782 2411 -815 -1219 817 26
1034 26 -1130 -640 1479 544 -700 1596 2588 -790 1310 3022 -272 289 1875 1481 36 1311 2541
1051 2541 1067 219 3210 2102 -616 2548 1711 -607 434 1374 551 -683 1445 1719 -649 19
1067 19 2292 -591 -1270 1551 -526 -1495 -840 293 -1004 -2113 545 -125 -2589 -520 381 -3033 -1840
1084a840J492j979Q6Q79Q20j914O48K282k025j383L065j020k276K759k87q94M8
1101a539J734N9j684J353J340k423Q1K888k385k71K034n04o70J35K048j071j290
1118a65K370m80k242J458J408k718J331Q49k92q61P16J432k168l0J953j691j776
1135i06K835p96j786J594L25n13j255J962l27k418J072J466k621j05K579j947
1151h41l52R97M06j067p50K212j356j875J982M28k562J313J160j317JP19P42k172
1169b332O92J836k076k98K298q23j611K155M59j181K99J243j81j946K035K96j929
1186a064Q70K067k367J31K279p12n98L82J066j107p28K238j147j315J818O87k144
1203C56R37J007o79q45P24Q84k173N55J647k041m33J898o97j339J344jq49r88
$$ plain form
1084 -1840 -348 -2327 -2241 -1362 -542 -2456 -1808 474 -1551 -2934 131 -889 -3165 -406 -693 -1587 -1539
1101 -1539 195 254 -1430 -77 1263 -1160 -1079 1809 -576 -847 1187 683 13 148 2196 1125 -165
1118 -165 2205 1725 -517 941 2349 -369 962 1811 1519 658 1374 2806 638 608 2561 870 -906
1135 -906 1929 1133 -653 941 1266 753 -502 1460 1133 -1285 -213 1253 -1368 -1473 1106 -841
1151 -841 -1193 -196 210 -857 -1607 605 -751 -2626 -644 -216 -2778 -1465 -305 -1622 -1621 -902 -160 -2332
1169 -2332 -1640 196 -1880 -2178 120 -703 -2314 -159 300 -881 -582 661 480 -1466 569 865 -1064
1186 -1064 -194 1873 -494 -363 1916 1204 606 988 2054 947 219 2457 1310 -5 1813 2500 356
1203 356 1293 2300 1621 776 1500 2384 211 766 2413 372 -61 1837 1140 -199 1145 1144 295 -693
1221f93J627l54k491J976L68j723K91J742j648j78Q13K1j286l61J675j241r91
1238b453K165l01j604J662L76j356M97L70J57j443O42J608k273O07J546j132l53
1255a285J716l71j071O36R42m74j228J972M8j475J336Q45j343j73J473p90l97
1272C61K39J036q94o68K179j055n72J645j70j686O76P17j210m4N18M23j846R45
1290E94J378k206M02J364o61j134R61j59r48l09R85l04j351J572k23j291P11J018
1308C99j384l10P33R7q04p5J675j341l72J592r01q45Q65N95j083R9O02j59o16
1327a233P27J065j896J188Q68j200p7R10j00o44L06R76p73n97J642M0j323J612
1345A491k1j120L54Q13o51m17P57M03p11M0J555j553l32J210j93j212N38N91q88
$$ plain form
1221 -693 934 580 -1911 65 433 -1290 -999 743 -905 -1083 -270 -249 -1535 -1896 -221 -1462 -2453
1238 -2453 -288 -589 -2193 -531 -155 -1511 -1014 -644 -487 -1930 -1288 320 -1953 -1346 200 -932 -1285
1255 -1285 431 60 -1011 -375 567 93 -1135 837 885 -590 746 1591 248 75 1548 758 361
1272 361 600 1636 742 74 2253 1198 626 2271 2101 415 1091 1808 598 554 1072 1495 -351 594
1290 594 1972 -234 168 1532 871 -263 698 539 -409 -718 267 -37 -1388 184 -39 -1330 -619 399
1308 399 -985 -1295 -562 -465 -1269 -1344 331 -1010 -1382 210 -691 -1536 -671 -76 -1159 -1060 -458 -617 -1233
1327 -1233 -506 559 -1337 -149 719 -481 -558 352 252 -392 -86 890 117 -480 1162 1202 -121 1491
1345 1491 1470 350 704 1517 866 449 1206 1609 898 938 2493 940 608 1818 1625 413 951 1542 654
1364F54l00P18L75j564O85Q41j662K87P52q64o03R25K13j049M1R71o30j303J800
1383B87n48j107P47L99r82J1P32p0p68M55J043j659J98J430j314n24Q41O7n21
1402a283M67N91k96n54Q79N61j704J099O62j352O05Q16o15m28N33Q18m24l50R00
1421I25m3j116J341l13p84M71N52j52q65R97Mn97j42J275j395j94J438r00k69
1440B33J01Q67r29k95R66l25j095Q74K47j480P93M21p47j70O37L72j016K37L35
1459B6k81o96Q45o12q74R75K91o79%Q82m80m96N75O39r44m35J349j110j83Q86
1479c22k73j26l6R59p22p6P36J29j176J088K64r06P01K55n0m15M84N27r52K70
1499C59M71j38n65J130j60n42M16K50l11m42O10n1r37N28O69j149k02J221p35
$$ plain form
1364 654 354 1072 1447 -117 568 1409 -253 34 786 -78 -681 244 457 -592 -551 420 -210 -1513 287
1383 287 -261 -1368 -621 -222 -1204 -1193 -461 -531 -1299 -844 199 -1460 -1262 168 -1146 -1670 -829 -762 -1283
1402 -1283 -816 -225 -521 -1075 -196 365 -1339 -240 422 -930 -325 491 -124 -552 -19 799 375 25 925
1421 925 882 -234 1107 794 10 481 1033 881 16 1013 1017 420 278 1553 158 -36 1402 502 233
1440 233 334 1201 272 -23 943 618 -477 397 644 -836 -43 378 -369 -539 98 470 -546 -309 26
1459 26 -255 -951 -106 -718 -1592 -617 -326 -1005 -1005 -123 -603 -1099 -524 115 -829 -1264 85 -1025 -1208 -322
1479 -322 -595 -721 -757 202 -520 -596 140 269 -907 181 445 -461 240 495 445 30 514 1041 89 359
1499 359 830 692 127 1257 1097 555 971 1221 910 468 1078 1027 90 618 1287 138 -64 1157 422
1518D22j36J42K71l81k74O11j11j237O47M21j060M09L99p00K58J94Q3n43Q9M31
1538f5m92j74N50m44n43Q54j84l68J19M63k28n85O33K81p13L04P24p59m03R64
1558f6M3k22kO51p96r8Q81j76n67Q50K73q72L72N47l35k07L70L04r25K22M93n99
1580A41O1O77j11n11O22o0l78j97O39k19m99M37M46r02kO86p49K20J95j16k57
1601A23j77N75n88l09N92r0m24J72J23m37Q1R0O5m81L02M21p96j72Q11k33m11
1622g63O59j34n66K23M83l43l55Q51k45o67P90L0l79k37J010n03M0j46O77m78
1642e3j23O82k85m63N23M53p19O03j78k32J88L6K00o24L56N60p70J44M41k19l80
1663A40N78j13l87p3O11j89o70M45L13o92K12J82l86R1L50l76j74p8M32m55j25
$$ plain form
1518 422 286 428 699 318 44 655 544 -693 -46 375 -685 -276 123 -577 -319 -125 -42 -585 -496 -65
1538 -65 -557 -731 -181 -625 -1168 -314 -498 -866 -747 -284 -512 -1097 -464 -183 -896 -592 132 -627 -1030 -66
1558 -66 -23 -245 -247 404 -392 -490 391 215 -352 498 771 -101 271 818 483 276 646 950 25 247 740 141
1580 141 202 879 768 257 879 819 441 244 883 664 165 602 1048 146 144 830 81 301 496 380 123
1601 123 -54 521 -67 -376 216 126 -298 -126 -3 -440 -359 -269 -204 -685 -383 38 -758 -930 -119 -352 -763
1622 -763 -104 -238 -804 -581 -98 -441 -796 55 -190 -857 -67 -37 -416 -653 357 -146 -106 -252 425 -53
1642 -53 -176 506 221 -242 281 734 15 618 440 208 396 432 632 8 364 924 154 298 739 520 140
1663 140 718 605 218 145 756 567 -103 342 655 -37 175 357 -29 62 412 36 -138 -216 216 -239 -364
1684c64Q09o51n26O09J89q91K62K52j07m23L86L50p48N22L21o40l2K99k2j65K17
1705c53K48k09n38Q16j37n63R14k55l38K86K60j80j12N65j4m46r5P81p05N4K35
1726B14Nl93N21K45m14j08M21j62m62P43J91j051N94L05o91J42L81o9k70K7J76
1747C45J11n67M22l52k2j58K17k01l71N51l39J74O8J59o03j23O80l78o0P2J03
1768b72k95PJ43k12j05M69J09n75K65L30m36J2K89j51j69N41q3j35kK81J42l50
1790a97K12J43k90K86J80l52o0M00j12r1o1O93p52Q0M38l02NR6K10m37J93L79
1812F61j53k83J68J37m13L44l3n56j9K62k4k76M10N7k81k11J93k49J48P3O0l00
1834b85J80K09l25j20J20J67j49l98M36n69K98J03l5k31J52L16l45K6n0J59j90
$$ plain form
1684 -364 445 -206 -732 -123 66 -825 -563 -311 -418 -841 -455 -105 -853 -331 -10 -650 -682 -383 -405 -570 -353
1705 -353 -105 -314 -852 -36 -173 -736 178 -77 -415 -129 131 -49 -161 404 390 -56 -151 630 -75 -21 214
1726 214 219 -174 347 592 178 70 491 329 -133 610 801 -250 344 649 -42 100 481 412 142 169 345
1747 345 456 -111 311 -41 -63 -221 -4 -205 -576 -25 -364 -190 -122 37 -566 -689 -9 -387 -447 -375 -272
1768 -272 -567 -560 -417 -629 -734 -265 -156 -731 -466 -136 -572 -560 -271 -422 -591 -50 -133 -268 -270 11 153 -197
1790 -197 15 158 -132 154 334 -18 -78 322 210 119 58 751 -1 79 517 215 220 316 526 89 282 661
1812 661 508 225 393 530 117 461 428 -128 -147 115 91 -185 225 282 1 -210 -17 -266 -118 -45 15 -285
1834 -285 -105 104 -221 -341 -221 -54 -203 -601 -165 -734 -436 -333 -368 -599 -447 -131 -476 -450 -500 -341 -531
1855e31K92q0q9L8L10j10p0J48k2j37O6M84j28p00N04K03j16J28m2o3K1J26j12
1878A20k09K64J83m78M99j47o9M6J88j51k79Q6J43k45j1K69n1k92M23j23n0m2
1900G4j48N8l49J71n7P5j79K08k46J55M9J23k03k28L26j57o5O1J2k45J27K65k50
1923d23m0N0J94j59j58N64l42q2L56K4l83M87n07R9K5J53J2j75L86R5p8j5J41
1946B24p9j69P33m48n43L96L4j08m38J136j075O59k70M65o33J12N84J75k58k62
1966B35L22q0k31P31j466J083m43k1P52q82K05k29l62K84j61K90m9j62M8p1K51
1987D4k43j03L02k69K2k2j38K9J07J60n7Rk41K90k43l2L10j32L5l8oJ6P8L30k48
2012d0l89N99k7j21j8J50j26M9J2j1k59K60J23o7J3J91j74L6p0K96J3k10M32m17
$$ plain form
1855 -531 -239 -319 -408 -370 -60 -170 -240 -92 -114 -251 -185 299 171 -529 -25 178 62 190 148 85 106 232 120
1878 120 -89 175 358 -120 379 232 163 209 397 246 -33 53 196 -49 -60 209 158 -134 289 166 116 74
1900 74 -74 -16 -365 -194 -251 -176 -355 -147 -393 -238 -189 -66 -269 -497 -171 -328 -393 -332 -320 -565 -438 -173 -423
1923 -423 -463 -413 -219 -378 -536 28 -314 -396 -40 -16 -399 88 -419 -320 -295 -142 -130 -305 81 176 98 83 224
1946 224 145 -24 709 261 -282 114 148 40 -398 738 -337 322 52 517 -116 -4 580 755 497 235
1966 235 557 477 246 977 -489 594 151 130 882 0 205 -24 -386 -102 -263 27 -22 -184 -136 -207 44
1987 44 -199 -302 0 -269 -247 -269 -407 -378 -271 -111 -168 -159 -400 -110 -353 -385 -75 -207 -172 -210 -216 -200 -122 208 -40
2012 -40 -429 170 143 22 4 154 28 77 89 78 -181 79 202 135 148 339 165 201 131 427 440 230 662 245
2036B45J02RN2k49M9Q7j77J8R3k4l6r1J37r5q6N4M9k63K8K59k00O9j82R0l46J37
2062b71J45k74J36L2K12m47J96nj9K50m88J39K03J25j84k8J99r6l43L02R7k63
2084c82K19L3J96l69L26J28m88L19p1R3o1K38Rj73M25j78j76J34j27M21l51L08
2106D73l56K61j46J54j90M4J43j24j65o1N8j8J27n2l9N3j52K21j24j69K07p1L2
2129A06j68P7Ll36K23J3m54M70J4r4o3J47k24m1K52j18j18J09J57l78M6K9r1K87
2153a52j05P3L2j53L68l50J13J78j04j92L75j42K17j85j09L03k74L07R9n5k35
2174IJ72n9J24j8k03J36J20k07J45j22J83K5lJ03J4j01m7j25J29qj38K34k37k4
2198A02O7q6J03o7k05K79j40L0k00P2OK49m79N9J04j90J47j96J84k4N5J05n63
$$ plain form
2036 245 347 356 408 159 208 295 118 136 229 205 169 78 215 120 34 88 137 -126 -98 161 -39 30 -152 -62 -408 -271
2062 -271 -126 -400 -264 -232 -20 -467 -271 -276 -295 -45 -533 -394 -191 -66 -250 -278 -79 -175 -518 -216 -119 -382
2084 -382 -163 -130 66 -303 23 151 -337 -18 -89 4 -57 181 190 17 442 264 88 222 95 516 165 473
2106 473 117 378 232 386 196 240 383 259 94 33 91 73 200 148 109 162 10 231 107 -62 145 74 106
2129 106 -62 15 18 -318 -95 -82 -536 -66 -52 -146 -209 -62 -286 -327 -75 -193 -311 -202 -45 -423 -377 -348 -439 -152
2153 -152 -257 -184 -152 -305 63 -287 -174 4 -100 -292 83 -59 158 -27 -136 167 -107 200 299 244 9
2174 9 181 122 246 228 25 161 281 74 219 97 280 305 302 405 419 318 271 146 275 267 129 363 126 102
2198 102 169 83 186 119 -86 193 53 83 -117 -45 -39 210 -269 -210 -106 -296 -149 -345 -161 -185 -130 -25 -588
2221e88K28R5M3j95J63J76k53J00J4L5m8q0J10j27K28K66l37NL50m10J22J02M6
2244D5J24l33L99j52k97J35J02Q5J55j13L2j10L0J25p2m7J65j79r3L22k4o6O2
2267B95k23M21l33q2j57J61O8P0M0l5j43O8j41j10J60k27N9J41k80P6JJ51l78
2290c98M04q3k21J40o6K10j77R3n7J24k46J33k1j2K43m63L41J16n9l7o0J02J9
2313B5j10j9m3K32j25J49K3J05r1l45J06K46j88J21Q3J2j5j7J49l5j92J84l9m2
2337A74q1QO8o5O7R7N4m01L14l5k09J13q8O8pk7P1k37M3N7j86L11l33J83j58L22
2363A23k1j0j46j26K11j89J09K28k07l07J57K9r7k6L46j9k91K75N0l23K5o4J79
2386i4r8J08L14l83M3M0L47k46m7J79K5q5J42j91J14n3j28M9j03K5L1O1K89m49
$$ plain form
2221 -588 -360 -265 -222 -417 -254 -78 -331 -231 -217 -182 -230 -310 -200 -327 -99 167 -170 -165 185 -225 -103 -1 45
2244 45 169 -164 235 83 -214 -79 23 108 263 150 182 72 102 227 155 108 273 94 1 323 299 233 295
2267 295 72 493 160 78 -79 82 150 220 260 225 82 150 9 -101 59 -168 -109 32 -248 -172 -171 -20 -398
2290 -398 6 -77 -298 -158 -224 -14 -191 -98 -155 -31 -277 -144 -165 -177 66 -397 -56 60 1 -36 -96 6 25
2313 25 -85 -104 -147 85 -40 109 132 237 146 -199 -93 153 -35 86 169 181 166 149 298 263 71 255 216 174
2337 174 93 101 169 104 171 268 322 -79 235 200 -9 104 16 84 77 50 121 -116 -73 -16 -202 109 -224 -41 -199 123
2363 123 102 92 -54 -180 31 -158 -49 179 -28 -335 -178 -149 -246 -272 74 55 -236 39 89 -234 -209 -273 -94
2386 -94 -192 -84 230 -153 -110 -70 277 31 -16 163 188 103 245 54 168 115 -13 36 -67 -42 -11 50 339 -110
2410a10J75L7K28P8k38j85K80q5m5nj84K43n6j00p8k6J52N0j79J56m03M41k16
2433g0j43P7j59L1K92l6m8j71J68J6k6J35k50Q2k53J36J41j71M7J19M8j68J82
2456b1r3n9J01n2J90Q9j76J06Jj25l9L35j57K44m97J72K72j26k6J20J9J2k21Q3
2480A52j77J13K41r7Q5k73K42l18J05L8K86j01n0k16M2m4%J5m02L09J61l5K0l2
2504F4l7l0r1k15K14O6J10k48J52k1M6k66J88k4k9r7lJ68k97L42k06k11L8N52
2528A65k72L7J93j72O9Q1Pj76r3N4K80l02R9M2j34K14J31N2k23K65k10j33J00
2551G4J97L4k63J8L07o1k59L8K33l68J77L8K09j53j58j23J58Rk5Ok2L2m8p3k45
2576b68L96l5j40J44j65m8j2K1LJ4o6J37q8R0m2k21L99k92K02j32r9o2p1R3J27
$$ plain form
2410 -110 65 102 330 408 170 -15 265 180 135 130 -54 189 133 33 -45 -71 81 131 -48 108 -295 146 -70
2433 -70 -213 -136 -295 -264 28 -8 -56 -227 -59 -43 -69 66 -184 -102 -355 -219 -78 -249 -202 -83 -35 -203 -21
2456 -21 -114 -173 -72 -124 66 155 -21 85 86 -39 -78 257 100 344 -153 19 291 165 139 259 278 290 69 152
2480 152 -25 88 329 232 317 44 286 -32 73 111 397 296 246 30 72 28 28 43 -359 -50 111 76 96 64
2504 64 27 -3 -94 -309 -95 -29 81 -167 -15 -36 10 -256 -68 -92 -121 -218 -221 -53 -350 -8 -214 -425 -387 165
2528 165 -107 -70 123 -49 20 101 108 -68 -161 -107 173 -129 -30 12 -122 92 223 275 52 317 107 -26 74
2551 74 271 305 42 60 367 306 47 85 318 -50 127 165 374 221 63 -60 98 107 82 88 66 98 50 -23 -268
2576 -268 128 93 -47 97 -68 -116 -128 -107 -104 -90 -156 -19 -107 -17 -59 -280 119 -173 29 -103 -202 -264 -335 -242 -115
2601a15o4J49J63m25j8L11p2l6L8j32L34k17J2J53kj83M6L86l53N6M9j1R4j61
2625BN5j63K80k4j58J61q7p9J41q0Q9O3l23L29J60l11K74l93j00J75J71m3J6K7
2649A82k80J88l9m3J08M8k58K82J93n63k07J39J68J4M1m1n4n3J39j36j05J76q6
2672a87P1n1q4j73K48k80K86L64l72J08j37l3K88j80J11j89L19K4j42N1J2j57
2694a03L0Q1J99m45M14k35N4j7J1M9k51P78k80k42j89L72k89j8M72j81m83K59
2716a4K00J14m16l6K1l74J202o8q25l4J08Q68j018M94j39J51p92P30j23J61o70
2737d60N05J35n99m69K94M18o7J30q8l16l34P12M85j45n33m10Q64J00n70M31L
2758H6J15j91o50J06P00m29n8M46j19j99M27j88m36J00L85m57N33J01k88p4L50
$$ plain form
2601 -115 -179 -30 133 -292 -310 1 -71 -107 -69 -201 133 -84 -72 81 79 -104 -58 328 -25 31 80 69 163 2
2625 2 57 -106 174 150 -8 153 66 -13 128 48 137 200 -123 206 366 55 329 -64 -164 11 182 139 155 182
2649 182 -98 90 51 8 116 164 -94 188 381 -182 -389 -250 -82 -68 -27 -68 -122 -175 -36 -172 -277 -101 -187
2672 -187 -116 -167 -251 -424 -176 -456 -170 194 -178 -70 -207 -240 48 -132 -21 -210 109 133 -9 42 54 -103
2694 -103 -73 8 207 -238 176 -59 -5 -22 -11 38 -213 565 285 43 -146 226 -63 -81 391 210 -273 -14
2716 -14 186 300 -116 -152 -131 -505 697 629 -196 -230 -122 746 -272 222 83 234 -558 172 49 210 -460
2737 -460 45 180 -419 -888 -594 -176 -243 -113 -201 -517 -851 -139 346 201 -332 -742 122 222 -348 83 86
2758 86 201 10 -640 -534 166 -263 -321 125 6 -193 234 46 -390 -290 95 -362 171 272 -16 -90 260
2779B60n3QP5k37N3k5J63n94Q16J39m17k46J53l81N95n15J93Rk78j18J25K08o8
2802a35mJ71K68k69L8k00j59J48k04O24m98K02m5N7j83j09P7K73j66j43K67m58
2824d48L92l5O3q6q5J14k16J81k58L09QJ3j28K39j19j35K02p4J69j33N9j29J27
2847C0Q2J28l10L72J22n35L74k19l18P27o17k09O09l22j0j0K97L64p16L27r0P6
2869A52J17q1k08R7o7Q3m0j4j34L04j59l04K76j55j34P8K8K2K12N4k50J96m10
2892c37J51J19j31R2J10j58p4L06k09o7J03J4O8K9m1O4n9p3n4qK14k2j8n8j02
2917a41K24k29L33l9n9j0j2P4j0O9k57M65j35M3k09j06L09j39O4J42r0o2J02k45
2941H2j23J16Q9J06J1k60p9J25k57LL71l28J00K53l21L8p0J3L46rk68N2M6n1j46
$$ plain form
2779 260 207 215 290 53 106 81 244 -350 466 605 188 -58 95 -286 309 -206 -13 -4 -282 -400 -275 -67 -135
2802 -135 -139 32 300 31 69 -131 -290 -142 -346 278 -220 -18 -63 -6 -189 -298 -221 52 -114 -257 10 -448
2824 -448 -56 -91 -28 -114 -199 -85 -301 -120 -378 -69 -61 -48 -176 63 -56 -191 11 -63 106 -27 32 -97 30
2847 30 112 240 -70 302 424 -111 263 44 -274 453 -164 -373 236 -86 -96 -106 191 555 -161 166 76 152
2869 152 269 188 -20 77 10 93 53 39 -95 209 50 -254 22 -133 -267 -189 -161 -139 73 127 -123 73 -337
2892 -337 -186 -67 -198 -106 4 -154 -228 78 -131 -198 -95 -81 -13 16 -25 39 -20 -93 -147 -155 59 37 19 -39 -141
2917 -141 83 -146 187 148 89 79 67 141 131 200 -57 408 273 316 107 1 310 171 235 377 287 225 327 82
2941 82 -41 75 164 270 281 21 -58 67 -190 -187 184 -144 -44 209 -112 -74 -144 -131 215 206 -62 -10 36 -15 -161
2966a61L6Q0o1nQ0j01J12j92J58j57J70k02O9J70j69K25j4j99nP9oJ27j39J55
2990E0j18Q3Mj08R6k5P1o6J93l9j44L19k09k07K44q5p6M03j09k40J58p7Nq0O9
3015A12j31k04K31J96j06K5R5j7j05K35j23j49o8r1mJ08k6J22j75M9O6n3j05n2
3039a70M2ok77L60J86j11J4j73k3q4K51m49N04k17K0n6n7L50l62J60O7n1q8N90
3063D20m62j07J44ok9Q1j21J80l2j60K12j32J69m1j35n1K74j08R3j09j3K9J7l5
3087G8J45k39P9J91o2k08O2K37j26j8j47j25P8K57n24J11J11L33j81j62J99k76
3109a87L09m04J36j18Q9Ol7J24j00O8k32L19j13P5N7j86o4o9J64M4J04k93M7L11
3133E0j85J32j9o2j07Q5L02l32K3P4J27q2m0J11J14j83m3r8K93K0j24M09l58L
$$ plain form
2966 -161 -125 -45 -106 -111 -31 -132 -20 -212 -54 -211 -41 -243 -174 -4 -173 52 38 -161 -166 -87 -93 34 -105 50
2990 50 -68 15 19 -89 7 -18 53 -13 180 141 -3 316 107 -100 144 59 -17 386 277 37 195 118 123 43 112
3015 112 -19 -223 8 204 98 123 218 201 96 331 208 59 -9 -100 -104 4 -22 100 -75 -26 40 -13 -118 -170
3039 -170 -128 -134 -411 -51 135 24 38 -135 -158 -242 9 -440 64 -153 -133 -189 -246 104 -258 -98 -31 -82 -170 420
3063 420 -42 -149 -5 -11 -40 41 -80 100 68 -92 120 -12 157 116 -19 -70 204 96 189 80 67 96 113 78
3087 78 223 -16 63 254 192 -16 46 283 157 139 -8 -133 -55 202 -322 -211 -100 233 52 -110 89 -187
3109 -187 122 -282 -146 -264 -175 -169 -206 -82 -182 -114 -346 -27 -140 -65 -8 -194 -258 -327 -163 -119 -15 -308 -261 50
3133 50 -135 -3 -22 -84 -191 -106 196 -136 -113 -39 88 6 -34 77 191 8 -35 -133 160 180 56 465 107 110
3157A10J72k63L7K12l54J13N5N1o8J52k29J29j52J06J58M8j69p3p2J34J65k32
3179C0l9j23K17R7j90L0o1p5k66N0K83j92j00N12k26N2J07j65J92l76K78P0r0
3202A5k14R6p2K0K21l17Q4L3J99j87m2n8M31j90j28J73lJ40l73L84J49k20n5J16
3226B02j49J84K41o46J41J8K15j31R8q8j70J7k1K22J91P3k39J01j17k5k13J61
3248F5J8j38k4K81K77l12J4k55jk8o6L13o8k53M9J48j34J54j11j18Q7n6K01l13
3272b70J72J00j66J86m09M53n5j89n1J45l8O5J40j78J30j35k4Q1%k31L09L3j50
3295h2J90j14j35K72j69j85L27J17j9j26m3J20M2J89k33k51M36L65l25l11l8k15
3317a88l26N81j05l87N13j05l72J88M26L16k43k12l65P8J63P5k14r2M34k87p1
$$ plain form
3157 110 282 19 56 268 -86 27 82 133 65 217 -12 117 -35 71 229 277 108 35 -37 97 262 30
3179 30 -9 -132 85 182 -8 22 -39 -114 -380 -330 -47 -239 -339 173 -53 -1 106 -59 133 -243 35 105 15
3202 15 -199 -103 -175 -155 66 -251 -167 -134 65 -122 -164 -222 209 19 -109 64 61 201 -172 212 361 141 86 202
3226 202 53 237 478 -168 -27 -9 206 75 173 85 -85 -68 -89 133 324 397 158 259 142 117 -96 65
3248 65 83 -55 -79 202 479 167 181 -74 -75 -103 -169 144 76 -177 -128 20 -114 40 -71 -189 -102 -158 43 -270
3272 -270 -98 2 -164 22 -387 66 11 -178 -229 -84 -122 -57 83 -95 35 -100 -124 -43 -43 -274 35 68 -82
3295 -82 108 -6 -141 131 -38 -223 104 221 202 76 33 153 195 384 151 -100 336 701 376 65 27 -188
3317 -188 -514 67 -38 -425 88 -17 -389 -201 225 541 298 86 -279 -201 -38 37 -177 -269 165 -122 -193
3338a93N95j36l04J91l43p0J08n21N35J74j46n63K65l67Q40l34m8L98p44N91l20
3359c92M41o7K14n81l94L85P27o1n53L65q0L72n48L40o38K35K8O70j000J275m8
3380F90n34J54K6L53n12m97R82q01M90q68N50J50k03K73n95l4j9O76k38J4J03
3401A60Q2l91K30J06N9l60J7n89N04O2P2K83k53j30J09j16L86k48R4p8kJ02k28
3424a29J1J52k21J44q2m3J98j62PR8j8j11K23l30K45o5L01m15J19j8J63k1k26
$$ plain form
3338 -193 402 266 -38 153 -190 -260 -152 -673 -138 36 -110 -673 -408 -775 65 -269 -317 81 -663 -72 -392
3359 -392 49 -18 196 -385 -779 -394 333 272 -281 84 4 376 -172 168 -470 -235 -207 463 -537 738 690
3380 690 156 310 336 689 177 -320 662 -139 351 -517 33 183 -20 253 -342 -376 -395 281 43 57 160
3401 160 242 -149 81 187 246 -114 -97 -686 -182 -120 -48 235 -18 -148 -39 -155 231 -17 77 -1 -3 99 -129
3424 -129 -118 34 -187 -43 -125 -168 30 -132 -125 -27 -45 -156 67 -263 -18 -83 218 -197 -78 -96 67 46 -180
$$ [...]
8191A21
##END NTUPLES=NMR FID
##END=
